The Swift Package Index logo.Swift Package Index

Track the adoption of Swift 6 strict concurrency checks for data race safety. How many packages are Ready for Swift 6?

Build Information

Failed to build Anima, reference 1.3.0 (8440c1), with Swift 6.1 for watchOS using Xcode 16.3 on 28 Apr 2025 15:54:05 UTC.

Build Command

env DEVELOPER_DIR=/Applications/Xcode-16.3.0.app xcrun xcodebuild -IDEClonedSourcePackagesDirPathOverride=$PWD/.dependencies -skipMacroValidation -skipPackagePluginValidation -derivedDataPath $PWD/.derivedData build -scheme Anima -destination generic/platform=watchOS

Build Log

========================================
RunAll
========================================
Builder version: 4.61.0
Interrupt handler set up.
========================================
Checkout
========================================
Clone URL: https://github.com/flocked/Anima.git
Reference: 1.3.0
Initialized empty Git repository in /Users/admin/builder/spi-builder-workspace/.git/
From https://github.com/flocked/Anima
 * tag               1.3.0      -> FETCH_HEAD
HEAD is now at 8440c18 Update AnimatableArray.swift
Cloned https://github.com/flocked/Anima.git
Revision (git rev-parse @):
8440c18ff13d1194327a34936a2f059bb103f209
SPI manifest file found: $PWD/.spi.yml
SUCCESS checkout https://github.com/flocked/Anima.git at 1.3.0
========================================
Build
========================================
Selected platform:         watchOS
Swift version:             6.1
Building package at path:  $PWD
https://github.com/flocked/Anima.git
https://github.com/flocked/Anima.git
{
  "dependencies" : [
    {
      "identity" : "decomposed",
      "requirement" : {
        "branch" : [
          "main"
        ]
      },
      "type" : "sourceControl",
      "url" : "https://github.com/b3ll/Decomposed.git"
    }
  ],
  "manifest_display_name" : "Anima",
  "name" : "Anima",
  "path" : "/Users/admin/builder/spi-builder-workspace",
  "platforms" : [
    {
      "name" : "ios",
      "version" : "13.0"
    },
    {
      "name" : "macos",
      "version" : "11.0"
    },
    {
      "name" : "tvos",
      "version" : "13.0"
    }
  ],
  "products" : [
    {
      "name" : "Anima",
      "targets" : [
        "Anima"
      ],
      "type" : {
        "library" : [
          "automatic"
        ]
      }
    }
  ],
  "targets" : [
    {
      "c99name" : "AnimaTests",
      "module_type" : "SwiftTarget",
      "name" : "AnimaTests",
      "path" : "Tests/AnimaTests",
      "sources" : [
        "AnimaTests.swift"
      ],
      "target_dependencies" : [
        "Anima"
      ],
      "type" : "test"
    },
    {
      "c99name" : "Anima",
      "module_type" : "SwiftTarget",
      "name" : "Anima",
      "path" : "Sources/Anima",
      "product_dependencies" : [
        "Decomposed"
      ],
      "product_memberships" : [
        "Anima"
      ],
      "sources" : [
        "Anima/Anima+AnimationConfiguration.swift",
        "Anima/Anima+AnimationOptions.swift",
        "Anima/Anima+AnimationState.swift",
        "Anima/Anima.swift",
        "Anima/AnimationController.swift",
        "AnimatableProperty/AnimatableArray.swift",
        "AnimatableProperty/AnimatableProperty.swift",
        "AnimatablePropertyProvider/AnimatablePropertyProvider.swift",
        "AnimatablePropertyProvider/AnimationProvider.swift",
        "AnimatablePropertyProvider/PropertyAnimator+Layer.swift",
        "AnimatablePropertyProvider/PropertyAnimator+Layout.swift",
        "AnimatablePropertyProvider/PropertyAnimator+Popover.swift",
        "AnimatablePropertyProvider/PropertyAnimator+View.swift",
        "AnimatablePropertyProvider/PropertyAnimator+Window.swift",
        "AnimatablePropertyProvider/PropertyAnimator.swift",
        "AnimationProviding/AnimatingState.swift",
        "AnimationProviding/AnimationEvent.swift",
        "AnimationProviding/AnimationPosition.swift",
        "AnimationProviding/AnimationProviding.swift",
        "Animations/Cubic/CubicAnimation.swift",
        "Animations/Cubic/CubicFunction.swift",
        "Animations/Decay/DecayAnimation.swift",
        "Animations/Decay/DecayFunction.swift",
        "Animations/Easing/EasingAnimation.swift",
        "Animations/Easing/TimingFunction.swift",
        "Animations/Misc/ColorAnimation.swift",
        "Animations/Misc/Keyframe.swift",
        "Animations/Property/PropertyAnimation.swift",
        "Animations/Spring/Spring.swift",
        "Animations/Spring/SpringAnimation.swift",
        "Extensions/AssociatedValue.swift",
        "Extensions/Colors/CGColor+.swift",
        "Extensions/Colors/NSUIColor+.swift",
        "Extensions/CoreAnimation/CALayer+.swift",
        "Extensions/CoreAnimation/CAMediaTimingFunction+.swift",
        "Extensions/CoreAnimation/CATransform3D+.swift",
        "Extensions/CoreAnimation/InnerShadowLayer.swift",
        "Extensions/DisplayLink+Combine.swift",
        "Extensions/KVO/KeyValueObserver.swift",
        "Extensions/KVO/NSObject+Observe.swift",
        "Extensions/KVO/NotificationCenter+.swift",
        "Extensions/KeyPath+.swift",
        "Extensions/Math & Geometry/ApproximateEquatable.swift",
        "Extensions/Math & Geometry/CVTimeStamp+.swift",
        "Extensions/Math & Geometry/Comparable+Clamp.swift",
        "Extensions/Math & Geometry/CoreGraphics+.swift",
        "Extensions/Math & Geometry/NSUIBezierpath+.swift",
        "Extensions/Math & Geometry/NSUIEdgeInset+.swift",
        "Extensions/Math & Geometry/NSValue+.swift",
        "Extensions/Math & Geometry/Number+FloatInitializable.swift",
        "Extensions/Math & Geometry/Sequence+Sort.swift",
        "Extensions/Math & Geometry/TimeInterval+.swift",
        "Extensions/Math & Geometry/VectorArithmetic+.swift",
        "Extensions/NSUI Typealias.swift",
        "Extensions/Optional.swift",
        "Extensions/Views/NSScrollView+.swift",
        "Extensions/Views/NSUITextField+.swift",
        "Extensions/Views/NSUIView+.swift",
        "Misc/CAKeyFrameAnimation/CAKeyframeAnimationEmittable+Layer.swift",
        "Misc/CAKeyFrameAnimation/CAKeyframeAnimationEmittable.swift",
        "Misc/CAKeyFrameAnimation/CAKeyframeAnimationValueConvertible.swift",
        "Misc/ContentConfiguration/BorderConfiguration.swift",
        "Misc/ContentConfiguration/ShadowConfiguration.swift",
        "Misc/Rubberband.swift"
      ],
      "type" : "library"
    }
  ],
  "tools_version" : "5.5"
}
Command line invocation:
    /Applications/Xcode-16.3.0.app/Contents/Developer/usr/bin/xcodebuild -IDEClonedSourcePackagesDirPathOverride=/Users/admin/builder/spi-builder-workspace/.dependencies -resolvePackageDependencies
Resolve Package Graph
Fetching from https://github.com/b3ll/Decomposed.git
Creating working copy of package ‘Decomposed’
Checking out main (225ec77) of package ‘Decomposed’
Resolve Package Graph
Resolved source packages:
  Anima: /Users/admin/builder/spi-builder-workspace
  Decomposed: https://github.com/b3ll/Decomposed.git @ main (225ec77)
resolved source packages: Anima, Decomposed
{
  "dependencies" : [
    {
      "identity" : "decomposed",
      "requirement" : {
        "branch" : [
          "main"
        ]
      },
      "type" : "sourceControl",
      "url" : "https://github.com/b3ll/Decomposed.git"
    }
  ],
  "manifest_display_name" : "Anima",
  "name" : "Anima",
  "path" : "/Users/admin/builder/spi-builder-workspace",
  "platforms" : [
    {
      "name" : "ios",
      "version" : "13.0"
    },
    {
      "name" : "macos",
      "version" : "11.0"
    },
    {
      "name" : "tvos",
      "version" : "13.0"
    }
  ],
  "products" : [
    {
      "name" : "Anima",
      "targets" : [
        "Anima"
      ],
      "type" : {
        "library" : [
          "automatic"
        ]
      }
    }
  ],
  "targets" : [
    {
      "c99name" : "AnimaTests",
      "module_type" : "SwiftTarget",
      "name" : "AnimaTests",
      "path" : "Tests/AnimaTests",
      "sources" : [
        "AnimaTests.swift"
      ],
      "target_dependencies" : [
        "Anima"
      ],
      "type" : "test"
    },
    {
      "c99name" : "Anima",
      "module_type" : "SwiftTarget",
      "name" : "Anima",
      "path" : "Sources/Anima",
      "product_dependencies" : [
        "Decomposed"
      ],
      "product_memberships" : [
        "Anima"
      ],
      "sources" : [
        "Anima/Anima+AnimationConfiguration.swift",
        "Anima/Anima+AnimationOptions.swift",
        "Anima/Anima+AnimationState.swift",
        "Anima/Anima.swift",
        "Anima/AnimationController.swift",
        "AnimatableProperty/AnimatableArray.swift",
        "AnimatableProperty/AnimatableProperty.swift",
        "AnimatablePropertyProvider/AnimatablePropertyProvider.swift",
        "AnimatablePropertyProvider/AnimationProvider.swift",
        "AnimatablePropertyProvider/PropertyAnimator+Layer.swift",
        "AnimatablePropertyProvider/PropertyAnimator+Layout.swift",
        "AnimatablePropertyProvider/PropertyAnimator+Popover.swift",
        "AnimatablePropertyProvider/PropertyAnimator+View.swift",
        "AnimatablePropertyProvider/PropertyAnimator+Window.swift",
        "AnimatablePropertyProvider/PropertyAnimator.swift",
        "AnimationProviding/AnimatingState.swift",
        "AnimationProviding/AnimationEvent.swift",
        "AnimationProviding/AnimationPosition.swift",
        "AnimationProviding/AnimationProviding.swift",
        "Animations/Cubic/CubicAnimation.swift",
        "Animations/Cubic/CubicFunction.swift",
        "Animations/Decay/DecayAnimation.swift",
        "Animations/Decay/DecayFunction.swift",
        "Animations/Easing/EasingAnimation.swift",
        "Animations/Easing/TimingFunction.swift",
        "Animations/Misc/ColorAnimation.swift",
        "Animations/Misc/Keyframe.swift",
        "Animations/Property/PropertyAnimation.swift",
        "Animations/Spring/Spring.swift",
        "Animations/Spring/SpringAnimation.swift",
        "Extensions/AssociatedValue.swift",
        "Extensions/Colors/CGColor+.swift",
        "Extensions/Colors/NSUIColor+.swift",
        "Extensions/CoreAnimation/CALayer+.swift",
        "Extensions/CoreAnimation/CAMediaTimingFunction+.swift",
        "Extensions/CoreAnimation/CATransform3D+.swift",
        "Extensions/CoreAnimation/InnerShadowLayer.swift",
        "Extensions/DisplayLink+Combine.swift",
        "Extensions/KVO/KeyValueObserver.swift",
        "Extensions/KVO/NSObject+Observe.swift",
        "Extensions/KVO/NotificationCenter+.swift",
        "Extensions/KeyPath+.swift",
        "Extensions/Math & Geometry/ApproximateEquatable.swift",
        "Extensions/Math & Geometry/CVTimeStamp+.swift",
        "Extensions/Math & Geometry/Comparable+Clamp.swift",
        "Extensions/Math & Geometry/CoreGraphics+.swift",
        "Extensions/Math & Geometry/NSUIBezierpath+.swift",
        "Extensions/Math & Geometry/NSUIEdgeInset+.swift",
        "Extensions/Math & Geometry/NSValue+.swift",
        "Extensions/Math & Geometry/Number+FloatInitializable.swift",
        "Extensions/Math & Geometry/Sequence+Sort.swift",
        "Extensions/Math & Geometry/TimeInterval+.swift",
        "Extensions/Math & Geometry/VectorArithmetic+.swift",
        "Extensions/NSUI Typealias.swift",
        "Extensions/Optional.swift",
        "Extensions/Views/NSScrollView+.swift",
        "Extensions/Views/NSUITextField+.swift",
        "Extensions/Views/NSUIView+.swift",
        "Misc/CAKeyFrameAnimation/CAKeyframeAnimationEmittable+Layer.swift",
        "Misc/CAKeyFrameAnimation/CAKeyframeAnimationEmittable.swift",
        "Misc/CAKeyFrameAnimation/CAKeyframeAnimationValueConvertible.swift",
        "Misc/ContentConfiguration/BorderConfiguration.swift",
        "Misc/ContentConfiguration/ShadowConfiguration.swift",
        "Misc/Rubberband.swift"
      ],
      "type" : "library"
    }
  ],
  "tools_version" : "5.5"
}
{
  "workspace" : {
    "name" : "spi-builder-workspace",
    "schemes" : [
      "Anima"
    ]
  }
}
Running build ...
env DEVELOPER_DIR=/Applications/Xcode-16.3.0.app xcrun xcodebuild -IDEClonedSourcePackagesDirPathOverride=$PWD/.dependencies -skipMacroValidation -skipPackagePluginValidation -derivedDataPath $PWD/.derivedData build -scheme Anima -destination generic/platform=watchOS OTHER_SWIFT_FLAGS=-stats-output-dir .stats -strict-concurrency=complete -enable-upcoming-feature StrictConcurrency -enable-upcoming-feature DisableOutwardActorInference -enable-upcoming-feature GlobalActorIsolatedTypesUsability -enable-upcoming-feature InferSendableFromCaptures
Command line invocation:
    /Applications/Xcode-16.3.0.app/Contents/Developer/usr/bin/xcodebuild -IDEClonedSourcePackagesDirPathOverride=/Users/admin/builder/spi-builder-workspace/.dependencies -skipMacroValidation -skipPackagePluginValidation -derivedDataPath /Users/admin/builder/spi-builder-workspace/.derivedData build -scheme Anima -destination generic/platform=watchOS "OTHER_SWIFT_FLAGS=-stats-output-dir .stats -strict-concurrency=complete -enable-upcoming-feature StrictConcurrency -enable-upcoming-feature DisableOutwardActorInference -enable-upcoming-feature GlobalActorIsolatedTypesUsability -enable-upcoming-feature InferSendableFromCaptures"
Build settings from command line:
    OTHER_SWIFT_FLAGS = -stats-output-dir .stats -strict-concurrency=complete -enable-upcoming-feature StrictConcurrency -enable-upcoming-feature DisableOutwardActorInference -enable-upcoming-feature GlobalActorIsolatedTypesUsability -enable-upcoming-feature InferSendableFromCaptures
Resolve Package Graph
Resolve Package Graph
Resolved source packages:
  Anima: /Users/admin/builder/spi-builder-workspace
  Decomposed: https://github.com/b3ll/Decomposed.git @ main (225ec77)
ComputePackagePrebuildTargetDependencyGraph
Prepare packages
CreateBuildRequest
SendProjectDescription
CreateBuildOperation
ComputeTargetDependencyGraph
note: Building targets in dependency order
note: Target dependency graph (5 targets)
    Target 'AnimaTests' in project 'Anima'
        ➜ Explicit dependency on target 'Anima' in project 'Anima'
        ➜ Explicit dependency on target 'Decomposed' in project 'Decomposed'
    Target 'Anima' in project 'Anima'
        ➜ Explicit dependency on target 'Anima' in project 'Anima'
        ➜ Explicit dependency on target 'Decomposed' in project 'Decomposed'
    Target 'Anima' in project 'Anima'
        ➜ Explicit dependency on target 'Decomposed' in project 'Decomposed'
    Target 'Decomposed' in project 'Decomposed'
        ➜ Explicit dependency on target 'Decomposed' in project 'Decomposed'
    Target 'Decomposed' in project 'Decomposed' (no dependencies)
GatherProvisioningInputs
CreateBuildDescription
ExecuteExternalTool /Applications/Xcode-16.3.0.app/Contents/Developer/Toolchains/XcodeDefault.xctoolchain/usr/bin/swiftc --version
ExecuteExternalTool /Applications/Xcode-16.3.0.app/Contents/Developer/Toolchains/XcodeDefault.xctoolchain/usr/bin/clang -v -E -dM -isysroot /Applications/Xcode-16.3.0.app/Contents/Developer/Platforms/WatchOS.platform/Developer/SDKs/WatchOS11.4.sdk -x c -c /dev/null
ExecuteExternalTool /Applications/Xcode-16.3.0.app/Contents/Developer/Toolchains/XcodeDefault.xctoolchain/usr/bin/ld -version_details
ReadFileContents /Applications/Xcode-16.3.0.app/Contents/Developer/Toolchains/XcodeDefault.xctoolchain/usr/share/docc/features.json
Build description signature: 4569a46cbf2549ef7f2663e7b9f25641
Build description path: /Users/admin/builder/spi-builder-workspace/.derivedData/Build/Intermediates.noindex/XCBuildData/4569a46cbf2549ef7f2663e7b9f25641.xcbuilddata
ClangStatCache /Applications/Xcode-16.3.0.app/Contents/Developer/Toolchains/XcodeDefault.xctoolchain/usr/bin/clang-stat-cache /Applications/Xcode-16.3.0.app/Contents/Developer/Platforms/WatchOS.platform/Developer/SDKs/WatchOS11.4.sdk /Users/admin/builder/spi-builder-workspace/.derivedData/SDKStatCaches.noindex/watchos11.4-22T246-43efb940ff07ba2497b70ec94253f576.sdkstatcache
    cd /Users/admin/builder/spi-builder-workspace/.swiftpm/xcode
    /Applications/Xcode-16.3.0.app/Contents/Developer/Toolchains/XcodeDefault.xctoolchain/usr/bin/clang-stat-cache /Applications/Xcode-16.3.0.app/Contents/Developer/Platforms/WatchOS.platform/Developer/SDKs/WatchOS11.4.sdk -o /Users/admin/builder/spi-builder-workspace/.derivedData/SDKStatCaches.noindex/watchos11.4-22T246-43efb940ff07ba2497b70ec94253f576.sdkstatcache
CreateBuildDirectory /Users/admin/builder/spi-builder-workspace/.derivedData/Build/Products
    cd /Users/admin/builder/spi-builder-workspace/.swiftpm/xcode
    builtin-create-build-directory /Users/admin/builder/spi-builder-workspace/.derivedData/Build/Products
CreateBuildDirectory /Users/admin/builder/spi-builder-workspace/.derivedData/Build/Intermediates.noindex
    cd /Users/admin/builder/spi-builder-workspace/.swiftpm/xcode
    builtin-create-build-directory /Users/admin/builder/spi-builder-workspace/.derivedData/Build/Intermediates.noindex
CreateBuildDirectory /Users/admin/builder/spi-builder-workspace/.derivedData/Build/Products/Debug-watchos
    cd /Users/admin/builder/spi-builder-workspace/.swiftpm/xcode
    builtin-create-build-directory /Users/admin/builder/spi-builder-workspace/.derivedData/Build/Products/Debug-watchos
CreateBuildDirectory /Users/admin/builder/spi-builder-workspace/.derivedData/Build/Intermediates.noindex/EagerLinkingTBDs/Debug-watchos
    cd /Users/admin/builder/spi-builder-workspace/.swiftpm/xcode
    builtin-create-build-directory /Users/admin/builder/spi-builder-workspace/.derivedData/Build/Intermediates.noindex/EagerLinkingTBDs/Debug-watchos
CreateBuildDirectory /Users/admin/builder/spi-builder-workspace/.derivedData/Build/Products/Debug-watchos/PackageFrameworks
    cd /Users/admin/builder/spi-builder-workspace/.swiftpm/xcode
    builtin-create-build-directory /Users/admin/builder/spi-builder-workspace/.derivedData/Build/Products/Debug-watchos/PackageFrameworks
WriteAuxiliaryFile /Users/admin/builder/spi-builder-workspace/.derivedData/Build/Intermediates.noindex/Decomposed.build/Debug-watchos/Decomposed.build/Objects-normal/armv7k/Decomposed-OutputFileMap.json (in target 'Decomposed' from project 'Decomposed')
    cd /Users/admin/builder/spi-builder-workspace/.dependencies/checkouts/Decomposed
    write-file /Users/admin/builder/spi-builder-workspace/.derivedData/Build/Intermediates.noindex/Decomposed.build/Debug-watchos/Decomposed.build/Objects-normal/armv7k/Decomposed-OutputFileMap.json
WriteAuxiliaryFile /Users/admin/builder/spi-builder-workspace/.derivedData/Build/Intermediates.noindex/Decomposed.build/Debug-watchos/Decomposed.build/Objects-normal/armv7k/Decomposed.LinkFileList (in target 'Decomposed' from project 'Decomposed')
    cd /Users/admin/builder/spi-builder-workspace/.dependencies/checkouts/Decomposed
    write-file /Users/admin/builder/spi-builder-workspace/.derivedData/Build/Intermediates.noindex/Decomposed.build/Debug-watchos/Decomposed.build/Objects-normal/armv7k/Decomposed.LinkFileList
WriteAuxiliaryFile /Users/admin/builder/spi-builder-workspace/.derivedData/Build/Intermediates.noindex/Decomposed.build/Debug-watchos/Decomposed.build/Objects-normal/armv7k/Decomposed_const_extract_protocols.json (in target 'Decomposed' from project 'Decomposed')
    cd /Users/admin/builder/spi-builder-workspace/.dependencies/checkouts/Decomposed
    write-file /Users/admin/builder/spi-builder-workspace/.derivedData/Build/Intermediates.noindex/Decomposed.build/Debug-watchos/Decomposed.build/Objects-normal/armv7k/Decomposed_const_extract_protocols.json
WriteAuxiliaryFile /Users/admin/builder/spi-builder-workspace/.derivedData/Build/Intermediates.noindex/Anima.build/Debug-watchos/AnimaTests.build/empty-AnimaTests.plist (in target 'AnimaTests' from project 'Anima')
    cd /Users/admin/builder/spi-builder-workspace
    write-file /Users/admin/builder/spi-builder-workspace/.derivedData/Build/Intermediates.noindex/Anima.build/Debug-watchos/AnimaTests.build/empty-AnimaTests.plist
WriteAuxiliaryFile /Users/admin/builder/spi-builder-workspace/.derivedData/Build/Intermediates.noindex/Anima.build/Debug-watchos/AnimaTests.build/Objects-normal/armv7k/AnimaTests.SwiftFileList (in target 'AnimaTests' from project 'Anima')
    cd /Users/admin/builder/spi-builder-workspace
    write-file /Users/admin/builder/spi-builder-workspace/.derivedData/Build/Intermediates.noindex/Anima.build/Debug-watchos/AnimaTests.build/Objects-normal/armv7k/AnimaTests.SwiftFileList
WriteAuxiliaryFile /Users/admin/builder/spi-builder-workspace/.derivedData/Build/Intermediates.noindex/Anima.build/Debug-watchos/AnimaTests.build/Objects-normal/armv7k/AnimaTests.LinkFileList (in target 'AnimaTests' from project 'Anima')
    cd /Users/admin/builder/spi-builder-workspace
    write-file /Users/admin/builder/spi-builder-workspace/.derivedData/Build/Intermediates.noindex/Anima.build/Debug-watchos/AnimaTests.build/Objects-normal/armv7k/AnimaTests.LinkFileList
WriteAuxiliaryFile /Users/admin/builder/spi-builder-workspace/.derivedData/Build/Intermediates.noindex/Anima.build/Debug-watchos/Anima.build/Objects-normal/armv7k/Anima_const_extract_protocols.json (in target 'Anima' from project 'Anima')
    cd /Users/admin/builder/spi-builder-workspace
    write-file /Users/admin/builder/spi-builder-workspace/.derivedData/Build/Intermediates.noindex/Anima.build/Debug-watchos/Anima.build/Objects-normal/armv7k/Anima_const_extract_protocols.json
WriteAuxiliaryFile /Users/admin/builder/spi-builder-workspace/.derivedData/Build/Intermediates.noindex/Decomposed.build/Debug-watchos/Decomposed.build/Objects-normal/arm64_32/Decomposed_const_extract_protocols.json (in target 'Decomposed' from project 'Decomposed')
    cd /Users/admin/builder/spi-builder-workspace/.dependencies/checkouts/Decomposed
    write-file /Users/admin/builder/spi-builder-workspace/.derivedData/Build/Intermediates.noindex/Decomposed.build/Debug-watchos/Decomposed.build/Objects-normal/arm64_32/Decomposed_const_extract_protocols.json
WriteAuxiliaryFile /Users/admin/builder/spi-builder-workspace/.derivedData/Build/Intermediates.noindex/Anima.build/Debug-watchos/AnimaTests.build/Objects-normal/armv7k/AnimaTests_const_extract_protocols.json (in target 'AnimaTests' from project 'Anima')
    cd /Users/admin/builder/spi-builder-workspace
    write-file /Users/admin/builder/spi-builder-workspace/.derivedData/Build/Intermediates.noindex/Anima.build/Debug-watchos/AnimaTests.build/Objects-normal/armv7k/AnimaTests_const_extract_protocols.json
WriteAuxiliaryFile /Users/admin/builder/spi-builder-workspace/.derivedData/Build/Intermediates.noindex/Decomposed.build/Debug-watchos/Decomposed.build/Objects-normal/armv7k/Decomposed.SwiftFileList (in target 'Decomposed' from project 'Decomposed')
    cd /Users/admin/builder/spi-builder-workspace/.dependencies/checkouts/Decomposed
    write-file /Users/admin/builder/spi-builder-workspace/.derivedData/Build/Intermediates.noindex/Decomposed.build/Debug-watchos/Decomposed.build/Objects-normal/armv7k/Decomposed.SwiftFileList
WriteAuxiliaryFile /Users/admin/builder/spi-builder-workspace/.derivedData/Build/Intermediates.noindex/Decomposed.build/Debug-watchos/Decomposed.build/Objects-normal/armv7k/Decomposed.SwiftConstValuesFileList (in target 'Decomposed' from project 'Decomposed')
    cd /Users/admin/builder/spi-builder-workspace/.dependencies/checkouts/Decomposed
    write-file /Users/admin/builder/spi-builder-workspace/.derivedData/Build/Intermediates.noindex/Decomposed.build/Debug-watchos/Decomposed.build/Objects-normal/armv7k/Decomposed.SwiftConstValuesFileList
WriteAuxiliaryFile /Users/admin/builder/spi-builder-workspace/.derivedData/Build/Intermediates.noindex/Decomposed.build/Debug-watchos/Decomposed.build/Objects-normal/arm64_32/Decomposed.SwiftFileList (in target 'Decomposed' from project 'Decomposed')
    cd /Users/admin/builder/spi-builder-workspace/.dependencies/checkouts/Decomposed
    write-file /Users/admin/builder/spi-builder-workspace/.derivedData/Build/Intermediates.noindex/Decomposed.build/Debug-watchos/Decomposed.build/Objects-normal/arm64_32/Decomposed.SwiftFileList
WriteAuxiliaryFile /Users/admin/builder/spi-builder-workspace/.derivedData/Build/Intermediates.noindex/Decomposed.build/Debug-watchos/Decomposed.build/Objects-normal/arm64_32/Decomposed.SwiftConstValuesFileList (in target 'Decomposed' from project 'Decomposed')
    cd /Users/admin/builder/spi-builder-workspace/.dependencies/checkouts/Decomposed
    write-file /Users/admin/builder/spi-builder-workspace/.derivedData/Build/Intermediates.noindex/Decomposed.build/Debug-watchos/Decomposed.build/Objects-normal/arm64_32/Decomposed.SwiftConstValuesFileList
WriteAuxiliaryFile /Users/admin/builder/spi-builder-workspace/.derivedData/Build/Intermediates.noindex/Decomposed.build/Debug-watchos/Decomposed.build/Objects-normal/arm64_32/Decomposed.LinkFileList (in target 'Decomposed' from project 'Decomposed')
    cd /Users/admin/builder/spi-builder-workspace/.dependencies/checkouts/Decomposed
    write-file /Users/admin/builder/spi-builder-workspace/.derivedData/Build/Intermediates.noindex/Decomposed.build/Debug-watchos/Decomposed.build/Objects-normal/arm64_32/Decomposed.LinkFileList
WriteAuxiliaryFile /Users/admin/builder/spi-builder-workspace/.derivedData/Build/Intermediates.noindex/Decomposed.build/Debug-watchos/Decomposed.build/Objects-normal/arm64_32/Decomposed-OutputFileMap.json (in target 'Decomposed' from project 'Decomposed')
    cd /Users/admin/builder/spi-builder-workspace/.dependencies/checkouts/Decomposed
    write-file /Users/admin/builder/spi-builder-workspace/.derivedData/Build/Intermediates.noindex/Decomposed.build/Debug-watchos/Decomposed.build/Objects-normal/arm64_32/Decomposed-OutputFileMap.json
WriteAuxiliaryFile /Users/admin/builder/spi-builder-workspace/.derivedData/Build/Intermediates.noindex/Decomposed.build/Debug-watchos/Decomposed.build/Objects-normal/arm64/Decomposed_const_extract_protocols.json (in target 'Decomposed' from project 'Decomposed')
    cd /Users/admin/builder/spi-builder-workspace/.dependencies/checkouts/Decomposed
    write-file /Users/admin/builder/spi-builder-workspace/.derivedData/Build/Intermediates.noindex/Decomposed.build/Debug-watchos/Decomposed.build/Objects-normal/arm64/Decomposed_const_extract_protocols.json
WriteAuxiliaryFile /Users/admin/builder/spi-builder-workspace/.derivedData/Build/Intermediates.noindex/Decomposed.build/Debug-watchos/Decomposed.build/Objects-normal/arm64/Decomposed.SwiftFileList (in target 'Decomposed' from project 'Decomposed')
    cd /Users/admin/builder/spi-builder-workspace/.dependencies/checkouts/Decomposed
    write-file /Users/admin/builder/spi-builder-workspace/.derivedData/Build/Intermediates.noindex/Decomposed.build/Debug-watchos/Decomposed.build/Objects-normal/arm64/Decomposed.SwiftFileList
WriteAuxiliaryFile /Users/admin/builder/spi-builder-workspace/.derivedData/Build/Intermediates.noindex/Decomposed.build/Debug-watchos/Decomposed.build/Objects-normal/arm64/Decomposed.SwiftConstValuesFileList (in target 'Decomposed' from project 'Decomposed')
    cd /Users/admin/builder/spi-builder-workspace/.dependencies/checkouts/Decomposed
    write-file /Users/admin/builder/spi-builder-workspace/.derivedData/Build/Intermediates.noindex/Decomposed.build/Debug-watchos/Decomposed.build/Objects-normal/arm64/Decomposed.SwiftConstValuesFileList
WriteAuxiliaryFile /Users/admin/builder/spi-builder-workspace/.derivedData/Build/Intermediates.noindex/Decomposed.build/Debug-watchos/Decomposed.build/Objects-normal/arm64/Decomposed.LinkFileList (in target 'Decomposed' from project 'Decomposed')
    cd /Users/admin/builder/spi-builder-workspace/.dependencies/checkouts/Decomposed
    write-file /Users/admin/builder/spi-builder-workspace/.derivedData/Build/Intermediates.noindex/Decomposed.build/Debug-watchos/Decomposed.build/Objects-normal/arm64/Decomposed.LinkFileList
WriteAuxiliaryFile /Users/admin/builder/spi-builder-workspace/.derivedData/Build/Intermediates.noindex/Decomposed.build/Debug-watchos/Decomposed.build/Objects-normal/arm64/Decomposed-OutputFileMap.json (in target 'Decomposed' from project 'Decomposed')
    cd /Users/admin/builder/spi-builder-workspace/.dependencies/checkouts/Decomposed
    write-file /Users/admin/builder/spi-builder-workspace/.derivedData/Build/Intermediates.noindex/Decomposed.build/Debug-watchos/Decomposed.build/Objects-normal/arm64/Decomposed-OutputFileMap.json
WriteAuxiliaryFile /Users/admin/builder/spi-builder-workspace/.derivedData/Build/Intermediates.noindex/Decomposed.build/Debug-watchos/Decomposed.build/Decomposed.modulemap (in target 'Decomposed' from project 'Decomposed')
    cd /Users/admin/builder/spi-builder-workspace/.dependencies/checkouts/Decomposed
    write-file /Users/admin/builder/spi-builder-workspace/.derivedData/Build/Intermediates.noindex/Decomposed.build/Debug-watchos/Decomposed.build/Decomposed.modulemap
WriteAuxiliaryFile /Users/admin/builder/spi-builder-workspace/.derivedData/Build/Intermediates.noindex/Decomposed.build/Debug-watchos/Decomposed.build/Decomposed.DependencyStaticMetadataFileList (in target 'Decomposed' from project 'Decomposed')
    cd /Users/admin/builder/spi-builder-workspace/.dependencies/checkouts/Decomposed
    write-file /Users/admin/builder/spi-builder-workspace/.derivedData/Build/Intermediates.noindex/Decomposed.build/Debug-watchos/Decomposed.build/Decomposed.DependencyStaticMetadataFileList
WriteAuxiliaryFile /Users/admin/builder/spi-builder-workspace/.derivedData/Build/Intermediates.noindex/Decomposed.build/Debug-watchos/Decomposed.build/Decomposed.DependencyMetadataFileList (in target 'Decomposed' from project 'Decomposed')
    cd /Users/admin/builder/spi-builder-workspace/.dependencies/checkouts/Decomposed
    write-file /Users/admin/builder/spi-builder-workspace/.derivedData/Build/Intermediates.noindex/Decomposed.build/Debug-watchos/Decomposed.build/Decomposed.DependencyMetadataFileList
WriteAuxiliaryFile /Users/admin/builder/spi-builder-workspace/.derivedData/Build/Intermediates.noindex/Anima.build/Debug-watchos/AnimaTests.build/Objects-normal/armv7k/AnimaTests.SwiftConstValuesFileList (in target 'AnimaTests' from project 'Anima')
    cd /Users/admin/builder/spi-builder-workspace
    write-file /Users/admin/builder/spi-builder-workspace/.derivedData/Build/Intermediates.noindex/Anima.build/Debug-watchos/AnimaTests.build/Objects-normal/armv7k/AnimaTests.SwiftConstValuesFileList
WriteAuxiliaryFile /Users/admin/builder/spi-builder-workspace/.derivedData/Build/Intermediates.noindex/Anima.build/Debug-watchos/AnimaTests.build/Objects-normal/armv7k/AnimaTests-OutputFileMap.json (in target 'AnimaTests' from project 'Anima')
    cd /Users/admin/builder/spi-builder-workspace
    write-file /Users/admin/builder/spi-builder-workspace/.derivedData/Build/Intermediates.noindex/Anima.build/Debug-watchos/AnimaTests.build/Objects-normal/armv7k/AnimaTests-OutputFileMap.json
WriteAuxiliaryFile /Users/admin/builder/spi-builder-workspace/.derivedData/Build/Intermediates.noindex/Anima.build/Debug-watchos/AnimaTests.build/Objects-normal/arm64_32/AnimaTests_const_extract_protocols.json (in target 'AnimaTests' from project 'Anima')
    cd /Users/admin/builder/spi-builder-workspace
    write-file /Users/admin/builder/spi-builder-workspace/.derivedData/Build/Intermediates.noindex/Anima.build/Debug-watchos/AnimaTests.build/Objects-normal/arm64_32/AnimaTests_const_extract_protocols.json
WriteAuxiliaryFile /Users/admin/builder/spi-builder-workspace/.derivedData/Build/Intermediates.noindex/Anima.build/Debug-watchos/AnimaTests.build/Objects-normal/arm64_32/AnimaTests.SwiftFileList (in target 'AnimaTests' from project 'Anima')
    cd /Users/admin/builder/spi-builder-workspace
    write-file /Users/admin/builder/spi-builder-workspace/.derivedData/Build/Intermediates.noindex/Anima.build/Debug-watchos/AnimaTests.build/Objects-normal/arm64_32/AnimaTests.SwiftFileList
WriteAuxiliaryFile /Users/admin/builder/spi-builder-workspace/.derivedData/Build/Intermediates.noindex/Anima.build/Debug-watchos/AnimaTests.build/Objects-normal/arm64_32/AnimaTests.SwiftConstValuesFileList (in target 'AnimaTests' from project 'Anima')
    cd /Users/admin/builder/spi-builder-workspace
    write-file /Users/admin/builder/spi-builder-workspace/.derivedData/Build/Intermediates.noindex/Anima.build/Debug-watchos/AnimaTests.build/Objects-normal/arm64_32/AnimaTests.SwiftConstValuesFileList
WriteAuxiliaryFile /Users/admin/builder/spi-builder-workspace/.derivedData/Build/Intermediates.noindex/Anima.build/Debug-watchos/AnimaTests.build/Objects-normal/arm64_32/AnimaTests.LinkFileList (in target 'AnimaTests' from project 'Anima')
    cd /Users/admin/builder/spi-builder-workspace
    write-file /Users/admin/builder/spi-builder-workspace/.derivedData/Build/Intermediates.noindex/Anima.build/Debug-watchos/AnimaTests.build/Objects-normal/arm64_32/AnimaTests.LinkFileList
WriteAuxiliaryFile /Users/admin/builder/spi-builder-workspace/.derivedData/Build/Intermediates.noindex/Anima.build/Debug-watchos/AnimaTests.build/Objects-normal/arm64_32/AnimaTests-OutputFileMap.json (in target 'AnimaTests' from project 'Anima')
    cd /Users/admin/builder/spi-builder-workspace
    write-file /Users/admin/builder/spi-builder-workspace/.derivedData/Build/Intermediates.noindex/Anima.build/Debug-watchos/AnimaTests.build/Objects-normal/arm64_32/AnimaTests-OutputFileMap.json
WriteAuxiliaryFile /Users/admin/builder/spi-builder-workspace/.derivedData/Build/Intermediates.noindex/Anima.build/Debug-watchos/AnimaTests.build/Objects-normal/arm64/AnimaTests.SwiftFileList (in target 'AnimaTests' from project 'Anima')
    cd /Users/admin/builder/spi-builder-workspace
    write-file /Users/admin/builder/spi-builder-workspace/.derivedData/Build/Intermediates.noindex/Anima.build/Debug-watchos/AnimaTests.build/Objects-normal/arm64/AnimaTests.SwiftFileList
WriteAuxiliaryFile /Users/admin/builder/spi-builder-workspace/.derivedData/Build/Intermediates.noindex/Anima.build/Debug-watchos/AnimaTests.build/Objects-normal/arm64/AnimaTests_const_extract_protocols.json (in target 'AnimaTests' from project 'Anima')
    cd /Users/admin/builder/spi-builder-workspace
    write-file /Users/admin/builder/spi-builder-workspace/.derivedData/Build/Intermediates.noindex/Anima.build/Debug-watchos/AnimaTests.build/Objects-normal/arm64/AnimaTests_const_extract_protocols.json
Copy /Users/admin/builder/spi-builder-workspace/.derivedData/Build/Intermediates.noindex/GeneratedModuleMaps-watchos/Decomposed.modulemap /Users/admin/builder/spi-builder-workspace/.derivedData/Build/Intermediates.noindex/Decomposed.build/Debug-watchos/Decomposed.build/Decomposed.modulemap (in target 'Decomposed' from project 'Decomposed')
    cd /Users/admin/builder/spi-builder-workspace/.dependencies/checkouts/Decomposed
    builtin-copy -exclude .DS_Store -exclude CVS -exclude .svn -exclude .git -exclude .hg -resolve-src-symlinks /Users/admin/builder/spi-builder-workspace/.derivedData/Build/Intermediates.noindex/Decomposed.build/Debug-watchos/Decomposed.build/Decomposed.modulemap /Users/admin/builder/spi-builder-workspace/.derivedData/Build/Intermediates.noindex/GeneratedModuleMaps-watchos
WriteAuxiliaryFile /Users/admin/builder/spi-builder-workspace/.derivedData/Build/Intermediates.noindex/Anima.build/Debug-watchos/AnimaTests.build/Objects-normal/arm64/AnimaTests.SwiftConstValuesFileList (in target 'AnimaTests' from project 'Anima')
    cd /Users/admin/builder/spi-builder-workspace
    write-file /Users/admin/builder/spi-builder-workspace/.derivedData/Build/Intermediates.noindex/Anima.build/Debug-watchos/AnimaTests.build/Objects-normal/arm64/AnimaTests.SwiftConstValuesFileList
WriteAuxiliaryFile /Users/admin/builder/spi-builder-workspace/.derivedData/Build/Intermediates.noindex/Anima.build/Debug-watchos/AnimaTests.build/Objects-normal/arm64/AnimaTests.LinkFileList (in target 'AnimaTests' from project 'Anima')
    cd /Users/admin/builder/spi-builder-workspace
    write-file /Users/admin/builder/spi-builder-workspace/.derivedData/Build/Intermediates.noindex/Anima.build/Debug-watchos/AnimaTests.build/Objects-normal/arm64/AnimaTests.LinkFileList
WriteAuxiliaryFile /Users/admin/builder/spi-builder-workspace/.derivedData/Build/Intermediates.noindex/Anima.build/Debug-watchos/AnimaTests.build/Objects-normal/arm64/AnimaTests-OutputFileMap.json (in target 'AnimaTests' from project 'Anima')
    cd /Users/admin/builder/spi-builder-workspace
    write-file /Users/admin/builder/spi-builder-workspace/.derivedData/Build/Intermediates.noindex/Anima.build/Debug-watchos/AnimaTests.build/Objects-normal/arm64/AnimaTests-OutputFileMap.json
WriteAuxiliaryFile /Users/admin/builder/spi-builder-workspace/.derivedData/Build/Intermediates.noindex/Anima.build/Debug-watchos/AnimaTests.build/AnimaTests.DependencyStaticMetadataFileList (in target 'AnimaTests' from project 'Anima')
    cd /Users/admin/builder/spi-builder-workspace
    write-file /Users/admin/builder/spi-builder-workspace/.derivedData/Build/Intermediates.noindex/Anima.build/Debug-watchos/AnimaTests.build/AnimaTests.DependencyStaticMetadataFileList
WriteAuxiliaryFile /Users/admin/builder/spi-builder-workspace/.derivedData/Build/Intermediates.noindex/Anima.build/Debug-watchos/AnimaTests.build/AnimaTests.DependencyMetadataFileList (in target 'AnimaTests' from project 'Anima')
    cd /Users/admin/builder/spi-builder-workspace
    write-file /Users/admin/builder/spi-builder-workspace/.derivedData/Build/Intermediates.noindex/Anima.build/Debug-watchos/AnimaTests.build/AnimaTests.DependencyMetadataFileList
WriteAuxiliaryFile /Users/admin/builder/spi-builder-workspace/.derivedData/Build/Intermediates.noindex/Anima.build/Debug-watchos/Anima.build/Objects-normal/armv7k/Anima.SwiftFileList (in target 'Anima' from project 'Anima')
    cd /Users/admin/builder/spi-builder-workspace
    write-file /Users/admin/builder/spi-builder-workspace/.derivedData/Build/Intermediates.noindex/Anima.build/Debug-watchos/Anima.build/Objects-normal/armv7k/Anima.SwiftFileList
WriteAuxiliaryFile /Users/admin/builder/spi-builder-workspace/.derivedData/Build/Intermediates.noindex/Anima.build/Debug-watchos/Anima.build/Objects-normal/armv7k/Anima.SwiftConstValuesFileList (in target 'Anima' from project 'Anima')
    cd /Users/admin/builder/spi-builder-workspace
    write-file /Users/admin/builder/spi-builder-workspace/.derivedData/Build/Intermediates.noindex/Anima.build/Debug-watchos/Anima.build/Objects-normal/armv7k/Anima.SwiftConstValuesFileList
WriteAuxiliaryFile /Users/admin/builder/spi-builder-workspace/.derivedData/Build/Intermediates.noindex/Anima.build/Debug-watchos/Anima.build/Objects-normal/armv7k/Anima.LinkFileList (in target 'Anima' from project 'Anima')
    cd /Users/admin/builder/spi-builder-workspace
    write-file /Users/admin/builder/spi-builder-workspace/.derivedData/Build/Intermediates.noindex/Anima.build/Debug-watchos/Anima.build/Objects-normal/armv7k/Anima.LinkFileList
WriteAuxiliaryFile /Users/admin/builder/spi-builder-workspace/.derivedData/Build/Intermediates.noindex/Anima.build/Debug-watchos/Anima.build/Objects-normal/armv7k/Anima-OutputFileMap.json (in target 'Anima' from project 'Anima')
    cd /Users/admin/builder/spi-builder-workspace
    write-file /Users/admin/builder/spi-builder-workspace/.derivedData/Build/Intermediates.noindex/Anima.build/Debug-watchos/Anima.build/Objects-normal/armv7k/Anima-OutputFileMap.json
WriteAuxiliaryFile /Users/admin/builder/spi-builder-workspace/.derivedData/Build/Intermediates.noindex/Anima.build/Debug-watchos/Anima.build/Objects-normal/arm64_32/Anima_const_extract_protocols.json (in target 'Anima' from project 'Anima')
    cd /Users/admin/builder/spi-builder-workspace
    write-file /Users/admin/builder/spi-builder-workspace/.derivedData/Build/Intermediates.noindex/Anima.build/Debug-watchos/Anima.build/Objects-normal/arm64_32/Anima_const_extract_protocols.json
WriteAuxiliaryFile /Users/admin/builder/spi-builder-workspace/.derivedData/Build/Intermediates.noindex/Anima.build/Debug-watchos/Anima.build/Objects-normal/arm64_32/Anima.SwiftFileList (in target 'Anima' from project 'Anima')
    cd /Users/admin/builder/spi-builder-workspace
    write-file /Users/admin/builder/spi-builder-workspace/.derivedData/Build/Intermediates.noindex/Anima.build/Debug-watchos/Anima.build/Objects-normal/arm64_32/Anima.SwiftFileList
WriteAuxiliaryFile /Users/admin/builder/spi-builder-workspace/.derivedData/Build/Intermediates.noindex/Anima.build/Debug-watchos/Anima.build/Objects-normal/arm64_32/Anima.SwiftConstValuesFileList (in target 'Anima' from project 'Anima')
    cd /Users/admin/builder/spi-builder-workspace
    write-file /Users/admin/builder/spi-builder-workspace/.derivedData/Build/Intermediates.noindex/Anima.build/Debug-watchos/Anima.build/Objects-normal/arm64_32/Anima.SwiftConstValuesFileList
WriteAuxiliaryFile /Users/admin/builder/spi-builder-workspace/.derivedData/Build/Intermediates.noindex/Anima.build/Debug-watchos/Anima.build/Objects-normal/arm64_32/Anima.LinkFileList (in target 'Anima' from project 'Anima')
    cd /Users/admin/builder/spi-builder-workspace
    write-file /Users/admin/builder/spi-builder-workspace/.derivedData/Build/Intermediates.noindex/Anima.build/Debug-watchos/Anima.build/Objects-normal/arm64_32/Anima.LinkFileList
WriteAuxiliaryFile /Users/admin/builder/spi-builder-workspace/.derivedData/Build/Intermediates.noindex/Anima.build/Debug-watchos/Anima.build/Objects-normal/arm64_32/Anima-OutputFileMap.json (in target 'Anima' from project 'Anima')
    cd /Users/admin/builder/spi-builder-workspace
    write-file /Users/admin/builder/spi-builder-workspace/.derivedData/Build/Intermediates.noindex/Anima.build/Debug-watchos/Anima.build/Objects-normal/arm64_32/Anima-OutputFileMap.json
WriteAuxiliaryFile /Users/admin/builder/spi-builder-workspace/.derivedData/Build/Intermediates.noindex/Anima.build/Debug-watchos/Anima.build/Objects-normal/arm64/Anima_const_extract_protocols.json (in target 'Anima' from project 'Anima')
    cd /Users/admin/builder/spi-builder-workspace
    write-file /Users/admin/builder/spi-builder-workspace/.derivedData/Build/Intermediates.noindex/Anima.build/Debug-watchos/Anima.build/Objects-normal/arm64/Anima_const_extract_protocols.json
WriteAuxiliaryFile /Users/admin/builder/spi-builder-workspace/.derivedData/Build/Intermediates.noindex/Anima.build/Debug-watchos/Anima.build/Objects-normal/arm64/Anima.SwiftFileList (in target 'Anima' from project 'Anima')
    cd /Users/admin/builder/spi-builder-workspace
    write-file /Users/admin/builder/spi-builder-workspace/.derivedData/Build/Intermediates.noindex/Anima.build/Debug-watchos/Anima.build/Objects-normal/arm64/Anima.SwiftFileList
WriteAuxiliaryFile /Users/admin/builder/spi-builder-workspace/.derivedData/Build/Intermediates.noindex/Anima.build/Debug-watchos/Anima.build/Objects-normal/arm64/Anima.SwiftConstValuesFileList (in target 'Anima' from project 'Anima')
    cd /Users/admin/builder/spi-builder-workspace
    write-file /Users/admin/builder/spi-builder-workspace/.derivedData/Build/Intermediates.noindex/Anima.build/Debug-watchos/Anima.build/Objects-normal/arm64/Anima.SwiftConstValuesFileList
WriteAuxiliaryFile /Users/admin/builder/spi-builder-workspace/.derivedData/Build/Intermediates.noindex/Anima.build/Debug-watchos/Anima.build/Objects-normal/arm64/Anima.LinkFileList (in target 'Anima' from project 'Anima')
    cd /Users/admin/builder/spi-builder-workspace
    write-file /Users/admin/builder/spi-builder-workspace/.derivedData/Build/Intermediates.noindex/Anima.build/Debug-watchos/Anima.build/Objects-normal/arm64/Anima.LinkFileList
WriteAuxiliaryFile /Users/admin/builder/spi-builder-workspace/.derivedData/Build/Intermediates.noindex/Anima.build/Debug-watchos/Anima.build/Objects-normal/arm64/Anima-OutputFileMap.json (in target 'Anima' from project 'Anima')
    cd /Users/admin/builder/spi-builder-workspace
    write-file /Users/admin/builder/spi-builder-workspace/.derivedData/Build/Intermediates.noindex/Anima.build/Debug-watchos/Anima.build/Objects-normal/arm64/Anima-OutputFileMap.json
WriteAuxiliaryFile /Users/admin/builder/spi-builder-workspace/.derivedData/Build/Intermediates.noindex/Anima.build/Debug-watchos/Anima.build/Anima.modulemap (in target 'Anima' from project 'Anima')
    cd /Users/admin/builder/spi-builder-workspace
    write-file /Users/admin/builder/spi-builder-workspace/.derivedData/Build/Intermediates.noindex/Anima.build/Debug-watchos/Anima.build/Anima.modulemap
WriteAuxiliaryFile /Users/admin/builder/spi-builder-workspace/.derivedData/Build/Intermediates.noindex/Anima.build/Debug-watchos/Anima.build/Anima.DependencyStaticMetadataFileList (in target 'Anima' from project 'Anima')
    cd /Users/admin/builder/spi-builder-workspace
    write-file /Users/admin/builder/spi-builder-workspace/.derivedData/Build/Intermediates.noindex/Anima.build/Debug-watchos/Anima.build/Anima.DependencyStaticMetadataFileList
WriteAuxiliaryFile /Users/admin/builder/spi-builder-workspace/.derivedData/Build/Intermediates.noindex/Anima.build/Debug-watchos/Anima.build/Anima.DependencyMetadataFileList (in target 'Anima' from project 'Anima')
    cd /Users/admin/builder/spi-builder-workspace
    write-file /Users/admin/builder/spi-builder-workspace/.derivedData/Build/Intermediates.noindex/Anima.build/Debug-watchos/Anima.build/Anima.DependencyMetadataFileList
MkDir /Users/admin/builder/spi-builder-workspace/.derivedData/Build/Products/Debug-watchos/AnimaTests.xctest (in target 'AnimaTests' from project 'Anima')
    cd /Users/admin/builder/spi-builder-workspace
    /bin/mkdir -p /Users/admin/builder/spi-builder-workspace/.derivedData/Build/Products/Debug-watchos/AnimaTests.xctest
Copy /Users/admin/builder/spi-builder-workspace/.derivedData/Build/Intermediates.noindex/GeneratedModuleMaps-watchos/Anima.modulemap /Users/admin/builder/spi-builder-workspace/.derivedData/Build/Intermediates.noindex/Anima.build/Debug-watchos/Anima.build/Anima.modulemap (in target 'Anima' from project 'Anima')
    cd /Users/admin/builder/spi-builder-workspace
    builtin-copy -exclude .DS_Store -exclude CVS -exclude .svn -exclude .git -exclude .hg -resolve-src-symlinks /Users/admin/builder/spi-builder-workspace/.derivedData/Build/Intermediates.noindex/Anima.build/Debug-watchos/Anima.build/Anima.modulemap /Users/admin/builder/spi-builder-workspace/.derivedData/Build/Intermediates.noindex/GeneratedModuleMaps-watchos
SwiftDriver Decomposed normal arm64 com.apple.xcode.tools.swift.compiler (in target 'Decomposed' from project 'Decomposed')
    cd /Users/admin/builder/spi-builder-workspace/.swiftpm/xcode
    builtin-SwiftDriver -- /Applications/Xcode-16.3.0.app/Contents/Developer/Toolchains/XcodeDefault.xctoolchain/usr/bin/swiftc -module-name Decomposed -Onone -enforce-exclusivity\=checked @/Users/admin/builder/spi-builder-workspace/.derivedData/Build/Intermediates.noindex/Decomposed.build/Debug-watchos/Decomposed.build/Objects-normal/arm64/Decomposed.SwiftFileList -DSWIFT_PACKAGE -DDEBUG -stats-output-dir .stats -strict-concurrency\=complete -enable-upcoming-feature StrictConcurrency -enable-upcoming-feature DisableOutwardActorInference -enable-upcoming-feature GlobalActorIsolatedTypesUsability -enable-upcoming-feature InferSendableFromCaptures -plugin-path /Applications/Xcode-16.3.0.app/Contents/Developer/Toolchains/XcodeDefault.xctoolchain/usr/lib/swift/host/plugins/testing -enable-experimental-feature DebugDescriptionMacro -sdk /Applications/Xcode-16.3.0.app/Contents/Developer/Platforms/WatchOS.platform/Developer/SDKs/WatchOS11.4.sdk -target arm64-apple-watchos6.0 -g -module-cache-path /Users/admin/builder/spi-builder-workspace/.derivedData/ModuleCache.noindex -Xfrontend -serialize-debugging-options -profile-coverage-mapping -profile-generate -enable-testing -suppress-warnings -index-store-path /Users/admin/builder/spi-builder-workspace/.derivedData/Index.noindex/DataStore -swift-version 5 -I /Users/admin/builder/spi-builder-workspace/.derivedData/Build/Products/Debug-watchos -I /Applications/Xcode-16.3.0.app/Contents/Developer/Platforms/WatchOS.platform/Developer/usr/lib -F /Users/admin/builder/spi-builder-workspace/.derivedData/Build/Products/Debug-watchos -F /Applications/Xcode-16.3.0.app/Contents/Developer/Platforms/WatchOS.platform/Developer/Library/Frameworks -F /Applications/Xcode-16.3.0.app/Contents/Developer/Platforms/WatchOS.platform/Developer/SDKs/WatchOS11.4.sdk/Developer/Library/Frameworks -c -j10 -enable-batch-mode -incremental -Xcc -ivfsstatcache -Xcc /Users/admin/builder/spi-builder-workspace/.derivedData/SDKStatCaches.noindex/watchos11.4-22T246-43efb940ff07ba2497b70ec94253f576.sdkstatcache -output-file-map /Users/admin/builder/spi-builder-workspace/.derivedData/Build/Intermediates.noindex/Decomposed.build/Debug-watchos/Decomposed.build/Objects-normal/arm64/Decomposed-OutputFileMap.json -use-frontend-parseable-output -save-temps -no-color-diagnostics -serialize-diagnostics -emit-dependencies -emit-module -emit-module-path /Users/admin/builder/spi-builder-workspace/.derivedData/Build/Intermediates.noindex/Decomposed.build/Debug-watchos/Decomposed.build/Objects-normal/arm64/Decomposed.swiftmodule -validate-clang-modules-once -clang-build-session-file /Users/admin/builder/spi-builder-workspace/.derivedData/ModuleCache.noindex/Session.modulevalidation -Xcc -I/Users/admin/builder/spi-builder-workspace/.derivedData/Build/Intermediates.noindex/Decomposed.build/Debug-watchos/Decomposed.build/swift-overrides.hmap -emit-const-values -Xfrontend -const-gather-protocols-file -Xfrontend /Users/admin/builder/spi-builder-workspace/.derivedData/Build/Intermediates.noindex/Decomposed.build/Debug-watchos/Decomposed.build/Objects-normal/arm64/Decomposed_const_extract_protocols.json -Xcc -I/Users/admin/builder/spi-builder-workspace/.derivedData/Build/Products/Debug-watchos/include -Xcc -I/Users/admin/builder/spi-builder-workspace/.derivedData/Build/Intermediates.noindex/Decomposed.build/Debug-watchos/Decomposed.build/DerivedSources-normal/arm64 -Xcc -I/Users/admin/builder/spi-builder-workspace/.derivedData/Build/Intermediates.noindex/Decomposed.build/Debug-watchos/Decomposed.build/DerivedSources/arm64 -Xcc -I/Users/admin/builder/spi-builder-workspace/.derivedData/Build/Intermediates.noindex/Decomposed.build/Debug-watchos/Decomposed.build/DerivedSources -Xcc -DSWIFT_PACKAGE -Xcc -DDEBUG\=1 -emit-objc-header -emit-objc-header-path /Users/admin/builder/spi-builder-workspace/.derivedData/Build/Intermediates.noindex/Decomposed.build/Debug-watchos/Decomposed.build/Objects-normal/arm64/Decomposed-Swift.h -working-directory /Users/admin/builder/spi-builder-workspace/.swiftpm/xcode -experimental-emit-module-separately -disable-cmo
SwiftDriver Decomposed normal arm64_32 com.apple.xcode.tools.swift.compiler (in target 'Decomposed' from project 'Decomposed')
    cd /Users/admin/builder/spi-builder-workspace/.swiftpm/xcode
    builtin-SwiftDriver -- /Applications/Xcode-16.3.0.app/Contents/Developer/Toolchains/XcodeDefault.xctoolchain/usr/bin/swiftc -module-name Decomposed -Onone -enforce-exclusivity\=checked @/Users/admin/builder/spi-builder-workspace/.derivedData/Build/Intermediates.noindex/Decomposed.build/Debug-watchos/Decomposed.build/Objects-normal/arm64_32/Decomposed.SwiftFileList -DSWIFT_PACKAGE -DDEBUG -stats-output-dir .stats -strict-concurrency\=complete -enable-upcoming-feature StrictConcurrency -enable-upcoming-feature DisableOutwardActorInference -enable-upcoming-feature GlobalActorIsolatedTypesUsability -enable-upcoming-feature InferSendableFromCaptures -plugin-path /Applications/Xcode-16.3.0.app/Contents/Developer/Toolchains/XcodeDefault.xctoolchain/usr/lib/swift/host/plugins/testing -enable-experimental-feature DebugDescriptionMacro -sdk /Applications/Xcode-16.3.0.app/Contents/Developer/Platforms/WatchOS.platform/Developer/SDKs/WatchOS11.4.sdk -target arm64_32-apple-watchos6.0 -g -module-cache-path /Users/admin/builder/spi-builder-workspace/.derivedData/ModuleCache.noindex -Xfrontend -serialize-debugging-options -profile-coverage-mapping -profile-generate -enable-testing -suppress-warnings -index-store-path /Users/admin/builder/spi-builder-workspace/.derivedData/Index.noindex/DataStore -swift-version 5 -I /Users/admin/builder/spi-builder-workspace/.derivedData/Build/Products/Debug-watchos -I /Applications/Xcode-16.3.0.app/Contents/Developer/Platforms/WatchOS.platform/Developer/usr/lib -F /Users/admin/builder/spi-builder-workspace/.derivedData/Build/Products/Debug-watchos -F /Applications/Xcode-16.3.0.app/Contents/Developer/Platforms/WatchOS.platform/Developer/Library/Frameworks -F /Applications/Xcode-16.3.0.app/Contents/Developer/Platforms/WatchOS.platform/Developer/SDKs/WatchOS11.4.sdk/Developer/Library/Frameworks -c -j10 -enable-batch-mode -incremental -Xcc -ivfsstatcache -Xcc /Users/admin/builder/spi-builder-workspace/.derivedData/SDKStatCaches.noindex/watchos11.4-22T246-43efb940ff07ba2497b70ec94253f576.sdkstatcache -output-file-map /Users/admin/builder/spi-builder-workspace/.derivedData/Build/Intermediates.noindex/Decomposed.build/Debug-watchos/Decomposed.build/Objects-normal/arm64_32/Decomposed-OutputFileMap.json -use-frontend-parseable-output -save-temps -no-color-diagnostics -serialize-diagnostics -emit-dependencies -emit-module -emit-module-path /Users/admin/builder/spi-builder-workspace/.derivedData/Build/Intermediates.noindex/Decomposed.build/Debug-watchos/Decomposed.build/Objects-normal/arm64_32/Decomposed.swiftmodule -validate-clang-modules-once -clang-build-session-file /Users/admin/builder/spi-builder-workspace/.derivedData/ModuleCache.noindex/Session.modulevalidation -Xcc -I/Users/admin/builder/spi-builder-workspace/.derivedData/Build/Intermediates.noindex/Decomposed.build/Debug-watchos/Decomposed.build/swift-overrides.hmap -emit-const-values -Xfrontend -const-gather-protocols-file -Xfrontend /Users/admin/builder/spi-builder-workspace/.derivedData/Build/Intermediates.noindex/Decomposed.build/Debug-watchos/Decomposed.build/Objects-normal/arm64_32/Decomposed_const_extract_protocols.json -Xcc -I/Users/admin/builder/spi-builder-workspace/.derivedData/Build/Products/Debug-watchos/include -Xcc -I/Users/admin/builder/spi-builder-workspace/.derivedData/Build/Intermediates.noindex/Decomposed.build/Debug-watchos/Decomposed.build/DerivedSources-normal/arm64_32 -Xcc -I/Users/admin/builder/spi-builder-workspace/.derivedData/Build/Intermediates.noindex/Decomposed.build/Debug-watchos/Decomposed.build/DerivedSources/arm64_32 -Xcc -I/Users/admin/builder/spi-builder-workspace/.derivedData/Build/Intermediates.noindex/Decomposed.build/Debug-watchos/Decomposed.build/DerivedSources -Xcc -DSWIFT_PACKAGE -Xcc -DDEBUG\=1 -emit-objc-header -emit-objc-header-path /Users/admin/builder/spi-builder-workspace/.derivedData/Build/Intermediates.noindex/Decomposed.build/Debug-watchos/Decomposed.build/Objects-normal/arm64_32/Decomposed-Swift.h -working-directory /Users/admin/builder/spi-builder-workspace/.swiftpm/xcode -experimental-emit-module-separately -disable-cmo
SwiftDriver Decomposed normal armv7k com.apple.xcode.tools.swift.compiler (in target 'Decomposed' from project 'Decomposed')
    cd /Users/admin/builder/spi-builder-workspace/.swiftpm/xcode
    builtin-SwiftDriver -- /Applications/Xcode-16.3.0.app/Contents/Developer/Toolchains/XcodeDefault.xctoolchain/usr/bin/swiftc -module-name Decomposed -Onone -enforce-exclusivity\=checked @/Users/admin/builder/spi-builder-workspace/.derivedData/Build/Intermediates.noindex/Decomposed.build/Debug-watchos/Decomposed.build/Objects-normal/armv7k/Decomposed.SwiftFileList -DSWIFT_PACKAGE -DDEBUG -stats-output-dir .stats -strict-concurrency\=complete -enable-upcoming-feature StrictConcurrency -enable-upcoming-feature DisableOutwardActorInference -enable-upcoming-feature GlobalActorIsolatedTypesUsability -enable-upcoming-feature InferSendableFromCaptures -plugin-path /Applications/Xcode-16.3.0.app/Contents/Developer/Toolchains/XcodeDefault.xctoolchain/usr/lib/swift/host/plugins/testing -enable-experimental-feature DebugDescriptionMacro -sdk /Applications/Xcode-16.3.0.app/Contents/Developer/Platforms/WatchOS.platform/Developer/SDKs/WatchOS11.4.sdk -target armv7k-apple-watchos6.0 -g -module-cache-path /Users/admin/builder/spi-builder-workspace/.derivedData/ModuleCache.noindex -Xfrontend -serialize-debugging-options -profile-coverage-mapping -profile-generate -enable-testing -suppress-warnings -index-store-path /Users/admin/builder/spi-builder-workspace/.derivedData/Index.noindex/DataStore -swift-version 5 -I /Users/admin/builder/spi-builder-workspace/.derivedData/Build/Products/Debug-watchos -I /Applications/Xcode-16.3.0.app/Contents/Developer/Platforms/WatchOS.platform/Developer/usr/lib -F /Users/admin/builder/spi-builder-workspace/.derivedData/Build/Products/Debug-watchos -F /Applications/Xcode-16.3.0.app/Contents/Developer/Platforms/WatchOS.platform/Developer/Library/Frameworks -F /Applications/Xcode-16.3.0.app/Contents/Developer/Platforms/WatchOS.platform/Developer/SDKs/WatchOS11.4.sdk/Developer/Library/Frameworks -c -j10 -enable-batch-mode -incremental -Xcc -ivfsstatcache -Xcc /Users/admin/builder/spi-builder-workspace/.derivedData/SDKStatCaches.noindex/watchos11.4-22T246-43efb940ff07ba2497b70ec94253f576.sdkstatcache -output-file-map /Users/admin/builder/spi-builder-workspace/.derivedData/Build/Intermediates.noindex/Decomposed.build/Debug-watchos/Decomposed.build/Objects-normal/armv7k/Decomposed-OutputFileMap.json -use-frontend-parseable-output -save-temps -no-color-diagnostics -serialize-diagnostics -emit-dependencies -emit-module -emit-module-path /Users/admin/builder/spi-builder-workspace/.derivedData/Build/Intermediates.noindex/Decomposed.build/Debug-watchos/Decomposed.build/Objects-normal/armv7k/Decomposed.swiftmodule -validate-clang-modules-once -clang-build-session-file /Users/admin/builder/spi-builder-workspace/.derivedData/ModuleCache.noindex/Session.modulevalidation -Xcc -I/Users/admin/builder/spi-builder-workspace/.derivedData/Build/Intermediates.noindex/Decomposed.build/Debug-watchos/Decomposed.build/swift-overrides.hmap -emit-const-values -Xfrontend -const-gather-protocols-file -Xfrontend /Users/admin/builder/spi-builder-workspace/.derivedData/Build/Intermediates.noindex/Decomposed.build/Debug-watchos/Decomposed.build/Objects-normal/armv7k/Decomposed_const_extract_protocols.json -Xcc -I/Users/admin/builder/spi-builder-workspace/.derivedData/Build/Products/Debug-watchos/include -Xcc -I/Users/admin/builder/spi-builder-workspace/.derivedData/Build/Intermediates.noindex/Decomposed.build/Debug-watchos/Decomposed.build/DerivedSources-normal/armv7k -Xcc -I/Users/admin/builder/spi-builder-workspace/.derivedData/Build/Intermediates.noindex/Decomposed.build/Debug-watchos/Decomposed.build/DerivedSources/armv7k -Xcc -I/Users/admin/builder/spi-builder-workspace/.derivedData/Build/Intermediates.noindex/Decomposed.build/Debug-watchos/Decomposed.build/DerivedSources -Xcc -DSWIFT_PACKAGE -Xcc -DDEBUG\=1 -emit-objc-header -emit-objc-header-path /Users/admin/builder/spi-builder-workspace/.derivedData/Build/Intermediates.noindex/Decomposed.build/Debug-watchos/Decomposed.build/Objects-normal/armv7k/Decomposed-Swift.h -working-directory /Users/admin/builder/spi-builder-workspace/.swiftpm/xcode -experimental-emit-module-separately -disable-cmo
SwiftCompile normal arm64 Compiling\ CALayerExtensions.swift /Users/admin/builder/spi-builder-workspace/.dependencies/checkouts/Decomposed/Sources/Decomposed/CALayerExtensions.swift (in target 'Decomposed' from project 'Decomposed')
SwiftCompile normal arm64 /Users/admin/builder/spi-builder-workspace/.dependencies/checkouts/Decomposed/Sources/Decomposed/CALayerExtensions.swift (in target 'Decomposed' from project 'Decomposed')
    cd /Users/admin/builder/spi-builder-workspace/.swiftpm/xcode

SwiftCompile normal arm64 Compiling\ CATransform3DExtensions.swift /Users/admin/builder/spi-builder-workspace/.dependencies/checkouts/Decomposed/Sources/Decomposed/CATransform3DExtensions.swift (in target 'Decomposed' from project 'Decomposed')
SwiftCompile normal arm64 /Users/admin/builder/spi-builder-workspace/.dependencies/checkouts/Decomposed/Sources/Decomposed/CATransform3DExtensions.swift (in target 'Decomposed' from project 'Decomposed')
    cd /Users/admin/builder/spi-builder-workspace/.swiftpm/xcode

SwiftCompile normal arm64 Compiling\ CATransform3DConvenienceExtensions.swift /Users/admin/builder/spi-builder-workspace/.dependencies/checkouts/Decomposed/Sources/Decomposed/CATransform3DConvenienceExtensions.swift (in target 'Decomposed' from project 'Decomposed')
SwiftCompile normal arm64 /Users/admin/builder/spi-builder-workspace/.dependencies/checkouts/Decomposed/Sources/Decomposed/CATransform3DConvenienceExtensions.swift (in target 'Decomposed' from project 'Decomposed')
    cd /Users/admin/builder/spi-builder-workspace/.swiftpm/xcode

SwiftCompile normal arm64 Compiling\ CGFloatVectorTypes.swift /Users/admin/builder/spi-builder-workspace/.dependencies/checkouts/Decomposed/Sources/Decomposed/CGFloatVectorTypes.swift (in target 'Decomposed' from project 'Decomposed')
SwiftCompile normal arm64 /Users/admin/builder/spi-builder-workspace/.dependencies/checkouts/Decomposed/Sources/Decomposed/CGFloatVectorTypes.swift (in target 'Decomposed' from project 'Decomposed')
    cd /Users/admin/builder/spi-builder-workspace/.swiftpm/xcode

SwiftCompile normal arm64 Compiling\ Globals.swift /Users/admin/builder/spi-builder-workspace/.dependencies/checkouts/Decomposed/Sources/Decomposed/Globals.swift (in target 'Decomposed' from project 'Decomposed')
SwiftCompile normal arm64 /Users/admin/builder/spi-builder-workspace/.dependencies/checkouts/Decomposed/Sources/Decomposed/Globals.swift (in target 'Decomposed' from project 'Decomposed')
    cd /Users/admin/builder/spi-builder-workspace/.swiftpm/xcode

SwiftEmitModule normal arm64_32 Emitting\ module\ for\ Decomposed (in target 'Decomposed' from project 'Decomposed')
Failed frontend command:
/Applications/Xcode-16.3.0.app/Contents/Developer/Toolchains/XcodeDefault.xctoolchain/usr/bin/swift-frontend -frontend -emit-module -experimental-skip-non-inlinable-function-bodies-without-types /Users/admin/builder/spi-builder-workspace/.dependencies/checkouts/Decomposed/Sources/Decomposed/CALayerExtensions.swift /Users/admin/builder/spi-builder-workspace/.dependencies/checkouts/Decomposed/Sources/Decomposed/CATransform3DConvenienceExtensions.swift /Users/admin/builder/spi-builder-workspace/.dependencies/checkouts/Decomposed/Sources/Decomposed/CATransform3DExtensions.swift /Users/admin/builder/spi-builder-workspace/.dependencies/checkouts/Decomposed/Sources/Decomposed/CGFloatVectorTypes.swift /Users/admin/builder/spi-builder-workspace/.dependencies/checkouts/Decomposed/Sources/Decomposed/Globals.swift /Users/admin/builder/spi-builder-workspace/.dependencies/checkouts/Decomposed/Sources/Decomposed/Interpolatable.swift /Users/admin/builder/spi-builder-workspace/.dependencies/checkouts/Decomposed/Sources/Decomposed/SIMDConvenienceExtensions.swift /Users/admin/builder/spi-builder-workspace/.dependencies/checkouts/Decomposed/Sources/Decomposed/SIMDDecomposed.swift -target arm64_32-apple-watchos6.0 -enable-objc-interop -sdk /Applications/Xcode-16.3.0.app/Contents/Developer/Platforms/WatchOS.platform/Developer/SDKs/WatchOS11.4.sdk -I /Users/admin/builder/spi-builder-workspace/.derivedData/Build/Products/Debug-watchos -I /Applications/Xcode-16.3.0.app/Contents/Developer/Platforms/WatchOS.platform/Developer/usr/lib -F /Users/admin/builder/spi-builder-workspace/.derivedData/Build/Products/Debug-watchos -F /Applications/Xcode-16.3.0.app/Contents/Developer/Platforms/WatchOS.platform/Developer/Library/Frameworks -F /Applications/Xcode-16.3.0.app/Contents/Developer/Platforms/WatchOS.platform/Developer/SDKs/WatchOS11.4.sdk/Developer/Library/Frameworks -no-color-diagnostics -enable-testing -g -debug-info-format\=dwarf -dwarf-version\=4 -module-cache-path /Users/admin/builder/spi-builder-workspace/.derivedData/ModuleCache.noindex -suppress-warnings -profile-generate -profile-coverage-mapping -swift-version 5 -enforce-exclusivity\=checked -stats-output-dir /Users/admin/builder/spi-builder-workspace/.swiftpm/xcode/.stats -Onone -D SWIFT_PACKAGE -D DEBUG -serialize-debugging-options -const-gather-protocols-file /Users/admin/builder/spi-builder-workspace/.derivedData/Build/Intermediates.noindex/Decomposed.build/Debug-watchos/Decomposed.build/Objects-normal/arm64_32/Decomposed_const_extract_protocols.json -enable-upcoming-feature StrictConcurrency -enable-upcoming-feature DisableOutwardActorInference -enable-upcoming-feature GlobalActorIsolatedTypesUsability -enable-upcoming-feature InferSendableFromCaptures -enable-experimental-feature DebugDescriptionMacro -strict-concurrency\=complete -empty-abi-descriptor -plugin-path /Applications/Xcode-16.3.0.app/Contents/Developer/Toolchains/XcodeDefault.xctoolchain/usr/lib/swift/host/plugins/testing -validate-clang-modules-once -clang-build-session-file /Users/admin/builder/spi-builder-workspace/.derivedData/ModuleCache.noindex/Session.modulevalidation -Xcc -working-directory -Xcc /Users/admin/builder/spi-builder-workspace/.swiftpm/xcode -resource-dir /Applications/Xcode-16.3.0.app/Contents/Developer/Toolchains/XcodeDefault.xctoolchain/usr/lib/swift -enable-anonymous-context-mangled-names -file-compilation-dir /Users/admin/builder/spi-builder-workspace/.swiftpm/xcode -Xcc -ivfsstatcache -Xcc /Users/admin/builder/spi-builder-workspace/.derivedData/SDKStatCaches.noindex/watchos11.4-22T246-43efb940ff07ba2497b70ec94253f576.sdkstatcache -Xcc -I/Users/admin/builder/spi-builder-workspace/.derivedData/Build/Intermediates.noindex/Decomposed.build/Debug-watchos/Decomposed.build/swift-overrides.hmap -Xcc -I/Users/admin/builder/spi-builder-workspace/.derivedData/Build/Products/Debug-watchos/include -Xcc -I/Users/admin/builder/spi-builder-workspace/.derivedData/Build/Intermediates.noindex/Decomposed.build/Debug-watchos/Decomposed.build/DerivedSources-normal/arm64_32 -Xcc -I/Users/admin/builder/spi-builder-workspace/.derivedData/Build/Intermediates.noindex/Decomposed.build/Debug-watchos/Decomposed.build/DerivedSources/arm64_32 -Xcc -I/Users/admin/builder/spi-builder-workspace/.derivedData/Build/Intermediates.noindex/Decomposed.build/Debug-watchos/Decomposed.build/DerivedSources -Xcc -DSWIFT_PACKAGE -Xcc -DDEBUG\=1 -module-name Decomposed -frontend-parseable-output -disable-clang-spi -target-sdk-version 11.4 -target-sdk-name watchos11.4 -external-plugin-path /Applications/Xcode-16.3.0.app/Contents/Developer/Platforms/WatchOS.platform/Developer/usr/lib/swift/host/plugins\#/Applications/Xcode-16.3.0.app/Contents/Developer/Platforms/WatchOS.platform/Developer/usr/bin/swift-plugin-server -external-plugin-path /Applications/Xcode-16.3.0.app/Contents/Developer/Platforms/WatchOS.platform/Developer/usr/local/lib/swift/host/plugins\#/Applications/Xcode-16.3.0.app/Contents/Developer/Platforms/WatchOS.platform/Developer/usr/bin/swift-plugin-server -in-process-plugin-server-path /Applications/Xcode-16.3.0.app/Contents/Developer/Toolchains/XcodeDefault.xctoolchain/usr/lib/swift/host/libSwiftInProcPluginServer.dylib -plugin-path /Applications/Xcode-16.3.0.app/Contents/Developer/Toolchains/XcodeDefault.xctoolchain/usr/lib/swift/host/plugins -plugin-path /Applications/Xcode-16.3.0.app/Contents/Developer/Toolchains/XcodeDefault.xctoolchain/usr/local/lib/swift/host/plugins -emit-module-doc-path /Users/admin/builder/spi-builder-workspace/.derivedData/Build/Intermediates.noindex/Decomposed.build/Debug-watchos/Decomposed.build/Objects-normal/arm64_32/Decomposed.swiftdoc -emit-module-source-info-path /Users/admin/builder/spi-builder-workspace/.derivedData/Build/Intermediates.noindex/Decomposed.build/Debug-watchos/Decomposed.build/Objects-normal/arm64_32/Decomposed.swiftsourceinfo -emit-objc-header-path /Users/admin/builder/spi-builder-workspace/.derivedData/Build/Intermediates.noindex/Decomposed.build/Debug-watchos/Decomposed.build/Objects-normal/arm64_32/Decomposed-Swift.h -serialize-diagnostics-path /Users/admin/builder/spi-builder-workspace/.derivedData/Build/Intermediates.noindex/Decomposed.build/Debug-watchos/Decomposed.build/Objects-normal/arm64_32/Decomposed-master-emit-module.dia -emit-dependencies-path /Users/admin/builder/spi-builder-workspace/.derivedData/Build/Intermediates.noindex/Decomposed.build/Debug-watchos/Decomposed.build/Objects-normal/arm64_32/Decomposed-master-emit-module.d -o /Users/admin/builder/spi-builder-workspace/.derivedData/Build/Intermediates.noindex/Decomposed.build/Debug-watchos/Decomposed.build/Objects-normal/arm64_32/Decomposed.swiftmodule -emit-abi-descriptor-path /Users/admin/builder/spi-builder-workspace/.derivedData/Build/Intermediates.noindex/Decomposed.build/Debug-watchos/Decomposed.build/Objects-normal/arm64_32/Decomposed.abi.json
EmitSwiftModule normal arm64_32 (in target 'Decomposed' from project 'Decomposed')
    cd /Users/admin/builder/spi-builder-workspace/.swiftpm/xcode

/Users/admin/builder/spi-builder-workspace/.dependencies/checkouts/Decomposed/Sources/Decomposed/CALayerExtensions.swift:14:18: error: 'CALayer' is unavailable in watchOS
public extension CALayer {
                 ^~~~~~~
/Applications/Xcode-16.3.0.app/Contents/Developer/Platforms/WatchOS.platform/Developer/SDKs/WatchOS11.4.sdk/System/Library/Frameworks/QuartzCore.framework/Headers/CALayer.h:86:12: note: 'CALayer' has been explicitly marked unavailable here
@interface CALayer : NSObject <NSSecureCoding, CAMediaTiming>
           ^
/Users/admin/builder/spi-builder-workspace/.dependencies/checkouts/Decomposed/Sources/Decomposed/CATransform3DExtensions.swift:14:24: error: 'CATransform3D' is unavailable in watchOS
  static var identity: CATransform3D {
                       ^~~~~~~~~~~~~
/Applications/Xcode-16.3.0.app/Contents/Developer/Platforms/WatchOS.platform/Developer/SDKs/WatchOS11.4.sdk/System/Library/Frameworks/QuartzCore.framework/Headers/CATransform3D.h:17:8: note: 'CATransform3D' has been explicitly marked unavailable here
struct CATransform3D
       ^
/Users/admin/builder/spi-builder-workspace/.dependencies/checkouts/Decomposed/Sources/Decomposed/CATransform3DExtensions.swift:19:20: error: 'CATransform3D' is unavailable in watchOS
  static var zero: CATransform3D {
                   ^~~~~~~~~~~~~
/Applications/Xcode-16.3.0.app/Contents/Developer/Platforms/WatchOS.platform/Developer/SDKs/WatchOS11.4.sdk/System/Library/Frameworks/QuartzCore.framework/Headers/CATransform3D.h:17:8: note: 'CATransform3D' has been explicitly marked unavailable here
struct CATransform3D
       ^
/Users/admin/builder/spi-builder-workspace/.dependencies/checkouts/Decomposed/Sources/Decomposed/CATransform3DExtensions.swift:11:18: error: 'CATransform3D' is unavailable in watchOS
public extension CATransform3D {
                 ^~~~~~~~~~~~~
/Applications/Xcode-16.3.0.app/Contents/Developer/Platforms/WatchOS.platform/Developer/SDKs/WatchOS11.4.sdk/System/Library/Frameworks/QuartzCore.framework/Headers/CATransform3D.h:17:8: note: 'CATransform3D' has been explicitly marked unavailable here
struct CATransform3D
       ^
/Users/admin/builder/spi-builder-workspace/.dependencies/checkouts/Decomposed/Sources/Decomposed/CATransform3DExtensions.swift:384:33: error: 'CATransform3D' is unavailable in watchOS
    public func recomposed() -> CATransform3D {
                                ^~~~~~~~~~~~~
/Applications/Xcode-16.3.0.app/Contents/Developer/Platforms/WatchOS.platform/Developer/SDKs/WatchOS11.4.sdk/System/Library/Frameworks/QuartzCore.framework/Headers/CATransform3D.h:17:8: note: 'CATransform3D' has been explicitly marked unavailable here
struct CATransform3D
       ^
/Users/admin/builder/spi-builder-workspace/.dependencies/checkouts/Decomposed/Sources/Decomposed/CATransform3DExtensions.swift:316:18: error: 'CATransform3D' is unavailable in watchOS
public extension CATransform3D {
                 ^~~~~~~~~~~~~
/Applications/Xcode-16.3.0.app/Contents/Developer/Platforms/WatchOS.platform/Developer/SDKs/WatchOS11.4.sdk/System/Library/Frameworks/QuartzCore.framework/Headers/CATransform3D.h:17:8: note: 'CATransform3D' has been explicitly marked unavailable here
struct CATransform3D
       ^
/Users/admin/builder/spi-builder-workspace/.dependencies/checkouts/Decomposed/Sources/Decomposed/CATransform3DExtensions.swift:394:11: error: 'CATransform3D' is unavailable in watchOS
extension CATransform3D.DecomposedTransform: Interpolatable {
          ^~~~~~~~~~~~~
/Applications/Xcode-16.3.0.app/Contents/Developer/Platforms/WatchOS.platform/Developer/SDKs/WatchOS11.4.sdk/System/Library/Frameworks/QuartzCore.framework/Headers/CATransform3D.h:17:8: note: 'CATransform3D' has been explicitly marked unavailable here
struct CATransform3D
       ^
/Users/admin/builder/spi-builder-workspace/.dependencies/checkouts/Decomposed/Sources/Decomposed/CATransform3DExtensions.swift:402:11: error: 'CATransform3D' is unavailable in watchOS
extension CATransform3D: Interpolatable {
          ^~~~~~~~~~~~~
/Applications/Xcode-16.3.0.app/Contents/Developer/Platforms/WatchOS.platform/Developer/SDKs/WatchOS11.4.sdk/System/Library/Frameworks/QuartzCore.framework/Headers/CATransform3D.h:17:8: note: 'CATransform3D' has been explicitly marked unavailable here
struct CATransform3D
       ^
/Users/admin/builder/spi-builder-workspace/.dependencies/checkouts/Decomposed/Sources/Decomposed/Globals.swift:14:3: error: 'CATransaction' is unavailable in watchOS
  CATransaction.begin()
  ^~~~~~~~~~~~~
/Applications/Xcode-16.3.0.app/Contents/Developer/Platforms/WatchOS.platform/Developer/SDKs/WatchOS11.4.sdk/System/Library/Frameworks/QuartzCore.framework/Headers/CATransaction.h:34:12: note: 'CATransaction' has been explicitly marked unavailable here
@interface CATransaction : NSObject
           ^
/Users/admin/builder/spi-builder-workspace/.dependencies/checkouts/Decomposed/Sources/Decomposed/Globals.swift:15:3: error: 'CATransaction' is unavailable in watchOS
  CATransaction.setDisableActions(true)
  ^~~~~~~~~~~~~
/Applications/Xcode-16.3.0.app/Contents/Developer/Platforms/WatchOS.platform/Developer/SDKs/WatchOS11.4.sdk/System/Library/Frameworks/QuartzCore.framework/Headers/CATransaction.h:34:12: note: 'CATransaction' has been explicitly marked unavailable here
@interface CATransaction : NSObject
           ^
/Users/admin/builder/spi-builder-workspace/.dependencies/checkouts/Decomposed/Sources/Decomposed/Globals.swift:17:3: error: 'CATransaction' is unavailable in watchOS
  CATransaction.commit()
  ^~~~~~~~~~~~~
/Applications/Xcode-16.3.0.app/Contents/Developer/Platforms/WatchOS.platform/Developer/SDKs/WatchOS11.4.sdk/System/Library/Frameworks/QuartzCore.framework/Headers/CATransaction.h:34:12: note: 'CATransaction' has been explicitly marked unavailable here
@interface CATransaction : NSObject
           ^
/Users/admin/builder/spi-builder-workspace/.dependencies/checkouts/Decomposed/Sources/Decomposed/SIMDDecomposed.swift:28:21: error: 'CATransform3D' is unavailable in watchOS
  init(_ transform: CATransform3D) {
                    ^~~~~~~~~~~~~
/Applications/Xcode-16.3.0.app/Contents/Developer/Platforms/WatchOS.platform/Developer/SDKs/WatchOS11.4.sdk/System/Library/Frameworks/QuartzCore.framework/Headers/CATransform3D.h:17:8: note: 'CATransform3D' has been explicitly marked unavailable here
struct CATransform3D
       ^
/Users/admin/builder/spi-builder-workspace/.dependencies/checkouts/Decomposed/Sources/Decomposed/SIMDDecomposed.swift:393:21: error: 'CATransform3D' is unavailable in watchOS
  init(_ transform: CATransform3D) {
                    ^~~~~~~~~~~~~
/Applications/Xcode-16.3.0.app/Contents/Developer/Platforms/WatchOS.platform/Developer/SDKs/WatchOS11.4.sdk/System/Library/Frameworks/QuartzCore.framework/Headers/CATransform3D.h:17:8: note: 'CATransform3D' has been explicitly marked unavailable here
struct CATransform3D
       ^
SwiftEmitModule normal arm64 Emitting\ module\ for\ Decomposed (in target 'Decomposed' from project 'Decomposed')
EmitSwiftModule normal arm64 (in target 'Decomposed' from project 'Decomposed')
    cd /Users/admin/builder/spi-builder-workspace/.swiftpm/xcode

SwiftEmitModule normal armv7k Emitting\ module\ for\ Decomposed (in target 'Decomposed' from project 'Decomposed')
EmitSwiftModule normal armv7k (in target 'Decomposed' from project 'Decomposed')
    cd /Users/admin/builder/spi-builder-workspace/.swiftpm/xcode

SwiftCompile normal armv7k Compiling\ CGFloatVectorTypes.swift /Users/admin/builder/spi-builder-workspace/.dependencies/checkouts/Decomposed/Sources/Decomposed/CGFloatVectorTypes.swift (in target 'Decomposed' from project 'Decomposed')
SwiftCompile normal armv7k /Users/admin/builder/spi-builder-workspace/.dependencies/checkouts/Decomposed/Sources/Decomposed/CGFloatVectorTypes.swift (in target 'Decomposed' from project 'Decomposed')
    cd /Users/admin/builder/spi-builder-workspace/.swiftpm/xcode

SwiftCompile normal armv7k Compiling\ SIMDConvenienceExtensions.swift /Users/admin/builder/spi-builder-workspace/.dependencies/checkouts/Decomposed/Sources/Decomposed/SIMDConvenienceExtensions.swift (in target 'Decomposed' from project 'Decomposed')
SwiftCompile normal armv7k /Users/admin/builder/spi-builder-workspace/.dependencies/checkouts/Decomposed/Sources/Decomposed/SIMDConvenienceExtensions.swift (in target 'Decomposed' from project 'Decomposed')
    cd /Users/admin/builder/spi-builder-workspace/.swiftpm/xcode

SwiftCompile normal arm64_32 Compiling\ CATransform3DExtensions.swift /Users/admin/builder/spi-builder-workspace/.dependencies/checkouts/Decomposed/Sources/Decomposed/CATransform3DExtensions.swift (in target 'Decomposed' from project 'Decomposed')
Command SwiftCompile failed with a nonzero exit code
** BUILD FAILED **
The following build commands failed:
	SwiftEmitModule normal arm64_32 Emitting\ module\ for\ Decomposed (in target 'Decomposed' from project 'Decomposed')
	EmitSwiftModule normal arm64_32 (in target 'Decomposed' from project 'Decomposed')
	SwiftCompile normal arm64_32 Compiling\ CATransform3DExtensions.swift /Users/admin/builder/spi-builder-workspace/.dependencies/checkouts/Decomposed/Sources/Decomposed/CATransform3DExtensions.swift (in target 'Decomposed' from project 'Decomposed')
	Building workspace spi-builder-workspace with scheme Anima
(4 failures)
Command line invocation:
    /Applications/Xcode-16.3.0.app/Contents/Developer/usr/bin/xcodebuild -IDEClonedSourcePackagesDirPathOverride=/Users/admin/builder/spi-builder-workspace/.dependencies -resolvePackageDependencies
Resolve Package Graph
Resolved source packages:
  Anima: /Users/admin/builder/spi-builder-workspace
  Decomposed: https://github.com/b3ll/Decomposed.git @ main (225ec77)
resolved source packages: Anima, Decomposed
{
  "dependencies" : [
    {
      "identity" : "decomposed",
      "requirement" : {
        "branch" : [
          "main"
        ]
      },
      "type" : "sourceControl",
      "url" : "https://github.com/b3ll/Decomposed.git"
    }
  ],
  "manifest_display_name" : "Anima",
  "name" : "Anima",
  "path" : "/Users/admin/builder/spi-builder-workspace",
  "platforms" : [
    {
      "name" : "ios",
      "version" : "13.0"
    },
    {
      "name" : "macos",
      "version" : "11.0"
    },
    {
      "name" : "tvos",
      "version" : "13.0"
    }
  ],
  "products" : [
    {
      "name" : "Anima",
      "targets" : [
        "Anima"
      ],
      "type" : {
        "library" : [
          "automatic"
        ]
      }
    }
  ],
  "targets" : [
    {
      "c99name" : "AnimaTests",
      "module_type" : "SwiftTarget",
      "name" : "AnimaTests",
      "path" : "Tests/AnimaTests",
      "sources" : [
        "AnimaTests.swift"
      ],
      "target_dependencies" : [
        "Anima"
      ],
      "type" : "test"
    },
    {
      "c99name" : "Anima",
      "module_type" : "SwiftTarget",
      "name" : "Anima",
      "path" : "Sources/Anima",
      "product_dependencies" : [
        "Decomposed"
      ],
      "product_memberships" : [
        "Anima"
      ],
      "sources" : [
        "Anima/Anima+AnimationConfiguration.swift",
        "Anima/Anima+AnimationOptions.swift",
        "Anima/Anima+AnimationState.swift",
        "Anima/Anima.swift",
        "Anima/AnimationController.swift",
        "AnimatableProperty/AnimatableArray.swift",
        "AnimatableProperty/AnimatableProperty.swift",
        "AnimatablePropertyProvider/AnimatablePropertyProvider.swift",
        "AnimatablePropertyProvider/AnimationProvider.swift",
        "AnimatablePropertyProvider/PropertyAnimator+Layer.swift",
        "AnimatablePropertyProvider/PropertyAnimator+Layout.swift",
        "AnimatablePropertyProvider/PropertyAnimator+Popover.swift",
        "AnimatablePropertyProvider/PropertyAnimator+View.swift",
        "AnimatablePropertyProvider/PropertyAnimator+Window.swift",
        "AnimatablePropertyProvider/PropertyAnimator.swift",
        "AnimationProviding/AnimatingState.swift",
        "AnimationProviding/AnimationEvent.swift",
        "AnimationProviding/AnimationPosition.swift",
        "AnimationProviding/AnimationProviding.swift",
        "Animations/Cubic/CubicAnimation.swift",
        "Animations/Cubic/CubicFunction.swift",
        "Animations/Decay/DecayAnimation.swift",
        "Animations/Decay/DecayFunction.swift",
        "Animations/Easing/EasingAnimation.swift",
        "Animations/Easing/TimingFunction.swift",
        "Animations/Misc/ColorAnimation.swift",
        "Animations/Misc/Keyframe.swift",
        "Animations/Property/PropertyAnimation.swift",
        "Animations/Spring/Spring.swift",
        "Animations/Spring/SpringAnimation.swift",
        "Extensions/AssociatedValue.swift",
        "Extensions/Colors/CGColor+.swift",
        "Extensions/Colors/NSUIColor+.swift",
        "Extensions/CoreAnimation/CALayer+.swift",
        "Extensions/CoreAnimation/CAMediaTimingFunction+.swift",
        "Extensions/CoreAnimation/CATransform3D+.swift",
        "Extensions/CoreAnimation/InnerShadowLayer.swift",
        "Extensions/DisplayLink+Combine.swift",
        "Extensions/KVO/KeyValueObserver.swift",
        "Extensions/KVO/NSObject+Observe.swift",
        "Extensions/KVO/NotificationCenter+.swift",
        "Extensions/KeyPath+.swift",
        "Extensions/Math & Geometry/ApproximateEquatable.swift",
        "Extensions/Math & Geometry/CVTimeStamp+.swift",
        "Extensions/Math & Geometry/Comparable+Clamp.swift",
        "Extensions/Math & Geometry/CoreGraphics+.swift",
        "Extensions/Math & Geometry/NSUIBezierpath+.swift",
        "Extensions/Math & Geometry/NSUIEdgeInset+.swift",
        "Extensions/Math & Geometry/NSValue+.swift",
        "Extensions/Math & Geometry/Number+FloatInitializable.swift",
        "Extensions/Math & Geometry/Sequence+Sort.swift",
        "Extensions/Math & Geometry/TimeInterval+.swift",
        "Extensions/Math & Geometry/VectorArithmetic+.swift",
        "Extensions/NSUI Typealias.swift",
        "Extensions/Optional.swift",
        "Extensions/Views/NSScrollView+.swift",
        "Extensions/Views/NSUITextField+.swift",
        "Extensions/Views/NSUIView+.swift",
        "Misc/CAKeyFrameAnimation/CAKeyframeAnimationEmittable+Layer.swift",
        "Misc/CAKeyFrameAnimation/CAKeyframeAnimationEmittable.swift",
        "Misc/CAKeyFrameAnimation/CAKeyframeAnimationValueConvertible.swift",
        "Misc/ContentConfiguration/BorderConfiguration.swift",
        "Misc/ContentConfiguration/ShadowConfiguration.swift",
        "Misc/Rubberband.swift"
      ],
      "type" : "library"
    }
  ],
  "tools_version" : "5.5"
}
{
  "workspace" : {
    "name" : "spi-builder-workspace",
    "schemes" : [
      "Anima"
    ]
  }
}
Running build ...
env DEVELOPER_DIR=/Applications/Xcode-16.3.0.app xcrun xcodebuild -IDEClonedSourcePackagesDirPathOverride=$PWD/.dependencies -skipMacroValidation -skipPackagePluginValidation -derivedDataPath $PWD/.derivedData build -scheme Anima -destination generic/platform=watchOS
Command line invocation:
    /Applications/Xcode-16.3.0.app/Contents/Developer/usr/bin/xcodebuild -IDEClonedSourcePackagesDirPathOverride=/Users/admin/builder/spi-builder-workspace/.dependencies -skipMacroValidation -skipPackagePluginValidation -derivedDataPath /Users/admin/builder/spi-builder-workspace/.derivedData build -scheme Anima -destination generic/platform=watchOS
Resolve Package Graph
Resolved source packages:
  Anima: /Users/admin/builder/spi-builder-workspace
  Decomposed: https://github.com/b3ll/Decomposed.git @ main (225ec77)
ComputePackagePrebuildTargetDependencyGraph
Prepare packages
CreateBuildRequest
SendProjectDescription
CreateBuildOperation
ComputeTargetDependencyGraph
note: Building targets in dependency order
note: Target dependency graph (5 targets)
    Target 'AnimaTests' in project 'Anima'
        ➜ Explicit dependency on target 'Anima' in project 'Anima'
        ➜ Explicit dependency on target 'Decomposed' in project 'Decomposed'
    Target 'Anima' in project 'Anima'
        ➜ Explicit dependency on target 'Anima' in project 'Anima'
        ➜ Explicit dependency on target 'Decomposed' in project 'Decomposed'
    Target 'Anima' in project 'Anima'
        ➜ Explicit dependency on target 'Decomposed' in project 'Decomposed'
    Target 'Decomposed' in project 'Decomposed'
        ➜ Explicit dependency on target 'Decomposed' in project 'Decomposed'
    Target 'Decomposed' in project 'Decomposed' (no dependencies)
GatherProvisioningInputs
CreateBuildDescription
ExecuteExternalTool /Applications/Xcode-16.3.0.app/Contents/Developer/Toolchains/XcodeDefault.xctoolchain/usr/bin/swiftc --version
ExecuteExternalTool /Applications/Xcode-16.3.0.app/Contents/Developer/Toolchains/XcodeDefault.xctoolchain/usr/bin/clang -v -E -dM -isysroot /Applications/Xcode-16.3.0.app/Contents/Developer/Platforms/WatchOS.platform/Developer/SDKs/WatchOS11.4.sdk -x c -c /dev/null
ExecuteExternalTool /Applications/Xcode-16.3.0.app/Contents/Developer/Toolchains/XcodeDefault.xctoolchain/usr/bin/ld -version_details
ReadFileContents /Applications/Xcode-16.3.0.app/Contents/Developer/Toolchains/XcodeDefault.xctoolchain/usr/share/docc/features.json
Build description signature: 83ba3552b19b87f1b13f7a0b2f1c2dd9
Build description path: /Users/admin/builder/spi-builder-workspace/.derivedData/Build/Intermediates.noindex/XCBuildData/83ba3552b19b87f1b13f7a0b2f1c2dd9.xcbuilddata
ClangStatCache /Applications/Xcode-16.3.0.app/Contents/Developer/Toolchains/XcodeDefault.xctoolchain/usr/bin/clang-stat-cache /Applications/Xcode-16.3.0.app/Contents/Developer/Platforms/WatchOS.platform/Developer/SDKs/WatchOS11.4.sdk /Users/admin/builder/spi-builder-workspace/.derivedData/SDKStatCaches.noindex/watchos11.4-22T246-43efb940ff07ba2497b70ec94253f576.sdkstatcache
    cd /Users/admin/builder/spi-builder-workspace/.swiftpm/xcode
    /Applications/Xcode-16.3.0.app/Contents/Developer/Toolchains/XcodeDefault.xctoolchain/usr/bin/clang-stat-cache /Applications/Xcode-16.3.0.app/Contents/Developer/Platforms/WatchOS.platform/Developer/SDKs/WatchOS11.4.sdk -o /Users/admin/builder/spi-builder-workspace/.derivedData/SDKStatCaches.noindex/watchos11.4-22T246-43efb940ff07ba2497b70ec94253f576.sdkstatcache
SwiftDriver Decomposed normal arm64 com.apple.xcode.tools.swift.compiler (in target 'Decomposed' from project 'Decomposed')
    cd /Users/admin/builder/spi-builder-workspace/.swiftpm/xcode
    builtin-SwiftDriver -- /Applications/Xcode-16.3.0.app/Contents/Developer/Toolchains/XcodeDefault.xctoolchain/usr/bin/swiftc -module-name Decomposed -Onone -enforce-exclusivity\=checked @/Users/admin/builder/spi-builder-workspace/.derivedData/Build/Intermediates.noindex/Decomposed.build/Debug-watchos/Decomposed.build/Objects-normal/arm64/Decomposed.SwiftFileList -DSWIFT_PACKAGE -DDEBUG -DXcode -plugin-path /Applications/Xcode-16.3.0.app/Contents/Developer/Toolchains/XcodeDefault.xctoolchain/usr/lib/swift/host/plugins/testing -enable-experimental-feature DebugDescriptionMacro -sdk /Applications/Xcode-16.3.0.app/Contents/Developer/Platforms/WatchOS.platform/Developer/SDKs/WatchOS11.4.sdk -target arm64-apple-watchos6.0 -g -module-cache-path /Users/admin/builder/spi-builder-workspace/.derivedData/ModuleCache.noindex -Xfrontend -serialize-debugging-options -profile-coverage-mapping -profile-generate -enable-testing -suppress-warnings -index-store-path /Users/admin/builder/spi-builder-workspace/.derivedData/Index.noindex/DataStore -swift-version 5 -I /Users/admin/builder/spi-builder-workspace/.derivedData/Build/Products/Debug-watchos -I /Applications/Xcode-16.3.0.app/Contents/Developer/Platforms/WatchOS.platform/Developer/usr/lib -F /Users/admin/builder/spi-builder-workspace/.derivedData/Build/Products/Debug-watchos -F /Applications/Xcode-16.3.0.app/Contents/Developer/Platforms/WatchOS.platform/Developer/Library/Frameworks -F /Applications/Xcode-16.3.0.app/Contents/Developer/Platforms/WatchOS.platform/Developer/SDKs/WatchOS11.4.sdk/Developer/Library/Frameworks -c -j10 -enable-batch-mode -incremental -Xcc -ivfsstatcache -Xcc /Users/admin/builder/spi-builder-workspace/.derivedData/SDKStatCaches.noindex/watchos11.4-22T246-43efb940ff07ba2497b70ec94253f576.sdkstatcache -output-file-map /Users/admin/builder/spi-builder-workspace/.derivedData/Build/Intermediates.noindex/Decomposed.build/Debug-watchos/Decomposed.build/Objects-normal/arm64/Decomposed-OutputFileMap.json -use-frontend-parseable-output -save-temps -no-color-diagnostics -serialize-diagnostics -emit-dependencies -emit-module -emit-module-path /Users/admin/builder/spi-builder-workspace/.derivedData/Build/Intermediates.noindex/Decomposed.build/Debug-watchos/Decomposed.build/Objects-normal/arm64/Decomposed.swiftmodule -validate-clang-modules-once -clang-build-session-file /Users/admin/builder/spi-builder-workspace/.derivedData/ModuleCache.noindex/Session.modulevalidation -Xcc -I/Users/admin/builder/spi-builder-workspace/.derivedData/Build/Intermediates.noindex/Decomposed.build/Debug-watchos/Decomposed.build/swift-overrides.hmap -emit-const-values -Xfrontend -const-gather-protocols-file -Xfrontend /Users/admin/builder/spi-builder-workspace/.derivedData/Build/Intermediates.noindex/Decomposed.build/Debug-watchos/Decomposed.build/Objects-normal/arm64/Decomposed_const_extract_protocols.json -Xcc -I/Users/admin/builder/spi-builder-workspace/.derivedData/Build/Products/Debug-watchos/include -Xcc -I/Users/admin/builder/spi-builder-workspace/.derivedData/Build/Intermediates.noindex/Decomposed.build/Debug-watchos/Decomposed.build/DerivedSources-normal/arm64 -Xcc -I/Users/admin/builder/spi-builder-workspace/.derivedData/Build/Intermediates.noindex/Decomposed.build/Debug-watchos/Decomposed.build/DerivedSources/arm64 -Xcc -I/Users/admin/builder/spi-builder-workspace/.derivedData/Build/Intermediates.noindex/Decomposed.build/Debug-watchos/Decomposed.build/DerivedSources -Xcc -DSWIFT_PACKAGE -Xcc -DDEBUG\=1 -emit-objc-header -emit-objc-header-path /Users/admin/builder/spi-builder-workspace/.derivedData/Build/Intermediates.noindex/Decomposed.build/Debug-watchos/Decomposed.build/Objects-normal/arm64/Decomposed-Swift.h -working-directory /Users/admin/builder/spi-builder-workspace/.swiftpm/xcode -experimental-emit-module-separately -disable-cmo
SwiftDriver Decomposed normal armv7k com.apple.xcode.tools.swift.compiler (in target 'Decomposed' from project 'Decomposed')
    cd /Users/admin/builder/spi-builder-workspace/.swiftpm/xcode
    builtin-SwiftDriver -- /Applications/Xcode-16.3.0.app/Contents/Developer/Toolchains/XcodeDefault.xctoolchain/usr/bin/swiftc -module-name Decomposed -Onone -enforce-exclusivity\=checked @/Users/admin/builder/spi-builder-workspace/.derivedData/Build/Intermediates.noindex/Decomposed.build/Debug-watchos/Decomposed.build/Objects-normal/armv7k/Decomposed.SwiftFileList -DSWIFT_PACKAGE -DDEBUG -DXcode -plugin-path /Applications/Xcode-16.3.0.app/Contents/Developer/Toolchains/XcodeDefault.xctoolchain/usr/lib/swift/host/plugins/testing -enable-experimental-feature DebugDescriptionMacro -sdk /Applications/Xcode-16.3.0.app/Contents/Developer/Platforms/WatchOS.platform/Developer/SDKs/WatchOS11.4.sdk -target armv7k-apple-watchos6.0 -g -module-cache-path /Users/admin/builder/spi-builder-workspace/.derivedData/ModuleCache.noindex -Xfrontend -serialize-debugging-options -profile-coverage-mapping -profile-generate -enable-testing -suppress-warnings -index-store-path /Users/admin/builder/spi-builder-workspace/.derivedData/Index.noindex/DataStore -swift-version 5 -I /Users/admin/builder/spi-builder-workspace/.derivedData/Build/Products/Debug-watchos -I /Applications/Xcode-16.3.0.app/Contents/Developer/Platforms/WatchOS.platform/Developer/usr/lib -F /Users/admin/builder/spi-builder-workspace/.derivedData/Build/Products/Debug-watchos -F /Applications/Xcode-16.3.0.app/Contents/Developer/Platforms/WatchOS.platform/Developer/Library/Frameworks -F /Applications/Xcode-16.3.0.app/Contents/Developer/Platforms/WatchOS.platform/Developer/SDKs/WatchOS11.4.sdk/Developer/Library/Frameworks -c -j10 -enable-batch-mode -incremental -Xcc -ivfsstatcache -Xcc /Users/admin/builder/spi-builder-workspace/.derivedData/SDKStatCaches.noindex/watchos11.4-22T246-43efb940ff07ba2497b70ec94253f576.sdkstatcache -output-file-map /Users/admin/builder/spi-builder-workspace/.derivedData/Build/Intermediates.noindex/Decomposed.build/Debug-watchos/Decomposed.build/Objects-normal/armv7k/Decomposed-OutputFileMap.json -use-frontend-parseable-output -save-temps -no-color-diagnostics -serialize-diagnostics -emit-dependencies -emit-module -emit-module-path /Users/admin/builder/spi-builder-workspace/.derivedData/Build/Intermediates.noindex/Decomposed.build/Debug-watchos/Decomposed.build/Objects-normal/armv7k/Decomposed.swiftmodule -validate-clang-modules-once -clang-build-session-file /Users/admin/builder/spi-builder-workspace/.derivedData/ModuleCache.noindex/Session.modulevalidation -Xcc -I/Users/admin/builder/spi-builder-workspace/.derivedData/Build/Intermediates.noindex/Decomposed.build/Debug-watchos/Decomposed.build/swift-overrides.hmap -emit-const-values -Xfrontend -const-gather-protocols-file -Xfrontend /Users/admin/builder/spi-builder-workspace/.derivedData/Build/Intermediates.noindex/Decomposed.build/Debug-watchos/Decomposed.build/Objects-normal/armv7k/Decomposed_const_extract_protocols.json -Xcc -I/Users/admin/builder/spi-builder-workspace/.derivedData/Build/Products/Debug-watchos/include -Xcc -I/Users/admin/builder/spi-builder-workspace/.derivedData/Build/Intermediates.noindex/Decomposed.build/Debug-watchos/Decomposed.build/DerivedSources-normal/armv7k -Xcc -I/Users/admin/builder/spi-builder-workspace/.derivedData/Build/Intermediates.noindex/Decomposed.build/Debug-watchos/Decomposed.build/DerivedSources/armv7k -Xcc -I/Users/admin/builder/spi-builder-workspace/.derivedData/Build/Intermediates.noindex/Decomposed.build/Debug-watchos/Decomposed.build/DerivedSources -Xcc -DSWIFT_PACKAGE -Xcc -DDEBUG\=1 -emit-objc-header -emit-objc-header-path /Users/admin/builder/spi-builder-workspace/.derivedData/Build/Intermediates.noindex/Decomposed.build/Debug-watchos/Decomposed.build/Objects-normal/armv7k/Decomposed-Swift.h -working-directory /Users/admin/builder/spi-builder-workspace/.swiftpm/xcode -experimental-emit-module-separately -disable-cmo
SwiftDriver Decomposed normal arm64_32 com.apple.xcode.tools.swift.compiler (in target 'Decomposed' from project 'Decomposed')
    cd /Users/admin/builder/spi-builder-workspace/.swiftpm/xcode
    builtin-SwiftDriver -- /Applications/Xcode-16.3.0.app/Contents/Developer/Toolchains/XcodeDefault.xctoolchain/usr/bin/swiftc -module-name Decomposed -Onone -enforce-exclusivity\=checked @/Users/admin/builder/spi-builder-workspace/.derivedData/Build/Intermediates.noindex/Decomposed.build/Debug-watchos/Decomposed.build/Objects-normal/arm64_32/Decomposed.SwiftFileList -DSWIFT_PACKAGE -DDEBUG -DXcode -plugin-path /Applications/Xcode-16.3.0.app/Contents/Developer/Toolchains/XcodeDefault.xctoolchain/usr/lib/swift/host/plugins/testing -enable-experimental-feature DebugDescriptionMacro -sdk /Applications/Xcode-16.3.0.app/Contents/Developer/Platforms/WatchOS.platform/Developer/SDKs/WatchOS11.4.sdk -target arm64_32-apple-watchos6.0 -g -module-cache-path /Users/admin/builder/spi-builder-workspace/.derivedData/ModuleCache.noindex -Xfrontend -serialize-debugging-options -profile-coverage-mapping -profile-generate -enable-testing -suppress-warnings -index-store-path /Users/admin/builder/spi-builder-workspace/.derivedData/Index.noindex/DataStore -swift-version 5 -I /Users/admin/builder/spi-builder-workspace/.derivedData/Build/Products/Debug-watchos -I /Applications/Xcode-16.3.0.app/Contents/Developer/Platforms/WatchOS.platform/Developer/usr/lib -F /Users/admin/builder/spi-builder-workspace/.derivedData/Build/Products/Debug-watchos -F /Applications/Xcode-16.3.0.app/Contents/Developer/Platforms/WatchOS.platform/Developer/Library/Frameworks -F /Applications/Xcode-16.3.0.app/Contents/Developer/Platforms/WatchOS.platform/Developer/SDKs/WatchOS11.4.sdk/Developer/Library/Frameworks -c -j10 -enable-batch-mode -incremental -Xcc -ivfsstatcache -Xcc /Users/admin/builder/spi-builder-workspace/.derivedData/SDKStatCaches.noindex/watchos11.4-22T246-43efb940ff07ba2497b70ec94253f576.sdkstatcache -output-file-map /Users/admin/builder/spi-builder-workspace/.derivedData/Build/Intermediates.noindex/Decomposed.build/Debug-watchos/Decomposed.build/Objects-normal/arm64_32/Decomposed-OutputFileMap.json -use-frontend-parseable-output -save-temps -no-color-diagnostics -serialize-diagnostics -emit-dependencies -emit-module -emit-module-path /Users/admin/builder/spi-builder-workspace/.derivedData/Build/Intermediates.noindex/Decomposed.build/Debug-watchos/Decomposed.build/Objects-normal/arm64_32/Decomposed.swiftmodule -validate-clang-modules-once -clang-build-session-file /Users/admin/builder/spi-builder-workspace/.derivedData/ModuleCache.noindex/Session.modulevalidation -Xcc -I/Users/admin/builder/spi-builder-workspace/.derivedData/Build/Intermediates.noindex/Decomposed.build/Debug-watchos/Decomposed.build/swift-overrides.hmap -emit-const-values -Xfrontend -const-gather-protocols-file -Xfrontend /Users/admin/builder/spi-builder-workspace/.derivedData/Build/Intermediates.noindex/Decomposed.build/Debug-watchos/Decomposed.build/Objects-normal/arm64_32/Decomposed_const_extract_protocols.json -Xcc -I/Users/admin/builder/spi-builder-workspace/.derivedData/Build/Products/Debug-watchos/include -Xcc -I/Users/admin/builder/spi-builder-workspace/.derivedData/Build/Intermediates.noindex/Decomposed.build/Debug-watchos/Decomposed.build/DerivedSources-normal/arm64_32 -Xcc -I/Users/admin/builder/spi-builder-workspace/.derivedData/Build/Intermediates.noindex/Decomposed.build/Debug-watchos/Decomposed.build/DerivedSources/arm64_32 -Xcc -I/Users/admin/builder/spi-builder-workspace/.derivedData/Build/Intermediates.noindex/Decomposed.build/Debug-watchos/Decomposed.build/DerivedSources -Xcc -DSWIFT_PACKAGE -Xcc -DDEBUG\=1 -emit-objc-header -emit-objc-header-path /Users/admin/builder/spi-builder-workspace/.derivedData/Build/Intermediates.noindex/Decomposed.build/Debug-watchos/Decomposed.build/Objects-normal/arm64_32/Decomposed-Swift.h -working-directory /Users/admin/builder/spi-builder-workspace/.swiftpm/xcode -experimental-emit-module-separately -disable-cmo
SwiftEmitModule normal armv7k Emitting\ module\ for\ Decomposed (in target 'Decomposed' from project 'Decomposed')
EmitSwiftModule normal armv7k (in target 'Decomposed' from project 'Decomposed')
    cd /Users/admin/builder/spi-builder-workspace/.swiftpm/xcode

/Users/admin/builder/spi-builder-workspace/.dependencies/checkouts/Decomposed/Sources/Decomposed/CALayerExtensions.swift:14:18: error: 'CALayer' is unavailable in watchOS
public extension CALayer {
                 ^~~~~~~
/Applications/Xcode-16.3.0.app/Contents/Developer/Platforms/WatchOS.platform/Developer/SDKs/WatchOS11.4.sdk/System/Library/Frameworks/QuartzCore.framework/Headers/CALayer.h:86:12: note: 'CALayer' has been explicitly marked unavailable here
@interface CALayer : NSObject <NSSecureCoding, CAMediaTiming>
           ^
/Users/admin/builder/spi-builder-workspace/.dependencies/checkouts/Decomposed/Sources/Decomposed/CATransform3DExtensions.swift:14:24: error: 'CATransform3D' is unavailable in watchOS
  static var identity: CATransform3D {
                       ^~~~~~~~~~~~~
/Applications/Xcode-16.3.0.app/Contents/Developer/Platforms/WatchOS.platform/Developer/SDKs/WatchOS11.4.sdk/System/Library/Frameworks/QuartzCore.framework/Headers/CATransform3D.h:17:8: note: 'CATransform3D' has been explicitly marked unavailable here
struct CATransform3D
       ^
/Users/admin/builder/spi-builder-workspace/.dependencies/checkouts/Decomposed/Sources/Decomposed/CATransform3DExtensions.swift:19:20: error: 'CATransform3D' is unavailable in watchOS
  static var zero: CATransform3D {
                   ^~~~~~~~~~~~~
/Applications/Xcode-16.3.0.app/Contents/Developer/Platforms/WatchOS.platform/Developer/SDKs/WatchOS11.4.sdk/System/Library/Frameworks/QuartzCore.framework/Headers/CATransform3D.h:17:8: note: 'CATransform3D' has been explicitly marked unavailable here
struct CATransform3D
       ^
/Users/admin/builder/spi-builder-workspace/.dependencies/checkouts/Decomposed/Sources/Decomposed/CATransform3DExtensions.swift:11:18: error: 'CATransform3D' is unavailable in watchOS
public extension CATransform3D {
                 ^~~~~~~~~~~~~
/Applications/Xcode-16.3.0.app/Contents/Developer/Platforms/WatchOS.platform/Developer/SDKs/WatchOS11.4.sdk/System/Library/Frameworks/QuartzCore.framework/Headers/CATransform3D.h:17:8: note: 'CATransform3D' has been explicitly marked unavailable here
struct CATransform3D
       ^
/Users/admin/builder/spi-builder-workspace/.dependencies/checkouts/Decomposed/Sources/Decomposed/CATransform3DExtensions.swift:384:33: error: 'CATransform3D' is unavailable in watchOS
    public func recomposed() -> CATransform3D {
                                ^~~~~~~~~~~~~
/Applications/Xcode-16.3.0.app/Contents/Developer/Platforms/WatchOS.platform/Developer/SDKs/WatchOS11.4.sdk/System/Library/Frameworks/QuartzCore.framework/Headers/CATransform3D.h:17:8: note: 'CATransform3D' has been explicitly marked unavailable here
struct CATransform3D
       ^
/Users/admin/builder/spi-builder-workspace/.dependencies/checkouts/Decomposed/Sources/Decomposed/CATransform3DExtensions.swift:316:18: error: 'CATransform3D' is unavailable in watchOS
public extension CATransform3D {
                 ^~~~~~~~~~~~~
/Applications/Xcode-16.3.0.app/Contents/Developer/Platforms/WatchOS.platform/Developer/SDKs/WatchOS11.4.sdk/System/Library/Frameworks/QuartzCore.framework/Headers/CATransform3D.h:17:8: note: 'CATransform3D' has been explicitly marked unavailable here
struct CATransform3D
       ^
/Users/admin/builder/spi-builder-workspace/.dependencies/checkouts/Decomposed/Sources/Decomposed/CATransform3DExtensions.swift:394:11: error: 'CATransform3D' is unavailable in watchOS
extension CATransform3D.DecomposedTransform: Interpolatable {
          ^~~~~~~~~~~~~
/Applications/Xcode-16.3.0.app/Contents/Developer/Platforms/WatchOS.platform/Developer/SDKs/WatchOS11.4.sdk/System/Library/Frameworks/QuartzCore.framework/Headers/CATransform3D.h:17:8: note: 'CATransform3D' has been explicitly marked unavailable here
struct CATransform3D
       ^
/Users/admin/builder/spi-builder-workspace/.dependencies/checkouts/Decomposed/Sources/Decomposed/CATransform3DExtensions.swift:402:11: error: 'CATransform3D' is unavailable in watchOS
extension CATransform3D: Interpolatable {
          ^~~~~~~~~~~~~
/Applications/Xcode-16.3.0.app/Contents/Developer/Platforms/WatchOS.platform/Developer/SDKs/WatchOS11.4.sdk/System/Library/Frameworks/QuartzCore.framework/Headers/CATransform3D.h:17:8: note: 'CATransform3D' has been explicitly marked unavailable here
struct CATransform3D
       ^
/Users/admin/builder/spi-builder-workspace/.dependencies/checkouts/Decomposed/Sources/Decomposed/Globals.swift:14:3: error: 'CATransaction' is unavailable in watchOS
  CATransaction.begin()
  ^~~~~~~~~~~~~
/Applications/Xcode-16.3.0.app/Contents/Developer/Platforms/WatchOS.platform/Developer/SDKs/WatchOS11.4.sdk/System/Library/Frameworks/QuartzCore.framework/Headers/CATransaction.h:34:12: note: 'CATransaction' has been explicitly marked unavailable here
@interface CATransaction : NSObject
           ^
/Users/admin/builder/spi-builder-workspace/.dependencies/checkouts/Decomposed/Sources/Decomposed/Globals.swift:15:3: error: 'CATransaction' is unavailable in watchOS
  CATransaction.setDisableActions(true)
  ^~~~~~~~~~~~~
/Applications/Xcode-16.3.0.app/Contents/Developer/Platforms/WatchOS.platform/Developer/SDKs/WatchOS11.4.sdk/System/Library/Frameworks/QuartzCore.framework/Headers/CATransaction.h:34:12: note: 'CATransaction' has been explicitly marked unavailable here
@interface CATransaction : NSObject
           ^
/Users/admin/builder/spi-builder-workspace/.dependencies/checkouts/Decomposed/Sources/Decomposed/Globals.swift:17:3: error: 'CATransaction' is unavailable in watchOS
  CATransaction.commit()
  ^~~~~~~~~~~~~
/Applications/Xcode-16.3.0.app/Contents/Developer/Platforms/WatchOS.platform/Developer/SDKs/WatchOS11.4.sdk/System/Library/Frameworks/QuartzCore.framework/Headers/CATransaction.h:34:12: note: 'CATransaction' has been explicitly marked unavailable here
@interface CATransaction : NSObject
           ^
/Users/admin/builder/spi-builder-workspace/.dependencies/checkouts/Decomposed/Sources/Decomposed/SIMDDecomposed.swift:28:21: error: 'CATransform3D' is unavailable in watchOS
  init(_ transform: CATransform3D) {
                    ^~~~~~~~~~~~~
/Applications/Xcode-16.3.0.app/Contents/Developer/Platforms/WatchOS.platform/Developer/SDKs/WatchOS11.4.sdk/System/Library/Frameworks/QuartzCore.framework/Headers/CATransform3D.h:17:8: note: 'CATransform3D' has been explicitly marked unavailable here
struct CATransform3D
       ^
/Users/admin/builder/spi-builder-workspace/.dependencies/checkouts/Decomposed/Sources/Decomposed/SIMDDecomposed.swift:393:21: error: 'CATransform3D' is unavailable in watchOS
  init(_ transform: CATransform3D) {
                    ^~~~~~~~~~~~~
/Applications/Xcode-16.3.0.app/Contents/Developer/Platforms/WatchOS.platform/Developer/SDKs/WatchOS11.4.sdk/System/Library/Frameworks/QuartzCore.framework/Headers/CATransform3D.h:17:8: note: 'CATransform3D' has been explicitly marked unavailable here
struct CATransform3D
       ^
Failed frontend command:
/Applications/Xcode-16.3.0.app/Contents/Developer/Toolchains/XcodeDefault.xctoolchain/usr/bin/swift-frontend -frontend -emit-module -experimental-skip-non-inlinable-function-bodies-without-types /Users/admin/builder/spi-builder-workspace/.dependencies/checkouts/Decomposed/Sources/Decomposed/CALayerExtensions.swift /Users/admin/builder/spi-builder-workspace/.dependencies/checkouts/Decomposed/Sources/Decomposed/CATransform3DConvenienceExtensions.swift /Users/admin/builder/spi-builder-workspace/.dependencies/checkouts/Decomposed/Sources/Decomposed/CATransform3DExtensions.swift /Users/admin/builder/spi-builder-workspace/.dependencies/checkouts/Decomposed/Sources/Decomposed/CGFloatVectorTypes.swift /Users/admin/builder/spi-builder-workspace/.dependencies/checkouts/Decomposed/Sources/Decomposed/Globals.swift /Users/admin/builder/spi-builder-workspace/.dependencies/checkouts/Decomposed/Sources/Decomposed/Interpolatable.swift /Users/admin/builder/spi-builder-workspace/.dependencies/checkouts/Decomposed/Sources/Decomposed/SIMDConvenienceExtensions.swift /Users/admin/builder/spi-builder-workspace/.dependencies/checkouts/Decomposed/Sources/Decomposed/SIMDDecomposed.swift -target armv7k-apple-watchos6.0 -enable-objc-interop -stack-check -sdk /Applications/Xcode-16.3.0.app/Contents/Developer/Platforms/WatchOS.platform/Developer/SDKs/WatchOS11.4.sdk -I /Users/admin/builder/spi-builder-workspace/.derivedData/Build/Products/Debug-watchos -I /Applications/Xcode-16.3.0.app/Contents/Developer/Platforms/WatchOS.platform/Developer/usr/lib -F /Users/admin/builder/spi-builder-workspace/.derivedData/Build/Products/Debug-watchos -F /Applications/Xcode-16.3.0.app/Contents/Developer/Platforms/WatchOS.platform/Developer/Library/Frameworks -F /Applications/Xcode-16.3.0.app/Contents/Developer/Platforms/WatchOS.platform/Developer/SDKs/WatchOS11.4.sdk/Developer/Library/Frameworks -no-color-diagnostics -enable-testing -g -debug-info-format\=dwarf -dwarf-version\=4 -module-cache-path /Users/admin/builder/spi-builder-workspace/.derivedData/ModuleCache.noindex -suppress-warnings -profile-generate -profile-coverage-mapping -swift-version 5 -enforce-exclusivity\=checked -Onone -D SWIFT_PACKAGE -D DEBUG -D Xcode -serialize-debugging-options -const-gather-protocols-file /Users/admin/builder/spi-builder-workspace/.derivedData/Build/Intermediates.noindex/Decomposed.build/Debug-watchos/Decomposed.build/Objects-normal/armv7k/Decomposed_const_extract_protocols.json -enable-experimental-feature DebugDescriptionMacro -empty-abi-descriptor -plugin-path /Applications/Xcode-16.3.0.app/Contents/Developer/Toolchains/XcodeDefault.xctoolchain/usr/lib/swift/host/plugins/testing -validate-clang-modules-once -clang-build-session-file /Users/admin/builder/spi-builder-workspace/.derivedData/ModuleCache.noindex/Session.modulevalidation -Xcc -working-directory -Xcc /Users/admin/builder/spi-builder-workspace/.swiftpm/xcode -resource-dir /Applications/Xcode-16.3.0.app/Contents/Developer/Toolchains/XcodeDefault.xctoolchain/usr/lib/swift -enable-anonymous-context-mangled-names -file-compilation-dir /Users/admin/builder/spi-builder-workspace/.swiftpm/xcode -Xcc -ivfsstatcache -Xcc /Users/admin/builder/spi-builder-workspace/.derivedData/SDKStatCaches.noindex/watchos11.4-22T246-43efb940ff07ba2497b70ec94253f576.sdkstatcache -Xcc -I/Users/admin/builder/spi-builder-workspace/.derivedData/Build/Intermediates.noindex/Decomposed.build/Debug-watchos/Decomposed.build/swift-overrides.hmap -Xcc -I/Users/admin/builder/spi-builder-workspace/.derivedData/Build/Products/Debug-watchos/include -Xcc -I/Users/admin/builder/spi-builder-workspace/.derivedData/Build/Intermediates.noindex/Decomposed.build/Debug-watchos/Decomposed.build/DerivedSources-normal/armv7k -Xcc -I/Users/admin/builder/spi-builder-workspace/.derivedData/Build/Intermediates.noindex/Decomposed.build/Debug-watchos/Decomposed.build/DerivedSources/armv7k -Xcc -I/Users/admin/builder/spi-builder-workspace/.derivedData/Build/Intermediates.noindex/Decomposed.build/Debug-watchos/Decomposed.build/DerivedSources -Xcc -DSWIFT_PACKAGE -Xcc -DDEBUG\=1 -module-name Decomposed -frontend-parseable-output -disable-clang-spi -target-sdk-version 11.4 -target-sdk-name watchos11.4 -external-plugin-path /Applications/Xcode-16.3.0.app/Contents/Developer/Platforms/WatchOS.platform/Developer/usr/lib/swift/host/plugins\#/Applications/Xcode-16.3.0.app/Contents/Developer/Platforms/WatchOS.platform/Developer/usr/bin/swift-plugin-server -external-plugin-path /Applications/Xcode-16.3.0.app/Contents/Developer/Platforms/WatchOS.platform/Developer/usr/local/lib/swift/host/plugins\#/Applications/Xcode-16.3.0.app/Contents/Developer/Platforms/WatchOS.platform/Developer/usr/bin/swift-plugin-server -in-process-plugin-server-path /Applications/Xcode-16.3.0.app/Contents/Developer/Toolchains/XcodeDefault.xctoolchain/usr/lib/swift/host/libSwiftInProcPluginServer.dylib -plugin-path /Applications/Xcode-16.3.0.app/Contents/Developer/Toolchains/XcodeDefault.xctoolchain/usr/lib/swift/host/plugins -plugin-path /Applications/Xcode-16.3.0.app/Contents/Developer/Toolchains/XcodeDefault.xctoolchain/usr/local/lib/swift/host/plugins -emit-module-doc-path /Users/admin/builder/spi-builder-workspace/.derivedData/Build/Intermediates.noindex/Decomposed.build/Debug-watchos/Decomposed.build/Objects-normal/armv7k/Decomposed.swiftdoc -emit-module-source-info-path /Users/admin/builder/spi-builder-workspace/.derivedData/Build/Intermediates.noindex/Decomposed.build/Debug-watchos/Decomposed.build/Objects-normal/armv7k/Decomposed.swiftsourceinfo -emit-objc-header-path /Users/admin/builder/spi-builder-workspace/.derivedData/Build/Intermediates.noindex/Decomposed.build/Debug-watchos/Decomposed.build/Objects-normal/armv7k/Decomposed-Swift.h -serialize-diagnostics-path /Users/admin/builder/spi-builder-workspace/.derivedData/Build/Intermediates.noindex/Decomposed.build/Debug-watchos/Decomposed.build/Objects-normal/armv7k/Decomposed-master-emit-module.dia -emit-dependencies-path /Users/admin/builder/spi-builder-workspace/.derivedData/Build/Intermediates.noindex/Decomposed.build/Debug-watchos/Decomposed.build/Objects-normal/armv7k/Decomposed-master-emit-module.d -o /Users/admin/builder/spi-builder-workspace/.derivedData/Build/Intermediates.noindex/Decomposed.build/Debug-watchos/Decomposed.build/Objects-normal/armv7k/Decomposed.swiftmodule -emit-abi-descriptor-path /Users/admin/builder/spi-builder-workspace/.derivedData/Build/Intermediates.noindex/Decomposed.build/Debug-watchos/Decomposed.build/Objects-normal/armv7k/Decomposed.abi.json
SwiftCompile normal armv7k Compiling\ CALayerExtensions.swift /Users/admin/builder/spi-builder-workspace/.dependencies/checkouts/Decomposed/Sources/Decomposed/CALayerExtensions.swift (in target 'Decomposed' from project 'Decomposed')
SwiftCompile normal armv7k /Users/admin/builder/spi-builder-workspace/.dependencies/checkouts/Decomposed/Sources/Decomposed/CALayerExtensions.swift (in target 'Decomposed' from project 'Decomposed')
    cd /Users/admin/builder/spi-builder-workspace/.swiftpm/xcode

SwiftCompile normal armv7k Compiling\ CATransform3DExtensions.swift /Users/admin/builder/spi-builder-workspace/.dependencies/checkouts/Decomposed/Sources/Decomposed/CATransform3DExtensions.swift (in target 'Decomposed' from project 'Decomposed')
SwiftCompile normal armv7k /Users/admin/builder/spi-builder-workspace/.dependencies/checkouts/Decomposed/Sources/Decomposed/CATransform3DExtensions.swift (in target 'Decomposed' from project 'Decomposed')
    cd /Users/admin/builder/spi-builder-workspace/.swiftpm/xcode

SwiftCompile normal armv7k Compiling\ CATransform3DConvenienceExtensions.swift /Users/admin/builder/spi-builder-workspace/.dependencies/checkouts/Decomposed/Sources/Decomposed/CATransform3DConvenienceExtensions.swift (in target 'Decomposed' from project 'Decomposed')
SwiftCompile normal armv7k /Users/admin/builder/spi-builder-workspace/.dependencies/checkouts/Decomposed/Sources/Decomposed/CATransform3DConvenienceExtensions.swift (in target 'Decomposed' from project 'Decomposed')
    cd /Users/admin/builder/spi-builder-workspace/.swiftpm/xcode

SwiftCompile normal armv7k Compiling\ Globals.swift /Users/admin/builder/spi-builder-workspace/.dependencies/checkouts/Decomposed/Sources/Decomposed/Globals.swift (in target 'Decomposed' from project 'Decomposed')
SwiftCompile normal armv7k /Users/admin/builder/spi-builder-workspace/.dependencies/checkouts/Decomposed/Sources/Decomposed/Globals.swift (in target 'Decomposed' from project 'Decomposed')
    cd /Users/admin/builder/spi-builder-workspace/.swiftpm/xcode

SwiftCompile normal armv7k Compiling\ Interpolatable.swift /Users/admin/builder/spi-builder-workspace/.dependencies/checkouts/Decomposed/Sources/Decomposed/Interpolatable.swift (in target 'Decomposed' from project 'Decomposed')
SwiftCompile normal armv7k /Users/admin/builder/spi-builder-workspace/.dependencies/checkouts/Decomposed/Sources/Decomposed/Interpolatable.swift (in target 'Decomposed' from project 'Decomposed')
    cd /Users/admin/builder/spi-builder-workspace/.swiftpm/xcode

SwiftCompile normal arm64_32 Compiling\ CALayerExtensions.swift /Users/admin/builder/spi-builder-workspace/.dependencies/checkouts/Decomposed/Sources/Decomposed/CALayerExtensions.swift (in target 'Decomposed' from project 'Decomposed')
SwiftCompile normal arm64_32 /Users/admin/builder/spi-builder-workspace/.dependencies/checkouts/Decomposed/Sources/Decomposed/CALayerExtensions.swift (in target 'Decomposed' from project 'Decomposed')
    cd /Users/admin/builder/spi-builder-workspace/.swiftpm/xcode

SwiftEmitModule normal arm64 Emitting\ module\ for\ Decomposed (in target 'Decomposed' from project 'Decomposed')
Failed frontend command:
/Applications/Xcode-16.3.0.app/Contents/Developer/Toolchains/XcodeDefault.xctoolchain/usr/bin/swift-frontend -frontend -emit-module -experimental-skip-non-inlinable-function-bodies-without-types /Users/admin/builder/spi-builder-workspace/.dependencies/checkouts/Decomposed/Sources/Decomposed/CALayerExtensions.swift /Users/admin/builder/spi-builder-workspace/.dependencies/checkouts/Decomposed/Sources/Decomposed/CATransform3DConvenienceExtensions.swift /Users/admin/builder/spi-builder-workspace/.dependencies/checkouts/Decomposed/Sources/Decomposed/CATransform3DExtensions.swift /Users/admin/builder/spi-builder-workspace/.dependencies/checkouts/Decomposed/Sources/Decomposed/CGFloatVectorTypes.swift /Users/admin/builder/spi-builder-workspace/.dependencies/checkouts/Decomposed/Sources/Decomposed/Globals.swift /Users/admin/builder/spi-builder-workspace/.dependencies/checkouts/Decomposed/Sources/Decomposed/Interpolatable.swift /Users/admin/builder/spi-builder-workspace/.dependencies/checkouts/Decomposed/Sources/Decomposed/SIMDConvenienceExtensions.swift /Users/admin/builder/spi-builder-workspace/.dependencies/checkouts/Decomposed/Sources/Decomposed/SIMDDecomposed.swift -target arm64-apple-watchos6.0 -Xllvm -aarch64-use-tbi -enable-objc-interop -stack-check -sdk /Applications/Xcode-16.3.0.app/Contents/Developer/Platforms/WatchOS.platform/Developer/SDKs/WatchOS11.4.sdk -I /Users/admin/builder/spi-builder-workspace/.derivedData/Build/Products/Debug-watchos -I /Applications/Xcode-16.3.0.app/Contents/Developer/Platforms/WatchOS.platform/Developer/usr/lib -F /Users/admin/builder/spi-builder-workspace/.derivedData/Build/Products/Debug-watchos -F /Applications/Xcode-16.3.0.app/Contents/Developer/Platforms/WatchOS.platform/Developer/Library/Frameworks -F /Applications/Xcode-16.3.0.app/Contents/Developer/Platforms/WatchOS.platform/Developer/SDKs/WatchOS11.4.sdk/Developer/Library/Frameworks -no-color-diagnostics -enable-testing -g -debug-info-format\=dwarf -dwarf-version\=4 -module-cache-path /Users/admin/builder/spi-builder-workspace/.derivedData/ModuleCache.noindex -suppress-warnings -profile-generate -profile-coverage-mapping -swift-version 5 -enforce-exclusivity\=checked -Onone -D SWIFT_PACKAGE -D DEBUG -D Xcode -serialize-debugging-options -const-gather-protocols-file /Users/admin/builder/spi-builder-workspace/.derivedData/Build/Intermediates.noindex/Decomposed.build/Debug-watchos/Decomposed.build/Objects-normal/arm64/Decomposed_const_extract_protocols.json -enable-experimental-feature DebugDescriptionMacro -empty-abi-descriptor -plugin-path /Applications/Xcode-16.3.0.app/Contents/Developer/Toolchains/XcodeDefault.xctoolchain/usr/lib/swift/host/plugins/testing -validate-clang-modules-once -clang-build-session-file /Users/admin/builder/spi-builder-workspace/.derivedData/ModuleCache.noindex/Session.modulevalidation -Xcc -working-directory -Xcc /Users/admin/builder/spi-builder-workspace/.swiftpm/xcode -resource-dir /Applications/Xcode-16.3.0.app/Contents/Developer/Toolchains/XcodeDefault.xctoolchain/usr/lib/swift -enable-anonymous-context-mangled-names -file-compilation-dir /Users/admin/builder/spi-builder-workspace/.swiftpm/xcode -Xcc -ivfsstatcache -Xcc /Users/admin/builder/spi-builder-workspace/.derivedData/SDKStatCaches.noindex/watchos11.4-22T246-43efb940ff07ba2497b70ec94253f576.sdkstatcache -Xcc -I/Users/admin/builder/spi-builder-workspace/.derivedData/Build/Intermediates.noindex/Decomposed.build/Debug-watchos/Decomposed.build/swift-overrides.hmap -Xcc -I/Users/admin/builder/spi-builder-workspace/.derivedData/Build/Products/Debug-watchos/include -Xcc -I/Users/admin/builder/spi-builder-workspace/.derivedData/Build/Intermediates.noindex/Decomposed.build/Debug-watchos/Decomposed.build/DerivedSources-normal/arm64 -Xcc -I/Users/admin/builder/spi-builder-workspace/.derivedData/Build/Intermediates.noindex/Decomposed.build/Debug-watchos/Decomposed.build/DerivedSources/arm64 -Xcc -I/Users/admin/builder/spi-builder-workspace/.derivedData/Build/Intermediates.noindex/Decomposed.build/Debug-watchos/Decomposed.build/DerivedSources -Xcc -DSWIFT_PACKAGE -Xcc -DDEBUG\=1 -module-name Decomposed -frontend-parseable-output -disable-clang-spi -target-sdk-version 11.4 -target-sdk-name watchos11.4 -external-plugin-path /Applications/Xcode-16.3.0.app/Contents/Developer/Platforms/WatchOS.platform/Developer/usr/lib/swift/host/plugins\#/Applications/Xcode-16.3.0.app/Contents/Developer/Platforms/WatchOS.platform/Developer/usr/bin/swift-plugin-server -external-plugin-path /Applications/Xcode-16.3.0.app/Contents/Developer/Platforms/WatchOS.platform/Developer/usr/local/lib/swift/host/plugins\#/Applications/Xcode-16.3.0.app/Contents/Developer/Platforms/WatchOS.platform/Developer/usr/bin/swift-plugin-server -in-process-plugin-server-path /Applications/Xcode-16.3.0.app/Contents/Developer/Toolchains/XcodeDefault.xctoolchain/usr/lib/swift/host/libSwiftInProcPluginServer.dylib -plugin-path /Applications/Xcode-16.3.0.app/Contents/Developer/Toolchains/XcodeDefault.xctoolchain/usr/lib/swift/host/plugins -plugin-path /Applications/Xcode-16.3.0.app/Contents/Developer/Toolchains/XcodeDefault.xctoolchain/usr/local/lib/swift/host/plugins -emit-module-doc-path /Users/admin/builder/spi-builder-workspace/.derivedData/Build/Intermediates.noindex/Decomposed.build/Debug-watchos/Decomposed.build/Objects-normal/arm64/Decomposed.swiftdoc -emit-module-source-info-path /Users/admin/builder/spi-builder-workspace/.derivedData/Build/Intermediates.noindex/Decomposed.build/Debug-watchos/Decomposed.build/Objects-normal/arm64/Decomposed.swiftsourceinfo -emit-objc-header-path /Users/admin/builder/spi-builder-workspace/.derivedData/Build/Intermediates.noindex/Decomposed.build/Debug-watchos/Decomposed.build/Objects-normal/arm64/Decomposed-Swift.h -serialize-diagnostics-path /Users/admin/builder/spi-builder-workspace/.derivedData/Build/Intermediates.noindex/Decomposed.build/Debug-watchos/Decomposed.build/Objects-normal/arm64/Decomposed-master-emit-module.dia -emit-dependencies-path /Users/admin/builder/spi-builder-workspace/.derivedData/Build/Intermediates.noindex/Decomposed.build/Debug-watchos/Decomposed.build/Objects-normal/arm64/Decomposed-master-emit-module.d -o /Users/admin/builder/spi-builder-workspace/.derivedData/Build/Intermediates.noindex/Decomposed.build/Debug-watchos/Decomposed.build/Objects-normal/arm64/Decomposed.swiftmodule -emit-abi-descriptor-path /Users/admin/builder/spi-builder-workspace/.derivedData/Build/Intermediates.noindex/Decomposed.build/Debug-watchos/Decomposed.build/Objects-normal/arm64/Decomposed.abi.json
EmitSwiftModule normal arm64 (in target 'Decomposed' from project 'Decomposed')
    cd /Users/admin/builder/spi-builder-workspace/.swiftpm/xcode

/Users/admin/builder/spi-builder-workspace/.dependencies/checkouts/Decomposed/Sources/Decomposed/CALayerExtensions.swift:14:18: error: 'CALayer' is unavailable in watchOS
public extension CALayer {
                 ^~~~~~~
/Applications/Xcode-16.3.0.app/Contents/Developer/Platforms/WatchOS.platform/Developer/SDKs/WatchOS11.4.sdk/System/Library/Frameworks/QuartzCore.framework/Headers/CALayer.h:86:12: note: 'CALayer' has been explicitly marked unavailable here
@interface CALayer : NSObject <NSSecureCoding, CAMediaTiming>
           ^
/Users/admin/builder/spi-builder-workspace/.dependencies/checkouts/Decomposed/Sources/Decomposed/CATransform3DExtensions.swift:14:24: error: 'CATransform3D' is unavailable in watchOS
  static var identity: CATransform3D {
                       ^~~~~~~~~~~~~
/Applications/Xcode-16.3.0.app/Contents/Developer/Platforms/WatchOS.platform/Developer/SDKs/WatchOS11.4.sdk/System/Library/Frameworks/QuartzCore.framework/Headers/CATransform3D.h:17:8: note: 'CATransform3D' has been explicitly marked unavailable here
struct CATransform3D
       ^
/Users/admin/builder/spi-builder-workspace/.dependencies/checkouts/Decomposed/Sources/Decomposed/CATransform3DExtensions.swift:19:20: error: 'CATransform3D' is unavailable in watchOS
  static var zero: CATransform3D {
                   ^~~~~~~~~~~~~
/Applications/Xcode-16.3.0.app/Contents/Developer/Platforms/WatchOS.platform/Developer/SDKs/WatchOS11.4.sdk/System/Library/Frameworks/QuartzCore.framework/Headers/CATransform3D.h:17:8: note: 'CATransform3D' has been explicitly marked unavailable here
struct CATransform3D
       ^
/Users/admin/builder/spi-builder-workspace/.dependencies/checkouts/Decomposed/Sources/Decomposed/CATransform3DExtensions.swift:11:18: error: 'CATransform3D' is unavailable in watchOS
public extension CATransform3D {
                 ^~~~~~~~~~~~~
/Applications/Xcode-16.3.0.app/Contents/Developer/Platforms/WatchOS.platform/Developer/SDKs/WatchOS11.4.sdk/System/Library/Frameworks/QuartzCore.framework/Headers/CATransform3D.h:17:8: note: 'CATransform3D' has been explicitly marked unavailable here
struct CATransform3D
       ^
/Users/admin/builder/spi-builder-workspace/.dependencies/checkouts/Decomposed/Sources/Decomposed/CATransform3DExtensions.swift:384:33: error: 'CATransform3D' is unavailable in watchOS
    public func recomposed() -> CATransform3D {
                                ^~~~~~~~~~~~~
/Applications/Xcode-16.3.0.app/Contents/Developer/Platforms/WatchOS.platform/Developer/SDKs/WatchOS11.4.sdk/System/Library/Frameworks/QuartzCore.framework/Headers/CATransform3D.h:17:8: note: 'CATransform3D' has been explicitly marked unavailable here
struct CATransform3D
       ^
/Users/admin/builder/spi-builder-workspace/.dependencies/checkouts/Decomposed/Sources/Decomposed/CATransform3DExtensions.swift:316:18: error: 'CATransform3D' is unavailable in watchOS
public extension CATransform3D {
                 ^~~~~~~~~~~~~
/Applications/Xcode-16.3.0.app/Contents/Developer/Platforms/WatchOS.platform/Developer/SDKs/WatchOS11.4.sdk/System/Library/Frameworks/QuartzCore.framework/Headers/CATransform3D.h:17:8: note: 'CATransform3D' has been explicitly marked unavailable here
struct CATransform3D
       ^
/Users/admin/builder/spi-builder-workspace/.dependencies/checkouts/Decomposed/Sources/Decomposed/CATransform3DExtensions.swift:394:11: error: 'CATransform3D' is unavailable in watchOS
extension CATransform3D.DecomposedTransform: Interpolatable {
          ^~~~~~~~~~~~~
/Applications/Xcode-16.3.0.app/Contents/Developer/Platforms/WatchOS.platform/Developer/SDKs/WatchOS11.4.sdk/System/Library/Frameworks/QuartzCore.framework/Headers/CATransform3D.h:17:8: note: 'CATransform3D' has been explicitly marked unavailable here
struct CATransform3D
       ^
/Users/admin/builder/spi-builder-workspace/.dependencies/checkouts/Decomposed/Sources/Decomposed/CATransform3DExtensions.swift:402:11: error: 'CATransform3D' is unavailable in watchOS
extension CATransform3D: Interpolatable {
          ^~~~~~~~~~~~~
/Applications/Xcode-16.3.0.app/Contents/Developer/Platforms/WatchOS.platform/Developer/SDKs/WatchOS11.4.sdk/System/Library/Frameworks/QuartzCore.framework/Headers/CATransform3D.h:17:8: note: 'CATransform3D' has been explicitly marked unavailable here
struct CATransform3D
       ^
/Users/admin/builder/spi-builder-workspace/.dependencies/checkouts/Decomposed/Sources/Decomposed/Globals.swift:14:3: error: 'CATransaction' is unavailable in watchOS
  CATransaction.begin()
  ^~~~~~~~~~~~~
/Applications/Xcode-16.3.0.app/Contents/Developer/Platforms/WatchOS.platform/Developer/SDKs/WatchOS11.4.sdk/System/Library/Frameworks/QuartzCore.framework/Headers/CATransaction.h:34:12: note: 'CATransaction' has been explicitly marked unavailable here
@interface CATransaction : NSObject
           ^
/Users/admin/builder/spi-builder-workspace/.dependencies/checkouts/Decomposed/Sources/Decomposed/Globals.swift:15:3: error: 'CATransaction' is unavailable in watchOS
  CATransaction.setDisableActions(true)
  ^~~~~~~~~~~~~
/Applications/Xcode-16.3.0.app/Contents/Developer/Platforms/WatchOS.platform/Developer/SDKs/WatchOS11.4.sdk/System/Library/Frameworks/QuartzCore.framework/Headers/CATransaction.h:34:12: note: 'CATransaction' has been explicitly marked unavailable here
@interface CATransaction : NSObject
           ^
/Users/admin/builder/spi-builder-workspace/.dependencies/checkouts/Decomposed/Sources/Decomposed/Globals.swift:17:3: error: 'CATransaction' is unavailable in watchOS
  CATransaction.commit()
  ^~~~~~~~~~~~~
/Applications/Xcode-16.3.0.app/Contents/Developer/Platforms/WatchOS.platform/Developer/SDKs/WatchOS11.4.sdk/System/Library/Frameworks/QuartzCore.framework/Headers/CATransaction.h:34:12: note: 'CATransaction' has been explicitly marked unavailable here
@interface CATransaction : NSObject
           ^
/Users/admin/builder/spi-builder-workspace/.dependencies/checkouts/Decomposed/Sources/Decomposed/SIMDDecomposed.swift:28:21: error: 'CATransform3D' is unavailable in watchOS
  init(_ transform: CATransform3D) {
                    ^~~~~~~~~~~~~
/Applications/Xcode-16.3.0.app/Contents/Developer/Platforms/WatchOS.platform/Developer/SDKs/WatchOS11.4.sdk/System/Library/Frameworks/QuartzCore.framework/Headers/CATransform3D.h:17:8: note: 'CATransform3D' has been explicitly marked unavailable here
struct CATransform3D
       ^
/Users/admin/builder/spi-builder-workspace/.dependencies/checkouts/Decomposed/Sources/Decomposed/SIMDDecomposed.swift:393:21: error: 'CATransform3D' is unavailable in watchOS
  init(_ transform: CATransform3D) {
                    ^~~~~~~~~~~~~
/Applications/Xcode-16.3.0.app/Contents/Developer/Platforms/WatchOS.platform/Developer/SDKs/WatchOS11.4.sdk/System/Library/Frameworks/QuartzCore.framework/Headers/CATransform3D.h:17:8: note: 'CATransform3D' has been explicitly marked unavailable here
struct CATransform3D
       ^
SwiftCompile normal armv7k Compiling\ SIMDConvenienceExtensions.swift /Users/admin/builder/spi-builder-workspace/.dependencies/checkouts/Decomposed/Sources/Decomposed/SIMDConvenienceExtensions.swift (in target 'Decomposed' from project 'Decomposed')
SwiftCompile normal armv7k /Users/admin/builder/spi-builder-workspace/.dependencies/checkouts/Decomposed/Sources/Decomposed/SIMDConvenienceExtensions.swift (in target 'Decomposed' from project 'Decomposed')
    cd /Users/admin/builder/spi-builder-workspace/.swiftpm/xcode

SwiftEmitModule normal arm64_32 Emitting\ module\ for\ Decomposed (in target 'Decomposed' from project 'Decomposed')
EmitSwiftModule normal arm64_32 (in target 'Decomposed' from project 'Decomposed')
    cd /Users/admin/builder/spi-builder-workspace/.swiftpm/xcode

SwiftCompile normal arm64 Compiling\ Globals.swift /Users/admin/builder/spi-builder-workspace/.dependencies/checkouts/Decomposed/Sources/Decomposed/Globals.swift (in target 'Decomposed' from project 'Decomposed')
Command SwiftCompile failed with a nonzero exit code
** BUILD FAILED **
The following build commands failed:
	EmitSwiftModule normal armv7k (in target 'Decomposed' from project 'Decomposed')
	SwiftEmitModule normal armv7k Emitting\ module\ for\ Decomposed (in target 'Decomposed' from project 'Decomposed')
	SwiftEmitModule normal arm64 Emitting\ module\ for\ Decomposed (in target 'Decomposed' from project 'Decomposed')
	EmitSwiftModule normal arm64 (in target 'Decomposed' from project 'Decomposed')
	SwiftCompile normal arm64 Compiling\ Globals.swift /Users/admin/builder/spi-builder-workspace/.dependencies/checkouts/Decomposed/Sources/Decomposed/Globals.swift (in target 'Decomposed' from project 'Decomposed')
	Building workspace spi-builder-workspace with scheme Anima
(6 failures)
BUILD FAILURE 6.1 watchOS