The Swift Package Index logo.Swift Package Index

Track the adoption of Swift 6 strict concurrency checks for data race safety. How many packages are Ready for Swift 6?

Build Information

Failed to build PostHog, reference 3.25.0 (d640df), with Swift 5.9 for macOS (Xcode) using Xcode 15.2 on 30 Apr 2025 06:28:27 UTC.

Build Command

No build command. This typically means the build failed at an early stage where we determine the build command.

Build Log

========================================
RunAll
========================================
Builder version: 4.61.1
Interrupt handler set up.
========================================
Checkout
========================================
Clone URL: https://github.com/PostHog/posthog-ios.git
Reference: 3.25.0
Initialized empty Git repository in /Users/admin/builder/spi-builder-workspace/.git/
From https://github.com/PostHog/posthog-ios
 * tag               3.25.0     -> FETCH_HEAD
HEAD is now at d640df8 Update version
Cloned https://github.com/PostHog/posthog-ios.git
Revision (git rev-parse @):
d640df892fcb3bbeadf02b9ec28eeb682df53d24
SUCCESS checkout https://github.com/PostHog/posthog-ios.git at 3.25.0
========================================
Build
========================================
Selected platform:         macosXcodebuild
Swift version:             5.9
Building package at path:  $PWD
https://github.com/PostHog/posthog-ios.git
Command line invocation:
    /Applications/Xcode-15.2.0.app/Contents/Developer/usr/bin/xcodebuild -IDEClonedSourcePackagesDirPathOverride=/Users/admin/builder/spi-builder-workspace/.dependencies -resolvePackageDependencies
User defaults from command line:
    IDEClonedSourcePackagesDirPathOverride = /Users/admin/builder/spi-builder-workspace/.dependencies
    IDEPackageSupportUseBuiltinSCM = YES
Resolve Package Graph
the package at '/Users/admin/builder/posthog-ios' cannot be accessed (Error Domain=NSCocoaErrorDomain Code=260 "The folder “posthog-ios” doesn’t exist." UserInfo={NSFilePath=/Users/admin/builder/posthog-ios, NSUserStringVariant=(
    Folder
), NSUnderlyingError=0x600001b3ebb0 {Error Domain=NSOSStatusErrorDomain Code=-43 "fnfErr: File not found"}})
2025-04-30 02:28:23.169 xcodebuild[461:2523] NOTE: Referenced project PostHogExampleVisionOS was written by a newer Xcode version (77) -- temporarily downgrading it (without modifying project file)
2025-04-30 02:28:23.169 xcodebuild[461:2523] didn't find classname for 'isa' key
2025-04-30 02:28:23.170 xcodebuild[461:2523] NOTE: Referenced project PostHogExampleVisionOS was written by a newer Xcode version (77) -- temporarily downgrading it (without modifying project file)
2025-04-30 02:28:23.170 xcodebuild[461:2523] didn't find classname for 'isa' key
2025-04-30 02:28:23.259 xcodebuild[461:2523] didn't find classname for 'isa' key
--- xcodebuild: WARNING: Unable to open referenced project file '/Users/admin/builder/spi-builder-workspace/PostHogExampleVisionOS/PostHogExampleVisionOS.xcodeproj'.
	Reason: The project ‘PostHogExampleVisionOS’ is damaged and cannot be opened. Examine the project file for invalid edits or unresolved source control conflicts.
Path: /Users/admin/builder/spi-builder-workspace/PostHogExampleVisionOS/PostHogExampleVisionOS.xcodeproj
Exception: didn't find classname for 'isa' key
2025-04-30 02:28:23.259 xcodebuild[461:2523] [MT] IDEFileReferenceDebug: [Load] <Xcode3FileReference, 0x11da579e0 (Represents: <PBXFileReference:0x600002ca2970:DAF7D2DC2D95ACA500016C39:name='PostHogExampleVisionOS.xcodeproj'>)> Failed to load container at path: /Users/admin/builder/spi-builder-workspace/PostHogExampleVisionOS/PostHogExampleVisionOS.xcodeproj, Error: Error Domain=Xcode3ProjectErrorDomain Code=2 "The project ‘PostHogExampleVisionOS’ is damaged and cannot be opened. Examine the project file for invalid edits or unresolved source control conflicts.
Path: /Users/admin/builder/spi-builder-workspace/PostHogExampleVisionOS/PostHogExampleVisionOS.xcodeproj
Exception: didn't find classname for 'isa' key" UserInfo={NSLocalizedDescription=The project ‘PostHogExampleVisionOS’ is damaged and cannot be opened. Examine the project file for invalid edits or unresolved source control conflicts.
Path: /Users/admin/builder/spi-builder-workspace/PostHogExampleVisionOS/PostHogExampleVisionOS.xcodeproj
Exception: didn't find classname for 'isa' key}
2025-04-30 02:28:24.721 xcodebuild[461:2523] Writing error result bundle to /var/folders/fs/0w3t9t1d28xc3bj0tgb8hcrw0000gn/T/ResultBundle_2025-30-04_02-28-0024.xcresult
xcodebuild: error: Could not resolve package dependencies:
  the package at '/Users/admin/builder/posthog-ios' cannot be accessed (Error Domain=NSCocoaErrorDomain Code=260 "The folder “posthog-ios” doesn’t exist." UserInfo={NSFilePath=/Users/admin/builder/posthog-ios, NSUserStringVariant=(
    Folder
), NSUnderlyingError=0x600001b3ebb0 {Error Domain=NSOSStatusErrorDomain Code=-43 "fnfErr: File not found"}})
Command line invocation:
    /Applications/Xcode-15.2.0.app/Contents/Developer/usr/bin/xcodebuild -IDEClonedSourcePackagesDirPathOverride=/Users/admin/builder/spi-builder-workspace/.dependencies -resolvePackageDependencies
User defaults from command line:
    IDEClonedSourcePackagesDirPathOverride = /Users/admin/builder/spi-builder-workspace/.dependencies
    IDEPackageSupportUseBuiltinSCM = YES
Resolve Package Graph
the package at '/Users/admin/builder/posthog-ios' cannot be accessed (Error Domain=NSCocoaErrorDomain Code=260 "The folder “posthog-ios” doesn’t exist." UserInfo={NSFilePath=/Users/admin/builder/posthog-ios, NSUserStringVariant=(
    Folder
), NSUnderlyingError=0x600003124990 {Error Domain=NSOSStatusErrorDomain Code=-43 "fnfErr: File not found"}})
2025-04-30 02:28:26.458 xcodebuild[509:2814] NOTE: Referenced project PostHogExampleVisionOS was written by a newer Xcode version (77) -- temporarily downgrading it (without modifying project file)
2025-04-30 02:28:26.458 xcodebuild[509:2814] didn't find classname for 'isa' key
2025-04-30 02:28:26.458 xcodebuild[509:2814] NOTE: Referenced project PostHogExampleVisionOS was written by a newer Xcode version (77) -- temporarily downgrading it (without modifying project file)
2025-04-30 02:28:26.459 xcodebuild[509:2814] didn't find classname for 'isa' key
2025-04-30 02:28:26.517 xcodebuild[509:2814] didn't find classname for 'isa' key
--- xcodebuild: WARNING: Unable to open referenced project file '/Users/admin/builder/spi-builder-workspace/PostHogExampleVisionOS/PostHogExampleVisionOS.xcodeproj'.
	Reason: The project ‘PostHogExampleVisionOS’ is damaged and cannot be opened. Examine the project file for invalid edits or unresolved source control conflicts.
Path: /Users/admin/builder/spi-builder-workspace/PostHogExampleVisionOS/PostHogExampleVisionOS.xcodeproj
Exception: didn't find classname for 'isa' key
2025-04-30 02:28:26.517 xcodebuild[509:2814] [MT] IDEFileReferenceDebug: [Load] <Xcode3FileReference, 0x15aea8530 (Represents: <PBXFileReference:0x600001835d40:DAF7D2DC2D95ACA500016C39:name='PostHogExampleVisionOS.xcodeproj'>)> Failed to load container at path: /Users/admin/builder/spi-builder-workspace/PostHogExampleVisionOS/PostHogExampleVisionOS.xcodeproj, Error: Error Domain=Xcode3ProjectErrorDomain Code=2 "The project ‘PostHogExampleVisionOS’ is damaged and cannot be opened. Examine the project file for invalid edits or unresolved source control conflicts.
Path: /Users/admin/builder/spi-builder-workspace/PostHogExampleVisionOS/PostHogExampleVisionOS.xcodeproj
Exception: didn't find classname for 'isa' key" UserInfo={NSLocalizedDescription=The project ‘PostHogExampleVisionOS’ is damaged and cannot be opened. Examine the project file for invalid edits or unresolved source control conflicts.
Path: /Users/admin/builder/spi-builder-workspace/PostHogExampleVisionOS/PostHogExampleVisionOS.xcodeproj
Exception: didn't find classname for 'isa' key}
2025-04-30 02:28:26.661 xcodebuild[509:2814] Writing error result bundle to /var/folders/fs/0w3t9t1d28xc3bj0tgb8hcrw0000gn/T/ResultBundle_2025-30-04_02-28-0026.xcresult
xcodebuild: error: Could not resolve package dependencies:
  the package at '/Users/admin/builder/posthog-ios' cannot be accessed (Error Domain=NSCocoaErrorDomain Code=260 "The folder “posthog-ios” doesn’t exist." UserInfo={NSFilePath=/Users/admin/builder/posthog-ios, NSUserStringVariant=(
    Folder
), NSUnderlyingError=0x600003124990 {Error Domain=NSOSStatusErrorDomain Code=-43 "fnfErr: File not found"}})
BUILD FAILURE 5.9 macosXcodebuild