Build Information
Failed to build apple-maps-kit, reference 1.0.0 (ed26ea
), with Swift 6.1 for watchOS using Xcode 16.3 on 30 Apr 2025 05:38:56 UTC.
Build Command
env DEVELOPER_DIR=/Applications/Xcode-16.3.0.app xcrun xcodebuild -IDEClonedSourcePackagesDirPathOverride=$PWD/.dependencies -skipMacroValidation -skipPackagePluginValidation -derivedDataPath $PWD/.derivedData build -scheme apple-maps-kit -destination generic/platform=watchOS
Build Log
cd /Users/admin/builder/spi-builder-workspace/.dependencies/checkouts/async-http-client
builtin-copy -exclude .DS_Store -exclude CVS -exclude .svn -exclude .git -exclude .hg -resolve-src-symlinks -rename /Users/admin/builder/spi-builder-workspace/.derivedData/Build/Intermediates.noindex/async-http-client.build/Debug-watchos/AsyncHTTPClient.build/Objects-normal/arm64_32/AsyncHTTPClient.swiftsourceinfo /Users/admin/builder/spi-builder-workspace/.derivedData/Build/Products/Debug-watchos/AsyncHTTPClient.swiftmodule/Project/arm64_32-apple-watchos.swiftsourceinfo
Copy /Users/admin/builder/spi-builder-workspace/.derivedData/Build/Products/Debug-watchos/AsyncHTTPClient.swiftmodule/Project/arm64-apple-watchos.swiftsourceinfo /Users/admin/builder/spi-builder-workspace/.derivedData/Build/Intermediates.noindex/async-http-client.build/Debug-watchos/AsyncHTTPClient.build/Objects-normal/arm64/AsyncHTTPClient.swiftsourceinfo (in target 'AsyncHTTPClient' from project 'async-http-client')
cd /Users/admin/builder/spi-builder-workspace/.dependencies/checkouts/async-http-client
builtin-copy -exclude .DS_Store -exclude CVS -exclude .svn -exclude .git -exclude .hg -resolve-src-symlinks -rename /Users/admin/builder/spi-builder-workspace/.derivedData/Build/Intermediates.noindex/async-http-client.build/Debug-watchos/AsyncHTTPClient.build/Objects-normal/arm64/AsyncHTTPClient.swiftsourceinfo /Users/admin/builder/spi-builder-workspace/.derivedData/Build/Products/Debug-watchos/AsyncHTTPClient.swiftmodule/Project/arm64-apple-watchos.swiftsourceinfo
SwiftCompile normal armv7k Compiling\ HTTPConnectionPool+Manager.swift,\ HTTPConnectionPool.swift,\ HTTPExecutableRequest.swift,\ HTTPRequestStateMachine+Demand.swift,\ HTTPRequestStateMachine.swift,\ RequestBodyLength.swift,\ RequestFramingMetadata.swift /Users/admin/builder/spi-builder-workspace/.dependencies/checkouts/async-http-client/Sources/AsyncHTTPClient/ConnectionPool/HTTPConnectionPool+Manager.swift /Users/admin/builder/spi-builder-workspace/.dependencies/checkouts/async-http-client/Sources/AsyncHTTPClient/ConnectionPool/HTTPConnectionPool.swift /Users/admin/builder/spi-builder-workspace/.dependencies/checkouts/async-http-client/Sources/AsyncHTTPClient/ConnectionPool/HTTPExecutableRequest.swift /Users/admin/builder/spi-builder-workspace/.dependencies/checkouts/async-http-client/Sources/AsyncHTTPClient/ConnectionPool/HTTPRequestStateMachine+Demand.swift /Users/admin/builder/spi-builder-workspace/.dependencies/checkouts/async-http-client/Sources/AsyncHTTPClient/ConnectionPool/HTTPRequestStateMachine.swift /Users/admin/builder/spi-builder-workspace/.dependencies/checkouts/async-http-client/Sources/AsyncHTTPClient/ConnectionPool/RequestBodyLength.swift /Users/admin/builder/spi-builder-workspace/.dependencies/checkouts/async-http-client/Sources/AsyncHTTPClient/ConnectionPool/RequestFramingMetadata.swift (in target 'AsyncHTTPClient' from project 'async-http-client')
SwiftCompile normal armv7k /Users/admin/builder/spi-builder-workspace/.dependencies/checkouts/async-http-client/Sources/AsyncHTTPClient/ConnectionPool/HTTPConnectionPool+Manager.swift (in target 'AsyncHTTPClient' from project 'async-http-client')
cd /Users/admin/builder/spi-builder-workspace/.swiftpm/xcode
SwiftCompile normal armv7k /Users/admin/builder/spi-builder-workspace/.dependencies/checkouts/async-http-client/Sources/AsyncHTTPClient/ConnectionPool/HTTPConnectionPool.swift (in target 'AsyncHTTPClient' from project 'async-http-client')
cd /Users/admin/builder/spi-builder-workspace/.swiftpm/xcode
SwiftCompile normal armv7k /Users/admin/builder/spi-builder-workspace/.dependencies/checkouts/async-http-client/Sources/AsyncHTTPClient/ConnectionPool/HTTPExecutableRequest.swift (in target 'AsyncHTTPClient' from project 'async-http-client')
cd /Users/admin/builder/spi-builder-workspace/.swiftpm/xcode
SwiftCompile normal armv7k /Users/admin/builder/spi-builder-workspace/.dependencies/checkouts/async-http-client/Sources/AsyncHTTPClient/ConnectionPool/HTTPRequestStateMachine+Demand.swift (in target 'AsyncHTTPClient' from project 'async-http-client')
cd /Users/admin/builder/spi-builder-workspace/.swiftpm/xcode
SwiftCompile normal armv7k /Users/admin/builder/spi-builder-workspace/.dependencies/checkouts/async-http-client/Sources/AsyncHTTPClient/ConnectionPool/HTTPRequestStateMachine.swift (in target 'AsyncHTTPClient' from project 'async-http-client')
cd /Users/admin/builder/spi-builder-workspace/.swiftpm/xcode
SwiftCompile normal armv7k /Users/admin/builder/spi-builder-workspace/.dependencies/checkouts/async-http-client/Sources/AsyncHTTPClient/ConnectionPool/RequestBodyLength.swift (in target 'AsyncHTTPClient' from project 'async-http-client')
cd /Users/admin/builder/spi-builder-workspace/.swiftpm/xcode
SwiftCompile normal armv7k /Users/admin/builder/spi-builder-workspace/.dependencies/checkouts/async-http-client/Sources/AsyncHTTPClient/ConnectionPool/RequestFramingMetadata.swift (in target 'AsyncHTTPClient' from project 'async-http-client')
cd /Users/admin/builder/spi-builder-workspace/.swiftpm/xcode
SwiftCompile normal armv7k Compiling\ HTTPClient+Proxy.swift,\ HTTPClient+StructuredConcurrency.swift,\ HTTPClient.swift,\ HTTPHandler.swift,\ LRUCache.swift,\ NWErrorHandler.swift /Users/admin/builder/spi-builder-workspace/.dependencies/checkouts/async-http-client/Sources/AsyncHTTPClient/HTTPClient+Proxy.swift /Users/admin/builder/spi-builder-workspace/.dependencies/checkouts/async-http-client/Sources/AsyncHTTPClient/HTTPClient+StructuredConcurrency.swift /Users/admin/builder/spi-builder-workspace/.dependencies/checkouts/async-http-client/Sources/AsyncHTTPClient/HTTPClient.swift /Users/admin/builder/spi-builder-workspace/.dependencies/checkouts/async-http-client/Sources/AsyncHTTPClient/HTTPHandler.swift /Users/admin/builder/spi-builder-workspace/.dependencies/checkouts/async-http-client/Sources/AsyncHTTPClient/LRUCache.swift /Users/admin/builder/spi-builder-workspace/.dependencies/checkouts/async-http-client/Sources/AsyncHTTPClient/NIOTransportServices/NWErrorHandler.swift (in target 'AsyncHTTPClient' from project 'async-http-client')
SwiftCompile normal armv7k /Users/admin/builder/spi-builder-workspace/.dependencies/checkouts/async-http-client/Sources/AsyncHTTPClient/HTTPClient+Proxy.swift (in target 'AsyncHTTPClient' from project 'async-http-client')
cd /Users/admin/builder/spi-builder-workspace/.swiftpm/xcode
SwiftCompile normal armv7k /Users/admin/builder/spi-builder-workspace/.dependencies/checkouts/async-http-client/Sources/AsyncHTTPClient/HTTPClient+StructuredConcurrency.swift (in target 'AsyncHTTPClient' from project 'async-http-client')
cd /Users/admin/builder/spi-builder-workspace/.swiftpm/xcode
SwiftCompile normal armv7k /Users/admin/builder/spi-builder-workspace/.dependencies/checkouts/async-http-client/Sources/AsyncHTTPClient/HTTPClient.swift (in target 'AsyncHTTPClient' from project 'async-http-client')
cd /Users/admin/builder/spi-builder-workspace/.swiftpm/xcode
SwiftCompile normal armv7k /Users/admin/builder/spi-builder-workspace/.dependencies/checkouts/async-http-client/Sources/AsyncHTTPClient/HTTPHandler.swift (in target 'AsyncHTTPClient' from project 'async-http-client')
cd /Users/admin/builder/spi-builder-workspace/.swiftpm/xcode
SwiftCompile normal armv7k /Users/admin/builder/spi-builder-workspace/.dependencies/checkouts/async-http-client/Sources/AsyncHTTPClient/LRUCache.swift (in target 'AsyncHTTPClient' from project 'async-http-client')
cd /Users/admin/builder/spi-builder-workspace/.swiftpm/xcode
SwiftCompile normal armv7k /Users/admin/builder/spi-builder-workspace/.dependencies/checkouts/async-http-client/Sources/AsyncHTTPClient/NIOTransportServices/NWErrorHandler.swift (in target 'AsyncHTTPClient' from project 'async-http-client')
cd /Users/admin/builder/spi-builder-workspace/.swiftpm/xcode
CreateUniversalBinary /Users/admin/builder/spi-builder-workspace/.derivedData/Build/Products/Debug-watchos/NIOHTTP2.o normal arm64\ armv7k\ arm64_32 (in target 'NIOHTTP2' from project 'swift-nio-http2')
cd /Users/admin/builder/spi-builder-workspace/.dependencies/checkouts/swift-nio-http2
/Applications/Xcode-16.3.0.app/Contents/Developer/Toolchains/XcodeDefault.xctoolchain/usr/bin/lipo -create /Users/admin/builder/spi-builder-workspace/.derivedData/Build/Intermediates.noindex/swift-nio-http2.build/Debug-watchos/NIOHTTP2.build/Objects-normal/arm64/Binary/NIOHTTP2.o /Users/admin/builder/spi-builder-workspace/.derivedData/Build/Intermediates.noindex/swift-nio-http2.build/Debug-watchos/NIOHTTP2.build/Objects-normal/armv7k/Binary/NIOHTTP2.o /Users/admin/builder/spi-builder-workspace/.derivedData/Build/Intermediates.noindex/swift-nio-http2.build/Debug-watchos/NIOHTTP2.build/Objects-normal/arm64_32/Binary/NIOHTTP2.o -output /Users/admin/builder/spi-builder-workspace/.derivedData/Build/Products/Debug-watchos/NIOHTTP2.o
SwiftDriverJobDiscovery normal armv7k Emitting module for AsyncHTTPClient (in target 'AsyncHTTPClient' from project 'async-http-client')
SwiftDriver\ Compilation\ Requirements AsyncHTTPClient normal armv7k com.apple.xcode.tools.swift.compiler (in target 'AsyncHTTPClient' from project 'async-http-client')
cd /Users/admin/builder/spi-builder-workspace/.swiftpm/xcode
builtin-Swift-Compilation-Requirements -- /Applications/Xcode-16.3.0.app/Contents/Developer/Toolchains/XcodeDefault.xctoolchain/usr/bin/swiftc -module-name AsyncHTTPClient -Onone -enforce-exclusivity\=checked @/Users/admin/builder/spi-builder-workspace/.derivedData/Build/Intermediates.noindex/async-http-client.build/Debug-watchos/AsyncHTTPClient.build/Objects-normal/armv7k/AsyncHTTPClient.SwiftFileList -DSWIFT_PACKAGE -DDEBUG -Xcc -fmodule-map-file\=/Users/admin/builder/spi-builder-workspace/.derivedData/Build/Intermediates.noindex/GeneratedModuleMaps-watchos/CNIOLLHTTP.modulemap -Xcc -fmodule-map-file\=/Users/admin/builder/spi-builder-workspace/.derivedData/Build/Intermediates.noindex/GeneratedModuleMaps-watchos/CNIOBoringSSLShims.modulemap -Xcc -fmodule-map-file\=/Users/admin/builder/spi-builder-workspace/.derivedData/Build/Intermediates.noindex/GeneratedModuleMaps-watchos/CNIOExtrasZlib.modulemap -Xcc -fmodule-map-file\=/Users/admin/builder/spi-builder-workspace/.derivedData/Build/Intermediates.noindex/GeneratedModuleMaps-watchos/CNIOWASI.modulemap -Xcc -fmodule-map-file\=/Users/admin/builder/spi-builder-workspace/.derivedData/Build/Intermediates.noindex/GeneratedModuleMaps-watchos/CNIOLinux.modulemap -Xcc -fmodule-map-file\=/Users/admin/builder/spi-builder-workspace/.derivedData/Build/Intermediates.noindex/GeneratedModuleMaps-watchos/CNIODarwin.modulemap -Xcc -fmodule-map-file\=/Users/admin/builder/spi-builder-workspace/.derivedData/Build/Intermediates.noindex/GeneratedModuleMaps-watchos/CNIOAtomics.modulemap -Xcc -fmodule-map-file\=/Users/admin/builder/spi-builder-workspace/.derivedData/Build/Intermediates.noindex/GeneratedModuleMaps-watchos/CAsyncHTTPClient.modulemap -DXcode -enable-upcoming-feature MemberImportVisibility -plugin-path /Applications/Xcode-16.3.0.app/Contents/Developer/Toolchains/XcodeDefault.xctoolchain/usr/lib/swift/host/plugins/testing -enable-experimental-feature DebugDescriptionMacro -sdk /Applications/Xcode-16.3.0.app/Contents/Developer/Platforms/WatchOS.platform/Developer/SDKs/WatchOS11.4.sdk -target armv7k-apple-watchos5.0 -g -module-cache-path /Users/admin/builder/spi-builder-workspace/.derivedData/ModuleCache.noindex -Xfrontend -serialize-debugging-options -profile-coverage-mapping -profile-generate -enable-testing -suppress-warnings -index-store-path /Users/admin/builder/spi-builder-workspace/.derivedData/Index.noindex/DataStore -swift-version 5 -I /Users/admin/builder/spi-builder-workspace/.derivedData/Build/Products/Debug-watchos -I /Applications/Xcode-16.3.0.app/Contents/Developer/Platforms/WatchOS.platform/Developer/usr/lib -F /Users/admin/builder/spi-builder-workspace/.derivedData/Build/Products/Debug-watchos/PackageFrameworks -F /Users/admin/builder/spi-builder-workspace/.derivedData/Build/Products/Debug-watchos/PackageFrameworks -F /Users/admin/builder/spi-builder-workspace/.derivedData/Build/Products/Debug-watchos/PackageFrameworks -F /Users/admin/builder/spi-builder-workspace/.derivedData/Build/Products/Debug-watchos/PackageFrameworks -F /Users/admin/builder/spi-builder-workspace/.derivedData/Build/Products/Debug-watchos/PackageFrameworks -F /Users/admin/builder/spi-builder-workspace/.derivedData/Build/Products/Debug-watchos/PackageFrameworks -F /Users/admin/builder/spi-builder-workspace/.derivedData/Build/Products/Debug-watchos/PackageFrameworks -F /Users/admin/builder/spi-builder-workspace/.derivedData/Build/Products/Debug-watchos/PackageFrameworks -F /Users/admin/builder/spi-builder-workspace/.derivedData/Build/Products/Debug-watchos/PackageFrameworks -F /Users/admin/builder/spi-builder-workspace/.derivedData/Build/Products/Debug-watchos/PackageFrameworks -F /Users/admin/builder/spi-builder-workspace/.derivedData/Build/Products/Debug-watchos/PackageFrameworks -F /Users/admin/builder/spi-builder-workspace/.derivedData/Build/Products/Debug-watchos/PackageFrameworks -F /Users/admin/builder/spi-builder-workspace/.derivedData/Build/Products/Debug-watchos/PackageFrameworks -F /Users/admin/builder/spi-builder-workspace/.derivedData/Build/Products/Debug-watchos/PackageFrameworks -F /Users/admin/builder/spi-builder-workspace/.derivedData/Build/Products/Debug-watchos/PackageFrameworks -F /Users/admin/builder/spi-builder-workspace/.derivedData/Build/Products/Debug-watchos/PackageFrameworks -F /Users/admin/builder/spi-builder-workspace/.derivedData/Build/Products/Debug-watchos/PackageFrameworks -F /Users/admin/builder/spi-builder-workspace/.derivedData/Build/Products/Debug-watchos/PackageFrameworks -F /Users/admin/builder/spi-builder-workspace/.derivedData/Build/Products/Debug-watchos/PackageFrameworks -F /Users/admin/builder/spi-builder-workspace/.derivedData/Build/Products/Debug-watchos/PackageFrameworks -F /Users/admin/builder/spi-builder-workspace/.derivedData/Build/Products/Debug-watchos/PackageFrameworks -F /Users/admin/builder/spi-builder-workspace/.derivedData/Build/Products/Debug-watchos/PackageFrameworks -F /Users/admin/builder/spi-builder-workspace/.derivedData/Build/Products/Debug-watchos/PackageFrameworks -F /Users/admin/builder/spi-builder-workspace/.derivedData/Build/Products/Debug-watchos/PackageFrameworks -F /Users/admin/builder/spi-builder-workspace/.derivedData/Build/Products/Debug-watchos/PackageFrameworks -F /Users/admin/builder/spi-builder-workspace/.derivedData/Build/Products/Debug-watchos/PackageFrameworks -F /Users/admin/builder/spi-builder-workspace/.derivedData/Build/Products/Debug-watchos/PackageFrameworks -F /Users/admin/builder/spi-builder-workspace/.derivedData/Build/Products/Debug-watchos/PackageFrameworks -F /Users/admin/builder/spi-builder-workspace/.derivedData/Build/Products/Debug-watchos/PackageFrameworks -F /Users/admin/builder/spi-builder-workspace/.derivedData/Build/Products/Debug-watchos/PackageFrameworks -F /Users/admin/builder/spi-builder-workspace/.derivedData/Build/Products/Debug-watchos/PackageFrameworks -F /Users/admin/builder/spi-builder-workspace/.derivedData/Build/Products/Debug-watchos/PackageFrameworks -F /Users/admin/builder/spi-builder-workspace/.derivedData/Build/Products/Debug-watchos/PackageFrameworks -F /Users/admin/builder/spi-builder-workspace/.derivedData/Build/Products/Debug-watchos/PackageFrameworks -F /Users/admin/builder/spi-builder-workspace/.derivedData/Build/Products/Debug-watchos -F /Applications/Xcode-16.3.0.app/Contents/Developer/Platforms/WatchOS.platform/Developer/Library/Frameworks -F /Applications/Xcode-16.3.0.app/Contents/Developer/Platforms/WatchOS.platform/Developer/SDKs/WatchOS11.4.sdk/Developer/Library/Frameworks -c -j10 -enable-batch-mode -incremental -Xcc -ivfsstatcache -Xcc /Users/admin/builder/spi-builder-workspace/.derivedData/SDKStatCaches.noindex/watchos11.4-22T246-43efb940ff07ba2497b70ec94253f576.sdkstatcache -output-file-map /Users/admin/builder/spi-builder-workspace/.derivedData/Build/Intermediates.noindex/async-http-client.build/Debug-watchos/AsyncHTTPClient.build/Objects-normal/armv7k/AsyncHTTPClient-OutputFileMap.json -use-frontend-parseable-output -save-temps -no-color-diagnostics -serialize-diagnostics -emit-dependencies -emit-module -emit-module-path /Users/admin/builder/spi-builder-workspace/.derivedData/Build/Intermediates.noindex/async-http-client.build/Debug-watchos/AsyncHTTPClient.build/Objects-normal/armv7k/AsyncHTTPClient.swiftmodule -validate-clang-modules-once -clang-build-session-file /Users/admin/builder/spi-builder-workspace/.derivedData/ModuleCache.noindex/Session.modulevalidation -Xcc -I/Users/admin/builder/spi-builder-workspace/.derivedData/Build/Intermediates.noindex/async-http-client.build/Debug-watchos/AsyncHTTPClient.build/swift-overrides.hmap -emit-const-values -Xfrontend -const-gather-protocols-file -Xfrontend /Users/admin/builder/spi-builder-workspace/.derivedData/Build/Intermediates.noindex/async-http-client.build/Debug-watchos/AsyncHTTPClient.build/Objects-normal/armv7k/AsyncHTTPClient_const_extract_protocols.json -Xcc -I/Users/admin/builder/spi-builder-workspace/.dependencies/checkouts/swift-nio/Sources/CNIOLLHTTP/include -Xcc -I/Users/admin/builder/spi-builder-workspace/.dependencies/checkouts/swift-nio-ssl/Sources/CNIOBoringSSLShims/include -Xcc -I/Users/admin/builder/spi-builder-workspace/.dependencies/checkouts/swift-nio-ssl/Sources/CNIOBoringSSL/include -Xcc -I/Users/admin/builder/spi-builder-workspace/.dependencies/checkouts/swift-nio-extras/Sources/CNIOExtrasZlib/include -Xcc -I/Users/admin/builder/spi-builder-workspace/.dependencies/checkouts/swift-nio/Sources/CNIOWASI/include -Xcc -I/Users/admin/builder/spi-builder-workspace/.dependencies/checkouts/swift-nio/Sources/CNIOWindows/include -Xcc -I/Users/admin/builder/spi-builder-workspace/.dependencies/checkouts/swift-nio/Sources/CNIOLinux/include -Xcc -I/Users/admin/builder/spi-builder-workspace/.dependencies/checkouts/swift-nio/Sources/CNIODarwin/include -Xcc -I/Users/admin/builder/spi-builder-workspace/.dependencies/checkouts/swift-nio/Sources/CNIOAtomics/include -Xcc -I/Users/admin/builder/spi-builder-workspace/.dependencies/checkouts/swift-atomics/Sources/_AtomicsShims/include -Xcc -I/Users/admin/builder/spi-builder-workspace/.dependencies/checkouts/swift-numerics/Sources/_NumericsShims/include -Xcc -I/Users/admin/builder/spi-builder-workspace/.dependencies/checkouts/async-http-client/Sources/CAsyncHTTPClient/include -Xcc -I/Users/admin/builder/spi-builder-workspace/.derivedData/Build/Products/Debug-watchos/include -Xcc -I/Users/admin/builder/spi-builder-workspace/.derivedData/Build/Intermediates.noindex/async-http-client.build/Debug-watchos/AsyncHTTPClient.build/DerivedSources-normal/armv7k -Xcc -I/Users/admin/builder/spi-builder-workspace/.derivedData/Build/Intermediates.noindex/async-http-client.build/Debug-watchos/AsyncHTTPClient.build/DerivedSources/armv7k -Xcc -I/Users/admin/builder/spi-builder-workspace/.derivedData/Build/Intermediates.noindex/async-http-client.build/Debug-watchos/AsyncHTTPClient.build/DerivedSources -Xcc -DSWIFT_PACKAGE -Xcc -DDEBUG\=1 -emit-objc-header -emit-objc-header-path /Users/admin/builder/spi-builder-workspace/.derivedData/Build/Intermediates.noindex/async-http-client.build/Debug-watchos/AsyncHTTPClient.build/Objects-normal/armv7k/AsyncHTTPClient-Swift.h -working-directory /Users/admin/builder/spi-builder-workspace/.swiftpm/xcode -experimental-emit-module-separately -disable-cmo
SwiftDriverJobDiscovery normal arm64_32 Compiling HTTPConnectionPool+StateMachine.swift, ConnectionTarget.swift, DeconstructedURL.swift, FileDownloadDelegate.swift, FoundationExtensions.swift, HTTPClient+HTTPCookie.swift (in target 'AsyncHTTPClient' from project 'async-http-client')
SwiftCompile normal armv7k Compiling\ RequestOptions.swift,\ HTTPConnectionPool+Backoff.swift,\ HTTPConnectionPool+HTTP1Connections.swift,\ HTTPConnectionPool+HTTP1StateMachine.swift,\ HTTPConnectionPool+HTTP2Connections.swift,\ HTTPConnectionPool+HTTP2StateMachine.swift,\ HTTPConnectionPool+RequestQueue.swift /Users/admin/builder/spi-builder-workspace/.dependencies/checkouts/async-http-client/Sources/AsyncHTTPClient/ConnectionPool/RequestOptions.swift /Users/admin/builder/spi-builder-workspace/.dependencies/checkouts/async-http-client/Sources/AsyncHTTPClient/ConnectionPool/State\ Machine/HTTPConnectionPool+Backoff.swift /Users/admin/builder/spi-builder-workspace/.dependencies/checkouts/async-http-client/Sources/AsyncHTTPClient/ConnectionPool/State\ Machine/HTTPConnectionPool+HTTP1Connections.swift /Users/admin/builder/spi-builder-workspace/.dependencies/checkouts/async-http-client/Sources/AsyncHTTPClient/ConnectionPool/State\ Machine/HTTPConnectionPool+HTTP1StateMachine.swift /Users/admin/builder/spi-builder-workspace/.dependencies/checkouts/async-http-client/Sources/AsyncHTTPClient/ConnectionPool/State\ Machine/HTTPConnectionPool+HTTP2Connections.swift /Users/admin/builder/spi-builder-workspace/.dependencies/checkouts/async-http-client/Sources/AsyncHTTPClient/ConnectionPool/State\ Machine/HTTPConnectionPool+HTTP2StateMachine.swift /Users/admin/builder/spi-builder-workspace/.dependencies/checkouts/async-http-client/Sources/AsyncHTTPClient/ConnectionPool/State\ Machine/HTTPConnectionPool+RequestQueue.swift (in target 'AsyncHTTPClient' from project 'async-http-client')
SwiftCompile normal armv7k /Users/admin/builder/spi-builder-workspace/.dependencies/checkouts/async-http-client/Sources/AsyncHTTPClient/ConnectionPool/RequestOptions.swift (in target 'AsyncHTTPClient' from project 'async-http-client')
cd /Users/admin/builder/spi-builder-workspace/.swiftpm/xcode
SwiftCompile normal armv7k /Users/admin/builder/spi-builder-workspace/.dependencies/checkouts/async-http-client/Sources/AsyncHTTPClient/ConnectionPool/State\ Machine/HTTPConnectionPool+Backoff.swift (in target 'AsyncHTTPClient' from project 'async-http-client')
cd /Users/admin/builder/spi-builder-workspace/.swiftpm/xcode
SwiftCompile normal armv7k /Users/admin/builder/spi-builder-workspace/.dependencies/checkouts/async-http-client/Sources/AsyncHTTPClient/ConnectionPool/State\ Machine/HTTPConnectionPool+HTTP1Connections.swift (in target 'AsyncHTTPClient' from project 'async-http-client')
cd /Users/admin/builder/spi-builder-workspace/.swiftpm/xcode
SwiftCompile normal armv7k /Users/admin/builder/spi-builder-workspace/.dependencies/checkouts/async-http-client/Sources/AsyncHTTPClient/ConnectionPool/State\ Machine/HTTPConnectionPool+HTTP1StateMachine.swift (in target 'AsyncHTTPClient' from project 'async-http-client')
cd /Users/admin/builder/spi-builder-workspace/.swiftpm/xcode
SwiftCompile normal armv7k /Users/admin/builder/spi-builder-workspace/.dependencies/checkouts/async-http-client/Sources/AsyncHTTPClient/ConnectionPool/State\ Machine/HTTPConnectionPool+HTTP2Connections.swift (in target 'AsyncHTTPClient' from project 'async-http-client')
cd /Users/admin/builder/spi-builder-workspace/.swiftpm/xcode
SwiftCompile normal armv7k /Users/admin/builder/spi-builder-workspace/.dependencies/checkouts/async-http-client/Sources/AsyncHTTPClient/ConnectionPool/State\ Machine/HTTPConnectionPool+HTTP2StateMachine.swift (in target 'AsyncHTTPClient' from project 'async-http-client')
cd /Users/admin/builder/spi-builder-workspace/.swiftpm/xcode
SwiftCompile normal armv7k /Users/admin/builder/spi-builder-workspace/.dependencies/checkouts/async-http-client/Sources/AsyncHTTPClient/ConnectionPool/State\ Machine/HTTPConnectionPool+RequestQueue.swift (in target 'AsyncHTTPClient' from project 'async-http-client')
cd /Users/admin/builder/spi-builder-workspace/.swiftpm/xcode
SwiftCompile normal armv7k Compiling\ HTTP1Connection.swift,\ HTTP1ConnectionStateMachine.swift,\ HTTP2ClientRequestHandler.swift,\ HTTP2Connection.swift,\ HTTP2IdleHandler.swift,\ HTTPConnectionEvent.swift,\ HTTPConnectionPool+Factory.swift /Users/admin/builder/spi-builder-workspace/.dependencies/checkouts/async-http-client/Sources/AsyncHTTPClient/ConnectionPool/HTTP1/HTTP1Connection.swift /Users/admin/builder/spi-builder-workspace/.dependencies/checkouts/async-http-client/Sources/AsyncHTTPClient/ConnectionPool/HTTP1/HTTP1ConnectionStateMachine.swift /Users/admin/builder/spi-builder-workspace/.dependencies/checkouts/async-http-client/Sources/AsyncHTTPClient/ConnectionPool/HTTP2/HTTP2ClientRequestHandler.swift /Users/admin/builder/spi-builder-workspace/.dependencies/checkouts/async-http-client/Sources/AsyncHTTPClient/ConnectionPool/HTTP2/HTTP2Connection.swift /Users/admin/builder/spi-builder-workspace/.dependencies/checkouts/async-http-client/Sources/AsyncHTTPClient/ConnectionPool/HTTP2/HTTP2IdleHandler.swift /Users/admin/builder/spi-builder-workspace/.dependencies/checkouts/async-http-client/Sources/AsyncHTTPClient/ConnectionPool/HTTPConnectionEvent.swift /Users/admin/builder/spi-builder-workspace/.dependencies/checkouts/async-http-client/Sources/AsyncHTTPClient/ConnectionPool/HTTPConnectionPool+Factory.swift (in target 'AsyncHTTPClient' from project 'async-http-client')
SwiftCompile normal armv7k /Users/admin/builder/spi-builder-workspace/.dependencies/checkouts/async-http-client/Sources/AsyncHTTPClient/ConnectionPool/HTTP1/HTTP1Connection.swift (in target 'AsyncHTTPClient' from project 'async-http-client')
cd /Users/admin/builder/spi-builder-workspace/.swiftpm/xcode
SwiftCompile normal armv7k /Users/admin/builder/spi-builder-workspace/.dependencies/checkouts/async-http-client/Sources/AsyncHTTPClient/ConnectionPool/HTTP1/HTTP1ConnectionStateMachine.swift (in target 'AsyncHTTPClient' from project 'async-http-client')
cd /Users/admin/builder/spi-builder-workspace/.swiftpm/xcode
SwiftCompile normal armv7k /Users/admin/builder/spi-builder-workspace/.dependencies/checkouts/async-http-client/Sources/AsyncHTTPClient/ConnectionPool/HTTP2/HTTP2ClientRequestHandler.swift (in target 'AsyncHTTPClient' from project 'async-http-client')
cd /Users/admin/builder/spi-builder-workspace/.swiftpm/xcode
SwiftCompile normal armv7k /Users/admin/builder/spi-builder-workspace/.dependencies/checkouts/async-http-client/Sources/AsyncHTTPClient/ConnectionPool/HTTP2/HTTP2Connection.swift (in target 'AsyncHTTPClient' from project 'async-http-client')
cd /Users/admin/builder/spi-builder-workspace/.swiftpm/xcode
SwiftCompile normal armv7k /Users/admin/builder/spi-builder-workspace/.dependencies/checkouts/async-http-client/Sources/AsyncHTTPClient/ConnectionPool/HTTP2/HTTP2IdleHandler.swift (in target 'AsyncHTTPClient' from project 'async-http-client')
cd /Users/admin/builder/spi-builder-workspace/.swiftpm/xcode
SwiftCompile normal armv7k /Users/admin/builder/spi-builder-workspace/.dependencies/checkouts/async-http-client/Sources/AsyncHTTPClient/ConnectionPool/HTTPConnectionEvent.swift (in target 'AsyncHTTPClient' from project 'async-http-client')
cd /Users/admin/builder/spi-builder-workspace/.swiftpm/xcode
SwiftCompile normal armv7k /Users/admin/builder/spi-builder-workspace/.dependencies/checkouts/async-http-client/Sources/AsyncHTTPClient/ConnectionPool/HTTPConnectionPool+Factory.swift (in target 'AsyncHTTPClient' from project 'async-http-client')
cd /Users/admin/builder/spi-builder-workspace/.swiftpm/xcode
SwiftMergeGeneratedHeaders /Users/admin/builder/spi-builder-workspace/.derivedData/Build/Intermediates.noindex/GeneratedModuleMaps-watchos/AsyncHTTPClient-Swift.h /Users/admin/builder/spi-builder-workspace/.derivedData/Build/Intermediates.noindex/async-http-client.build/Debug-watchos/AsyncHTTPClient.build/Objects-normal/arm64/AsyncHTTPClient-Swift.h /Users/admin/builder/spi-builder-workspace/.derivedData/Build/Intermediates.noindex/async-http-client.build/Debug-watchos/AsyncHTTPClient.build/Objects-normal/arm64_32/AsyncHTTPClient-Swift.h /Users/admin/builder/spi-builder-workspace/.derivedData/Build/Intermediates.noindex/async-http-client.build/Debug-watchos/AsyncHTTPClient.build/Objects-normal/armv7k/AsyncHTTPClient-Swift.h (in target 'AsyncHTTPClient' from project 'async-http-client')
cd /Users/admin/builder/spi-builder-workspace/.dependencies/checkouts/async-http-client
builtin-swiftHeaderTool -arch arm64 /Users/admin/builder/spi-builder-workspace/.derivedData/Build/Intermediates.noindex/async-http-client.build/Debug-watchos/AsyncHTTPClient.build/Objects-normal/arm64/AsyncHTTPClient-Swift.h -arch arm64_32 /Users/admin/builder/spi-builder-workspace/.derivedData/Build/Intermediates.noindex/async-http-client.build/Debug-watchos/AsyncHTTPClient.build/Objects-normal/arm64_32/AsyncHTTPClient-Swift.h -arch armv7k /Users/admin/builder/spi-builder-workspace/.derivedData/Build/Intermediates.noindex/async-http-client.build/Debug-watchos/AsyncHTTPClient.build/Objects-normal/armv7k/AsyncHTTPClient-Swift.h -o /Users/admin/builder/spi-builder-workspace/.derivedData/Build/Intermediates.noindex/GeneratedModuleMaps-watchos/AsyncHTTPClient-Swift.h
SwiftDriverJobDiscovery normal arm64_32 Compiling HTTPClientRequest.swift, HTTPClientResponse.swift, SingleIteratorPrecondition.swift, Transaction+StateMachine.swift, Transaction.swift, Base64.swift, BasicAuth.swift (in target 'AsyncHTTPClient' from project 'async-http-client')
Copy /Users/admin/builder/spi-builder-workspace/.derivedData/Build/Products/Debug-watchos/AsyncHTTPClient.swiftmodule/armv7k-apple-watchos.swiftmodule /Users/admin/builder/spi-builder-workspace/.derivedData/Build/Intermediates.noindex/async-http-client.build/Debug-watchos/AsyncHTTPClient.build/Objects-normal/armv7k/AsyncHTTPClient.swiftmodule (in target 'AsyncHTTPClient' from project 'async-http-client')
cd /Users/admin/builder/spi-builder-workspace/.dependencies/checkouts/async-http-client
builtin-copy -exclude .DS_Store -exclude CVS -exclude .svn -exclude .git -exclude .hg -resolve-src-symlinks -rename /Users/admin/builder/spi-builder-workspace/.derivedData/Build/Intermediates.noindex/async-http-client.build/Debug-watchos/AsyncHTTPClient.build/Objects-normal/armv7k/AsyncHTTPClient.swiftmodule /Users/admin/builder/spi-builder-workspace/.derivedData/Build/Products/Debug-watchos/AsyncHTTPClient.swiftmodule/armv7k-apple-watchos.swiftmodule
Copy /Users/admin/builder/spi-builder-workspace/.derivedData/Build/Products/Debug-watchos/AsyncHTTPClient.swiftmodule/armv7k-apple-watchos.swiftdoc /Users/admin/builder/spi-builder-workspace/.derivedData/Build/Intermediates.noindex/async-http-client.build/Debug-watchos/AsyncHTTPClient.build/Objects-normal/armv7k/AsyncHTTPClient.swiftdoc (in target 'AsyncHTTPClient' from project 'async-http-client')
cd /Users/admin/builder/spi-builder-workspace/.dependencies/checkouts/async-http-client
builtin-copy -exclude .DS_Store -exclude CVS -exclude .svn -exclude .git -exclude .hg -resolve-src-symlinks -rename /Users/admin/builder/spi-builder-workspace/.derivedData/Build/Intermediates.noindex/async-http-client.build/Debug-watchos/AsyncHTTPClient.build/Objects-normal/armv7k/AsyncHTTPClient.swiftdoc /Users/admin/builder/spi-builder-workspace/.derivedData/Build/Products/Debug-watchos/AsyncHTTPClient.swiftmodule/armv7k-apple-watchos.swiftdoc
Copy /Users/admin/builder/spi-builder-workspace/.derivedData/Build/Products/Debug-watchos/AsyncHTTPClient.swiftmodule/armv7k-apple-watchos.abi.json /Users/admin/builder/spi-builder-workspace/.derivedData/Build/Intermediates.noindex/async-http-client.build/Debug-watchos/AsyncHTTPClient.build/Objects-normal/armv7k/AsyncHTTPClient.abi.json (in target 'AsyncHTTPClient' from project 'async-http-client')
cd /Users/admin/builder/spi-builder-workspace/.dependencies/checkouts/async-http-client
builtin-copy -exclude .DS_Store -exclude CVS -exclude .svn -exclude .git -exclude .hg -resolve-src-symlinks -rename /Users/admin/builder/spi-builder-workspace/.derivedData/Build/Intermediates.noindex/async-http-client.build/Debug-watchos/AsyncHTTPClient.build/Objects-normal/armv7k/AsyncHTTPClient.abi.json /Users/admin/builder/spi-builder-workspace/.derivedData/Build/Products/Debug-watchos/AsyncHTTPClient.swiftmodule/armv7k-apple-watchos.abi.json
Copy /Users/admin/builder/spi-builder-workspace/.derivedData/Build/Products/Debug-watchos/AsyncHTTPClient.swiftmodule/Project/armv7k-apple-watchos.swiftsourceinfo /Users/admin/builder/spi-builder-workspace/.derivedData/Build/Intermediates.noindex/async-http-client.build/Debug-watchos/AsyncHTTPClient.build/Objects-normal/armv7k/AsyncHTTPClient.swiftsourceinfo (in target 'AsyncHTTPClient' from project 'async-http-client')
cd /Users/admin/builder/spi-builder-workspace/.dependencies/checkouts/async-http-client
builtin-copy -exclude .DS_Store -exclude CVS -exclude .svn -exclude .git -exclude .hg -resolve-src-symlinks -rename /Users/admin/builder/spi-builder-workspace/.derivedData/Build/Intermediates.noindex/async-http-client.build/Debug-watchos/AsyncHTTPClient.build/Objects-normal/armv7k/AsyncHTTPClient.swiftsourceinfo /Users/admin/builder/spi-builder-workspace/.derivedData/Build/Products/Debug-watchos/AsyncHTTPClient.swiftmodule/Project/armv7k-apple-watchos.swiftsourceinfo
SwiftCompile normal arm64 Compiling\ HTTPClientRequest.swift,\ HTTPClientResponse.swift,\ SingleIteratorPrecondition.swift,\ Transaction+StateMachine.swift,\ Transaction.swift,\ Base64.swift,\ BasicAuth.swift /Users/admin/builder/spi-builder-workspace/.dependencies/checkouts/async-http-client/Sources/AsyncHTTPClient/AsyncAwait/HTTPClientRequest.swift /Users/admin/builder/spi-builder-workspace/.dependencies/checkouts/async-http-client/Sources/AsyncHTTPClient/AsyncAwait/HTTPClientResponse.swift /Users/admin/builder/spi-builder-workspace/.dependencies/checkouts/async-http-client/Sources/AsyncHTTPClient/AsyncAwait/SingleIteratorPrecondition.swift /Users/admin/builder/spi-builder-workspace/.dependencies/checkouts/async-http-client/Sources/AsyncHTTPClient/AsyncAwait/Transaction+StateMachine.swift /Users/admin/builder/spi-builder-workspace/.dependencies/checkouts/async-http-client/Sources/AsyncHTTPClient/AsyncAwait/Transaction.swift /Users/admin/builder/spi-builder-workspace/.dependencies/checkouts/async-http-client/Sources/AsyncHTTPClient/Base64.swift /Users/admin/builder/spi-builder-workspace/.dependencies/checkouts/async-http-client/Sources/AsyncHTTPClient/BasicAuth.swift (in target 'AsyncHTTPClient' from project 'async-http-client')
SwiftCompile normal arm64 /Users/admin/builder/spi-builder-workspace/.dependencies/checkouts/async-http-client/Sources/AsyncHTTPClient/AsyncAwait/HTTPClientRequest.swift (in target 'AsyncHTTPClient' from project 'async-http-client')
cd /Users/admin/builder/spi-builder-workspace/.swiftpm/xcode
SwiftCompile normal arm64 /Users/admin/builder/spi-builder-workspace/.dependencies/checkouts/async-http-client/Sources/AsyncHTTPClient/AsyncAwait/HTTPClientResponse.swift (in target 'AsyncHTTPClient' from project 'async-http-client')
cd /Users/admin/builder/spi-builder-workspace/.swiftpm/xcode
SwiftCompile normal arm64 /Users/admin/builder/spi-builder-workspace/.dependencies/checkouts/async-http-client/Sources/AsyncHTTPClient/AsyncAwait/SingleIteratorPrecondition.swift (in target 'AsyncHTTPClient' from project 'async-http-client')
cd /Users/admin/builder/spi-builder-workspace/.swiftpm/xcode
SwiftCompile normal arm64 /Users/admin/builder/spi-builder-workspace/.dependencies/checkouts/async-http-client/Sources/AsyncHTTPClient/AsyncAwait/Transaction+StateMachine.swift (in target 'AsyncHTTPClient' from project 'async-http-client')
cd /Users/admin/builder/spi-builder-workspace/.swiftpm/xcode
SwiftCompile normal arm64 /Users/admin/builder/spi-builder-workspace/.dependencies/checkouts/async-http-client/Sources/AsyncHTTPClient/AsyncAwait/Transaction.swift (in target 'AsyncHTTPClient' from project 'async-http-client')
cd /Users/admin/builder/spi-builder-workspace/.swiftpm/xcode
SwiftCompile normal arm64 /Users/admin/builder/spi-builder-workspace/.dependencies/checkouts/async-http-client/Sources/AsyncHTTPClient/Base64.swift (in target 'AsyncHTTPClient' from project 'async-http-client')
cd /Users/admin/builder/spi-builder-workspace/.swiftpm/xcode
SwiftCompile normal arm64 /Users/admin/builder/spi-builder-workspace/.dependencies/checkouts/async-http-client/Sources/AsyncHTTPClient/BasicAuth.swift (in target 'AsyncHTTPClient' from project 'async-http-client')
cd /Users/admin/builder/spi-builder-workspace/.swiftpm/xcode
SwiftCompile normal armv7k Compiling\ AnyAsyncSequence.swift,\ AnyAsyncSequenceProucerDelete.swift,\ AsyncLazySequence.swift,\ HTTPClient+execute.swift,\ HTTPClient+shutdown.swift,\ HTTPClientRequest+Prepared.swift,\ HTTPClientRequest+auth.swift /Users/admin/builder/spi-builder-workspace/.dependencies/checkouts/async-http-client/Sources/AsyncHTTPClient/AsyncAwait/AnyAsyncSequence.swift /Users/admin/builder/spi-builder-workspace/.dependencies/checkouts/async-http-client/Sources/AsyncHTTPClient/AsyncAwait/AnyAsyncSequenceProucerDelete.swift /Users/admin/builder/spi-builder-workspace/.dependencies/checkouts/async-http-client/Sources/AsyncHTTPClient/AsyncAwait/AsyncLazySequence.swift /Users/admin/builder/spi-builder-workspace/.dependencies/checkouts/async-http-client/Sources/AsyncHTTPClient/AsyncAwait/HTTPClient+execute.swift /Users/admin/builder/spi-builder-workspace/.dependencies/checkouts/async-http-client/Sources/AsyncHTTPClient/AsyncAwait/HTTPClient+shutdown.swift /Users/admin/builder/spi-builder-workspace/.dependencies/checkouts/async-http-client/Sources/AsyncHTTPClient/AsyncAwait/HTTPClientRequest+Prepared.swift /Users/admin/builder/spi-builder-workspace/.dependencies/checkouts/async-http-client/Sources/AsyncHTTPClient/AsyncAwait/HTTPClientRequest+auth.swift (in target 'AsyncHTTPClient' from project 'async-http-client')
SwiftCompile normal armv7k /Users/admin/builder/spi-builder-workspace/.dependencies/checkouts/async-http-client/Sources/AsyncHTTPClient/AsyncAwait/AnyAsyncSequence.swift (in target 'AsyncHTTPClient' from project 'async-http-client')
cd /Users/admin/builder/spi-builder-workspace/.swiftpm/xcode
SwiftCompile normal armv7k /Users/admin/builder/spi-builder-workspace/.dependencies/checkouts/async-http-client/Sources/AsyncHTTPClient/AsyncAwait/AnyAsyncSequenceProucerDelete.swift (in target 'AsyncHTTPClient' from project 'async-http-client')
cd /Users/admin/builder/spi-builder-workspace/.swiftpm/xcode
SwiftCompile normal armv7k /Users/admin/builder/spi-builder-workspace/.dependencies/checkouts/async-http-client/Sources/AsyncHTTPClient/AsyncAwait/AsyncLazySequence.swift (in target 'AsyncHTTPClient' from project 'async-http-client')
cd /Users/admin/builder/spi-builder-workspace/.swiftpm/xcode
SwiftCompile normal armv7k /Users/admin/builder/spi-builder-workspace/.dependencies/checkouts/async-http-client/Sources/AsyncHTTPClient/AsyncAwait/HTTPClient+execute.swift (in target 'AsyncHTTPClient' from project 'async-http-client')
cd /Users/admin/builder/spi-builder-workspace/.swiftpm/xcode
SwiftCompile normal armv7k /Users/admin/builder/spi-builder-workspace/.dependencies/checkouts/async-http-client/Sources/AsyncHTTPClient/AsyncAwait/HTTPClient+shutdown.swift (in target 'AsyncHTTPClient' from project 'async-http-client')
cd /Users/admin/builder/spi-builder-workspace/.swiftpm/xcode
SwiftCompile normal armv7k /Users/admin/builder/spi-builder-workspace/.dependencies/checkouts/async-http-client/Sources/AsyncHTTPClient/AsyncAwait/HTTPClientRequest+Prepared.swift (in target 'AsyncHTTPClient' from project 'async-http-client')
cd /Users/admin/builder/spi-builder-workspace/.swiftpm/xcode
SwiftCompile normal armv7k /Users/admin/builder/spi-builder-workspace/.dependencies/checkouts/async-http-client/Sources/AsyncHTTPClient/AsyncAwait/HTTPClientRequest+auth.swift (in target 'AsyncHTTPClient' from project 'async-http-client')
cd /Users/admin/builder/spi-builder-workspace/.swiftpm/xcode
SwiftDriverJobDiscovery normal arm64_32 Compiling HTTPConnectionPool+Manager.swift, HTTPConnectionPool.swift, HTTPExecutableRequest.swift, HTTPRequestStateMachine+Demand.swift, HTTPRequestStateMachine.swift, RequestBodyLength.swift, RequestFramingMetadata.swift (in target 'AsyncHTTPClient' from project 'async-http-client')
SwiftCompile normal arm64 Compiling\ HTTPConnectionPool+Manager.swift,\ HTTPConnectionPool.swift,\ HTTPExecutableRequest.swift,\ HTTPRequestStateMachine+Demand.swift,\ HTTPRequestStateMachine.swift,\ RequestBodyLength.swift,\ RequestFramingMetadata.swift /Users/admin/builder/spi-builder-workspace/.dependencies/checkouts/async-http-client/Sources/AsyncHTTPClient/ConnectionPool/HTTPConnectionPool+Manager.swift /Users/admin/builder/spi-builder-workspace/.dependencies/checkouts/async-http-client/Sources/AsyncHTTPClient/ConnectionPool/HTTPConnectionPool.swift /Users/admin/builder/spi-builder-workspace/.dependencies/checkouts/async-http-client/Sources/AsyncHTTPClient/ConnectionPool/HTTPExecutableRequest.swift /Users/admin/builder/spi-builder-workspace/.dependencies/checkouts/async-http-client/Sources/AsyncHTTPClient/ConnectionPool/HTTPRequestStateMachine+Demand.swift /Users/admin/builder/spi-builder-workspace/.dependencies/checkouts/async-http-client/Sources/AsyncHTTPClient/ConnectionPool/HTTPRequestStateMachine.swift /Users/admin/builder/spi-builder-workspace/.dependencies/checkouts/async-http-client/Sources/AsyncHTTPClient/ConnectionPool/RequestBodyLength.swift /Users/admin/builder/spi-builder-workspace/.dependencies/checkouts/async-http-client/Sources/AsyncHTTPClient/ConnectionPool/RequestFramingMetadata.swift (in target 'AsyncHTTPClient' from project 'async-http-client')
SwiftCompile normal arm64 /Users/admin/builder/spi-builder-workspace/.dependencies/checkouts/async-http-client/Sources/AsyncHTTPClient/ConnectionPool/HTTPConnectionPool+Manager.swift (in target 'AsyncHTTPClient' from project 'async-http-client')
cd /Users/admin/builder/spi-builder-workspace/.swiftpm/xcode
SwiftCompile normal arm64 /Users/admin/builder/spi-builder-workspace/.dependencies/checkouts/async-http-client/Sources/AsyncHTTPClient/ConnectionPool/HTTPConnectionPool.swift (in target 'AsyncHTTPClient' from project 'async-http-client')
cd /Users/admin/builder/spi-builder-workspace/.swiftpm/xcode
SwiftCompile normal arm64 /Users/admin/builder/spi-builder-workspace/.dependencies/checkouts/async-http-client/Sources/AsyncHTTPClient/ConnectionPool/HTTPExecutableRequest.swift (in target 'AsyncHTTPClient' from project 'async-http-client')
cd /Users/admin/builder/spi-builder-workspace/.swiftpm/xcode
SwiftCompile normal arm64 /Users/admin/builder/spi-builder-workspace/.dependencies/checkouts/async-http-client/Sources/AsyncHTTPClient/ConnectionPool/HTTPRequestStateMachine+Demand.swift (in target 'AsyncHTTPClient' from project 'async-http-client')
cd /Users/admin/builder/spi-builder-workspace/.swiftpm/xcode
SwiftCompile normal arm64 /Users/admin/builder/spi-builder-workspace/.dependencies/checkouts/async-http-client/Sources/AsyncHTTPClient/ConnectionPool/HTTPRequestStateMachine.swift (in target 'AsyncHTTPClient' from project 'async-http-client')
cd /Users/admin/builder/spi-builder-workspace/.swiftpm/xcode
SwiftCompile normal arm64 /Users/admin/builder/spi-builder-workspace/.dependencies/checkouts/async-http-client/Sources/AsyncHTTPClient/ConnectionPool/RequestBodyLength.swift (in target 'AsyncHTTPClient' from project 'async-http-client')
cd /Users/admin/builder/spi-builder-workspace/.swiftpm/xcode
SwiftCompile normal arm64 /Users/admin/builder/spi-builder-workspace/.dependencies/checkouts/async-http-client/Sources/AsyncHTTPClient/ConnectionPool/RequestFramingMetadata.swift (in target 'AsyncHTTPClient' from project 'async-http-client')
cd /Users/admin/builder/spi-builder-workspace/.swiftpm/xcode
SwiftDriverJobDiscovery normal arm64_32 Compiling HTTP1Connection.swift, HTTP1ConnectionStateMachine.swift, HTTP2ClientRequestHandler.swift, HTTP2Connection.swift, HTTP2IdleHandler.swift, HTTPConnectionEvent.swift, HTTPConnectionPool+Factory.swift (in target 'AsyncHTTPClient' from project 'async-http-client')
SwiftCompile normal arm64_32 Compiling\ SSLContextCache.swift,\ Scheme.swift,\ Singleton.swift,\ StringConvertibleInstances.swift,\ StructuredConcurrencyHelpers.swift,\ Utils.swift /Users/admin/builder/spi-builder-workspace/.dependencies/checkouts/async-http-client/Sources/AsyncHTTPClient/SSLContextCache.swift /Users/admin/builder/spi-builder-workspace/.dependencies/checkouts/async-http-client/Sources/AsyncHTTPClient/Scheme.swift /Users/admin/builder/spi-builder-workspace/.dependencies/checkouts/async-http-client/Sources/AsyncHTTPClient/Singleton.swift /Users/admin/builder/spi-builder-workspace/.dependencies/checkouts/async-http-client/Sources/AsyncHTTPClient/StringConvertibleInstances.swift /Users/admin/builder/spi-builder-workspace/.dependencies/checkouts/async-http-client/Sources/AsyncHTTPClient/StructuredConcurrencyHelpers.swift /Users/admin/builder/spi-builder-workspace/.dependencies/checkouts/async-http-client/Sources/AsyncHTTPClient/Utils.swift (in target 'AsyncHTTPClient' from project 'async-http-client')
SwiftCompile normal arm64_32 /Users/admin/builder/spi-builder-workspace/.dependencies/checkouts/async-http-client/Sources/AsyncHTTPClient/SSLContextCache.swift (in target 'AsyncHTTPClient' from project 'async-http-client')
cd /Users/admin/builder/spi-builder-workspace/.swiftpm/xcode
SwiftCompile normal arm64_32 /Users/admin/builder/spi-builder-workspace/.dependencies/checkouts/async-http-client/Sources/AsyncHTTPClient/Scheme.swift (in target 'AsyncHTTPClient' from project 'async-http-client')
cd /Users/admin/builder/spi-builder-workspace/.swiftpm/xcode
SwiftCompile normal arm64_32 /Users/admin/builder/spi-builder-workspace/.dependencies/checkouts/async-http-client/Sources/AsyncHTTPClient/Singleton.swift (in target 'AsyncHTTPClient' from project 'async-http-client')
cd /Users/admin/builder/spi-builder-workspace/.swiftpm/xcode
SwiftCompile normal arm64_32 /Users/admin/builder/spi-builder-workspace/.dependencies/checkouts/async-http-client/Sources/AsyncHTTPClient/StringConvertibleInstances.swift (in target 'AsyncHTTPClient' from project 'async-http-client')
cd /Users/admin/builder/spi-builder-workspace/.swiftpm/xcode
SwiftCompile normal arm64_32 /Users/admin/builder/spi-builder-workspace/.dependencies/checkouts/async-http-client/Sources/AsyncHTTPClient/StructuredConcurrencyHelpers.swift (in target 'AsyncHTTPClient' from project 'async-http-client')
cd /Users/admin/builder/spi-builder-workspace/.swiftpm/xcode
SwiftCompile normal arm64_32 /Users/admin/builder/spi-builder-workspace/.dependencies/checkouts/async-http-client/Sources/AsyncHTTPClient/Utils.swift (in target 'AsyncHTTPClient' from project 'async-http-client')
cd /Users/admin/builder/spi-builder-workspace/.swiftpm/xcode
SwiftDriverJobDiscovery normal arm64_32 Compiling RequestOptions.swift, HTTPConnectionPool+Backoff.swift, HTTPConnectionPool+HTTP1Connections.swift, HTTPConnectionPool+HTTP1StateMachine.swift, HTTPConnectionPool+HTTP2Connections.swift, HTTPConnectionPool+HTTP2StateMachine.swift, HTTPConnectionPool+RequestQueue.swift (in target 'AsyncHTTPClient' from project 'async-http-client')
SwiftCompile normal armv7k Compiling\ SSLContextCache.swift,\ Scheme.swift,\ Singleton.swift,\ StringConvertibleInstances.swift,\ StructuredConcurrencyHelpers.swift,\ Utils.swift /Users/admin/builder/spi-builder-workspace/.dependencies/checkouts/async-http-client/Sources/AsyncHTTPClient/SSLContextCache.swift /Users/admin/builder/spi-builder-workspace/.dependencies/checkouts/async-http-client/Sources/AsyncHTTPClient/Scheme.swift /Users/admin/builder/spi-builder-workspace/.dependencies/checkouts/async-http-client/Sources/AsyncHTTPClient/Singleton.swift /Users/admin/builder/spi-builder-workspace/.dependencies/checkouts/async-http-client/Sources/AsyncHTTPClient/StringConvertibleInstances.swift /Users/admin/builder/spi-builder-workspace/.dependencies/checkouts/async-http-client/Sources/AsyncHTTPClient/StructuredConcurrencyHelpers.swift /Users/admin/builder/spi-builder-workspace/.dependencies/checkouts/async-http-client/Sources/AsyncHTTPClient/Utils.swift (in target 'AsyncHTTPClient' from project 'async-http-client')
SwiftCompile normal armv7k /Users/admin/builder/spi-builder-workspace/.dependencies/checkouts/async-http-client/Sources/AsyncHTTPClient/SSLContextCache.swift (in target 'AsyncHTTPClient' from project 'async-http-client')
cd /Users/admin/builder/spi-builder-workspace/.swiftpm/xcode
SwiftCompile normal armv7k /Users/admin/builder/spi-builder-workspace/.dependencies/checkouts/async-http-client/Sources/AsyncHTTPClient/Scheme.swift (in target 'AsyncHTTPClient' from project 'async-http-client')
cd /Users/admin/builder/spi-builder-workspace/.swiftpm/xcode
SwiftCompile normal armv7k /Users/admin/builder/spi-builder-workspace/.dependencies/checkouts/async-http-client/Sources/AsyncHTTPClient/Singleton.swift (in target 'AsyncHTTPClient' from project 'async-http-client')
cd /Users/admin/builder/spi-builder-workspace/.swiftpm/xcode
SwiftCompile normal armv7k /Users/admin/builder/spi-builder-workspace/.dependencies/checkouts/async-http-client/Sources/AsyncHTTPClient/StringConvertibleInstances.swift (in target 'AsyncHTTPClient' from project 'async-http-client')
cd /Users/admin/builder/spi-builder-workspace/.swiftpm/xcode
SwiftCompile normal armv7k /Users/admin/builder/spi-builder-workspace/.dependencies/checkouts/async-http-client/Sources/AsyncHTTPClient/StructuredConcurrencyHelpers.swift (in target 'AsyncHTTPClient' from project 'async-http-client')
cd /Users/admin/builder/spi-builder-workspace/.swiftpm/xcode
SwiftCompile normal armv7k /Users/admin/builder/spi-builder-workspace/.dependencies/checkouts/async-http-client/Sources/AsyncHTTPClient/Utils.swift (in target 'AsyncHTTPClient' from project 'async-http-client')
cd /Users/admin/builder/spi-builder-workspace/.swiftpm/xcode
SwiftDriverJobDiscovery normal armv7k Compiling HTTPClientRequest.swift, HTTPClientResponse.swift, SingleIteratorPrecondition.swift, Transaction+StateMachine.swift, Transaction.swift, Base64.swift, BasicAuth.swift (in target 'AsyncHTTPClient' from project 'async-http-client')
SwiftCompile normal arm64 Compiling\ RequestOptions.swift,\ HTTPConnectionPool+Backoff.swift,\ HTTPConnectionPool+HTTP1Connections.swift,\ HTTPConnectionPool+HTTP1StateMachine.swift,\ HTTPConnectionPool+HTTP2Connections.swift,\ HTTPConnectionPool+HTTP2StateMachine.swift,\ HTTPConnectionPool+RequestQueue.swift /Users/admin/builder/spi-builder-workspace/.dependencies/checkouts/async-http-client/Sources/AsyncHTTPClient/ConnectionPool/RequestOptions.swift /Users/admin/builder/spi-builder-workspace/.dependencies/checkouts/async-http-client/Sources/AsyncHTTPClient/ConnectionPool/State\ Machine/HTTPConnectionPool+Backoff.swift /Users/admin/builder/spi-builder-workspace/.dependencies/checkouts/async-http-client/Sources/AsyncHTTPClient/ConnectionPool/State\ Machine/HTTPConnectionPool+HTTP1Connections.swift /Users/admin/builder/spi-builder-workspace/.dependencies/checkouts/async-http-client/Sources/AsyncHTTPClient/ConnectionPool/State\ Machine/HTTPConnectionPool+HTTP1StateMachine.swift /Users/admin/builder/spi-builder-workspace/.dependencies/checkouts/async-http-client/Sources/AsyncHTTPClient/ConnectionPool/State\ Machine/HTTPConnectionPool+HTTP2Connections.swift /Users/admin/builder/spi-builder-workspace/.dependencies/checkouts/async-http-client/Sources/AsyncHTTPClient/ConnectionPool/State\ Machine/HTTPConnectionPool+HTTP2StateMachine.swift /Users/admin/builder/spi-builder-workspace/.dependencies/checkouts/async-http-client/Sources/AsyncHTTPClient/ConnectionPool/State\ Machine/HTTPConnectionPool+RequestQueue.swift (in target 'AsyncHTTPClient' from project 'async-http-client')
SwiftCompile normal arm64 /Users/admin/builder/spi-builder-workspace/.dependencies/checkouts/async-http-client/Sources/AsyncHTTPClient/ConnectionPool/RequestOptions.swift (in target 'AsyncHTTPClient' from project 'async-http-client')
cd /Users/admin/builder/spi-builder-workspace/.swiftpm/xcode
SwiftCompile normal arm64 /Users/admin/builder/spi-builder-workspace/.dependencies/checkouts/async-http-client/Sources/AsyncHTTPClient/ConnectionPool/State\ Machine/HTTPConnectionPool+Backoff.swift (in target 'AsyncHTTPClient' from project 'async-http-client')
cd /Users/admin/builder/spi-builder-workspace/.swiftpm/xcode
SwiftCompile normal arm64 /Users/admin/builder/spi-builder-workspace/.dependencies/checkouts/async-http-client/Sources/AsyncHTTPClient/ConnectionPool/State\ Machine/HTTPConnectionPool+HTTP1Connections.swift (in target 'AsyncHTTPClient' from project 'async-http-client')
cd /Users/admin/builder/spi-builder-workspace/.swiftpm/xcode
SwiftCompile normal arm64 /Users/admin/builder/spi-builder-workspace/.dependencies/checkouts/async-http-client/Sources/AsyncHTTPClient/ConnectionPool/State\ Machine/HTTPConnectionPool+HTTP1StateMachine.swift (in target 'AsyncHTTPClient' from project 'async-http-client')
cd /Users/admin/builder/spi-builder-workspace/.swiftpm/xcode
SwiftCompile normal arm64 /Users/admin/builder/spi-builder-workspace/.dependencies/checkouts/async-http-client/Sources/AsyncHTTPClient/ConnectionPool/State\ Machine/HTTPConnectionPool+HTTP2Connections.swift (in target 'AsyncHTTPClient' from project 'async-http-client')
cd /Users/admin/builder/spi-builder-workspace/.swiftpm/xcode
SwiftCompile normal arm64 /Users/admin/builder/spi-builder-workspace/.dependencies/checkouts/async-http-client/Sources/AsyncHTTPClient/ConnectionPool/State\ Machine/HTTPConnectionPool+HTTP2StateMachine.swift (in target 'AsyncHTTPClient' from project 'async-http-client')
cd /Users/admin/builder/spi-builder-workspace/.swiftpm/xcode
SwiftCompile normal arm64 /Users/admin/builder/spi-builder-workspace/.dependencies/checkouts/async-http-client/Sources/AsyncHTTPClient/ConnectionPool/State\ Machine/HTTPConnectionPool+RequestQueue.swift (in target 'AsyncHTTPClient' from project 'async-http-client')
cd /Users/admin/builder/spi-builder-workspace/.swiftpm/xcode
SwiftDriverJobDiscovery normal arm64_32 Compiling SSLContextCache.swift, Scheme.swift, Singleton.swift, StringConvertibleInstances.swift, StructuredConcurrencyHelpers.swift, Utils.swift (in target 'AsyncHTTPClient' from project 'async-http-client')
SwiftCompile normal arm64 Compiling\ HTTP1Connection.swift,\ HTTP1ConnectionStateMachine.swift,\ HTTP2ClientRequestHandler.swift,\ HTTP2Connection.swift,\ HTTP2IdleHandler.swift,\ HTTPConnectionEvent.swift,\ HTTPConnectionPool+Factory.swift /Users/admin/builder/spi-builder-workspace/.dependencies/checkouts/async-http-client/Sources/AsyncHTTPClient/ConnectionPool/HTTP1/HTTP1Connection.swift /Users/admin/builder/spi-builder-workspace/.dependencies/checkouts/async-http-client/Sources/AsyncHTTPClient/ConnectionPool/HTTP1/HTTP1ConnectionStateMachine.swift /Users/admin/builder/spi-builder-workspace/.dependencies/checkouts/async-http-client/Sources/AsyncHTTPClient/ConnectionPool/HTTP2/HTTP2ClientRequestHandler.swift /Users/admin/builder/spi-builder-workspace/.dependencies/checkouts/async-http-client/Sources/AsyncHTTPClient/ConnectionPool/HTTP2/HTTP2Connection.swift /Users/admin/builder/spi-builder-workspace/.dependencies/checkouts/async-http-client/Sources/AsyncHTTPClient/ConnectionPool/HTTP2/HTTP2IdleHandler.swift /Users/admin/builder/spi-builder-workspace/.dependencies/checkouts/async-http-client/Sources/AsyncHTTPClient/ConnectionPool/HTTPConnectionEvent.swift /Users/admin/builder/spi-builder-workspace/.dependencies/checkouts/async-http-client/Sources/AsyncHTTPClient/ConnectionPool/HTTPConnectionPool+Factory.swift (in target 'AsyncHTTPClient' from project 'async-http-client')
SwiftCompile normal arm64 /Users/admin/builder/spi-builder-workspace/.dependencies/checkouts/async-http-client/Sources/AsyncHTTPClient/ConnectionPool/HTTP1/HTTP1Connection.swift (in target 'AsyncHTTPClient' from project 'async-http-client')
cd /Users/admin/builder/spi-builder-workspace/.swiftpm/xcode
SwiftCompile normal arm64 /Users/admin/builder/spi-builder-workspace/.dependencies/checkouts/async-http-client/Sources/AsyncHTTPClient/ConnectionPool/HTTP1/HTTP1ConnectionStateMachine.swift (in target 'AsyncHTTPClient' from project 'async-http-client')
cd /Users/admin/builder/spi-builder-workspace/.swiftpm/xcode
SwiftCompile normal arm64 /Users/admin/builder/spi-builder-workspace/.dependencies/checkouts/async-http-client/Sources/AsyncHTTPClient/ConnectionPool/HTTP2/HTTP2ClientRequestHandler.swift (in target 'AsyncHTTPClient' from project 'async-http-client')
cd /Users/admin/builder/spi-builder-workspace/.swiftpm/xcode
SwiftCompile normal arm64 /Users/admin/builder/spi-builder-workspace/.dependencies/checkouts/async-http-client/Sources/AsyncHTTPClient/ConnectionPool/HTTP2/HTTP2Connection.swift (in target 'AsyncHTTPClient' from project 'async-http-client')
cd /Users/admin/builder/spi-builder-workspace/.swiftpm/xcode
SwiftCompile normal arm64 /Users/admin/builder/spi-builder-workspace/.dependencies/checkouts/async-http-client/Sources/AsyncHTTPClient/ConnectionPool/HTTP2/HTTP2IdleHandler.swift (in target 'AsyncHTTPClient' from project 'async-http-client')
cd /Users/admin/builder/spi-builder-workspace/.swiftpm/xcode
SwiftCompile normal arm64 /Users/admin/builder/spi-builder-workspace/.dependencies/checkouts/async-http-client/Sources/AsyncHTTPClient/ConnectionPool/HTTPConnectionEvent.swift (in target 'AsyncHTTPClient' from project 'async-http-client')
cd /Users/admin/builder/spi-builder-workspace/.swiftpm/xcode
SwiftCompile normal arm64 /Users/admin/builder/spi-builder-workspace/.dependencies/checkouts/async-http-client/Sources/AsyncHTTPClient/ConnectionPool/HTTPConnectionPool+Factory.swift (in target 'AsyncHTTPClient' from project 'async-http-client')
cd /Users/admin/builder/spi-builder-workspace/.swiftpm/xcode
SwiftDriverJobDiscovery normal armv7k Compiling SSLContextCache.swift, Scheme.swift, Singleton.swift, StringConvertibleInstances.swift, StructuredConcurrencyHelpers.swift, Utils.swift (in target 'AsyncHTTPClient' from project 'async-http-client')
SwiftCompile normal arm64 Compiling\ NWWaitingHandler.swift,\ TLSConfiguration.swift,\ RedirectState.swift,\ RequestBag+StateMachine.swift,\ RequestBag.swift,\ RequestValidation.swift /Users/admin/builder/spi-builder-workspace/.dependencies/checkouts/async-http-client/Sources/AsyncHTTPClient/NIOTransportServices/NWWaitingHandler.swift /Users/admin/builder/spi-builder-workspace/.dependencies/checkouts/async-http-client/Sources/AsyncHTTPClient/NIOTransportServices/TLSConfiguration.swift /Users/admin/builder/spi-builder-workspace/.dependencies/checkouts/async-http-client/Sources/AsyncHTTPClient/RedirectState.swift /Users/admin/builder/spi-builder-workspace/.dependencies/checkouts/async-http-client/Sources/AsyncHTTPClient/RequestBag+StateMachine.swift /Users/admin/builder/spi-builder-workspace/.dependencies/checkouts/async-http-client/Sources/AsyncHTTPClient/RequestBag.swift /Users/admin/builder/spi-builder-workspace/.dependencies/checkouts/async-http-client/Sources/AsyncHTTPClient/RequestValidation.swift (in target 'AsyncHTTPClient' from project 'async-http-client')
SwiftCompile normal arm64 /Users/admin/builder/spi-builder-workspace/.dependencies/checkouts/async-http-client/Sources/AsyncHTTPClient/NIOTransportServices/NWWaitingHandler.swift (in target 'AsyncHTTPClient' from project 'async-http-client')
cd /Users/admin/builder/spi-builder-workspace/.swiftpm/xcode
SwiftCompile normal arm64 /Users/admin/builder/spi-builder-workspace/.dependencies/checkouts/async-http-client/Sources/AsyncHTTPClient/NIOTransportServices/TLSConfiguration.swift (in target 'AsyncHTTPClient' from project 'async-http-client')
cd /Users/admin/builder/spi-builder-workspace/.swiftpm/xcode
SwiftCompile normal arm64 /Users/admin/builder/spi-builder-workspace/.dependencies/checkouts/async-http-client/Sources/AsyncHTTPClient/RedirectState.swift (in target 'AsyncHTTPClient' from project 'async-http-client')
cd /Users/admin/builder/spi-builder-workspace/.swiftpm/xcode
SwiftCompile normal arm64 /Users/admin/builder/spi-builder-workspace/.dependencies/checkouts/async-http-client/Sources/AsyncHTTPClient/RequestBag+StateMachine.swift (in target 'AsyncHTTPClient' from project 'async-http-client')
cd /Users/admin/builder/spi-builder-workspace/.swiftpm/xcode
SwiftCompile normal arm64 /Users/admin/builder/spi-builder-workspace/.dependencies/checkouts/async-http-client/Sources/AsyncHTTPClient/RequestBag.swift (in target 'AsyncHTTPClient' from project 'async-http-client')
cd /Users/admin/builder/spi-builder-workspace/.swiftpm/xcode
SwiftCompile normal arm64 /Users/admin/builder/spi-builder-workspace/.dependencies/checkouts/async-http-client/Sources/AsyncHTTPClient/RequestValidation.swift (in target 'AsyncHTTPClient' from project 'async-http-client')
cd /Users/admin/builder/spi-builder-workspace/.swiftpm/xcode
SwiftDriverJobDiscovery normal armv7k Compiling AnyAsyncSequence.swift, AnyAsyncSequenceProucerDelete.swift, AsyncLazySequence.swift, HTTPClient+execute.swift, HTTPClient+shutdown.swift, HTTPClientRequest+Prepared.swift, HTTPClientRequest+auth.swift (in target 'AsyncHTTPClient' from project 'async-http-client')
SwiftCompile normal arm64 Compiling\ HTTPConnectionPool+StateMachine.swift,\ ConnectionTarget.swift,\ DeconstructedURL.swift,\ FileDownloadDelegate.swift,\ FoundationExtensions.swift,\ HTTPClient+HTTPCookie.swift /Users/admin/builder/spi-builder-workspace/.dependencies/checkouts/async-http-client/Sources/AsyncHTTPClient/ConnectionPool/State\ Machine/HTTPConnectionPool+StateMachine.swift /Users/admin/builder/spi-builder-workspace/.dependencies/checkouts/async-http-client/Sources/AsyncHTTPClient/ConnectionTarget.swift /Users/admin/builder/spi-builder-workspace/.dependencies/checkouts/async-http-client/Sources/AsyncHTTPClient/DeconstructedURL.swift /Users/admin/builder/spi-builder-workspace/.dependencies/checkouts/async-http-client/Sources/AsyncHTTPClient/FileDownloadDelegate.swift /Users/admin/builder/spi-builder-workspace/.dependencies/checkouts/async-http-client/Sources/AsyncHTTPClient/FoundationExtensions.swift /Users/admin/builder/spi-builder-workspace/.dependencies/checkouts/async-http-client/Sources/AsyncHTTPClient/HTTPClient+HTTPCookie.swift (in target 'AsyncHTTPClient' from project 'async-http-client')
SwiftCompile normal arm64 /Users/admin/builder/spi-builder-workspace/.dependencies/checkouts/async-http-client/Sources/AsyncHTTPClient/ConnectionPool/State\ Machine/HTTPConnectionPool+StateMachine.swift (in target 'AsyncHTTPClient' from project 'async-http-client')
cd /Users/admin/builder/spi-builder-workspace/.swiftpm/xcode
SwiftCompile normal arm64 /Users/admin/builder/spi-builder-workspace/.dependencies/checkouts/async-http-client/Sources/AsyncHTTPClient/ConnectionTarget.swift (in target 'AsyncHTTPClient' from project 'async-http-client')
cd /Users/admin/builder/spi-builder-workspace/.swiftpm/xcode
SwiftCompile normal arm64 /Users/admin/builder/spi-builder-workspace/.dependencies/checkouts/async-http-client/Sources/AsyncHTTPClient/DeconstructedURL.swift (in target 'AsyncHTTPClient' from project 'async-http-client')
cd /Users/admin/builder/spi-builder-workspace/.swiftpm/xcode
SwiftCompile normal arm64 /Users/admin/builder/spi-builder-workspace/.dependencies/checkouts/async-http-client/Sources/AsyncHTTPClient/FileDownloadDelegate.swift (in target 'AsyncHTTPClient' from project 'async-http-client')
cd /Users/admin/builder/spi-builder-workspace/.swiftpm/xcode
SwiftCompile normal arm64 /Users/admin/builder/spi-builder-workspace/.dependencies/checkouts/async-http-client/Sources/AsyncHTTPClient/FoundationExtensions.swift (in target 'AsyncHTTPClient' from project 'async-http-client')
cd /Users/admin/builder/spi-builder-workspace/.swiftpm/xcode
SwiftCompile normal arm64 /Users/admin/builder/spi-builder-workspace/.dependencies/checkouts/async-http-client/Sources/AsyncHTTPClient/HTTPClient+HTTPCookie.swift (in target 'AsyncHTTPClient' from project 'async-http-client')
cd /Users/admin/builder/spi-builder-workspace/.swiftpm/xcode
SwiftDriverJobDiscovery normal armv7k Compiling HTTPConnectionPool+Manager.swift, HTTPConnectionPool.swift, HTTPExecutableRequest.swift, HTTPRequestStateMachine+Demand.swift, HTTPRequestStateMachine.swift, RequestBodyLength.swift, RequestFramingMetadata.swift (in target 'AsyncHTTPClient' from project 'async-http-client')
SwiftCompile normal arm64_32 Compiling\ HTTPClient+Proxy.swift,\ HTTPClient+StructuredConcurrency.swift,\ HTTPClient.swift,\ HTTPHandler.swift,\ LRUCache.swift,\ NWErrorHandler.swift /Users/admin/builder/spi-builder-workspace/.dependencies/checkouts/async-http-client/Sources/AsyncHTTPClient/HTTPClient+Proxy.swift /Users/admin/builder/spi-builder-workspace/.dependencies/checkouts/async-http-client/Sources/AsyncHTTPClient/HTTPClient+StructuredConcurrency.swift /Users/admin/builder/spi-builder-workspace/.dependencies/checkouts/async-http-client/Sources/AsyncHTTPClient/HTTPClient.swift /Users/admin/builder/spi-builder-workspace/.dependencies/checkouts/async-http-client/Sources/AsyncHTTPClient/HTTPHandler.swift /Users/admin/builder/spi-builder-workspace/.dependencies/checkouts/async-http-client/Sources/AsyncHTTPClient/LRUCache.swift /Users/admin/builder/spi-builder-workspace/.dependencies/checkouts/async-http-client/Sources/AsyncHTTPClient/NIOTransportServices/NWErrorHandler.swift (in target 'AsyncHTTPClient' from project 'async-http-client')
SwiftCompile normal arm64_32 /Users/admin/builder/spi-builder-workspace/.dependencies/checkouts/async-http-client/Sources/AsyncHTTPClient/HTTPClient+Proxy.swift (in target 'AsyncHTTPClient' from project 'async-http-client')
cd /Users/admin/builder/spi-builder-workspace/.swiftpm/xcode
SwiftCompile normal arm64_32 /Users/admin/builder/spi-builder-workspace/.dependencies/checkouts/async-http-client/Sources/AsyncHTTPClient/HTTPClient+StructuredConcurrency.swift (in target 'AsyncHTTPClient' from project 'async-http-client')
cd /Users/admin/builder/spi-builder-workspace/.swiftpm/xcode
SwiftCompile normal arm64_32 /Users/admin/builder/spi-builder-workspace/.dependencies/checkouts/async-http-client/Sources/AsyncHTTPClient/HTTPClient.swift (in target 'AsyncHTTPClient' from project 'async-http-client')
cd /Users/admin/builder/spi-builder-workspace/.swiftpm/xcode
SwiftCompile normal arm64_32 /Users/admin/builder/spi-builder-workspace/.dependencies/checkouts/async-http-client/Sources/AsyncHTTPClient/HTTPHandler.swift (in target 'AsyncHTTPClient' from project 'async-http-client')
cd /Users/admin/builder/spi-builder-workspace/.swiftpm/xcode
SwiftCompile normal arm64_32 /Users/admin/builder/spi-builder-workspace/.dependencies/checkouts/async-http-client/Sources/AsyncHTTPClient/LRUCache.swift (in target 'AsyncHTTPClient' from project 'async-http-client')
cd /Users/admin/builder/spi-builder-workspace/.swiftpm/xcode
SwiftCompile normal arm64_32 /Users/admin/builder/spi-builder-workspace/.dependencies/checkouts/async-http-client/Sources/AsyncHTTPClient/NIOTransportServices/NWErrorHandler.swift (in target 'AsyncHTTPClient' from project 'async-http-client')
cd /Users/admin/builder/spi-builder-workspace/.swiftpm/xcode
SwiftDriverJobDiscovery normal arm64_32 Compiling NWWaitingHandler.swift, TLSConfiguration.swift, RedirectState.swift, RequestBag+StateMachine.swift, RequestBag.swift, RequestValidation.swift (in target 'AsyncHTTPClient' from project 'async-http-client')
SwiftCompile normal arm64 Compiling\ SSLContextCache.swift,\ Scheme.swift,\ Singleton.swift,\ StringConvertibleInstances.swift,\ StructuredConcurrencyHelpers.swift,\ Utils.swift /Users/admin/builder/spi-builder-workspace/.dependencies/checkouts/async-http-client/Sources/AsyncHTTPClient/SSLContextCache.swift /Users/admin/builder/spi-builder-workspace/.dependencies/checkouts/async-http-client/Sources/AsyncHTTPClient/Scheme.swift /Users/admin/builder/spi-builder-workspace/.dependencies/checkouts/async-http-client/Sources/AsyncHTTPClient/Singleton.swift /Users/admin/builder/spi-builder-workspace/.dependencies/checkouts/async-http-client/Sources/AsyncHTTPClient/StringConvertibleInstances.swift /Users/admin/builder/spi-builder-workspace/.dependencies/checkouts/async-http-client/Sources/AsyncHTTPClient/StructuredConcurrencyHelpers.swift /Users/admin/builder/spi-builder-workspace/.dependencies/checkouts/async-http-client/Sources/AsyncHTTPClient/Utils.swift (in target 'AsyncHTTPClient' from project 'async-http-client')
SwiftCompile normal arm64 /Users/admin/builder/spi-builder-workspace/.dependencies/checkouts/async-http-client/Sources/AsyncHTTPClient/SSLContextCache.swift (in target 'AsyncHTTPClient' from project 'async-http-client')
cd /Users/admin/builder/spi-builder-workspace/.swiftpm/xcode
SwiftCompile normal arm64 /Users/admin/builder/spi-builder-workspace/.dependencies/checkouts/async-http-client/Sources/AsyncHTTPClient/Scheme.swift (in target 'AsyncHTTPClient' from project 'async-http-client')
cd /Users/admin/builder/spi-builder-workspace/.swiftpm/xcode
SwiftCompile normal arm64 /Users/admin/builder/spi-builder-workspace/.dependencies/checkouts/async-http-client/Sources/AsyncHTTPClient/Singleton.swift (in target 'AsyncHTTPClient' from project 'async-http-client')
cd /Users/admin/builder/spi-builder-workspace/.swiftpm/xcode
SwiftCompile normal arm64 /Users/admin/builder/spi-builder-workspace/.dependencies/checkouts/async-http-client/Sources/AsyncHTTPClient/StringConvertibleInstances.swift (in target 'AsyncHTTPClient' from project 'async-http-client')
cd /Users/admin/builder/spi-builder-workspace/.swiftpm/xcode
SwiftCompile normal arm64 /Users/admin/builder/spi-builder-workspace/.dependencies/checkouts/async-http-client/Sources/AsyncHTTPClient/StructuredConcurrencyHelpers.swift (in target 'AsyncHTTPClient' from project 'async-http-client')
cd /Users/admin/builder/spi-builder-workspace/.swiftpm/xcode
SwiftCompile normal arm64 /Users/admin/builder/spi-builder-workspace/.dependencies/checkouts/async-http-client/Sources/AsyncHTTPClient/Utils.swift (in target 'AsyncHTTPClient' from project 'async-http-client')
cd /Users/admin/builder/spi-builder-workspace/.swiftpm/xcode
SwiftDriverJobDiscovery normal armv7k Compiling HTTP1Connection.swift, HTTP1ConnectionStateMachine.swift, HTTP2ClientRequestHandler.swift, HTTP2Connection.swift, HTTP2IdleHandler.swift, HTTPConnectionEvent.swift, HTTPConnectionPool+Factory.swift (in target 'AsyncHTTPClient' from project 'async-http-client')
SwiftCompile normal arm64 Compiling\ BestEffortHashableTLSConfiguration.swift,\ Configuration+BrowserLike.swift,\ ConnectionPool.swift,\ HTTP1ProxyConnectHandler.swift,\ SOCKSEventsHandler.swift,\ TLSEventsHandler.swift,\ HTTP1ClientChannelHandler.swift /Users/admin/builder/spi-builder-workspace/.dependencies/checkouts/async-http-client/Sources/AsyncHTTPClient/BestEffortHashableTLSConfiguration.swift /Users/admin/builder/spi-builder-workspace/.dependencies/checkouts/async-http-client/Sources/AsyncHTTPClient/Configuration+BrowserLike.swift /Users/admin/builder/spi-builder-workspace/.dependencies/checkouts/async-http-client/Sources/AsyncHTTPClient/ConnectionPool.swift /Users/admin/builder/spi-builder-workspace/.dependencies/checkouts/async-http-client/Sources/AsyncHTTPClient/ConnectionPool/ChannelHandler/HTTP1ProxyConnectHandler.swift /Users/admin/builder/spi-builder-workspace/.dependencies/checkouts/async-http-client/Sources/AsyncHTTPClient/ConnectionPool/ChannelHandler/SOCKSEventsHandler.swift /Users/admin/builder/spi-builder-workspace/.dependencies/checkouts/async-http-client/Sources/AsyncHTTPClient/ConnectionPool/ChannelHandler/TLSEventsHandler.swift /Users/admin/builder/spi-builder-workspace/.dependencies/checkouts/async-http-client/Sources/AsyncHTTPClient/ConnectionPool/HTTP1/HTTP1ClientChannelHandler.swift (in target 'AsyncHTTPClient' from project 'async-http-client')
SwiftCompile normal arm64 /Users/admin/builder/spi-builder-workspace/.dependencies/checkouts/async-http-client/Sources/AsyncHTTPClient/BestEffortHashableTLSConfiguration.swift (in target 'AsyncHTTPClient' from project 'async-http-client')
cd /Users/admin/builder/spi-builder-workspace/.swiftpm/xcode
SwiftCompile normal arm64 /Users/admin/builder/spi-builder-workspace/.dependencies/checkouts/async-http-client/Sources/AsyncHTTPClient/Configuration+BrowserLike.swift (in target 'AsyncHTTPClient' from project 'async-http-client')
cd /Users/admin/builder/spi-builder-workspace/.swiftpm/xcode
SwiftCompile normal arm64 /Users/admin/builder/spi-builder-workspace/.dependencies/checkouts/async-http-client/Sources/AsyncHTTPClient/ConnectionPool.swift (in target 'AsyncHTTPClient' from project 'async-http-client')
cd /Users/admin/builder/spi-builder-workspace/.swiftpm/xcode
SwiftCompile normal arm64 /Users/admin/builder/spi-builder-workspace/.dependencies/checkouts/async-http-client/Sources/AsyncHTTPClient/ConnectionPool/ChannelHandler/HTTP1ProxyConnectHandler.swift (in target 'AsyncHTTPClient' from project 'async-http-client')
cd /Users/admin/builder/spi-builder-workspace/.swiftpm/xcode
SwiftCompile normal arm64 /Users/admin/builder/spi-builder-workspace/.dependencies/checkouts/async-http-client/Sources/AsyncHTTPClient/ConnectionPool/ChannelHandler/SOCKSEventsHandler.swift (in target 'AsyncHTTPClient' from project 'async-http-client')
cd /Users/admin/builder/spi-builder-workspace/.swiftpm/xcode
SwiftCompile normal arm64 /Users/admin/builder/spi-builder-workspace/.dependencies/checkouts/async-http-client/Sources/AsyncHTTPClient/ConnectionPool/ChannelHandler/TLSEventsHandler.swift (in target 'AsyncHTTPClient' from project 'async-http-client')
cd /Users/admin/builder/spi-builder-workspace/.swiftpm/xcode
SwiftCompile normal arm64 /Users/admin/builder/spi-builder-workspace/.dependencies/checkouts/async-http-client/Sources/AsyncHTTPClient/ConnectionPool/HTTP1/HTTP1ClientChannelHandler.swift (in target 'AsyncHTTPClient' from project 'async-http-client')
cd /Users/admin/builder/spi-builder-workspace/.swiftpm/xcode
SwiftDriverJobDiscovery normal arm64 Compiling HTTPClientRequest.swift, HTTPClientResponse.swift, SingleIteratorPrecondition.swift, Transaction+StateMachine.swift, Transaction.swift, Base64.swift, BasicAuth.swift (in target 'AsyncHTTPClient' from project 'async-http-client')
SwiftCompile normal armv7k Compiling\ HTTPConnectionPool+StateMachine.swift,\ ConnectionTarget.swift,\ DeconstructedURL.swift,\ FileDownloadDelegate.swift,\ FoundationExtensions.swift,\ HTTPClient+HTTPCookie.swift /Users/admin/builder/spi-builder-workspace/.dependencies/checkouts/async-http-client/Sources/AsyncHTTPClient/ConnectionPool/State\ Machine/HTTPConnectionPool+StateMachine.swift /Users/admin/builder/spi-builder-workspace/.dependencies/checkouts/async-http-client/Sources/AsyncHTTPClient/ConnectionTarget.swift /Users/admin/builder/spi-builder-workspace/.dependencies/checkouts/async-http-client/Sources/AsyncHTTPClient/DeconstructedURL.swift /Users/admin/builder/spi-builder-workspace/.dependencies/checkouts/async-http-client/Sources/AsyncHTTPClient/FileDownloadDelegate.swift /Users/admin/builder/spi-builder-workspace/.dependencies/checkouts/async-http-client/Sources/AsyncHTTPClient/FoundationExtensions.swift /Users/admin/builder/spi-builder-workspace/.dependencies/checkouts/async-http-client/Sources/AsyncHTTPClient/HTTPClient+HTTPCookie.swift (in target 'AsyncHTTPClient' from project 'async-http-client')
SwiftCompile normal armv7k /Users/admin/builder/spi-builder-workspace/.dependencies/checkouts/async-http-client/Sources/AsyncHTTPClient/ConnectionPool/State\ Machine/HTTPConnectionPool+StateMachine.swift (in target 'AsyncHTTPClient' from project 'async-http-client')
cd /Users/admin/builder/spi-builder-workspace/.swiftpm/xcode
SwiftCompile normal armv7k /Users/admin/builder/spi-builder-workspace/.dependencies/checkouts/async-http-client/Sources/AsyncHTTPClient/ConnectionTarget.swift (in target 'AsyncHTTPClient' from project 'async-http-client')
cd /Users/admin/builder/spi-builder-workspace/.swiftpm/xcode
SwiftCompile normal armv7k /Users/admin/builder/spi-builder-workspace/.dependencies/checkouts/async-http-client/Sources/AsyncHTTPClient/DeconstructedURL.swift (in target 'AsyncHTTPClient' from project 'async-http-client')
cd /Users/admin/builder/spi-builder-workspace/.swiftpm/xcode
SwiftCompile normal armv7k /Users/admin/builder/spi-builder-workspace/.dependencies/checkouts/async-http-client/Sources/AsyncHTTPClient/FileDownloadDelegate.swift (in target 'AsyncHTTPClient' from project 'async-http-client')
cd /Users/admin/builder/spi-builder-workspace/.swiftpm/xcode
SwiftCompile normal armv7k /Users/admin/builder/spi-builder-workspace/.dependencies/checkouts/async-http-client/Sources/AsyncHTTPClient/FoundationExtensions.swift (in target 'AsyncHTTPClient' from project 'async-http-client')
cd /Users/admin/builder/spi-builder-workspace/.swiftpm/xcode
SwiftCompile normal armv7k /Users/admin/builder/spi-builder-workspace/.dependencies/checkouts/async-http-client/Sources/AsyncHTTPClient/HTTPClient+HTTPCookie.swift (in target 'AsyncHTTPClient' from project 'async-http-client')
cd /Users/admin/builder/spi-builder-workspace/.swiftpm/xcode
SwiftDriverJobDiscovery normal armv7k Compiling HTTPClient+Proxy.swift, HTTPClient+StructuredConcurrency.swift, HTTPClient.swift, HTTPHandler.swift, LRUCache.swift, NWErrorHandler.swift (in target 'AsyncHTTPClient' from project 'async-http-client')
SwiftCompile normal arm64 Compiling\ AnyAsyncSequence.swift,\ AnyAsyncSequenceProucerDelete.swift,\ AsyncLazySequence.swift,\ HTTPClient+execute.swift,\ HTTPClient+shutdown.swift,\ HTTPClientRequest+Prepared.swift,\ HTTPClientRequest+auth.swift /Users/admin/builder/spi-builder-workspace/.dependencies/checkouts/async-http-client/Sources/AsyncHTTPClient/AsyncAwait/AnyAsyncSequence.swift /Users/admin/builder/spi-builder-workspace/.dependencies/checkouts/async-http-client/Sources/AsyncHTTPClient/AsyncAwait/AnyAsyncSequenceProucerDelete.swift /Users/admin/builder/spi-builder-workspace/.dependencies/checkouts/async-http-client/Sources/AsyncHTTPClient/AsyncAwait/AsyncLazySequence.swift /Users/admin/builder/spi-builder-workspace/.dependencies/checkouts/async-http-client/Sources/AsyncHTTPClient/AsyncAwait/HTTPClient+execute.swift /Users/admin/builder/spi-builder-workspace/.dependencies/checkouts/async-http-client/Sources/AsyncHTTPClient/AsyncAwait/HTTPClient+shutdown.swift /Users/admin/builder/spi-builder-workspace/.dependencies/checkouts/async-http-client/Sources/AsyncHTTPClient/AsyncAwait/HTTPClientRequest+Prepared.swift /Users/admin/builder/spi-builder-workspace/.dependencies/checkouts/async-http-client/Sources/AsyncHTTPClient/AsyncAwait/HTTPClientRequest+auth.swift (in target 'AsyncHTTPClient' from project 'async-http-client')
SwiftCompile normal arm64 /Users/admin/builder/spi-builder-workspace/.dependencies/checkouts/async-http-client/Sources/AsyncHTTPClient/AsyncAwait/AnyAsyncSequence.swift (in target 'AsyncHTTPClient' from project 'async-http-client')
cd /Users/admin/builder/spi-builder-workspace/.swiftpm/xcode
SwiftCompile normal arm64 /Users/admin/builder/spi-builder-workspace/.dependencies/checkouts/async-http-client/Sources/AsyncHTTPClient/AsyncAwait/AnyAsyncSequenceProucerDelete.swift (in target 'AsyncHTTPClient' from project 'async-http-client')
cd /Users/admin/builder/spi-builder-workspace/.swiftpm/xcode
SwiftCompile normal arm64 /Users/admin/builder/spi-builder-workspace/.dependencies/checkouts/async-http-client/Sources/AsyncHTTPClient/AsyncAwait/AsyncLazySequence.swift (in target 'AsyncHTTPClient' from project 'async-http-client')
cd /Users/admin/builder/spi-builder-workspace/.swiftpm/xcode
SwiftCompile normal arm64 /Users/admin/builder/spi-builder-workspace/.dependencies/checkouts/async-http-client/Sources/AsyncHTTPClient/AsyncAwait/HTTPClient+execute.swift (in target 'AsyncHTTPClient' from project 'async-http-client')
cd /Users/admin/builder/spi-builder-workspace/.swiftpm/xcode
SwiftCompile normal arm64 /Users/admin/builder/spi-builder-workspace/.dependencies/checkouts/async-http-client/Sources/AsyncHTTPClient/AsyncAwait/HTTPClient+shutdown.swift (in target 'AsyncHTTPClient' from project 'async-http-client')
cd /Users/admin/builder/spi-builder-workspace/.swiftpm/xcode
SwiftCompile normal arm64 /Users/admin/builder/spi-builder-workspace/.dependencies/checkouts/async-http-client/Sources/AsyncHTTPClient/AsyncAwait/HTTPClientRequest+Prepared.swift (in target 'AsyncHTTPClient' from project 'async-http-client')
cd /Users/admin/builder/spi-builder-workspace/.swiftpm/xcode
SwiftCompile normal arm64 /Users/admin/builder/spi-builder-workspace/.dependencies/checkouts/async-http-client/Sources/AsyncHTTPClient/AsyncAwait/HTTPClientRequest+auth.swift (in target 'AsyncHTTPClient' from project 'async-http-client')
cd /Users/admin/builder/spi-builder-workspace/.swiftpm/xcode
SwiftDriverJobDiscovery normal arm64 Compiling HTTPConnectionPool+Manager.swift, HTTPConnectionPool.swift, HTTPExecutableRequest.swift, HTTPRequestStateMachine+Demand.swift, HTTPRequestStateMachine.swift, RequestBodyLength.swift, RequestFramingMetadata.swift (in target 'AsyncHTTPClient' from project 'async-http-client')
SwiftCompile normal armv7k Compiling\ NWWaitingHandler.swift,\ TLSConfiguration.swift,\ RedirectState.swift,\ RequestBag+StateMachine.swift,\ RequestBag.swift,\ RequestValidation.swift /Users/admin/builder/spi-builder-workspace/.dependencies/checkouts/async-http-client/Sources/AsyncHTTPClient/NIOTransportServices/NWWaitingHandler.swift /Users/admin/builder/spi-builder-workspace/.dependencies/checkouts/async-http-client/Sources/AsyncHTTPClient/NIOTransportServices/TLSConfiguration.swift /Users/admin/builder/spi-builder-workspace/.dependencies/checkouts/async-http-client/Sources/AsyncHTTPClient/RedirectState.swift /Users/admin/builder/spi-builder-workspace/.dependencies/checkouts/async-http-client/Sources/AsyncHTTPClient/RequestBag+StateMachine.swift /Users/admin/builder/spi-builder-workspace/.dependencies/checkouts/async-http-client/Sources/AsyncHTTPClient/RequestBag.swift /Users/admin/builder/spi-builder-workspace/.dependencies/checkouts/async-http-client/Sources/AsyncHTTPClient/RequestValidation.swift (in target 'AsyncHTTPClient' from project 'async-http-client')
SwiftCompile normal armv7k /Users/admin/builder/spi-builder-workspace/.dependencies/checkouts/async-http-client/Sources/AsyncHTTPClient/NIOTransportServices/NWWaitingHandler.swift (in target 'AsyncHTTPClient' from project 'async-http-client')
cd /Users/admin/builder/spi-builder-workspace/.swiftpm/xcode
SwiftCompile normal armv7k /Users/admin/builder/spi-builder-workspace/.dependencies/checkouts/async-http-client/Sources/AsyncHTTPClient/NIOTransportServices/TLSConfiguration.swift (in target 'AsyncHTTPClient' from project 'async-http-client')
cd /Users/admin/builder/spi-builder-workspace/.swiftpm/xcode
SwiftCompile normal armv7k /Users/admin/builder/spi-builder-workspace/.dependencies/checkouts/async-http-client/Sources/AsyncHTTPClient/RedirectState.swift (in target 'AsyncHTTPClient' from project 'async-http-client')
cd /Users/admin/builder/spi-builder-workspace/.swiftpm/xcode
SwiftCompile normal armv7k /Users/admin/builder/spi-builder-workspace/.dependencies/checkouts/async-http-client/Sources/AsyncHTTPClient/RequestBag+StateMachine.swift (in target 'AsyncHTTPClient' from project 'async-http-client')
cd /Users/admin/builder/spi-builder-workspace/.swiftpm/xcode
SwiftCompile normal armv7k /Users/admin/builder/spi-builder-workspace/.dependencies/checkouts/async-http-client/Sources/AsyncHTTPClient/RequestBag.swift (in target 'AsyncHTTPClient' from project 'async-http-client')
cd /Users/admin/builder/spi-builder-workspace/.swiftpm/xcode
SwiftCompile normal armv7k /Users/admin/builder/spi-builder-workspace/.dependencies/checkouts/async-http-client/Sources/AsyncHTTPClient/RequestValidation.swift (in target 'AsyncHTTPClient' from project 'async-http-client')
cd /Users/admin/builder/spi-builder-workspace/.swiftpm/xcode
SwiftDriverJobDiscovery normal armv7k Compiling RequestOptions.swift, HTTPConnectionPool+Backoff.swift, HTTPConnectionPool+HTTP1Connections.swift, HTTPConnectionPool+HTTP1StateMachine.swift, HTTPConnectionPool+HTTP2Connections.swift, HTTPConnectionPool+HTTP2StateMachine.swift, HTTPConnectionPool+RequestQueue.swift (in target 'AsyncHTTPClient' from project 'async-http-client')
SwiftCompile normal arm64 Compiling\ HTTPClient+Proxy.swift,\ HTTPClient+StructuredConcurrency.swift,\ HTTPClient.swift,\ HTTPHandler.swift,\ LRUCache.swift,\ NWErrorHandler.swift /Users/admin/builder/spi-builder-workspace/.dependencies/checkouts/async-http-client/Sources/AsyncHTTPClient/HTTPClient+Proxy.swift /Users/admin/builder/spi-builder-workspace/.dependencies/checkouts/async-http-client/Sources/AsyncHTTPClient/HTTPClient+StructuredConcurrency.swift /Users/admin/builder/spi-builder-workspace/.dependencies/checkouts/async-http-client/Sources/AsyncHTTPClient/HTTPClient.swift /Users/admin/builder/spi-builder-workspace/.dependencies/checkouts/async-http-client/Sources/AsyncHTTPClient/HTTPHandler.swift /Users/admin/builder/spi-builder-workspace/.dependencies/checkouts/async-http-client/Sources/AsyncHTTPClient/LRUCache.swift /Users/admin/builder/spi-builder-workspace/.dependencies/checkouts/async-http-client/Sources/AsyncHTTPClient/NIOTransportServices/NWErrorHandler.swift (in target 'AsyncHTTPClient' from project 'async-http-client')
SwiftCompile normal arm64 /Users/admin/builder/spi-builder-workspace/.dependencies/checkouts/async-http-client/Sources/AsyncHTTPClient/HTTPClient+Proxy.swift (in target 'AsyncHTTPClient' from project 'async-http-client')
cd /Users/admin/builder/spi-builder-workspace/.swiftpm/xcode
SwiftCompile normal arm64 /Users/admin/builder/spi-builder-workspace/.dependencies/checkouts/async-http-client/Sources/AsyncHTTPClient/HTTPClient+StructuredConcurrency.swift (in target 'AsyncHTTPClient' from project 'async-http-client')
cd /Users/admin/builder/spi-builder-workspace/.swiftpm/xcode
SwiftCompile normal arm64 /Users/admin/builder/spi-builder-workspace/.dependencies/checkouts/async-http-client/Sources/AsyncHTTPClient/HTTPClient.swift (in target 'AsyncHTTPClient' from project 'async-http-client')
cd /Users/admin/builder/spi-builder-workspace/.swiftpm/xcode
SwiftCompile normal arm64 /Users/admin/builder/spi-builder-workspace/.dependencies/checkouts/async-http-client/Sources/AsyncHTTPClient/HTTPHandler.swift (in target 'AsyncHTTPClient' from project 'async-http-client')
cd /Users/admin/builder/spi-builder-workspace/.swiftpm/xcode
SwiftCompile normal arm64 /Users/admin/builder/spi-builder-workspace/.dependencies/checkouts/async-http-client/Sources/AsyncHTTPClient/LRUCache.swift (in target 'AsyncHTTPClient' from project 'async-http-client')
cd /Users/admin/builder/spi-builder-workspace/.swiftpm/xcode
SwiftCompile normal arm64 /Users/admin/builder/spi-builder-workspace/.dependencies/checkouts/async-http-client/Sources/AsyncHTTPClient/NIOTransportServices/NWErrorHandler.swift (in target 'AsyncHTTPClient' from project 'async-http-client')
cd /Users/admin/builder/spi-builder-workspace/.swiftpm/xcode
SwiftDriverJobDiscovery normal arm64 Compiling SSLContextCache.swift, Scheme.swift, Singleton.swift, StringConvertibleInstances.swift, StructuredConcurrencyHelpers.swift, Utils.swift (in target 'AsyncHTTPClient' from project 'async-http-client')
SwiftCompile normal armv7k Compiling\ BestEffortHashableTLSConfiguration.swift,\ Configuration+BrowserLike.swift,\ ConnectionPool.swift,\ HTTP1ProxyConnectHandler.swift,\ SOCKSEventsHandler.swift,\ TLSEventsHandler.swift,\ HTTP1ClientChannelHandler.swift /Users/admin/builder/spi-builder-workspace/.dependencies/checkouts/async-http-client/Sources/AsyncHTTPClient/BestEffortHashableTLSConfiguration.swift /Users/admin/builder/spi-builder-workspace/.dependencies/checkouts/async-http-client/Sources/AsyncHTTPClient/Configuration+BrowserLike.swift /Users/admin/builder/spi-builder-workspace/.dependencies/checkouts/async-http-client/Sources/AsyncHTTPClient/ConnectionPool.swift /Users/admin/builder/spi-builder-workspace/.dependencies/checkouts/async-http-client/Sources/AsyncHTTPClient/ConnectionPool/ChannelHandler/HTTP1ProxyConnectHandler.swift /Users/admin/builder/spi-builder-workspace/.dependencies/checkouts/async-http-client/Sources/AsyncHTTPClient/ConnectionPool/ChannelHandler/SOCKSEventsHandler.swift /Users/admin/builder/spi-builder-workspace/.dependencies/checkouts/async-http-client/Sources/AsyncHTTPClient/ConnectionPool/ChannelHandler/TLSEventsHandler.swift /Users/admin/builder/spi-builder-workspace/.dependencies/checkouts/async-http-client/Sources/AsyncHTTPClient/ConnectionPool/HTTP1/HTTP1ClientChannelHandler.swift (in target 'AsyncHTTPClient' from project 'async-http-client')
SwiftCompile normal armv7k /Users/admin/builder/spi-builder-workspace/.dependencies/checkouts/async-http-client/Sources/AsyncHTTPClient/BestEffortHashableTLSConfiguration.swift (in target 'AsyncHTTPClient' from project 'async-http-client')
cd /Users/admin/builder/spi-builder-workspace/.swiftpm/xcode
SwiftCompile normal armv7k /Users/admin/builder/spi-builder-workspace/.dependencies/checkouts/async-http-client/Sources/AsyncHTTPClient/Configuration+BrowserLike.swift (in target 'AsyncHTTPClient' from project 'async-http-client')
cd /Users/admin/builder/spi-builder-workspace/.swiftpm/xcode
SwiftCompile normal armv7k /Users/admin/builder/spi-builder-workspace/.dependencies/checkouts/async-http-client/Sources/AsyncHTTPClient/ConnectionPool.swift (in target 'AsyncHTTPClient' from project 'async-http-client')
cd /Users/admin/builder/spi-builder-workspace/.swiftpm/xcode
SwiftCompile normal armv7k /Users/admin/builder/spi-builder-workspace/.dependencies/checkouts/async-http-client/Sources/AsyncHTTPClient/ConnectionPool/ChannelHandler/HTTP1ProxyConnectHandler.swift (in target 'AsyncHTTPClient' from project 'async-http-client')
cd /Users/admin/builder/spi-builder-workspace/.swiftpm/xcode
SwiftCompile normal armv7k /Users/admin/builder/spi-builder-workspace/.dependencies/checkouts/async-http-client/Sources/AsyncHTTPClient/ConnectionPool/ChannelHandler/SOCKSEventsHandler.swift (in target 'AsyncHTTPClient' from project 'async-http-client')
cd /Users/admin/builder/spi-builder-workspace/.swiftpm/xcode
SwiftCompile normal armv7k /Users/admin/builder/spi-builder-workspace/.dependencies/checkouts/async-http-client/Sources/AsyncHTTPClient/ConnectionPool/ChannelHandler/TLSEventsHandler.swift (in target 'AsyncHTTPClient' from project 'async-http-client')
cd /Users/admin/builder/spi-builder-workspace/.swiftpm/xcode
SwiftCompile normal armv7k /Users/admin/builder/spi-builder-workspace/.dependencies/checkouts/async-http-client/Sources/AsyncHTTPClient/ConnectionPool/HTTP1/HTTP1ClientChannelHandler.swift (in target 'AsyncHTTPClient' from project 'async-http-client')
cd /Users/admin/builder/spi-builder-workspace/.swiftpm/xcode
SwiftDriverJobDiscovery normal arm64 Compiling HTTPConnectionPool+StateMachine.swift, ConnectionTarget.swift, DeconstructedURL.swift, FileDownloadDelegate.swift, FoundationExtensions.swift, HTTPClient+HTTPCookie.swift (in target 'AsyncHTTPClient' from project 'async-http-client')
SwiftCompile normal arm64_32 Compiling\ BestEffortHashableTLSConfiguration.swift,\ Configuration+BrowserLike.swift,\ ConnectionPool.swift,\ HTTP1ProxyConnectHandler.swift,\ SOCKSEventsHandler.swift,\ TLSEventsHandler.swift,\ HTTP1ClientChannelHandler.swift /Users/admin/builder/spi-builder-workspace/.dependencies/checkouts/async-http-client/Sources/AsyncHTTPClient/BestEffortHashableTLSConfiguration.swift /Users/admin/builder/spi-builder-workspace/.dependencies/checkouts/async-http-client/Sources/AsyncHTTPClient/Configuration+BrowserLike.swift /Users/admin/builder/spi-builder-workspace/.dependencies/checkouts/async-http-client/Sources/AsyncHTTPClient/ConnectionPool.swift /Users/admin/builder/spi-builder-workspace/.dependencies/checkouts/async-http-client/Sources/AsyncHTTPClient/ConnectionPool/ChannelHandler/HTTP1ProxyConnectHandler.swift /Users/admin/builder/spi-builder-workspace/.dependencies/checkouts/async-http-client/Sources/AsyncHTTPClient/ConnectionPool/ChannelHandler/SOCKSEventsHandler.swift /Users/admin/builder/spi-builder-workspace/.dependencies/checkouts/async-http-client/Sources/AsyncHTTPClient/ConnectionPool/ChannelHandler/TLSEventsHandler.swift /Users/admin/builder/spi-builder-workspace/.dependencies/checkouts/async-http-client/Sources/AsyncHTTPClient/ConnectionPool/HTTP1/HTTP1ClientChannelHandler.swift (in target 'AsyncHTTPClient' from project 'async-http-client')
SwiftCompile normal arm64_32 /Users/admin/builder/spi-builder-workspace/.dependencies/checkouts/async-http-client/Sources/AsyncHTTPClient/BestEffortHashableTLSConfiguration.swift (in target 'AsyncHTTPClient' from project 'async-http-client')
cd /Users/admin/builder/spi-builder-workspace/.swiftpm/xcode
SwiftCompile normal arm64_32 /Users/admin/builder/spi-builder-workspace/.dependencies/checkouts/async-http-client/Sources/AsyncHTTPClient/Configuration+BrowserLike.swift (in target 'AsyncHTTPClient' from project 'async-http-client')
cd /Users/admin/builder/spi-builder-workspace/.swiftpm/xcode
SwiftCompile normal arm64_32 /Users/admin/builder/spi-builder-workspace/.dependencies/checkouts/async-http-client/Sources/AsyncHTTPClient/ConnectionPool.swift (in target 'AsyncHTTPClient' from project 'async-http-client')
cd /Users/admin/builder/spi-builder-workspace/.swiftpm/xcode
SwiftCompile normal arm64_32 /Users/admin/builder/spi-builder-workspace/.dependencies/checkouts/async-http-client/Sources/AsyncHTTPClient/ConnectionPool/ChannelHandler/HTTP1ProxyConnectHandler.swift (in target 'AsyncHTTPClient' from project 'async-http-client')
cd /Users/admin/builder/spi-builder-workspace/.swiftpm/xcode
SwiftCompile normal arm64_32 /Users/admin/builder/spi-builder-workspace/.dependencies/checkouts/async-http-client/Sources/AsyncHTTPClient/ConnectionPool/ChannelHandler/SOCKSEventsHandler.swift (in target 'AsyncHTTPClient' from project 'async-http-client')
cd /Users/admin/builder/spi-builder-workspace/.swiftpm/xcode
SwiftCompile normal arm64_32 /Users/admin/builder/spi-builder-workspace/.dependencies/checkouts/async-http-client/Sources/AsyncHTTPClient/ConnectionPool/ChannelHandler/TLSEventsHandler.swift (in target 'AsyncHTTPClient' from project 'async-http-client')
cd /Users/admin/builder/spi-builder-workspace/.swiftpm/xcode
SwiftCompile normal arm64_32 /Users/admin/builder/spi-builder-workspace/.dependencies/checkouts/async-http-client/Sources/AsyncHTTPClient/ConnectionPool/HTTP1/HTTP1ClientChannelHandler.swift (in target 'AsyncHTTPClient' from project 'async-http-client')
cd /Users/admin/builder/spi-builder-workspace/.swiftpm/xcode
SwiftDriverJobDiscovery normal arm64 Compiling AnyAsyncSequence.swift, AnyAsyncSequenceProucerDelete.swift, AsyncLazySequence.swift, HTTPClient+execute.swift, HTTPClient+shutdown.swift, HTTPClientRequest+Prepared.swift, HTTPClientRequest+auth.swift (in target 'AsyncHTTPClient' from project 'async-http-client')
SwiftDriverJobDiscovery normal arm64 Compiling HTTP1Connection.swift, HTTP1ConnectionStateMachine.swift, HTTP2ClientRequestHandler.swift, HTTP2Connection.swift, HTTP2IdleHandler.swift, HTTPConnectionEvent.swift, HTTPConnectionPool+Factory.swift (in target 'AsyncHTTPClient' from project 'async-http-client')
SwiftDriverJobDiscovery normal arm64 Compiling NWWaitingHandler.swift, TLSConfiguration.swift, RedirectState.swift, RequestBag+StateMachine.swift, RequestBag.swift, RequestValidation.swift (in target 'AsyncHTTPClient' from project 'async-http-client')
ExtractAppIntentsMetadata (in target 'NIOHTTP2' from project 'swift-nio-http2')
cd /Users/admin/builder/spi-builder-workspace/.dependencies/checkouts/swift-nio-http2
/Applications/Xcode-16.3.0.app/Contents/Developer/Toolchains/XcodeDefault.xctoolchain/usr/bin/appintentsmetadataprocessor --toolchain-dir /Applications/Xcode-16.3.0.app/Contents/Developer/Toolchains/XcodeDefault.xctoolchain --module-name NIOHTTP2 --sdk-root /Applications/Xcode-16.3.0.app/Contents/Developer/Platforms/WatchOS.platform/Developer/SDKs/WatchOS11.4.sdk --xcode-version 16E140 --platform-family watchOS --deployment-target 5.0 --bundle-identifier swift-nio-http2.NIOHTTP2 --output /Users/admin/builder/spi-builder-workspace/.derivedData/Build/Products/Debug-watchos/NIOHTTP2.appintents --target-triple arm64-apple-watchos5.0 --target-triple armv7k-apple-watchos5.0 --target-triple arm64_32-apple-watchos5.0 --binary-file /Users/admin/builder/spi-builder-workspace/.derivedData/Build/Products/Debug-watchos/NIOHTTP2.o --dependency-file /Users/admin/builder/spi-builder-workspace/.derivedData/Build/Intermediates.noindex/swift-nio-http2.build/Debug-watchos/NIOHTTP2.build/Objects-normal/arm64/NIOHTTP2_dependency_info.dat --dependency-file /Users/admin/builder/spi-builder-workspace/.derivedData/Build/Intermediates.noindex/swift-nio-http2.build/Debug-watchos/NIOHTTP2.build/Objects-normal/armv7k/NIOHTTP2_dependency_info.dat --dependency-file /Users/admin/builder/spi-builder-workspace/.derivedData/Build/Intermediates.noindex/swift-nio-http2.build/Debug-watchos/NIOHTTP2.build/Objects-normal/arm64_32/NIOHTTP2_dependency_info.dat --stringsdata-file /Users/admin/builder/spi-builder-workspace/.derivedData/Build/Intermediates.noindex/swift-nio-http2.build/Debug-watchos/NIOHTTP2.build/Objects-normal/arm64/ExtractedAppShortcutsMetadata.stringsdata --stringsdata-file /Users/admin/builder/spi-builder-workspace/.derivedData/Build/Intermediates.noindex/swift-nio-http2.build/Debug-watchos/NIOHTTP2.build/Objects-normal/armv7k/ExtractedAppShortcutsMetadata.stringsdata --stringsdata-file /Users/admin/builder/spi-builder-workspace/.derivedData/Build/Intermediates.noindex/swift-nio-http2.build/Debug-watchos/NIOHTTP2.build/Objects-normal/arm64_32/ExtractedAppShortcutsMetadata.stringsdata --source-file-list /Users/admin/builder/spi-builder-workspace/.derivedData/Build/Intermediates.noindex/swift-nio-http2.build/Debug-watchos/NIOHTTP2.build/Objects-normal/arm64/NIOHTTP2.SwiftFileList --source-file-list /Users/admin/builder/spi-builder-workspace/.derivedData/Build/Intermediates.noindex/swift-nio-http2.build/Debug-watchos/NIOHTTP2.build/Objects-normal/armv7k/NIOHTTP2.SwiftFileList --source-file-list /Users/admin/builder/spi-builder-workspace/.derivedData/Build/Intermediates.noindex/swift-nio-http2.build/Debug-watchos/NIOHTTP2.build/Objects-normal/arm64_32/NIOHTTP2.SwiftFileList --metadata-file-list /Users/admin/builder/spi-builder-workspace/.derivedData/Build/Intermediates.noindex/swift-nio-http2.build/Debug-watchos/NIOHTTP2.build/NIOHTTP2.DependencyMetadataFileList --static-metadata-file-list /Users/admin/builder/spi-builder-workspace/.derivedData/Build/Intermediates.noindex/swift-nio-http2.build/Debug-watchos/NIOHTTP2.build/NIOHTTP2.DependencyStaticMetadataFileList --swift-const-vals-list /Users/admin/builder/spi-builder-workspace/.derivedData/Build/Intermediates.noindex/swift-nio-http2.build/Debug-watchos/NIOHTTP2.build/Objects-normal/arm64/NIOHTTP2.SwiftConstValuesFileList --swift-const-vals-list /Users/admin/builder/spi-builder-workspace/.derivedData/Build/Intermediates.noindex/swift-nio-http2.build/Debug-watchos/NIOHTTP2.build/Objects-normal/armv7k/NIOHTTP2.SwiftConstValuesFileList --swift-const-vals-list /Users/admin/builder/spi-builder-workspace/.derivedData/Build/Intermediates.noindex/swift-nio-http2.build/Debug-watchos/NIOHTTP2.build/Objects-normal/arm64_32/NIOHTTP2.SwiftConstValuesFileList --force --compile-time-extraction --deployment-aware-processing --validate-assistant-intents --no-app-shortcuts-localization
2025-04-29 22:38:55.333 appintentsmetadataprocessor[9080:22488] Starting appintentsmetadataprocessor export
2025-04-29 22:38:55.370 appintentsmetadataprocessor[9080:22488] Extracted no relevant App Intents symbols, skipping writing output
SwiftDriver AppleMapsKit normal arm64 com.apple.xcode.tools.swift.compiler (in target 'AppleMapsKit' from project 'apple-maps-kit')
cd /Users/admin/builder/spi-builder-workspace/.swiftpm/xcode
builtin-SwiftDriver -- /Applications/Xcode-16.3.0.app/Contents/Developer/Toolchains/XcodeDefault.xctoolchain/usr/bin/swiftc -module-name AppleMapsKit -Onone -enforce-exclusivity\=checked @/Users/admin/builder/spi-builder-workspace/.derivedData/Build/Intermediates.noindex/apple-maps-kit.build/Debug-watchos/AppleMapsKit.build/Objects-normal/arm64/AppleMapsKit.SwiftFileList -DSWIFT_PACKAGE -DDEBUG -Xcc -fmodule-map-file\=/Users/admin/builder/spi-builder-workspace/.derivedData/Build/Intermediates.noindex/GeneratedModuleMaps-watchos/CNIOLLHTTP.modulemap -Xcc -fmodule-map-file\=/Users/admin/builder/spi-builder-workspace/.derivedData/Build/Intermediates.noindex/GeneratedModuleMaps-watchos/CNIOBoringSSLShims.modulemap -Xcc -fmodule-map-file\=/Users/admin/builder/spi-builder-workspace/.derivedData/Build/Intermediates.noindex/GeneratedModuleMaps-watchos/CNIOExtrasZlib.modulemap -Xcc -fmodule-map-file\=/Users/admin/builder/spi-builder-workspace/.derivedData/Build/Intermediates.noindex/GeneratedModuleMaps-watchos/CNIOWASI.modulemap -Xcc -fmodule-map-file\=/Users/admin/builder/spi-builder-workspace/.derivedData/Build/Intermediates.noindex/GeneratedModuleMaps-watchos/CNIOLinux.modulemap -Xcc -fmodule-map-file\=/Users/admin/builder/spi-builder-workspace/.derivedData/Build/Intermediates.noindex/GeneratedModuleMaps-watchos/CNIODarwin.modulemap -Xcc -fmodule-map-file\=/Users/admin/builder/spi-builder-workspace/.derivedData/Build/Intermediates.noindex/GeneratedModuleMaps-watchos/CNIOAtomics.modulemap -Xcc -fmodule-map-file\=/Users/admin/builder/spi-builder-workspace/.derivedData/Build/Intermediates.noindex/GeneratedModuleMaps-watchos/CAsyncHTTPClient.modulemap -DXcode -enable-upcoming-feature ExistentialAny -plugin-path /Applications/Xcode-16.3.0.app/Contents/Developer/Toolchains/XcodeDefault.xctoolchain/usr/lib/swift/host/plugins/testing -enable-experimental-feature DebugDescriptionMacro -sdk /Applications/Xcode-16.3.0.app/Contents/Developer/Platforms/WatchOS.platform/Developer/SDKs/WatchOS11.4.sdk -target arm64-apple-watchos8.0 -g -module-cache-path /Users/admin/builder/spi-builder-workspace/.derivedData/ModuleCache.noindex -Xfrontend -serialize-debugging-options -profile-coverage-mapping -profile-generate -enable-testing -index-store-path /Users/admin/builder/spi-builder-workspace/.derivedData/Index.noindex/DataStore -swift-version 6 -I /Users/admin/builder/spi-builder-workspace/.derivedData/Build/Products/Debug-watchos -I /Applications/Xcode-16.3.0.app/Contents/Developer/Platforms/WatchOS.platform/Developer/usr/lib -F /Users/admin/builder/spi-builder-workspace/.derivedData/Build/Products/Debug-watchos/PackageFrameworks -F /Users/admin/builder/spi-builder-workspace/.derivedData/Build/Products/Debug-watchos/PackageFrameworks -F /Users/admin/builder/spi-builder-workspace/.derivedData/Build/Products/Debug-watchos/PackageFrameworks -F /Users/admin/builder/spi-builder-workspace/.derivedData/Build/Products/Debug-watchos/PackageFrameworks -F /Users/admin/builder/spi-builder-workspace/.derivedData/Build/Products/Debug-watchos/PackageFrameworks -F /Users/admin/builder/spi-builder-workspace/.derivedData/Build/Products/Debug-watchos/PackageFrameworks -F /Users/admin/builder/spi-builder-workspace/.derivedData/Build/Products/Debug-watchos/PackageFrameworks -F /Users/admin/builder/spi-builder-workspace/.derivedData/Build/Products/Debug-watchos/PackageFrameworks -F /Users/admin/builder/spi-builder-workspace/.derivedData/Build/Products/Debug-watchos/PackageFrameworks -F /Users/admin/builder/spi-builder-workspace/.derivedData/Build/Products/Debug-watchos/PackageFrameworks -F /Users/admin/builder/spi-builder-workspace/.derivedData/Build/Products/Debug-watchos/PackageFrameworks -F /Users/admin/builder/spi-builder-workspace/.derivedData/Build/Products/Debug-watchos/PackageFrameworks -F /Users/admin/builder/spi-builder-workspace/.derivedData/Build/Products/Debug-watchos/PackageFrameworks -F /Users/admin/builder/spi-builder-workspace/.derivedData/Build/Products/Debug-watchos/PackageFrameworks -F /Users/admin/builder/spi-builder-workspace/.derivedData/Build/Products/Debug-watchos/PackageFrameworks -F /Users/admin/builder/spi-builder-workspace/.derivedData/Build/Products/Debug-watchos/PackageFrameworks -F /Users/admin/builder/spi-builder-workspace/.derivedData/Build/Products/Debug-watchos/PackageFrameworks -F /Users/admin/builder/spi-builder-workspace/.derivedData/Build/Products/Debug-watchos/PackageFrameworks -F /Users/admin/builder/spi-builder-workspace/.derivedData/Build/Products/Debug-watchos/PackageFrameworks -F /Users/admin/builder/spi-builder-workspace/.derivedData/Build/Products/Debug-watchos/PackageFrameworks -F /Users/admin/builder/spi-builder-workspace/.derivedData/Build/Products/Debug-watchos/PackageFrameworks -F /Users/admin/builder/spi-builder-workspace/.derivedData/Build/Products/Debug-watchos/PackageFrameworks -F /Users/admin/builder/spi-builder-workspace/.derivedData/Build/Products/Debug-watchos/PackageFrameworks -F /Users/admin/builder/spi-builder-workspace/.derivedData/Build/Products/Debug-watchos/PackageFrameworks -F /Users/admin/builder/spi-builder-workspace/.derivedData/Build/Products/Debug-watchos/PackageFrameworks -F /Users/admin/builder/spi-builder-workspace/.derivedData/Build/Products/Debug-watchos/PackageFrameworks -F /Users/admin/builder/spi-builder-workspace/.derivedData/Build/Products/Debug-watchos/PackageFrameworks -F /Users/admin/builder/spi-builder-workspace/.derivedData/Build/Products/Debug-watchos/PackageFrameworks -F /Users/admin/builder/spi-builder-workspace/.derivedData/Build/Products/Debug-watchos/PackageFrameworks -F /Users/admin/builder/spi-builder-workspace/.derivedData/Build/Products/Debug-watchos/PackageFrameworks -F /Users/admin/builder/spi-builder-workspace/.derivedData/Build/Products/Debug-watchos/PackageFrameworks -F /Users/admin/builder/spi-builder-workspace/.derivedData/Build/Products/Debug-watchos/PackageFrameworks -F /Users/admin/builder/spi-builder-workspace/.derivedData/Build/Products/Debug-watchos/PackageFrameworks -F /Users/admin/builder/spi-builder-workspace/.derivedData/Build/Products/Debug-watchos/PackageFrameworks -F /Users/admin/builder/spi-builder-workspace/.derivedData/Build/Products/Debug-watchos/PackageFrameworks -F /Users/admin/builder/spi-builder-workspace/.derivedData/Build/Products/Debug-watchos/PackageFrameworks -F /Users/admin/builder/spi-builder-workspace/.derivedData/Build/Products/Debug-watchos/PackageFrameworks -F /Users/admin/builder/spi-builder-workspace/.derivedData/Build/Products/Debug-watchos/PackageFrameworks -F /Users/admin/builder/spi-builder-workspace/.derivedData/Build/Products/Debug-watchos/PackageFrameworks -F /Users/admin/builder/spi-builder-workspace/.derivedData/Build/Products/Debug-watchos/PackageFrameworks -F /Users/admin/builder/spi-builder-workspace/.derivedData/Build/Products/Debug-watchos/PackageFrameworks -F /Users/admin/builder/spi-builder-workspace/.derivedData/Build/Products/Debug-watchos/PackageFrameworks -F /Users/admin/builder/spi-builder-workspace/.derivedData/Build/Products/Debug-watchos/PackageFrameworks -F /Users/admin/builder/spi-builder-workspace/.derivedData/Build/Products/Debug-watchos/PackageFrameworks -F /Users/admin/builder/spi-builder-workspace/.derivedData/Build/Products/Debug-watchos -F /Applications/Xcode-16.3.0.app/Contents/Developer/Platforms/WatchOS.platform/Developer/Library/Frameworks -F /Applications/Xcode-16.3.0.app/Contents/Developer/Platforms/WatchOS.platform/Developer/SDKs/WatchOS11.4.sdk/Developer/Library/Frameworks -c -j10 -enable-batch-mode -incremental -Xcc -ivfsstatcache -Xcc /Users/admin/builder/spi-builder-workspace/.derivedData/SDKStatCaches.noindex/watchos11.4-22T246-43efb940ff07ba2497b70ec94253f576.sdkstatcache -output-file-map /Users/admin/builder/spi-builder-workspace/.derivedData/Build/Intermediates.noindex/apple-maps-kit.build/Debug-watchos/AppleMapsKit.build/Objects-normal/arm64/AppleMapsKit-OutputFileMap.json -use-frontend-parseable-output -save-temps -no-color-diagnostics -serialize-diagnostics -emit-dependencies -emit-module -emit-module-path /Users/admin/builder/spi-builder-workspace/.derivedData/Build/Intermediates.noindex/apple-maps-kit.build/Debug-watchos/AppleMapsKit.build/Objects-normal/arm64/AppleMapsKit.swiftmodule -validate-clang-modules-once -clang-build-session-file /Users/admin/builder/spi-builder-workspace/.derivedData/ModuleCache.noindex/Session.modulevalidation -package-name spi_builder_workspace -Xcc -I/Users/admin/builder/spi-builder-workspace/.derivedData/Build/Intermediates.noindex/apple-maps-kit.build/Debug-watchos/AppleMapsKit.build/swift-overrides.hmap -emit-const-values -Xfrontend -const-gather-protocols-file -Xfrontend /Users/admin/builder/spi-builder-workspace/.derivedData/Build/Intermediates.noindex/apple-maps-kit.build/Debug-watchos/AppleMapsKit.build/Objects-normal/arm64/AppleMapsKit_const_extract_protocols.json -Xcc -I/Users/admin/builder/spi-builder-workspace/.dependencies/checkouts/swift-nio/Sources/CNIOLLHTTP/include -Xcc -I/Users/admin/builder/spi-builder-workspace/.dependencies/checkouts/swift-nio-ssl/Sources/CNIOBoringSSLShims/include -Xcc -I/Users/admin/builder/spi-builder-workspace/.dependencies/checkouts/swift-nio-ssl/Sources/CNIOBoringSSL/include -Xcc -I/Users/admin/builder/spi-builder-workspace/.dependencies/checkouts/swift-nio-extras/Sources/CNIOExtrasZlib/include -Xcc -I/Users/admin/builder/spi-builder-workspace/.dependencies/checkouts/swift-nio/Sources/CNIOWASI/include -Xcc -I/Users/admin/builder/spi-builder-workspace/.dependencies/checkouts/swift-nio/Sources/CNIOWindows/include -Xcc -I/Users/admin/builder/spi-builder-workspace/.dependencies/checkouts/swift-nio/Sources/CNIOLinux/include -Xcc -I/Users/admin/builder/spi-builder-workspace/.dependencies/checkouts/swift-nio/Sources/CNIODarwin/include -Xcc -I/Users/admin/builder/spi-builder-workspace/.dependencies/checkouts/swift-nio/Sources/CNIOAtomics/include -Xcc -I/Users/admin/builder/spi-builder-workspace/.dependencies/checkouts/swift-atomics/Sources/_AtomicsShims/include -Xcc -I/Users/admin/builder/spi-builder-workspace/.dependencies/checkouts/swift-numerics/Sources/_NumericsShims/include -Xcc -I/Users/admin/builder/spi-builder-workspace/.dependencies/checkouts/async-http-client/Sources/CAsyncHTTPClient/include -Xcc -I/Users/admin/builder/spi-builder-workspace/.dependencies/checkouts/swift-crypto/Sources/CCryptoBoringSSLShims/include -Xcc -I/Users/admin/builder/spi-builder-workspace/.dependencies/checkouts/swift-crypto/Sources/CCryptoBoringSSL/include -Xcc -I/Users/admin/builder/spi-builder-workspace/.derivedData/Build/Products/Debug-watchos/include -Xcc -I/Users/admin/builder/spi-builder-workspace/.derivedData/Build/Intermediates.noindex/apple-maps-kit.build/Debug-watchos/AppleMapsKit.build/DerivedSources-normal/arm64 -Xcc -I/Users/admin/builder/spi-builder-workspace/.derivedData/Build/Intermediates.noindex/apple-maps-kit.build/Debug-watchos/AppleMapsKit.build/DerivedSources/arm64 -Xcc -I/Users/admin/builder/spi-builder-workspace/.derivedData/Build/Intermediates.noindex/apple-maps-kit.build/Debug-watchos/AppleMapsKit.build/DerivedSources -Xcc -DSWIFT_PACKAGE -Xcc -DDEBUG\=1 -emit-objc-header -emit-objc-header-path /Users/admin/builder/spi-builder-workspace/.derivedData/Build/Intermediates.noindex/apple-maps-kit.build/Debug-watchos/AppleMapsKit.build/Objects-normal/arm64/AppleMapsKit-Swift.h -working-directory /Users/admin/builder/spi-builder-workspace/.swiftpm/xcode -experimental-emit-module-separately -disable-cmo
SwiftDriver AppleMapsKit normal arm64_32 com.apple.xcode.tools.swift.compiler (in target 'AppleMapsKit' from project 'apple-maps-kit')
cd /Users/admin/builder/spi-builder-workspace/.swiftpm/xcode
builtin-SwiftDriver -- /Applications/Xcode-16.3.0.app/Contents/Developer/Toolchains/XcodeDefault.xctoolchain/usr/bin/swiftc -module-name AppleMapsKit -Onone -enforce-exclusivity\=checked @/Users/admin/builder/spi-builder-workspace/.derivedData/Build/Intermediates.noindex/apple-maps-kit.build/Debug-watchos/AppleMapsKit.build/Objects-normal/arm64_32/AppleMapsKit.SwiftFileList -DSWIFT_PACKAGE -DDEBUG -Xcc -fmodule-map-file\=/Users/admin/builder/spi-builder-workspace/.derivedData/Build/Intermediates.noindex/GeneratedModuleMaps-watchos/CNIOLLHTTP.modulemap -Xcc -fmodule-map-file\=/Users/admin/builder/spi-builder-workspace/.derivedData/Build/Intermediates.noindex/GeneratedModuleMaps-watchos/CNIOBoringSSLShims.modulemap -Xcc -fmodule-map-file\=/Users/admin/builder/spi-builder-workspace/.derivedData/Build/Intermediates.noindex/GeneratedModuleMaps-watchos/CNIOExtrasZlib.modulemap -Xcc -fmodule-map-file\=/Users/admin/builder/spi-builder-workspace/.derivedData/Build/Intermediates.noindex/GeneratedModuleMaps-watchos/CNIOWASI.modulemap -Xcc -fmodule-map-file\=/Users/admin/builder/spi-builder-workspace/.derivedData/Build/Intermediates.noindex/GeneratedModuleMaps-watchos/CNIOLinux.modulemap -Xcc -fmodule-map-file\=/Users/admin/builder/spi-builder-workspace/.derivedData/Build/Intermediates.noindex/GeneratedModuleMaps-watchos/CNIODarwin.modulemap -Xcc -fmodule-map-file\=/Users/admin/builder/spi-builder-workspace/.derivedData/Build/Intermediates.noindex/GeneratedModuleMaps-watchos/CNIOAtomics.modulemap -Xcc -fmodule-map-file\=/Users/admin/builder/spi-builder-workspace/.derivedData/Build/Intermediates.noindex/GeneratedModuleMaps-watchos/CAsyncHTTPClient.modulemap -DXcode -enable-upcoming-feature ExistentialAny -plugin-path /Applications/Xcode-16.3.0.app/Contents/Developer/Toolchains/XcodeDefault.xctoolchain/usr/lib/swift/host/plugins/testing -enable-experimental-feature DebugDescriptionMacro -sdk /Applications/Xcode-16.3.0.app/Contents/Developer/Platforms/WatchOS.platform/Developer/SDKs/WatchOS11.4.sdk -target arm64_32-apple-watchos8.0 -g -module-cache-path /Users/admin/builder/spi-builder-workspace/.derivedData/ModuleCache.noindex -Xfrontend -serialize-debugging-options -profile-coverage-mapping -profile-generate -enable-testing -index-store-path /Users/admin/builder/spi-builder-workspace/.derivedData/Index.noindex/DataStore -swift-version 6 -I /Users/admin/builder/spi-builder-workspace/.derivedData/Build/Products/Debug-watchos -I /Applications/Xcode-16.3.0.app/Contents/Developer/Platforms/WatchOS.platform/Developer/usr/lib -F /Users/admin/builder/spi-builder-workspace/.derivedData/Build/Products/Debug-watchos/PackageFrameworks -F /Users/admin/builder/spi-builder-workspace/.derivedData/Build/Products/Debug-watchos/PackageFrameworks -F /Users/admin/builder/spi-builder-workspace/.derivedData/Build/Products/Debug-watchos/PackageFrameworks -F /Users/admin/builder/spi-builder-workspace/.derivedData/Build/Products/Debug-watchos/PackageFrameworks -F /Users/admin/builder/spi-builder-workspace/.derivedData/Build/Products/Debug-watchos/PackageFrameworks -F /Users/admin/builder/spi-builder-workspace/.derivedData/Build/Products/Debug-watchos/PackageFrameworks -F /Users/admin/builder/spi-builder-workspace/.derivedData/Build/Products/Debug-watchos/PackageFrameworks -F /Users/admin/builder/spi-builder-workspace/.derivedData/Build/Products/Debug-watchos/PackageFrameworks -F /Users/admin/builder/spi-builder-workspace/.derivedData/Build/Products/Debug-watchos/PackageFrameworks -F /Users/admin/builder/spi-builder-workspace/.derivedData/Build/Products/Debug-watchos/PackageFrameworks -F /Users/admin/builder/spi-builder-workspace/.derivedData/Build/Products/Debug-watchos/PackageFrameworks -F /Users/admin/builder/spi-builder-workspace/.derivedData/Build/Products/Debug-watchos/PackageFrameworks -F /Users/admin/builder/spi-builder-workspace/.derivedData/Build/Products/Debug-watchos/PackageFrameworks -F /Users/admin/builder/spi-builder-workspace/.derivedData/Build/Products/Debug-watchos/PackageFrameworks -F /Users/admin/builder/spi-builder-workspace/.derivedData/Build/Products/Debug-watchos/PackageFrameworks -F /Users/admin/builder/spi-builder-workspace/.derivedData/Build/Products/Debug-watchos/PackageFrameworks -F /Users/admin/builder/spi-builder-workspace/.derivedData/Build/Products/Debug-watchos/PackageFrameworks -F /Users/admin/builder/spi-builder-workspace/.derivedData/Build/Products/Debug-watchos/PackageFrameworks -F /Users/admin/builder/spi-builder-workspace/.derivedData/Build/Products/Debug-watchos/PackageFrameworks -F /Users/admin/builder/spi-builder-workspace/.derivedData/Build/Products/Debug-watchos/PackageFrameworks -F /Users/admin/builder/spi-builder-workspace/.derivedData/Build/Products/Debug-watchos/PackageFrameworks -F /Users/admin/builder/spi-builder-workspace/.derivedData/Build/Products/Debug-watchos/PackageFrameworks -F /Users/admin/builder/spi-builder-workspace/.derivedData/Build/Products/Debug-watchos/PackageFrameworks -F /Users/admin/builder/spi-builder-workspace/.derivedData/Build/Products/Debug-watchos/PackageFrameworks -F /Users/admin/builder/spi-builder-workspace/.derivedData/Build/Products/Debug-watchos/PackageFrameworks -F /Users/admin/builder/spi-builder-workspace/.derivedData/Build/Products/Debug-watchos/PackageFrameworks -F /Users/admin/builder/spi-builder-workspace/.derivedData/Build/Products/Debug-watchos/PackageFrameworks -F /Users/admin/builder/spi-builder-workspace/.derivedData/Build/Products/Debug-watchos/PackageFrameworks -F /Users/admin/builder/spi-builder-workspace/.derivedData/Build/Products/Debug-watchos/PackageFrameworks -F /Users/admin/builder/spi-builder-workspace/.derivedData/Build/Products/Debug-watchos/PackageFrameworks -F /Users/admin/builder/spi-builder-workspace/.derivedData/Build/Products/Debug-watchos/PackageFrameworks -F /Users/admin/builder/spi-builder-workspace/.derivedData/Build/Products/Debug-watchos/PackageFrameworks -F /Users/admin/builder/spi-builder-workspace/.derivedData/Build/Products/Debug-watchos/PackageFrameworks -F /Users/admin/builder/spi-builder-workspace/.derivedData/Build/Products/Debug-watchos/PackageFrameworks -F /Users/admin/builder/spi-builder-workspace/.derivedData/Build/Products/Debug-watchos/PackageFrameworks -F /Users/admin/builder/spi-builder-workspace/.derivedData/Build/Products/Debug-watchos/PackageFrameworks -F /Users/admin/builder/spi-builder-workspace/.derivedData/Build/Products/Debug-watchos/PackageFrameworks -F /Users/admin/builder/spi-builder-workspace/.derivedData/Build/Products/Debug-watchos/PackageFrameworks -F /Users/admin/builder/spi-builder-workspace/.derivedData/Build/Products/Debug-watchos/PackageFrameworks -F /Users/admin/builder/spi-builder-workspace/.derivedData/Build/Products/Debug-watchos/PackageFrameworks -F /Users/admin/builder/spi-builder-workspace/.derivedData/Build/Products/Debug-watchos/PackageFrameworks -F /Users/admin/builder/spi-builder-workspace/.derivedData/Build/Products/Debug-watchos/PackageFrameworks -F /Users/admin/builder/spi-builder-workspace/.derivedData/Build/Products/Debug-watchos/PackageFrameworks -F /Users/admin/builder/spi-builder-workspace/.derivedData/Build/Products/Debug-watchos/PackageFrameworks -F /Users/admin/builder/spi-builder-workspace/.derivedData/Build/Products/Debug-watchos -F /Applications/Xcode-16.3.0.app/Contents/Developer/Platforms/WatchOS.platform/Developer/Library/Frameworks -F /Applications/Xcode-16.3.0.app/Contents/Developer/Platforms/WatchOS.platform/Developer/SDKs/WatchOS11.4.sdk/Developer/Library/Frameworks -c -j10 -enable-batch-mode -incremental -Xcc -ivfsstatcache -Xcc /Users/admin/builder/spi-builder-workspace/.derivedData/SDKStatCaches.noindex/watchos11.4-22T246-43efb940ff07ba2497b70ec94253f576.sdkstatcache -output-file-map /Users/admin/builder/spi-builder-workspace/.derivedData/Build/Intermediates.noindex/apple-maps-kit.build/Debug-watchos/AppleMapsKit.build/Objects-normal/arm64_32/AppleMapsKit-OutputFileMap.json -use-frontend-parseable-output -save-temps -no-color-diagnostics -serialize-diagnostics -emit-dependencies -emit-module -emit-module-path /Users/admin/builder/spi-builder-workspace/.derivedData/Build/Intermediates.noindex/apple-maps-kit.build/Debug-watchos/AppleMapsKit.build/Objects-normal/arm64_32/AppleMapsKit.swiftmodule -validate-clang-modules-once -clang-build-session-file /Users/admin/builder/spi-builder-workspace/.derivedData/ModuleCache.noindex/Session.modulevalidation -package-name spi_builder_workspace -Xcc -I/Users/admin/builder/spi-builder-workspace/.derivedData/Build/Intermediates.noindex/apple-maps-kit.build/Debug-watchos/AppleMapsKit.build/swift-overrides.hmap -emit-const-values -Xfrontend -const-gather-protocols-file -Xfrontend /Users/admin/builder/spi-builder-workspace/.derivedData/Build/Intermediates.noindex/apple-maps-kit.build/Debug-watchos/AppleMapsKit.build/Objects-normal/arm64_32/AppleMapsKit_const_extract_protocols.json -Xcc -I/Users/admin/builder/spi-builder-workspace/.dependencies/checkouts/swift-nio/Sources/CNIOLLHTTP/include -Xcc -I/Users/admin/builder/spi-builder-workspace/.dependencies/checkouts/swift-nio-ssl/Sources/CNIOBoringSSLShims/include -Xcc -I/Users/admin/builder/spi-builder-workspace/.dependencies/checkouts/swift-nio-ssl/Sources/CNIOBoringSSL/include -Xcc -I/Users/admin/builder/spi-builder-workspace/.dependencies/checkouts/swift-nio-extras/Sources/CNIOExtrasZlib/include -Xcc -I/Users/admin/builder/spi-builder-workspace/.dependencies/checkouts/swift-nio/Sources/CNIOWASI/include -Xcc -I/Users/admin/builder/spi-builder-workspace/.dependencies/checkouts/swift-nio/Sources/CNIOWindows/include -Xcc -I/Users/admin/builder/spi-builder-workspace/.dependencies/checkouts/swift-nio/Sources/CNIOLinux/include -Xcc -I/Users/admin/builder/spi-builder-workspace/.dependencies/checkouts/swift-nio/Sources/CNIODarwin/include -Xcc -I/Users/admin/builder/spi-builder-workspace/.dependencies/checkouts/swift-nio/Sources/CNIOAtomics/include -Xcc -I/Users/admin/builder/spi-builder-workspace/.dependencies/checkouts/swift-atomics/Sources/_AtomicsShims/include -Xcc -I/Users/admin/builder/spi-builder-workspace/.dependencies/checkouts/swift-numerics/Sources/_NumericsShims/include -Xcc -I/Users/admin/builder/spi-builder-workspace/.dependencies/checkouts/async-http-client/Sources/CAsyncHTTPClient/include -Xcc -I/Users/admin/builder/spi-builder-workspace/.dependencies/checkouts/swift-crypto/Sources/CCryptoBoringSSLShims/include -Xcc -I/Users/admin/builder/spi-builder-workspace/.dependencies/checkouts/swift-crypto/Sources/CCryptoBoringSSL/include -Xcc -I/Users/admin/builder/spi-builder-workspace/.derivedData/Build/Products/Debug-watchos/include -Xcc -I/Users/admin/builder/spi-builder-workspace/.derivedData/Build/Intermediates.noindex/apple-maps-kit.build/Debug-watchos/AppleMapsKit.build/DerivedSources-normal/arm64_32 -Xcc -I/Users/admin/builder/spi-builder-workspace/.derivedData/Build/Intermediates.noindex/apple-maps-kit.build/Debug-watchos/AppleMapsKit.build/DerivedSources/arm64_32 -Xcc -I/Users/admin/builder/spi-builder-workspace/.derivedData/Build/Intermediates.noindex/apple-maps-kit.build/Debug-watchos/AppleMapsKit.build/DerivedSources -Xcc -DSWIFT_PACKAGE -Xcc -DDEBUG\=1 -emit-objc-header -emit-objc-header-path /Users/admin/builder/spi-builder-workspace/.derivedData/Build/Intermediates.noindex/apple-maps-kit.build/Debug-watchos/AppleMapsKit.build/Objects-normal/arm64_32/AppleMapsKit-Swift.h -working-directory /Users/admin/builder/spi-builder-workspace/.swiftpm/xcode -experimental-emit-module-separately -disable-cmo
SwiftDriverJobDiscovery normal arm64 Compiling BestEffortHashableTLSConfiguration.swift, Configuration+BrowserLike.swift, ConnectionPool.swift, HTTP1ProxyConnectHandler.swift, SOCKSEventsHandler.swift, TLSEventsHandler.swift, HTTP1ClientChannelHandler.swift (in target 'AsyncHTTPClient' from project 'async-http-client')
SwiftDriver AppleMapsKit normal armv7k com.apple.xcode.tools.swift.compiler (in target 'AppleMapsKit' from project 'apple-maps-kit')
cd /Users/admin/builder/spi-builder-workspace/.swiftpm/xcode
builtin-SwiftDriver -- /Applications/Xcode-16.3.0.app/Contents/Developer/Toolchains/XcodeDefault.xctoolchain/usr/bin/swiftc -module-name AppleMapsKit -Onone -enforce-exclusivity\=checked @/Users/admin/builder/spi-builder-workspace/.derivedData/Build/Intermediates.noindex/apple-maps-kit.build/Debug-watchos/AppleMapsKit.build/Objects-normal/armv7k/AppleMapsKit.SwiftFileList -DSWIFT_PACKAGE -DDEBUG -Xcc -fmodule-map-file\=/Users/admin/builder/spi-builder-workspace/.derivedData/Build/Intermediates.noindex/GeneratedModuleMaps-watchos/CNIOLLHTTP.modulemap -Xcc -fmodule-map-file\=/Users/admin/builder/spi-builder-workspace/.derivedData/Build/Intermediates.noindex/GeneratedModuleMaps-watchos/CNIOBoringSSLShims.modulemap -Xcc -fmodule-map-file\=/Users/admin/builder/spi-builder-workspace/.derivedData/Build/Intermediates.noindex/GeneratedModuleMaps-watchos/CNIOExtrasZlib.modulemap -Xcc -fmodule-map-file\=/Users/admin/builder/spi-builder-workspace/.derivedData/Build/Intermediates.noindex/GeneratedModuleMaps-watchos/CNIOWASI.modulemap -Xcc -fmodule-map-file\=/Users/admin/builder/spi-builder-workspace/.derivedData/Build/Intermediates.noindex/GeneratedModuleMaps-watchos/CNIOLinux.modulemap -Xcc -fmodule-map-file\=/Users/admin/builder/spi-builder-workspace/.derivedData/Build/Intermediates.noindex/GeneratedModuleMaps-watchos/CNIODarwin.modulemap -Xcc -fmodule-map-file\=/Users/admin/builder/spi-builder-workspace/.derivedData/Build/Intermediates.noindex/GeneratedModuleMaps-watchos/CNIOAtomics.modulemap -Xcc -fmodule-map-file\=/Users/admin/builder/spi-builder-workspace/.derivedData/Build/Intermediates.noindex/GeneratedModuleMaps-watchos/CAsyncHTTPClient.modulemap -DXcode -enable-upcoming-feature ExistentialAny -plugin-path /Applications/Xcode-16.3.0.app/Contents/Developer/Toolchains/XcodeDefault.xctoolchain/usr/lib/swift/host/plugins/testing -enable-experimental-feature DebugDescriptionMacro -sdk /Applications/Xcode-16.3.0.app/Contents/Developer/Platforms/WatchOS.platform/Developer/SDKs/WatchOS11.4.sdk -target armv7k-apple-watchos8.0 -g -module-cache-path /Users/admin/builder/spi-builder-workspace/.derivedData/ModuleCache.noindex -Xfrontend -serialize-debugging-options -profile-coverage-mapping -profile-generate -enable-testing -index-store-path /Users/admin/builder/spi-builder-workspace/.derivedData/Index.noindex/DataStore -swift-version 6 -I /Users/admin/builder/spi-builder-workspace/.derivedData/Build/Products/Debug-watchos -I /Applications/Xcode-16.3.0.app/Contents/Developer/Platforms/WatchOS.platform/Developer/usr/lib -F /Users/admin/builder/spi-builder-workspace/.derivedData/Build/Products/Debug-watchos/PackageFrameworks -F /Users/admin/builder/spi-builder-workspace/.derivedData/Build/Products/Debug-watchos/PackageFrameworks -F /Users/admin/builder/spi-builder-workspace/.derivedData/Build/Products/Debug-watchos/PackageFrameworks -F /Users/admin/builder/spi-builder-workspace/.derivedData/Build/Products/Debug-watchos/PackageFrameworks -F /Users/admin/builder/spi-builder-workspace/.derivedData/Build/Products/Debug-watchos/PackageFrameworks -F /Users/admin/builder/spi-builder-workspace/.derivedData/Build/Products/Debug-watchos/PackageFrameworks -F /Users/admin/builder/spi-builder-workspace/.derivedData/Build/Products/Debug-watchos/PackageFrameworks -F /Users/admin/builder/spi-builder-workspace/.derivedData/Build/Products/Debug-watchos/PackageFrameworks -F /Users/admin/builder/spi-builder-workspace/.derivedData/Build/Products/Debug-watchos/PackageFrameworks -F /Users/admin/builder/spi-builder-workspace/.derivedData/Build/Products/Debug-watchos/PackageFrameworks -F /Users/admin/builder/spi-builder-workspace/.derivedData/Build/Products/Debug-watchos/PackageFrameworks -F /Users/admin/builder/spi-builder-workspace/.derivedData/Build/Products/Debug-watchos/PackageFrameworks -F /Users/admin/builder/spi-builder-workspace/.derivedData/Build/Products/Debug-watchos/PackageFrameworks -F /Users/admin/builder/spi-builder-workspace/.derivedData/Build/Products/Debug-watchos/PackageFrameworks -F /Users/admin/builder/spi-builder-workspace/.derivedData/Build/Products/Debug-watchos/PackageFrameworks -F /Users/admin/builder/spi-builder-workspace/.derivedData/Build/Products/Debug-watchos/PackageFrameworks -F /Users/admin/builder/spi-builder-workspace/.derivedData/Build/Products/Debug-watchos/PackageFrameworks -F /Users/admin/builder/spi-builder-workspace/.derivedData/Build/Products/Debug-watchos/PackageFrameworks -F /Users/admin/builder/spi-builder-workspace/.derivedData/Build/Products/Debug-watchos/PackageFrameworks -F /Users/admin/builder/spi-builder-workspace/.derivedData/Build/Products/Debug-watchos/PackageFrameworks -F /Users/admin/builder/spi-builder-workspace/.derivedData/Build/Products/Debug-watchos/PackageFrameworks -F /Users/admin/builder/spi-builder-workspace/.derivedData/Build/Products/Debug-watchos/PackageFrameworks -F /Users/admin/builder/spi-builder-workspace/.derivedData/Build/Products/Debug-watchos/PackageFrameworks -F /Users/admin/builder/spi-builder-workspace/.derivedData/Build/Products/Debug-watchos/PackageFrameworks -F /Users/admin/builder/spi-builder-workspace/.derivedData/Build/Products/Debug-watchos/PackageFrameworks -F /Users/admin/builder/spi-builder-workspace/.derivedData/Build/Products/Debug-watchos/PackageFrameworks -F /Users/admin/builder/spi-builder-workspace/.derivedData/Build/Products/Debug-watchos/PackageFrameworks -F /Users/admin/builder/spi-builder-workspace/.derivedData/Build/Products/Debug-watchos/PackageFrameworks -F /Users/admin/builder/spi-builder-workspace/.derivedData/Build/Products/Debug-watchos/PackageFrameworks -F /Users/admin/builder/spi-builder-workspace/.derivedData/Build/Products/Debug-watchos/PackageFrameworks -F /Users/admin/builder/spi-builder-workspace/.derivedData/Build/Products/Debug-watchos/PackageFrameworks -F /Users/admin/builder/spi-builder-workspace/.derivedData/Build/Products/Debug-watchos/PackageFrameworks -F /Users/admin/builder/spi-builder-workspace/.derivedData/Build/Products/Debug-watchos/PackageFrameworks -F /Users/admin/builder/spi-builder-workspace/.derivedData/Build/Products/Debug-watchos/PackageFrameworks -F /Users/admin/builder/spi-builder-workspace/.derivedData/Build/Products/Debug-watchos/PackageFrameworks -F /Users/admin/builder/spi-builder-workspace/.derivedData/Build/Products/Debug-watchos/PackageFrameworks -F /Users/admin/builder/spi-builder-workspace/.derivedData/Build/Products/Debug-watchos/PackageFrameworks -F /Users/admin/builder/spi-builder-workspace/.derivedData/Build/Products/Debug-watchos/PackageFrameworks -F /Users/admin/builder/spi-builder-workspace/.derivedData/Build/Products/Debug-watchos/PackageFrameworks -F /Users/admin/builder/spi-builder-workspace/.derivedData/Build/Products/Debug-watchos/PackageFrameworks -F /Users/admin/builder/spi-builder-workspace/.derivedData/Build/Products/Debug-watchos/PackageFrameworks -F /Users/admin/builder/spi-builder-workspace/.derivedData/Build/Products/Debug-watchos/PackageFrameworks -F /Users/admin/builder/spi-builder-workspace/.derivedData/Build/Products/Debug-watchos/PackageFrameworks -F /Users/admin/builder/spi-builder-workspace/.derivedData/Build/Products/Debug-watchos/PackageFrameworks -F /Users/admin/builder/spi-builder-workspace/.derivedData/Build/Products/Debug-watchos -F /Applications/Xcode-16.3.0.app/Contents/Developer/Platforms/WatchOS.platform/Developer/Library/Frameworks -F /Applications/Xcode-16.3.0.app/Contents/Developer/Platforms/WatchOS.platform/Developer/SDKs/WatchOS11.4.sdk/Developer/Library/Frameworks -c -j10 -enable-batch-mode -incremental -Xcc -ivfsstatcache -Xcc /Users/admin/builder/spi-builder-workspace/.derivedData/SDKStatCaches.noindex/watchos11.4-22T246-43efb940ff07ba2497b70ec94253f576.sdkstatcache -output-file-map /Users/admin/builder/spi-builder-workspace/.derivedData/Build/Intermediates.noindex/apple-maps-kit.build/Debug-watchos/AppleMapsKit.build/Objects-normal/armv7k/AppleMapsKit-OutputFileMap.json -use-frontend-parseable-output -save-temps -no-color-diagnostics -serialize-diagnostics -emit-dependencies -emit-module -emit-module-path /Users/admin/builder/spi-builder-workspace/.derivedData/Build/Intermediates.noindex/apple-maps-kit.build/Debug-watchos/AppleMapsKit.build/Objects-normal/armv7k/AppleMapsKit.swiftmodule -validate-clang-modules-once -clang-build-session-file /Users/admin/builder/spi-builder-workspace/.derivedData/ModuleCache.noindex/Session.modulevalidation -package-name spi_builder_workspace -Xcc -I/Users/admin/builder/spi-builder-workspace/.derivedData/Build/Intermediates.noindex/apple-maps-kit.build/Debug-watchos/AppleMapsKit.build/swift-overrides.hmap -emit-const-values -Xfrontend -const-gather-protocols-file -Xfrontend /Users/admin/builder/spi-builder-workspace/.derivedData/Build/Intermediates.noindex/apple-maps-kit.build/Debug-watchos/AppleMapsKit.build/Objects-normal/armv7k/AppleMapsKit_const_extract_protocols.json -Xcc -I/Users/admin/builder/spi-builder-workspace/.dependencies/checkouts/swift-nio/Sources/CNIOLLHTTP/include -Xcc -I/Users/admin/builder/spi-builder-workspace/.dependencies/checkouts/swift-nio-ssl/Sources/CNIOBoringSSLShims/include -Xcc -I/Users/admin/builder/spi-builder-workspace/.dependencies/checkouts/swift-nio-ssl/Sources/CNIOBoringSSL/include -Xcc -I/Users/admin/builder/spi-builder-workspace/.dependencies/checkouts/swift-nio-extras/Sources/CNIOExtrasZlib/include -Xcc -I/Users/admin/builder/spi-builder-workspace/.dependencies/checkouts/swift-nio/Sources/CNIOWASI/include -Xcc -I/Users/admin/builder/spi-builder-workspace/.dependencies/checkouts/swift-nio/Sources/CNIOWindows/include -Xcc -I/Users/admin/builder/spi-builder-workspace/.dependencies/checkouts/swift-nio/Sources/CNIOLinux/include -Xcc -I/Users/admin/builder/spi-builder-workspace/.dependencies/checkouts/swift-nio/Sources/CNIODarwin/include -Xcc -I/Users/admin/builder/spi-builder-workspace/.dependencies/checkouts/swift-nio/Sources/CNIOAtomics/include -Xcc -I/Users/admin/builder/spi-builder-workspace/.dependencies/checkouts/swift-atomics/Sources/_AtomicsShims/include -Xcc -I/Users/admin/builder/spi-builder-workspace/.dependencies/checkouts/swift-numerics/Sources/_NumericsShims/include -Xcc -I/Users/admin/builder/spi-builder-workspace/.dependencies/checkouts/async-http-client/Sources/CAsyncHTTPClient/include -Xcc -I/Users/admin/builder/spi-builder-workspace/.dependencies/checkouts/swift-crypto/Sources/CCryptoBoringSSLShims/include -Xcc -I/Users/admin/builder/spi-builder-workspace/.dependencies/checkouts/swift-crypto/Sources/CCryptoBoringSSL/include -Xcc -I/Users/admin/builder/spi-builder-workspace/.derivedData/Build/Products/Debug-watchos/include -Xcc -I/Users/admin/builder/spi-builder-workspace/.derivedData/Build/Intermediates.noindex/apple-maps-kit.build/Debug-watchos/AppleMapsKit.build/DerivedSources-normal/armv7k -Xcc -I/Users/admin/builder/spi-builder-workspace/.derivedData/Build/Intermediates.noindex/apple-maps-kit.build/Debug-watchos/AppleMapsKit.build/DerivedSources/armv7k -Xcc -I/Users/admin/builder/spi-builder-workspace/.derivedData/Build/Intermediates.noindex/apple-maps-kit.build/Debug-watchos/AppleMapsKit.build/DerivedSources -Xcc -DSWIFT_PACKAGE -Xcc -DDEBUG\=1 -emit-objc-header -emit-objc-header-path /Users/admin/builder/spi-builder-workspace/.derivedData/Build/Intermediates.noindex/apple-maps-kit.build/Debug-watchos/AppleMapsKit.build/Objects-normal/armv7k/AppleMapsKit-Swift.h -working-directory /Users/admin/builder/spi-builder-workspace/.swiftpm/xcode -experimental-emit-module-separately -disable-cmo
RegisterExecutionPolicyException /Users/admin/builder/spi-builder-workspace/.derivedData/Build/Products/Debug-watchos/NIOTransportServices.o (in target 'NIOTransportServices' from project 'swift-nio-transport-services')
cd /Users/admin/builder/spi-builder-workspace/.dependencies/checkouts/swift-nio-transport-services
builtin-RegisterExecutionPolicyException /Users/admin/builder/spi-builder-workspace/.derivedData/Build/Products/Debug-watchos/NIOTransportServices.o
SwiftEmitModule normal arm64_32 Emitting\ module\ for\ AppleMapsKit (in target 'AppleMapsKit' from project 'apple-maps-kit')
EmitSwiftModule normal arm64_32 (in target 'AppleMapsKit' from project 'apple-maps-kit')
cd /Users/admin/builder/spi-builder-workspace/.swiftpm/xcode
SwiftEmitModule normal arm64 Emitting\ module\ for\ AppleMapsKit (in target 'AppleMapsKit' from project 'apple-maps-kit')
EmitSwiftModule normal arm64 (in target 'AppleMapsKit' from project 'apple-maps-kit')
cd /Users/admin/builder/spi-builder-workspace/.swiftpm/xcode
SwiftCompile normal arm64 Compiling\ AppleMapsClient.swift,\ AppleMapsKitError.swift /Users/admin/builder/spi-builder-workspace/Sources/AppleMapsKit/AppleMapsClient.swift /Users/admin/builder/spi-builder-workspace/Sources/AppleMapsKit/AppleMapsKitError.swift (in target 'AppleMapsKit' from project 'apple-maps-kit')
Failed frontend command:
/Applications/Xcode-16.3.0.app/Contents/Developer/Toolchains/XcodeDefault.xctoolchain/usr/bin/swift-frontend -frontend -c -primary-file /Users/admin/builder/spi-builder-workspace/Sources/AppleMapsKit/AppleMapsClient.swift -primary-file /Users/admin/builder/spi-builder-workspace/Sources/AppleMapsKit/AppleMapsKitError.swift /Users/admin/builder/spi-builder-workspace/Sources/AppleMapsKit/Auth/AuthClient.swift /Users/admin/builder/spi-builder-workspace/Sources/AppleMapsKit/Auth/TokenResponse.swift /Users/admin/builder/spi-builder-workspace/Sources/AppleMapsKit/DTOs/AlternateIDsResponse.swift /Users/admin/builder/spi-builder-workspace/Sources/AppleMapsKit/DTOs/AutocompleteResult.swift /Users/admin/builder/spi-builder-workspace/Sources/AppleMapsKit/DTOs/DirectionsResponse.swift /Users/admin/builder/spi-builder-workspace/Sources/AppleMapsKit/DTOs/ErrorResponse.swift /Users/admin/builder/spi-builder-workspace/Sources/AppleMapsKit/DTOs/Eta.swift /Users/admin/builder/spi-builder-workspace/Sources/AppleMapsKit/DTOs/MapRegion.swift /Users/admin/builder/spi-builder-workspace/Sources/AppleMapsKit/DTOs/Place.swift /Users/admin/builder/spi-builder-workspace/Sources/AppleMapsKit/DTOs/PlacesResponse.swift /Users/admin/builder/spi-builder-workspace/Sources/AppleMapsKit/DTOs/PoiCategory.swift /Users/admin/builder/spi-builder-workspace/Sources/AppleMapsKit/DTOs/SearchResponse.swift /Users/admin/builder/spi-builder-workspace/Sources/AppleMapsKit/DTOs/SearchResultType.swift -emit-dependencies-path /Users/admin/builder/spi-builder-workspace/.derivedData/Build/Intermediates.noindex/apple-maps-kit.build/Debug-watchos/AppleMapsKit.build/Objects-normal/arm64/AppleMapsClient.d -emit-const-values-path /Users/admin/builder/spi-builder-workspace/.derivedData/Build/Intermediates.noindex/apple-maps-kit.build/Debug-watchos/AppleMapsKit.build/Objects-normal/arm64/AppleMapsClient.swiftconstvalues -emit-reference-dependencies-path /Users/admin/builder/spi-builder-workspace/.derivedData/Build/Intermediates.noindex/apple-maps-kit.build/Debug-watchos/AppleMapsKit.build/Objects-normal/arm64/AppleMapsClient.swiftdeps -serialize-diagnostics-path /Users/admin/builder/spi-builder-workspace/.derivedData/Build/Intermediates.noindex/apple-maps-kit.build/Debug-watchos/AppleMapsKit.build/Objects-normal/arm64/AppleMapsClient.dia -emit-dependencies-path /Users/admin/builder/spi-builder-workspace/.derivedData/Build/Intermediates.noindex/apple-maps-kit.build/Debug-watchos/AppleMapsKit.build/Objects-normal/arm64/AppleMapsKitError.d -emit-const-values-path /Users/admin/builder/spi-builder-workspace/.derivedData/Build/Intermediates.noindex/apple-maps-kit.build/Debug-watchos/AppleMapsKit.build/Objects-normal/arm64/AppleMapsKitError.swiftconstvalues -emit-reference-dependencies-path /Users/admin/builder/spi-builder-workspace/.derivedData/Build/Intermediates.noindex/apple-maps-kit.build/Debug-watchos/AppleMapsKit.build/Objects-normal/arm64/AppleMapsKitError.swiftdeps -serialize-diagnostics-path /Users/admin/builder/spi-builder-workspace/.derivedData/Build/Intermediates.noindex/apple-maps-kit.build/Debug-watchos/AppleMapsKit.build/Objects-normal/arm64/AppleMapsKitError.dia -target arm64-apple-watchos8.0 -Xllvm -aarch64-use-tbi -enable-objc-interop -stack-check -sdk /Applications/Xcode-16.3.0.app/Contents/Developer/Platforms/WatchOS.platform/Developer/SDKs/WatchOS11.4.sdk -I /Users/admin/builder/spi-builder-workspace/.derivedData/Build/Products/Debug-watchos -I /Applications/Xcode-16.3.0.app/Contents/Developer/Platforms/WatchOS.platform/Developer/usr/lib -F /Users/admin/builder/spi-builder-workspace/.derivedData/Build/Products/Debug-watchos/PackageFrameworks -F /Users/admin/builder/spi-builder-workspace/.derivedData/Build/Products/Debug-watchos/PackageFrameworks -F /Users/admin/builder/spi-builder-workspace/.derivedData/Build/Products/Debug-watchos/PackageFrameworks -F /Users/admin/builder/spi-builder-workspace/.derivedData/Build/Products/Debug-watchos/PackageFrameworks -F /Users/admin/builder/spi-builder-workspace/.derivedData/Build/Products/Debug-watchos/PackageFrameworks -F /Users/admin/builder/spi-builder-workspace/.derivedData/Build/Products/Debug-watchos/PackageFrameworks -F /Users/admin/builder/spi-builder-workspace/.derivedData/Build/Products/Debug-watchos/PackageFrameworks -F /Users/admin/builder/spi-builder-workspace/.derivedData/Build/Products/Debug-watchos/PackageFrameworks -F /Users/admin/builder/spi-builder-workspace/.derivedData/Build/Products/Debug-watchos/PackageFrameworks -F /Users/admin/builder/spi-builder-workspace/.derivedData/Build/Products/Debug-watchos/PackageFrameworks -F /Users/admin/builder/spi-builder-workspace/.derivedData/Build/Products/Debug-watchos/PackageFrameworks -F /Users/admin/builder/spi-builder-workspace/.derivedData/Build/Products/Debug-watchos/PackageFrameworks -F /Users/admin/builder/spi-builder-workspace/.derivedData/Build/Products/Debug-watchos/PackageFrameworks -F /Users/admin/builder/spi-builder-workspace/.derivedData/Build/Products/Debug-watchos/PackageFrameworks -F /Users/admin/builder/spi-builder-workspace/.derivedData/Build/Products/Debug-watchos/PackageFrameworks -F /Users/admin/builder/spi-builder-workspace/.derivedData/Build/Products/Debug-watchos/PackageFrameworks -F /Users/admin/builder/spi-builder-workspace/.derivedData/Build/Products/Debug-watchos/PackageFrameworks -F /Users/admin/builder/spi-builder-workspace/.derivedData/Build/Products/Debug-watchos/PackageFrameworks -F /Users/admin/builder/spi-builder-workspace/.derivedData/Build/Products/Debug-watchos/PackageFrameworks -F /Users/admin/builder/spi-builder-workspace/.derivedData/Build/Products/Debug-watchos/PackageFrameworks -F /Users/admin/builder/spi-builder-workspace/.derivedData/Build/Products/Debug-watchos/PackageFrameworks -F /Users/admin/builder/spi-builder-workspace/.derivedData/Build/Products/Debug-watchos/PackageFrameworks -F /Users/admin/builder/spi-builder-workspace/.derivedData/Build/Products/Debug-watchos/PackageFrameworks -F /Users/admin/builder/spi-builder-workspace/.derivedData/Build/Products/Debug-watchos/PackageFrameworks -F /Users/admin/builder/spi-builder-workspace/.derivedData/Build/Products/Debug-watchos/PackageFrameworks -F /Users/admin/builder/spi-builder-workspace/.derivedData/Build/Products/Debug-watchos/PackageFrameworks -F /Users/admin/builder/spi-builder-workspace/.derivedData/Build/Products/Debug-watchos/PackageFrameworks -F /Users/admin/builder/spi-builder-workspace/.derivedData/Build/Products/Debug-watchos/PackageFrameworks -F /Users/admin/builder/spi-builder-workspace/.derivedData/Build/Products/Debug-watchos/PackageFrameworks -F /Users/admin/builder/spi-builder-workspace/.derivedData/Build/Products/Debug-watchos/PackageFrameworks -F /Users/admin/builder/spi-builder-workspace/.derivedData/Build/Products/Debug-watchos/PackageFrameworks -F /Users/admin/builder/spi-builder-workspace/.derivedData/Build/Products/Debug-watchos/PackageFrameworks -F /Users/admin/builder/spi-builder-workspace/.derivedData/Build/Products/Debug-watchos/PackageFrameworks -F /Users/admin/builder/spi-builder-workspace/.derivedData/Build/Products/Debug-watchos/PackageFrameworks -F /Users/admin/builder/spi-builder-workspace/.derivedData/Build/Products/Debug-watchos/PackageFrameworks -F /Users/admin/builder/spi-builder-workspace/.derivedData/Build/Products/Debug-watchos/PackageFrameworks -F /Users/admin/builder/spi-builder-workspace/.derivedData/Build/Products/Debug-watchos/PackageFrameworks -F /Users/admin/builder/spi-builder-workspace/.derivedData/Build/Products/Debug-watchos/PackageFrameworks -F /Users/admin/builder/spi-builder-workspace/.derivedData/Build/Products/Debug-watchos/PackageFrameworks -F /Users/admin/builder/spi-builder-workspace/.derivedData/Build/Products/Debug-watchos/PackageFrameworks -F /Users/admin/builder/spi-builder-workspace/.derivedData/Build/Products/Debug-watchos/PackageFrameworks -F /Users/admin/builder/spi-builder-workspace/.derivedData/Build/Products/Debug-watchos/PackageFrameworks -F /Users/admin/builder/spi-builder-workspace/.derivedData/Build/Products/Debug-watchos/PackageFrameworks -F /Users/admin/builder/spi-builder-workspace/.derivedData/Build/Products/Debug-watchos/PackageFrameworks -F /Users/admin/builder/spi-builder-workspace/.derivedData/Build/Products/Debug-watchos -F /Applications/Xcode-16.3.0.app/Contents/Developer/Platforms/WatchOS.platform/Developer/Library/Frameworks -F /Applications/Xcode-16.3.0.app/Contents/Developer/Platforms/WatchOS.platform/Developer/SDKs/WatchOS11.4.sdk/Developer/Library/Frameworks -no-color-diagnostics -enable-testing -g -debug-info-format\=dwarf -dwarf-version\=4 -module-cache-path /Users/admin/builder/spi-builder-workspace/.derivedData/ModuleCache.noindex -profile-generate -profile-coverage-mapping -swift-version 6 -enforce-exclusivity\=checked -Onone -D SWIFT_PACKAGE -D DEBUG -D Xcode -serialize-debugging-options -const-gather-protocols-file /Users/admin/builder/spi-builder-workspace/.derivedData/Build/Intermediates.noindex/apple-maps-kit.build/Debug-watchos/AppleMapsKit.build/Objects-normal/arm64/AppleMapsKit_const_extract_protocols.json -enable-upcoming-feature ExistentialAny -enable-experimental-feature DebugDescriptionMacro -empty-abi-descriptor -plugin-path /Applications/Xcode-16.3.0.app/Contents/Developer/Toolchains/XcodeDefault.xctoolchain/usr/lib/swift/host/plugins/testing -validate-clang-modules-once -clang-build-session-file /Users/admin/builder/spi-builder-workspace/.derivedData/ModuleCache.noindex/Session.modulevalidation -Xcc -working-directory -Xcc /Users/admin/builder/spi-builder-workspace/.swiftpm/xcode -resource-dir /Applications/Xcode-16.3.0.app/Contents/Developer/Toolchains/XcodeDefault.xctoolchain/usr/lib/swift -enable-anonymous-context-mangled-names -file-compilation-dir /Users/admin/builder/spi-builder-workspace/.swiftpm/xcode -Xcc -fmodule-map-file\=/Users/admin/builder/spi-builder-workspace/.derivedData/Build/Intermediates.noindex/GeneratedModuleMaps-watchos/CNIOLLHTTP.modulemap -Xcc -fmodule-map-file\=/Users/admin/builder/spi-builder-workspace/.derivedData/Build/Intermediates.noindex/GeneratedModuleMaps-watchos/CNIOBoringSSLShims.modulemap -Xcc -fmodule-map-file\=/Users/admin/builder/spi-builder-workspace/.derivedData/Build/Intermediates.noindex/GeneratedModuleMaps-watchos/CNIOExtrasZlib.modulemap -Xcc -fmodule-map-file\=/Users/admin/builder/spi-builder-workspace/.derivedData/Build/Intermediates.noindex/GeneratedModuleMaps-watchos/CNIOWASI.modulemap -Xcc -fmodule-map-file\=/Users/admin/builder/spi-builder-workspace/.derivedData/Build/Intermediates.noindex/GeneratedModuleMaps-watchos/CNIOLinux.modulemap -Xcc -fmodule-map-file\=/Users/admin/builder/spi-builder-workspace/.derivedData/Build/Intermediates.noindex/GeneratedModuleMaps-watchos/CNIODarwin.modulemap -Xcc -fmodule-map-file\=/Users/admin/builder/spi-builder-workspace/.derivedData/Build/Intermediates.noindex/GeneratedModuleMaps-watchos/CNIOAtomics.modulemap -Xcc -fmodule-map-file\=/Users/admin/builder/spi-builder-workspace/.derivedData/Build/Intermediates.noindex/GeneratedModuleMaps-watchos/CAsyncHTTPClient.modulemap -Xcc -ivfsstatcache -Xcc /Users/admin/builder/spi-builder-workspace/.derivedData/SDKStatCaches.noindex/watchos11.4-22T246-43efb940ff07ba2497b70ec94253f576.sdkstatcache -Xcc -I/Users/admin/builder/spi-builder-workspace/.derivedData/Build/Intermediates.noindex/apple-maps-kit.build/Debug-watchos/AppleMapsKit.build/swift-overrides.hmap -Xcc -I/Users/admin/builder/spi-builder-workspace/.dependencies/checkouts/swift-nio/Sources/CNIOLLHTTP/include -Xcc -I/Users/admin/builder/spi-builder-workspace/.dependencies/checkouts/swift-nio-ssl/Sources/CNIOBoringSSLShims/include -Xcc -I/Users/admin/builder/spi-builder-workspace/.dependencies/checkouts/swift-nio-ssl/Sources/CNIOBoringSSL/include -Xcc -I/Users/admin/builder/spi-builder-workspace/.dependencies/checkouts/swift-nio-extras/Sources/CNIOExtrasZlib/include -Xcc -I/Users/admin/builder/spi-builder-workspace/.dependencies/checkouts/swift-nio/Sources/CNIOWASI/include -Xcc -I/Users/admin/builder/spi-builder-workspace/.dependencies/checkouts/swift-nio/Sources/CNIOWindows/include -Xcc -I/Users/admin/builder/spi-builder-workspace/.dependencies/checkouts/swift-nio/Sources/CNIOLinux/include -Xcc -I/Users/admin/builder/spi-builder-workspace/.dependencies/checkouts/swift-nio/Sources/CNIODarwin/include -Xcc -I/Users/admin/builder/spi-builder-workspace/.dependencies/checkouts/swift-nio/Sources/CNIOAtomics/include -Xcc -I/Users/admin/builder/spi-builder-workspace/.dependencies/checkouts/swift-atomics/Sources/_AtomicsShims/include -Xcc -I/Users/admin/builder/spi-builder-workspace/.dependencies/checkouts/swift-numerics/Sources/_NumericsShims/include -Xcc -I/Users/admin/builder/spi-builder-workspace/.dependencies/checkouts/async-http-client/Sources/CAsyncHTTPClient/include -Xcc -I/Users/admin/builder/spi-builder-workspace/.dependencies/checkouts/swift-crypto/Sources/CCryptoBoringSSLShims/include -Xcc -I/Users/admin/builder/spi-builder-workspace/.dependencies/checkouts/swift-crypto/Sources/CCryptoBoringSSL/include -Xcc -I/Users/admin/builder/spi-builder-workspace/.derivedData/Build/Products/Debug-watchos/include -Xcc -I/Users/admin/builder/spi-builder-workspace/.derivedData/Build/Intermediates.noindex/apple-maps-kit.build/Debug-watchos/AppleMapsKit.build/DerivedSources-normal/arm64 -Xcc -I/Users/admin/builder/spi-builder-workspace/.derivedData/Build/Intermediates.noindex/apple-maps-kit.build/Debug-watchos/AppleMapsKit.build/DerivedSources/arm64 -Xcc -I/Users/admin/builder/spi-builder-workspace/.derivedData/Build/Intermediates.noindex/apple-maps-kit.build/Debug-watchos/AppleMapsKit.build/DerivedSources -Xcc -DSWIFT_PACKAGE -Xcc -DDEBUG\=1 -module-name AppleMapsKit -package-name spi_builder_workspace -frontend-parseable-output -disable-clang-spi -target-sdk-version 11.4 -target-sdk-name watchos11.4 -external-plugin-path /Applications/Xcode-16.3.0.app/Contents/Developer/Platforms/WatchOS.platform/Developer/usr/lib/swift/host/plugins\#/Applications/Xcode-16.3.0.app/Contents/Developer/Platforms/WatchOS.platform/Developer/usr/bin/swift-plugin-server -external-plugin-path /Applications/Xcode-16.3.0.app/Contents/Developer/Platforms/WatchOS.platform/Developer/usr/local/lib/swift/host/plugins\#/Applications/Xcode-16.3.0.app/Contents/Developer/Platforms/WatchOS.platform/Developer/usr/bin/swift-plugin-server -in-process-plugin-server-path /Applications/Xcode-16.3.0.app/Contents/Developer/Toolchains/XcodeDefault.xctoolchain/usr/lib/swift/host/libSwiftInProcPluginServer.dylib -plugin-path /Applications/Xcode-16.3.0.app/Contents/Developer/Toolchains/XcodeDefault.xctoolchain/usr/lib/swift/host/plugins -plugin-path /Applications/Xcode-16.3.0.app/Contents/Developer/Toolchains/XcodeDefault.xctoolchain/usr/local/lib/swift/host/plugins -o /Users/admin/builder/spi-builder-workspace/.derivedData/Build/Intermediates.noindex/apple-maps-kit.build/Debug-watchos/AppleMapsKit.build/Objects-normal/arm64/AppleMapsClient.o -o /Users/admin/builder/spi-builder-workspace/.derivedData/Build/Intermediates.noindex/apple-maps-kit.build/Debug-watchos/AppleMapsKit.build/Objects-normal/arm64/AppleMapsKitError.o -index-unit-output-path /apple-maps-kit.build/Debug-watchos/AppleMapsKit.build/Objects-normal/arm64/AppleMapsClient.o -index-unit-output-path /apple-maps-kit.build/Debug-watchos/AppleMapsKit.build/Objects-normal/arm64/AppleMapsKitError.o -index-store-path /Users/admin/builder/spi-builder-workspace/.derivedData/Index.noindex/DataStore -index-system-modules
SwiftCompile normal arm64 /Users/admin/builder/spi-builder-workspace/Sources/AppleMapsKit/AppleMapsClient.swift (in target 'AppleMapsKit' from project 'apple-maps-kit')
cd /Users/admin/builder/spi-builder-workspace/.swiftpm/xcode
/Users/admin/builder/spi-builder-workspace/Sources/AppleMapsKit/AppleMapsClient.swift:74:13: error: 'append(queryItems:)' is only available in watchOS 9.0 or newer
url.append(queryItems: queries)
^
/Users/admin/builder/spi-builder-workspace/Sources/AppleMapsKit/AppleMapsClient.swift:74:13: note: add 'if #available' version check
url.append(queryItems: queries)
^
/Users/admin/builder/spi-builder-workspace/Sources/AppleMapsKit/AppleMapsClient.swift:47:17: note: add @available attribute to enclosing instance method
public func geocode(
^
/Users/admin/builder/spi-builder-workspace/Sources/AppleMapsKit/AppleMapsClient.swift:8:15: note: add @available attribute to enclosing struct
public struct AppleMapsClient: Sendable {
^
/Users/admin/builder/spi-builder-workspace/Sources/AppleMapsKit/AppleMapsClient.swift:95:13: error: 'append(queryItems:)' is only available in watchOS 9.0 or newer
url.append(queryItems: queries)
^
/Users/admin/builder/spi-builder-workspace/Sources/AppleMapsKit/AppleMapsClient.swift:95:13: note: add 'if #available' version check
url.append(queryItems: queries)
^
/Users/admin/builder/spi-builder-workspace/Sources/AppleMapsKit/AppleMapsClient.swift:87:17: note: add @available attribute to enclosing instance method
public func reverseGeocode(latitude: Double, longitude: Double, lang: String? = nil) async throws -> [Place] {
^
/Users/admin/builder/spi-builder-workspace/Sources/AppleMapsKit/AppleMapsClient.swift:8:15: note: add @available attribute to enclosing struct
public struct AppleMapsClient: Sendable {
^
/Users/admin/builder/spi-builder-workspace/Sources/AppleMapsKit/AppleMapsClient.swift:202:13: error: 'append(queryItems:)' is only available in watchOS 9.0 or newer
url.append(queryItems: queries)
^
/Users/admin/builder/spi-builder-workspace/Sources/AppleMapsKit/AppleMapsClient.swift:202:13: note: add 'if #available' version check
url.append(queryItems: queries)
^
/Users/admin/builder/spi-builder-workspace/Sources/AppleMapsKit/AppleMapsClient.swift:121:17: note: add @available attribute to enclosing instance method
public func search(
^
/Users/admin/builder/spi-builder-workspace/Sources/AppleMapsKit/AppleMapsClient.swift:8:15: note: add @available attribute to enclosing struct
public struct AppleMapsClient: Sendable {
^
/Users/admin/builder/spi-builder-workspace/Sources/AppleMapsKit/AppleMapsClient.swift:285:13: error: 'append(queryItems:)' is only available in watchOS 9.0 or newer
url.append(queryItems: queries)
^
/Users/admin/builder/spi-builder-workspace/Sources/AppleMapsKit/AppleMapsClient.swift:285:13: note: add 'if #available' version check
url.append(queryItems: queries)
^
/Users/admin/builder/spi-builder-workspace/Sources/AppleMapsKit/AppleMapsClient.swift:226:17: note: add @available attribute to enclosing instance method
public func searchAutoComplete(
^
/Users/admin/builder/spi-builder-workspace/Sources/AppleMapsKit/AppleMapsClient.swift:8:15: note: add @available attribute to enclosing struct
public struct AppleMapsClient: Sendable {
^
/Users/admin/builder/spi-builder-workspace/Sources/AppleMapsKit/AppleMapsClient.swift:383:13: error: 'append(queryItems:)' is only available in watchOS 9.0 or newer
url.append(queryItems: queries)
^
/Users/admin/builder/spi-builder-workspace/Sources/AppleMapsKit/AppleMapsClient.swift:383:13: note: add 'if #available' version check
url.append(queryItems: queries)
^
/Users/admin/builder/spi-builder-workspace/Sources/AppleMapsKit/AppleMapsClient.swift:310:17: note: add @available attribute to enclosing instance method
public func directions(
^
/Users/admin/builder/spi-builder-workspace/Sources/AppleMapsKit/AppleMapsClient.swift:8:15: note: add @available attribute to enclosing struct
public struct AppleMapsClient: Sendable {
^
/Users/admin/builder/spi-builder-workspace/Sources/AppleMapsKit/AppleMapsClient.swift:452:13: error: 'append(queryItems:)' is only available in watchOS 9.0 or newer
url.append(queryItems: queries)
^
/Users/admin/builder/spi-builder-workspace/Sources/AppleMapsKit/AppleMapsClient.swift:452:13: note: add 'if #available' version check
url.append(queryItems: queries)
^
/Users/admin/builder/spi-builder-workspace/Sources/AppleMapsKit/AppleMapsClient.swift:400:17: note: add @available attribute to enclosing instance method
public func eta(
^
/Users/admin/builder/spi-builder-workspace/Sources/AppleMapsKit/AppleMapsClient.swift:8:15: note: add @available attribute to enclosing struct
public struct AppleMapsClient: Sendable {
^
/Users/admin/builder/spi-builder-workspace/Sources/AppleMapsKit/AppleMapsClient.swift:520:17: error: 'append(queryItems:)' is only available in watchOS 9.0 or newer
url.append(queryItems: [URLQueryItem(name: "lang", value: lang)])
^
/Users/admin/builder/spi-builder-workspace/Sources/AppleMapsKit/AppleMapsClient.swift:520:17: note: add 'if #available' version check
url.append(queryItems: [URLQueryItem(name: "lang", value: lang)])
^
/Users/admin/builder/spi-builder-workspace/Sources/AppleMapsKit/AppleMapsClient.swift:517:17: note: add @available attribute to enclosing instance method
public func place(id: String, lang: String? = nil) async throws -> Place {
^
/Users/admin/builder/spi-builder-workspace/Sources/AppleMapsKit/AppleMapsClient.swift:8:15: note: add @available attribute to enclosing struct
public struct AppleMapsClient: Sendable {
^
/Users/admin/builder/spi-builder-workspace/Sources/AppleMapsKit/AppleMapsClient.swift:541:13: error: 'append(queryItems:)' is only available in watchOS 9.0 or newer
url.append(queryItems: queries)
^
/Users/admin/builder/spi-builder-workspace/Sources/AppleMapsKit/AppleMapsClient.swift:541:13: note: add 'if #available' version check
url.append(queryItems: queries)
^
/Users/admin/builder/spi-builder-workspace/Sources/AppleMapsKit/AppleMapsClient.swift:533:17: note: add @available attribute to enclosing instance method
public func places(ids: [String], lang: String? = nil) async throws -> PlacesResponse {
^
/Users/admin/builder/spi-builder-workspace/Sources/AppleMapsKit/AppleMapsClient.swift:8:15: note: add @available attribute to enclosing struct
public struct AppleMapsClient: Sendable {
^
/Users/admin/builder/spi-builder-workspace/Sources/AppleMapsKit/AppleMapsClient.swift:553:13: error: 'append(queryItems:)' is only available in watchOS 9.0 or newer
url.append(queryItems: [URLQueryItem(name: "ids", value: ids.joined(separator: ","))])
^
/Users/admin/builder/spi-builder-workspace/Sources/AppleMapsKit/AppleMapsClient.swift:553:13: note: add 'if #available' version check
url.append(queryItems: [URLQueryItem(name: "ids", value: ids.joined(separator: ","))])
^
/Users/admin/builder/spi-builder-workspace/Sources/AppleMapsKit/AppleMapsClient.swift:551:17: note: add @available attribute to enclosing instance method
public func alternatePlaceIDs(ids: [String]) async throws -> AlternateIDsResponse {
^
/Users/admin/builder/spi-builder-workspace/Sources/AppleMapsKit/AppleMapsClient.swift:8:15: note: add @available attribute to enclosing struct
public struct AppleMapsClient: Sendable {
^
SwiftCompile normal arm64 /Users/admin/builder/spi-builder-workspace/Sources/AppleMapsKit/AppleMapsKitError.swift (in target 'AppleMapsKit' from project 'apple-maps-kit')
cd /Users/admin/builder/spi-builder-workspace/.swiftpm/xcode
SwiftEmitModule normal armv7k Emitting\ module\ for\ AppleMapsKit (in target 'AppleMapsKit' from project 'apple-maps-kit')
EmitSwiftModule normal armv7k (in target 'AppleMapsKit' from project 'apple-maps-kit')
cd /Users/admin/builder/spi-builder-workspace/.swiftpm/xcode
SwiftDriverJobDiscovery normal arm64 Compiling RequestOptions.swift, HTTPConnectionPool+Backoff.swift, HTTPConnectionPool+HTTP1Connections.swift, HTTPConnectionPool+HTTP1StateMachine.swift, HTTPConnectionPool+HTTP2Connections.swift, HTTPConnectionPool+HTTP2StateMachine.swift, HTTPConnectionPool+RequestQueue.swift (in target 'AsyncHTTPClient' from project 'async-http-client')
SwiftCompile normal arm64 Compiling\ DirectionsResponse.swift,\ ErrorResponse.swift /Users/admin/builder/spi-builder-workspace/Sources/AppleMapsKit/DTOs/DirectionsResponse.swift /Users/admin/builder/spi-builder-workspace/Sources/AppleMapsKit/DTOs/ErrorResponse.swift (in target 'AppleMapsKit' from project 'apple-maps-kit')
SwiftCompile normal arm64 /Users/admin/builder/spi-builder-workspace/Sources/AppleMapsKit/DTOs/DirectionsResponse.swift (in target 'AppleMapsKit' from project 'apple-maps-kit')
cd /Users/admin/builder/spi-builder-workspace/.swiftpm/xcode
SwiftCompile normal arm64 /Users/admin/builder/spi-builder-workspace/Sources/AppleMapsKit/DTOs/ErrorResponse.swift (in target 'AppleMapsKit' from project 'apple-maps-kit')
cd /Users/admin/builder/spi-builder-workspace/.swiftpm/xcode
SwiftDriverJobDiscovery normal armv7k Compiling HTTPConnectionPool+StateMachine.swift, ConnectionTarget.swift, DeconstructedURL.swift, FileDownloadDelegate.swift, FoundationExtensions.swift, HTTPClient+HTTPCookie.swift (in target 'AsyncHTTPClient' from project 'async-http-client')
SwiftCompile normal armv7k Compiling\ DirectionsResponse.swift,\ ErrorResponse.swift /Users/admin/builder/spi-builder-workspace/Sources/AppleMapsKit/DTOs/DirectionsResponse.swift /Users/admin/builder/spi-builder-workspace/Sources/AppleMapsKit/DTOs/ErrorResponse.swift (in target 'AppleMapsKit' from project 'apple-maps-kit')
SwiftCompile normal armv7k /Users/admin/builder/spi-builder-workspace/Sources/AppleMapsKit/DTOs/DirectionsResponse.swift (in target 'AppleMapsKit' from project 'apple-maps-kit')
cd /Users/admin/builder/spi-builder-workspace/.swiftpm/xcode
SwiftCompile normal armv7k /Users/admin/builder/spi-builder-workspace/Sources/AppleMapsKit/DTOs/ErrorResponse.swift (in target 'AppleMapsKit' from project 'apple-maps-kit')
cd /Users/admin/builder/spi-builder-workspace/.swiftpm/xcode
SwiftDriverJobDiscovery normal arm64_32 Compiling HTTPClient+Proxy.swift, HTTPClient+StructuredConcurrency.swift, HTTPClient.swift, HTTPHandler.swift, LRUCache.swift, NWErrorHandler.swift (in target 'AsyncHTTPClient' from project 'async-http-client')
SwiftCompile normal arm64 Compiling\ PoiCategory.swift /Users/admin/builder/spi-builder-workspace/Sources/AppleMapsKit/DTOs/PoiCategory.swift (in target 'AppleMapsKit' from project 'apple-maps-kit')
SwiftCompile normal arm64 /Users/admin/builder/spi-builder-workspace/Sources/AppleMapsKit/DTOs/PoiCategory.swift (in target 'AppleMapsKit' from project 'apple-maps-kit')
cd /Users/admin/builder/spi-builder-workspace/.swiftpm/xcode
SwiftDriverJobDiscovery normal armv7k Compiling NWWaitingHandler.swift, TLSConfiguration.swift, RedirectState.swift, RequestBag+StateMachine.swift, RequestBag.swift, RequestValidation.swift (in target 'AsyncHTTPClient' from project 'async-http-client')
SwiftCompile normal arm64_32 Compiling\ Place.swift /Users/admin/builder/spi-builder-workspace/Sources/AppleMapsKit/DTOs/Place.swift (in target 'AppleMapsKit' from project 'apple-maps-kit')
SwiftCompile normal arm64_32 /Users/admin/builder/spi-builder-workspace/Sources/AppleMapsKit/DTOs/Place.swift (in target 'AppleMapsKit' from project 'apple-maps-kit')
cd /Users/admin/builder/spi-builder-workspace/.swiftpm/xcode
SwiftDriverJobDiscovery normal armv7k Compiling BestEffortHashableTLSConfiguration.swift, Configuration+BrowserLike.swift, ConnectionPool.swift, HTTP1ProxyConnectHandler.swift, SOCKSEventsHandler.swift, TLSEventsHandler.swift, HTTP1ClientChannelHandler.swift (in target 'AsyncHTTPClient' from project 'async-http-client')
SwiftDriverJobDiscovery normal arm64_32 Compiling BestEffortHashableTLSConfiguration.swift, Configuration+BrowserLike.swift, ConnectionPool.swift, HTTP1ProxyConnectHandler.swift, SOCKSEventsHandler.swift, TLSEventsHandler.swift, HTTP1ClientChannelHandler.swift (in target 'AsyncHTTPClient' from project 'async-http-client')
SwiftDriver\ Compilation AsyncHTTPClient normal armv7k com.apple.xcode.tools.swift.compiler (in target 'AsyncHTTPClient' from project 'async-http-client')
cd /Users/admin/builder/spi-builder-workspace/.swiftpm/xcode
builtin-Swift-Compilation -- /Applications/Xcode-16.3.0.app/Contents/Developer/Toolchains/XcodeDefault.xctoolchain/usr/bin/swiftc -module-name AsyncHTTPClient -Onone -enforce-exclusivity\=checked @/Users/admin/builder/spi-builder-workspace/.derivedData/Build/Intermediates.noindex/async-http-client.build/Debug-watchos/AsyncHTTPClient.build/Objects-normal/armv7k/AsyncHTTPClient.SwiftFileList -DSWIFT_PACKAGE -DDEBUG -Xcc -fmodule-map-file\=/Users/admin/builder/spi-builder-workspace/.derivedData/Build/Intermediates.noindex/GeneratedModuleMaps-watchos/CNIOLLHTTP.modulemap -Xcc -fmodule-map-file\=/Users/admin/builder/spi-builder-workspace/.derivedData/Build/Intermediates.noindex/GeneratedModuleMaps-watchos/CNIOBoringSSLShims.modulemap -Xcc -fmodule-map-file\=/Users/admin/builder/spi-builder-workspace/.derivedData/Build/Intermediates.noindex/GeneratedModuleMaps-watchos/CNIOExtrasZlib.modulemap -Xcc -fmodule-map-file\=/Users/admin/builder/spi-builder-workspace/.derivedData/Build/Intermediates.noindex/GeneratedModuleMaps-watchos/CNIOWASI.modulemap -Xcc -fmodule-map-file\=/Users/admin/builder/spi-builder-workspace/.derivedData/Build/Intermediates.noindex/GeneratedModuleMaps-watchos/CNIOLinux.modulemap -Xcc -fmodule-map-file\=/Users/admin/builder/spi-builder-workspace/.derivedData/Build/Intermediates.noindex/GeneratedModuleMaps-watchos/CNIODarwin.modulemap -Xcc -fmodule-map-file\=/Users/admin/builder/spi-builder-workspace/.derivedData/Build/Intermediates.noindex/GeneratedModuleMaps-watchos/CNIOAtomics.modulemap -Xcc -fmodule-map-file\=/Users/admin/builder/spi-builder-workspace/.derivedData/Build/Intermediates.noindex/GeneratedModuleMaps-watchos/CAsyncHTTPClient.modulemap -DXcode -enable-upcoming-feature MemberImportVisibility -plugin-path /Applications/Xcode-16.3.0.app/Contents/Developer/Toolchains/XcodeDefault.xctoolchain/usr/lib/swift/host/plugins/testing -enable-experimental-feature DebugDescriptionMacro -sdk /Applications/Xcode-16.3.0.app/Contents/Developer/Platforms/WatchOS.platform/Developer/SDKs/WatchOS11.4.sdk -target armv7k-apple-watchos5.0 -g -module-cache-path /Users/admin/builder/spi-builder-workspace/.derivedData/ModuleCache.noindex -Xfrontend -serialize-debugging-options -profile-coverage-mapping -profile-generate -enable-testing -suppress-warnings -index-store-path /Users/admin/builder/spi-builder-workspace/.derivedData/Index.noindex/DataStore -swift-version 5 -I /Users/admin/builder/spi-builder-workspace/.derivedData/Build/Products/Debug-watchos -I /Applications/Xcode-16.3.0.app/Contents/Developer/Platforms/WatchOS.platform/Developer/usr/lib -F /Users/admin/builder/spi-builder-workspace/.derivedData/Build/Products/Debug-watchos/PackageFrameworks -F /Users/admin/builder/spi-builder-workspace/.derivedData/Build/Products/Debug-watchos/PackageFrameworks -F /Users/admin/builder/spi-builder-workspace/.derivedData/Build/Products/Debug-watchos/PackageFrameworks -F /Users/admin/builder/spi-builder-workspace/.derivedData/Build/Products/Debug-watchos/PackageFrameworks -F /Users/admin/builder/spi-builder-workspace/.derivedData/Build/Products/Debug-watchos/PackageFrameworks -F /Users/admin/builder/spi-builder-workspace/.derivedData/Build/Products/Debug-watchos/PackageFrameworks -F /Users/admin/builder/spi-builder-workspace/.derivedData/Build/Products/Debug-watchos/PackageFrameworks -F /Users/admin/builder/spi-builder-workspace/.derivedData/Build/Products/Debug-watchos/PackageFrameworks -F /Users/admin/builder/spi-builder-workspace/.derivedData/Build/Products/Debug-watchos/PackageFrameworks -F /Users/admin/builder/spi-builder-workspace/.derivedData/Build/Products/Debug-watchos/PackageFrameworks -F /Users/admin/builder/spi-builder-workspace/.derivedData/Build/Products/Debug-watchos/PackageFrameworks -F /Users/admin/builder/spi-builder-workspace/.derivedData/Build/Products/Debug-watchos/PackageFrameworks -F /Users/admin/builder/spi-builder-workspace/.derivedData/Build/Products/Debug-watchos/PackageFrameworks -F /Users/admin/builder/spi-builder-workspace/.derivedData/Build/Products/Debug-watchos/PackageFrameworks -F /Users/admin/builder/spi-builder-workspace/.derivedData/Build/Products/Debug-watchos/PackageFrameworks -F /Users/admin/builder/spi-builder-workspace/.derivedData/Build/Products/Debug-watchos/PackageFrameworks -F /Users/admin/builder/spi-builder-workspace/.derivedData/Build/Products/Debug-watchos/PackageFrameworks -F /Users/admin/builder/spi-builder-workspace/.derivedData/Build/Products/Debug-watchos/PackageFrameworks -F /Users/admin/builder/spi-builder-workspace/.derivedData/Build/Products/Debug-watchos/PackageFrameworks -F /Users/admin/builder/spi-builder-workspace/.derivedData/Build/Products/Debug-watchos/PackageFrameworks -F /Users/admin/builder/spi-builder-workspace/.derivedData/Build/Products/Debug-watchos/PackageFrameworks -F /Users/admin/builder/spi-builder-workspace/.derivedData/Build/Products/Debug-watchos/PackageFrameworks -F /Users/admin/builder/spi-builder-workspace/.derivedData/Build/Products/Debug-watchos/PackageFrameworks -F /Users/admin/builder/spi-builder-workspace/.derivedData/Build/Products/Debug-watchos/PackageFrameworks -F /Users/admin/builder/spi-builder-workspace/.derivedData/Build/Products/Debug-watchos/PackageFrameworks -F /Users/admin/builder/spi-builder-workspace/.derivedData/Build/Products/Debug-watchos/PackageFrameworks -F /Users/admin/builder/spi-builder-workspace/.derivedData/Build/Products/Debug-watchos/PackageFrameworks -F /Users/admin/builder/spi-builder-workspace/.derivedData/Build/Products/Debug-watchos/PackageFrameworks -F /Users/admin/builder/spi-builder-workspace/.derivedData/Build/Products/Debug-watchos/PackageFrameworks -F /Users/admin/builder/spi-builder-workspace/.derivedData/Build/Products/Debug-watchos/PackageFrameworks -F /Users/admin/builder/spi-builder-workspace/.derivedData/Build/Products/Debug-watchos/PackageFrameworks -F /Users/admin/builder/spi-builder-workspace/.derivedData/Build/Products/Debug-watchos/PackageFrameworks -F /Users/admin/builder/spi-builder-workspace/.derivedData/Build/Products/Debug-watchos/PackageFrameworks -F /Users/admin/builder/spi-builder-workspace/.derivedData/Build/Products/Debug-watchos/PackageFrameworks -F /Users/admin/builder/spi-builder-workspace/.derivedData/Build/Products/Debug-watchos -F /Applications/Xcode-16.3.0.app/Contents/Developer/Platforms/WatchOS.platform/Developer/Library/Frameworks -F /Applications/Xcode-16.3.0.app/Contents/Developer/Platforms/WatchOS.platform/Developer/SDKs/WatchOS11.4.sdk/Developer/Library/Frameworks -c -j10 -enable-batch-mode -incremental -Xcc -ivfsstatcache -Xcc /Users/admin/builder/spi-builder-workspace/.derivedData/SDKStatCaches.noindex/watchos11.4-22T246-43efb940ff07ba2497b70ec94253f576.sdkstatcache -output-file-map /Users/admin/builder/spi-builder-workspace/.derivedData/Build/Intermediates.noindex/async-http-client.build/Debug-watchos/AsyncHTTPClient.build/Objects-normal/armv7k/AsyncHTTPClient-OutputFileMap.json -use-frontend-parseable-output -save-temps -no-color-diagnostics -serialize-diagnostics -emit-dependencies -emit-module -emit-module-path /Users/admin/builder/spi-builder-workspace/.derivedData/Build/Intermediates.noindex/async-http-client.build/Debug-watchos/AsyncHTTPClient.build/Objects-normal/armv7k/AsyncHTTPClient.swiftmodule -validate-clang-modules-once -clang-build-session-file /Users/admin/builder/spi-builder-workspace/.derivedData/ModuleCache.noindex/Session.modulevalidation -Xcc -I/Users/admin/builder/spi-builder-workspace/.derivedData/Build/Intermediates.noindex/async-http-client.build/Debug-watchos/AsyncHTTPClient.build/swift-overrides.hmap -emit-const-values -Xfrontend -const-gather-protocols-file -Xfrontend /Users/admin/builder/spi-builder-workspace/.derivedData/Build/Intermediates.noindex/async-http-client.build/Debug-watchos/AsyncHTTPClient.build/Objects-normal/armv7k/AsyncHTTPClient_const_extract_protocols.json -Xcc -I/Users/admin/builder/spi-builder-workspace/.dependencies/checkouts/swift-nio/Sources/CNIOLLHTTP/include -Xcc -I/Users/admin/builder/spi-builder-workspace/.dependencies/checkouts/swift-nio-ssl/Sources/CNIOBoringSSLShims/include -Xcc -I/Users/admin/builder/spi-builder-workspace/.dependencies/checkouts/swift-nio-ssl/Sources/CNIOBoringSSL/include -Xcc -I/Users/admin/builder/spi-builder-workspace/.dependencies/checkouts/swift-nio-extras/Sources/CNIOExtrasZlib/include -Xcc -I/Users/admin/builder/spi-builder-workspace/.dependencies/checkouts/swift-nio/Sources/CNIOWASI/include -Xcc -I/Users/admin/builder/spi-builder-workspace/.dependencies/checkouts/swift-nio/Sources/CNIOWindows/include -Xcc -I/Users/admin/builder/spi-builder-workspace/.dependencies/checkouts/swift-nio/Sources/CNIOLinux/include -Xcc -I/Users/admin/builder/spi-builder-workspace/.dependencies/checkouts/swift-nio/Sources/CNIODarwin/include -Xcc -I/Users/admin/builder/spi-builder-workspace/.dependencies/checkouts/swift-nio/Sources/CNIOAtomics/include -Xcc -I/Users/admin/builder/spi-builder-workspace/.dependencies/checkouts/swift-atomics/Sources/_AtomicsShims/include -Xcc -I/Users/admin/builder/spi-builder-workspace/.dependencies/checkouts/swift-numerics/Sources/_NumericsShims/include -Xcc -I/Users/admin/builder/spi-builder-workspace/.dependencies/checkouts/async-http-client/Sources/CAsyncHTTPClient/include -Xcc -I/Users/admin/builder/spi-builder-workspace/.derivedData/Build/Products/Debug-watchos/include -Xcc -I/Users/admin/builder/spi-builder-workspace/.derivedData/Build/Intermediates.noindex/async-http-client.build/Debug-watchos/AsyncHTTPClient.build/DerivedSources-normal/armv7k -Xcc -I/Users/admin/builder/spi-builder-workspace/.derivedData/Build/Intermediates.noindex/async-http-client.build/Debug-watchos/AsyncHTTPClient.build/DerivedSources/armv7k -Xcc -I/Users/admin/builder/spi-builder-workspace/.derivedData/Build/Intermediates.noindex/async-http-client.build/Debug-watchos/AsyncHTTPClient.build/DerivedSources -Xcc -DSWIFT_PACKAGE -Xcc -DDEBUG\=1 -emit-objc-header -emit-objc-header-path /Users/admin/builder/spi-builder-workspace/.derivedData/Build/Intermediates.noindex/async-http-client.build/Debug-watchos/AsyncHTTPClient.build/Objects-normal/armv7k/AsyncHTTPClient-Swift.h -working-directory /Users/admin/builder/spi-builder-workspace/.swiftpm/xcode -experimental-emit-module-separately -disable-cmo
SwiftCompile normal armv7k Compiling\ PlacesResponse.swift /Users/admin/builder/spi-builder-workspace/Sources/AppleMapsKit/DTOs/PlacesResponse.swift (in target 'AppleMapsKit' from project 'apple-maps-kit')
SwiftCompile normal armv7k /Users/admin/builder/spi-builder-workspace/Sources/AppleMapsKit/DTOs/PlacesResponse.swift (in target 'AppleMapsKit' from project 'apple-maps-kit')
cd /Users/admin/builder/spi-builder-workspace/.swiftpm/xcode
SwiftDriverJobDiscovery normal arm64 Compiling HTTPClient+Proxy.swift, HTTPClient+StructuredConcurrency.swift, HTTPClient.swift, HTTPHandler.swift, LRUCache.swift, NWErrorHandler.swift (in target 'AsyncHTTPClient' from project 'async-http-client')
SwiftDriver\ Compilation AsyncHTTPClient normal arm64_32 com.apple.xcode.tools.swift.compiler (in target 'AsyncHTTPClient' from project 'async-http-client')
cd /Users/admin/builder/spi-builder-workspace/.swiftpm/xcode
builtin-Swift-Compilation -- /Applications/Xcode-16.3.0.app/Contents/Developer/Toolchains/XcodeDefault.xctoolchain/usr/bin/swiftc -module-name AsyncHTTPClient -Onone -enforce-exclusivity\=checked @/Users/admin/builder/spi-builder-workspace/.derivedData/Build/Intermediates.noindex/async-http-client.build/Debug-watchos/AsyncHTTPClient.build/Objects-normal/arm64_32/AsyncHTTPClient.SwiftFileList -DSWIFT_PACKAGE -DDEBUG -Xcc -fmodule-map-file\=/Users/admin/builder/spi-builder-workspace/.derivedData/Build/Intermediates.noindex/GeneratedModuleMaps-watchos/CNIOLLHTTP.modulemap -Xcc -fmodule-map-file\=/Users/admin/builder/spi-builder-workspace/.derivedData/Build/Intermediates.noindex/GeneratedModuleMaps-watchos/CNIOBoringSSLShims.modulemap -Xcc -fmodule-map-file\=/Users/admin/builder/spi-builder-workspace/.derivedData/Build/Intermediates.noindex/GeneratedModuleMaps-watchos/CNIOExtrasZlib.modulemap -Xcc -fmodule-map-file\=/Users/admin/builder/spi-builder-workspace/.derivedData/Build/Intermediates.noindex/GeneratedModuleMaps-watchos/CNIOWASI.modulemap -Xcc -fmodule-map-file\=/Users/admin/builder/spi-builder-workspace/.derivedData/Build/Intermediates.noindex/GeneratedModuleMaps-watchos/CNIOLinux.modulemap -Xcc -fmodule-map-file\=/Users/admin/builder/spi-builder-workspace/.derivedData/Build/Intermediates.noindex/GeneratedModuleMaps-watchos/CNIODarwin.modulemap -Xcc -fmodule-map-file\=/Users/admin/builder/spi-builder-workspace/.derivedData/Build/Intermediates.noindex/GeneratedModuleMaps-watchos/CNIOAtomics.modulemap -Xcc -fmodule-map-file\=/Users/admin/builder/spi-builder-workspace/.derivedData/Build/Intermediates.noindex/GeneratedModuleMaps-watchos/CAsyncHTTPClient.modulemap -DXcode -enable-upcoming-feature MemberImportVisibility -plugin-path /Applications/Xcode-16.3.0.app/Contents/Developer/Toolchains/XcodeDefault.xctoolchain/usr/lib/swift/host/plugins/testing -enable-experimental-feature DebugDescriptionMacro -sdk /Applications/Xcode-16.3.0.app/Contents/Developer/Platforms/WatchOS.platform/Developer/SDKs/WatchOS11.4.sdk -target arm64_32-apple-watchos5.0 -g -module-cache-path /Users/admin/builder/spi-builder-workspace/.derivedData/ModuleCache.noindex -Xfrontend -serialize-debugging-options -profile-coverage-mapping -profile-generate -enable-testing -suppress-warnings -index-store-path /Users/admin/builder/spi-builder-workspace/.derivedData/Index.noindex/DataStore -swift-version 5 -I /Users/admin/builder/spi-builder-workspace/.derivedData/Build/Products/Debug-watchos -I /Applications/Xcode-16.3.0.app/Contents/Developer/Platforms/WatchOS.platform/Developer/usr/lib -F /Users/admin/builder/spi-builder-workspace/.derivedData/Build/Products/Debug-watchos/PackageFrameworks -F /Users/admin/builder/spi-builder-workspace/.derivedData/Build/Products/Debug-watchos/PackageFrameworks -F /Users/admin/builder/spi-builder-workspace/.derivedData/Build/Products/Debug-watchos/PackageFrameworks -F /Users/admin/builder/spi-builder-workspace/.derivedData/Build/Products/Debug-watchos/PackageFrameworks -F /Users/admin/builder/spi-builder-workspace/.derivedData/Build/Products/Debug-watchos/PackageFrameworks -F /Users/admin/builder/spi-builder-workspace/.derivedData/Build/Products/Debug-watchos/PackageFrameworks -F /Users/admin/builder/spi-builder-workspace/.derivedData/Build/Products/Debug-watchos/PackageFrameworks -F /Users/admin/builder/spi-builder-workspace/.derivedData/Build/Products/Debug-watchos/PackageFrameworks -F /Users/admin/builder/spi-builder-workspace/.derivedData/Build/Products/Debug-watchos/PackageFrameworks -F /Users/admin/builder/spi-builder-workspace/.derivedData/Build/Products/Debug-watchos/PackageFrameworks -F /Users/admin/builder/spi-builder-workspace/.derivedData/Build/Products/Debug-watchos/PackageFrameworks -F /Users/admin/builder/spi-builder-workspace/.derivedData/Build/Products/Debug-watchos/PackageFrameworks -F /Users/admin/builder/spi-builder-workspace/.derivedData/Build/Products/Debug-watchos/PackageFrameworks -F /Users/admin/builder/spi-builder-workspace/.derivedData/Build/Products/Debug-watchos/PackageFrameworks -F /Users/admin/builder/spi-builder-workspace/.derivedData/Build/Products/Debug-watchos/PackageFrameworks -F /Users/admin/builder/spi-builder-workspace/.derivedData/Build/Products/Debug-watchos/PackageFrameworks -F /Users/admin/builder/spi-builder-workspace/.derivedData/Build/Products/Debug-watchos/PackageFrameworks -F /Users/admin/builder/spi-builder-workspace/.derivedData/Build/Products/Debug-watchos/PackageFrameworks -F /Users/admin/builder/spi-builder-workspace/.derivedData/Build/Products/Debug-watchos/PackageFrameworks -F /Users/admin/builder/spi-builder-workspace/.derivedData/Build/Products/Debug-watchos/PackageFrameworks -F /Users/admin/builder/spi-builder-workspace/.derivedData/Build/Products/Debug-watchos/PackageFrameworks -F /Users/admin/builder/spi-builder-workspace/.derivedData/Build/Products/Debug-watchos/PackageFrameworks -F /Users/admin/builder/spi-builder-workspace/.derivedData/Build/Products/Debug-watchos/PackageFrameworks -F /Users/admin/builder/spi-builder-workspace/.derivedData/Build/Products/Debug-watchos/PackageFrameworks -F /Users/admin/builder/spi-builder-workspace/.derivedData/Build/Products/Debug-watchos/PackageFrameworks -F /Users/admin/builder/spi-builder-workspace/.derivedData/Build/Products/Debug-watchos/PackageFrameworks -F /Users/admin/builder/spi-builder-workspace/.derivedData/Build/Products/Debug-watchos/PackageFrameworks -F /Users/admin/builder/spi-builder-workspace/.derivedData/Build/Products/Debug-watchos/PackageFrameworks -F /Users/admin/builder/spi-builder-workspace/.derivedData/Build/Products/Debug-watchos/PackageFrameworks -F /Users/admin/builder/spi-builder-workspace/.derivedData/Build/Products/Debug-watchos/PackageFrameworks -F /Users/admin/builder/spi-builder-workspace/.derivedData/Build/Products/Debug-watchos/PackageFrameworks -F /Users/admin/builder/spi-builder-workspace/.derivedData/Build/Products/Debug-watchos/PackageFrameworks -F /Users/admin/builder/spi-builder-workspace/.derivedData/Build/Products/Debug-watchos/PackageFrameworks -F /Users/admin/builder/spi-builder-workspace/.derivedData/Build/Products/Debug-watchos/PackageFrameworks -F /Users/admin/builder/spi-builder-workspace/.derivedData/Build/Products/Debug-watchos -F /Applications/Xcode-16.3.0.app/Contents/Developer/Platforms/WatchOS.platform/Developer/Library/Frameworks -F /Applications/Xcode-16.3.0.app/Contents/Developer/Platforms/WatchOS.platform/Developer/SDKs/WatchOS11.4.sdk/Developer/Library/Frameworks -c -j10 -enable-batch-mode -incremental -Xcc -ivfsstatcache -Xcc /Users/admin/builder/spi-builder-workspace/.derivedData/SDKStatCaches.noindex/watchos11.4-22T246-43efb940ff07ba2497b70ec94253f576.sdkstatcache -output-file-map /Users/admin/builder/spi-builder-workspace/.derivedData/Build/Intermediates.noindex/async-http-client.build/Debug-watchos/AsyncHTTPClient.build/Objects-normal/arm64_32/AsyncHTTPClient-OutputFileMap.json -use-frontend-parseable-output -save-temps -no-color-diagnostics -serialize-diagnostics -emit-dependencies -emit-module -emit-module-path /Users/admin/builder/spi-builder-workspace/.derivedData/Build/Intermediates.noindex/async-http-client.build/Debug-watchos/AsyncHTTPClient.build/Objects-normal/arm64_32/AsyncHTTPClient.swiftmodule -validate-clang-modules-once -clang-build-session-file /Users/admin/builder/spi-builder-workspace/.derivedData/ModuleCache.noindex/Session.modulevalidation -Xcc -I/Users/admin/builder/spi-builder-workspace/.derivedData/Build/Intermediates.noindex/async-http-client.build/Debug-watchos/AsyncHTTPClient.build/swift-overrides.hmap -emit-const-values -Xfrontend -const-gather-protocols-file -Xfrontend /Users/admin/builder/spi-builder-workspace/.derivedData/Build/Intermediates.noindex/async-http-client.build/Debug-watchos/AsyncHTTPClient.build/Objects-normal/arm64_32/AsyncHTTPClient_const_extract_protocols.json -Xcc -I/Users/admin/builder/spi-builder-workspace/.dependencies/checkouts/swift-nio/Sources/CNIOLLHTTP/include -Xcc -I/Users/admin/builder/spi-builder-workspace/.dependencies/checkouts/swift-nio-ssl/Sources/CNIOBoringSSLShims/include -Xcc -I/Users/admin/builder/spi-builder-workspace/.dependencies/checkouts/swift-nio-ssl/Sources/CNIOBoringSSL/include -Xcc -I/Users/admin/builder/spi-builder-workspace/.dependencies/checkouts/swift-nio-extras/Sources/CNIOExtrasZlib/include -Xcc -I/Users/admin/builder/spi-builder-workspace/.dependencies/checkouts/swift-nio/Sources/CNIOWASI/include -Xcc -I/Users/admin/builder/spi-builder-workspace/.dependencies/checkouts/swift-nio/Sources/CNIOWindows/include -Xcc -I/Users/admin/builder/spi-builder-workspace/.dependencies/checkouts/swift-nio/Sources/CNIOLinux/include -Xcc -I/Users/admin/builder/spi-builder-workspace/.dependencies/checkouts/swift-nio/Sources/CNIODarwin/include -Xcc -I/Users/admin/builder/spi-builder-workspace/.dependencies/checkouts/swift-nio/Sources/CNIOAtomics/include -Xcc -I/Users/admin/builder/spi-builder-workspace/.dependencies/checkouts/swift-atomics/Sources/_AtomicsShims/include -Xcc -I/Users/admin/builder/spi-builder-workspace/.dependencies/checkouts/swift-numerics/Sources/_NumericsShims/include -Xcc -I/Users/admin/builder/spi-builder-workspace/.dependencies/checkouts/async-http-client/Sources/CAsyncHTTPClient/include -Xcc -I/Users/admin/builder/spi-builder-workspace/.derivedData/Build/Products/Debug-watchos/include -Xcc -I/Users/admin/builder/spi-builder-workspace/.derivedData/Build/Intermediates.noindex/async-http-client.build/Debug-watchos/AsyncHTTPClient.build/DerivedSources-normal/arm64_32 -Xcc -I/Users/admin/builder/spi-builder-workspace/.derivedData/Build/Intermediates.noindex/async-http-client.build/Debug-watchos/AsyncHTTPClient.build/DerivedSources/arm64_32 -Xcc -I/Users/admin/builder/spi-builder-workspace/.derivedData/Build/Intermediates.noindex/async-http-client.build/Debug-watchos/AsyncHTTPClient.build/DerivedSources -Xcc -DSWIFT_PACKAGE -Xcc -DDEBUG\=1 -emit-objc-header -emit-objc-header-path /Users/admin/builder/spi-builder-workspace/.derivedData/Build/Intermediates.noindex/async-http-client.build/Debug-watchos/AsyncHTTPClient.build/Objects-normal/arm64_32/AsyncHTTPClient-Swift.h -working-directory /Users/admin/builder/spi-builder-workspace/.swiftpm/xcode -experimental-emit-module-separately -disable-cmo
SwiftCompile normal arm64 Compiling\ SearchResponse.swift /Users/admin/builder/spi-builder-workspace/Sources/AppleMapsKit/DTOs/SearchResponse.swift (in target 'AppleMapsKit' from project 'apple-maps-kit')
SwiftCompile normal arm64 /Users/admin/builder/spi-builder-workspace/Sources/AppleMapsKit/DTOs/SearchResponse.swift (in target 'AppleMapsKit' from project 'apple-maps-kit')
cd /Users/admin/builder/spi-builder-workspace/.swiftpm/xcode
SwiftDriverJobDiscovery normal arm64 Compiling PoiCategory.swift (in target 'AppleMapsKit' from project 'apple-maps-kit')
SwiftDriver\ Compilation AsyncHTTPClient normal arm64 com.apple.xcode.tools.swift.compiler (in target 'AsyncHTTPClient' from project 'async-http-client')
cd /Users/admin/builder/spi-builder-workspace/.swiftpm/xcode
builtin-Swift-Compilation -- /Applications/Xcode-16.3.0.app/Contents/Developer/Toolchains/XcodeDefault.xctoolchain/usr/bin/swiftc -module-name AsyncHTTPClient -Onone -enforce-exclusivity\=checked @/Users/admin/builder/spi-builder-workspace/.derivedData/Build/Intermediates.noindex/async-http-client.build/Debug-watchos/AsyncHTTPClient.build/Objects-normal/arm64/AsyncHTTPClient.SwiftFileList -DSWIFT_PACKAGE -DDEBUG -Xcc -fmodule-map-file\=/Users/admin/builder/spi-builder-workspace/.derivedData/Build/Intermediates.noindex/GeneratedModuleMaps-watchos/CNIOLLHTTP.modulemap -Xcc -fmodule-map-file\=/Users/admin/builder/spi-builder-workspace/.derivedData/Build/Intermediates.noindex/GeneratedModuleMaps-watchos/CNIOBoringSSLShims.modulemap -Xcc -fmodule-map-file\=/Users/admin/builder/spi-builder-workspace/.derivedData/Build/Intermediates.noindex/GeneratedModuleMaps-watchos/CNIOExtrasZlib.modulemap -Xcc -fmodule-map-file\=/Users/admin/builder/spi-builder-workspace/.derivedData/Build/Intermediates.noindex/GeneratedModuleMaps-watchos/CNIOWASI.modulemap -Xcc -fmodule-map-file\=/Users/admin/builder/spi-builder-workspace/.derivedData/Build/Intermediates.noindex/GeneratedModuleMaps-watchos/CNIOLinux.modulemap -Xcc -fmodule-map-file\=/Users/admin/builder/spi-builder-workspace/.derivedData/Build/Intermediates.noindex/GeneratedModuleMaps-watchos/CNIODarwin.modulemap -Xcc -fmodule-map-file\=/Users/admin/builder/spi-builder-workspace/.derivedData/Build/Intermediates.noindex/GeneratedModuleMaps-watchos/CNIOAtomics.modulemap -Xcc -fmodule-map-file\=/Users/admin/builder/spi-builder-workspace/.derivedData/Build/Intermediates.noindex/GeneratedModuleMaps-watchos/CAsyncHTTPClient.modulemap -DXcode -enable-upcoming-feature MemberImportVisibility -plugin-path /Applications/Xcode-16.3.0.app/Contents/Developer/Toolchains/XcodeDefault.xctoolchain/usr/lib/swift/host/plugins/testing -enable-experimental-feature DebugDescriptionMacro -sdk /Applications/Xcode-16.3.0.app/Contents/Developer/Platforms/WatchOS.platform/Developer/SDKs/WatchOS11.4.sdk -target arm64-apple-watchos5.0 -g -module-cache-path /Users/admin/builder/spi-builder-workspace/.derivedData/ModuleCache.noindex -Xfrontend -serialize-debugging-options -profile-coverage-mapping -profile-generate -enable-testing -suppress-warnings -index-store-path /Users/admin/builder/spi-builder-workspace/.derivedData/Index.noindex/DataStore -swift-version 5 -I /Users/admin/builder/spi-builder-workspace/.derivedData/Build/Products/Debug-watchos -I /Applications/Xcode-16.3.0.app/Contents/Developer/Platforms/WatchOS.platform/Developer/usr/lib -F /Users/admin/builder/spi-builder-workspace/.derivedData/Build/Products/Debug-watchos/PackageFrameworks -F /Users/admin/builder/spi-builder-workspace/.derivedData/Build/Products/Debug-watchos/PackageFrameworks -F /Users/admin/builder/spi-builder-workspace/.derivedData/Build/Products/Debug-watchos/PackageFrameworks -F /Users/admin/builder/spi-builder-workspace/.derivedData/Build/Products/Debug-watchos/PackageFrameworks -F /Users/admin/builder/spi-builder-workspace/.derivedData/Build/Products/Debug-watchos/PackageFrameworks -F /Users/admin/builder/spi-builder-workspace/.derivedData/Build/Products/Debug-watchos/PackageFrameworks -F /Users/admin/builder/spi-builder-workspace/.derivedData/Build/Products/Debug-watchos/PackageFrameworks -F /Users/admin/builder/spi-builder-workspace/.derivedData/Build/Products/Debug-watchos/PackageFrameworks -F /Users/admin/builder/spi-builder-workspace/.derivedData/Build/Products/Debug-watchos/PackageFrameworks -F /Users/admin/builder/spi-builder-workspace/.derivedData/Build/Products/Debug-watchos/PackageFrameworks -F /Users/admin/builder/spi-builder-workspace/.derivedData/Build/Products/Debug-watchos/PackageFrameworks -F /Users/admin/builder/spi-builder-workspace/.derivedData/Build/Products/Debug-watchos/PackageFrameworks -F /Users/admin/builder/spi-builder-workspace/.derivedData/Build/Products/Debug-watchos/PackageFrameworks -F /Users/admin/builder/spi-builder-workspace/.derivedData/Build/Products/Debug-watchos/PackageFrameworks -F /Users/admin/builder/spi-builder-workspace/.derivedData/Build/Products/Debug-watchos/PackageFrameworks -F /Users/admin/builder/spi-builder-workspace/.derivedData/Build/Products/Debug-watchos/PackageFrameworks -F /Users/admin/builder/spi-builder-workspace/.derivedData/Build/Products/Debug-watchos/PackageFrameworks -F /Users/admin/builder/spi-builder-workspace/.derivedData/Build/Products/Debug-watchos/PackageFrameworks -F /Users/admin/builder/spi-builder-workspace/.derivedData/Build/Products/Debug-watchos/PackageFrameworks -F /Users/admin/builder/spi-builder-workspace/.derivedData/Build/Products/Debug-watchos/PackageFrameworks -F /Users/admin/builder/spi-builder-workspace/.derivedData/Build/Products/Debug-watchos/PackageFrameworks -F /Users/admin/builder/spi-builder-workspace/.derivedData/Build/Products/Debug-watchos/PackageFrameworks -F /Users/admin/builder/spi-builder-workspace/.derivedData/Build/Products/Debug-watchos/PackageFrameworks -F /Users/admin/builder/spi-builder-workspace/.derivedData/Build/Products/Debug-watchos/PackageFrameworks -F /Users/admin/builder/spi-builder-workspace/.derivedData/Build/Products/Debug-watchos/PackageFrameworks -F /Users/admin/builder/spi-builder-workspace/.derivedData/Build/Products/Debug-watchos/PackageFrameworks -F /Users/admin/builder/spi-builder-workspace/.derivedData/Build/Products/Debug-watchos/PackageFrameworks -F /Users/admin/builder/spi-builder-workspace/.derivedData/Build/Products/Debug-watchos/PackageFrameworks -F /Users/admin/builder/spi-builder-workspace/.derivedData/Build/Products/Debug-watchos/PackageFrameworks -F /Users/admin/builder/spi-builder-workspace/.derivedData/Build/Products/Debug-watchos/PackageFrameworks -F /Users/admin/builder/spi-builder-workspace/.derivedData/Build/Products/Debug-watchos/PackageFrameworks -F /Users/admin/builder/spi-builder-workspace/.derivedData/Build/Products/Debug-watchos/PackageFrameworks -F /Users/admin/builder/spi-builder-workspace/.derivedData/Build/Products/Debug-watchos/PackageFrameworks -F /Users/admin/builder/spi-builder-workspace/.derivedData/Build/Products/Debug-watchos/PackageFrameworks -F /Users/admin/builder/spi-builder-workspace/.derivedData/Build/Products/Debug-watchos -F /Applications/Xcode-16.3.0.app/Contents/Developer/Platforms/WatchOS.platform/Developer/Library/Frameworks -F /Applications/Xcode-16.3.0.app/Contents/Developer/Platforms/WatchOS.platform/Developer/SDKs/WatchOS11.4.sdk/Developer/Library/Frameworks -c -j10 -enable-batch-mode -incremental -Xcc -ivfsstatcache -Xcc /Users/admin/builder/spi-builder-workspace/.derivedData/SDKStatCaches.noindex/watchos11.4-22T246-43efb940ff07ba2497b70ec94253f576.sdkstatcache -output-file-map /Users/admin/builder/spi-builder-workspace/.derivedData/Build/Intermediates.noindex/async-http-client.build/Debug-watchos/AsyncHTTPClient.build/Objects-normal/arm64/AsyncHTTPClient-OutputFileMap.json -use-frontend-parseable-output -save-temps -no-color-diagnostics -serialize-diagnostics -emit-dependencies -emit-module -emit-module-path /Users/admin/builder/spi-builder-workspace/.derivedData/Build/Intermediates.noindex/async-http-client.build/Debug-watchos/AsyncHTTPClient.build/Objects-normal/arm64/AsyncHTTPClient.swiftmodule -validate-clang-modules-once -clang-build-session-file /Users/admin/builder/spi-builder-workspace/.derivedData/ModuleCache.noindex/Session.modulevalidation -Xcc -I/Users/admin/builder/spi-builder-workspace/.derivedData/Build/Intermediates.noindex/async-http-client.build/Debug-watchos/AsyncHTTPClient.build/swift-overrides.hmap -emit-const-values -Xfrontend -const-gather-protocols-file -Xfrontend /Users/admin/builder/spi-builder-workspace/.derivedData/Build/Intermediates.noindex/async-http-client.build/Debug-watchos/AsyncHTTPClient.build/Objects-normal/arm64/AsyncHTTPClient_const_extract_protocols.json -Xcc -I/Users/admin/builder/spi-builder-workspace/.dependencies/checkouts/swift-nio/Sources/CNIOLLHTTP/include -Xcc -I/Users/admin/builder/spi-builder-workspace/.dependencies/checkouts/swift-nio-ssl/Sources/CNIOBoringSSLShims/include -Xcc -I/Users/admin/builder/spi-builder-workspace/.dependencies/checkouts/swift-nio-ssl/Sources/CNIOBoringSSL/include -Xcc -I/Users/admin/builder/spi-builder-workspace/.dependencies/checkouts/swift-nio-extras/Sources/CNIOExtrasZlib/include -Xcc -I/Users/admin/builder/spi-builder-workspace/.dependencies/checkouts/swift-nio/Sources/CNIOWASI/include -Xcc -I/Users/admin/builder/spi-builder-workspace/.dependencies/checkouts/swift-nio/Sources/CNIOWindows/include -Xcc -I/Users/admin/builder/spi-builder-workspace/.dependencies/checkouts/swift-nio/Sources/CNIOLinux/include -Xcc -I/Users/admin/builder/spi-builder-workspace/.dependencies/checkouts/swift-nio/Sources/CNIODarwin/include -Xcc -I/Users/admin/builder/spi-builder-workspace/.dependencies/checkouts/swift-nio/Sources/CNIOAtomics/include -Xcc -I/Users/admin/builder/spi-builder-workspace/.dependencies/checkouts/swift-atomics/Sources/_AtomicsShims/include -Xcc -I/Users/admin/builder/spi-builder-workspace/.dependencies/checkouts/swift-numerics/Sources/_NumericsShims/include -Xcc -I/Users/admin/builder/spi-builder-workspace/.dependencies/checkouts/async-http-client/Sources/CAsyncHTTPClient/include -Xcc -I/Users/admin/builder/spi-builder-workspace/.derivedData/Build/Products/Debug-watchos/include -Xcc -I/Users/admin/builder/spi-builder-workspace/.derivedData/Build/Intermediates.noindex/async-http-client.build/Debug-watchos/AsyncHTTPClient.build/DerivedSources-normal/arm64 -Xcc -I/Users/admin/builder/spi-builder-workspace/.derivedData/Build/Intermediates.noindex/async-http-client.build/Debug-watchos/AsyncHTTPClient.build/DerivedSources/arm64 -Xcc -I/Users/admin/builder/spi-builder-workspace/.derivedData/Build/Intermediates.noindex/async-http-client.build/Debug-watchos/AsyncHTTPClient.build/DerivedSources -Xcc -DSWIFT_PACKAGE -Xcc -DDEBUG\=1 -emit-objc-header -emit-objc-header-path /Users/admin/builder/spi-builder-workspace/.derivedData/Build/Intermediates.noindex/async-http-client.build/Debug-watchos/AsyncHTTPClient.build/Objects-normal/arm64/AsyncHTTPClient-Swift.h -working-directory /Users/admin/builder/spi-builder-workspace/.swiftpm/xcode -experimental-emit-module-separately -disable-cmo
SwiftCompile normal armv7k Compiling\ AlternateIDsResponse.swift,\ AutocompleteResult.swift /Users/admin/builder/spi-builder-workspace/Sources/AppleMapsKit/DTOs/AlternateIDsResponse.swift /Users/admin/builder/spi-builder-workspace/Sources/AppleMapsKit/DTOs/AutocompleteResult.swift (in target 'AppleMapsKit' from project 'apple-maps-kit')
SwiftCompile normal armv7k Compiling\ SearchResponse.swift /Users/admin/builder/spi-builder-workspace/Sources/AppleMapsKit/DTOs/SearchResponse.swift (in target 'AppleMapsKit' from project 'apple-maps-kit')
Command SwiftCompile failed with a nonzero exit code
** BUILD FAILED **
The following build commands failed:
SwiftCompile normal arm64 Compiling\ AppleMapsClient.swift,\ AppleMapsKitError.swift /Users/admin/builder/spi-builder-workspace/Sources/AppleMapsKit/AppleMapsClient.swift /Users/admin/builder/spi-builder-workspace/Sources/AppleMapsKit/AppleMapsKitError.swift (in target 'AppleMapsKit' from project 'apple-maps-kit')
SwiftCompile normal arm64 /Users/admin/builder/spi-builder-workspace/Sources/AppleMapsKit/AppleMapsClient.swift (in target 'AppleMapsKit' from project 'apple-maps-kit')
SwiftCompile normal armv7k Compiling\ SearchResponse.swift /Users/admin/builder/spi-builder-workspace/Sources/AppleMapsKit/DTOs/SearchResponse.swift (in target 'AppleMapsKit' from project 'apple-maps-kit')
Building workspace spi-builder-workspace with scheme apple-maps-kit
(4 failures)
BUILD FAILURE 6.1 watchOS