The Swift Package Index logo.Swift Package Index

Track the adoption of Swift 6 strict concurrency checks for data race safety. How many packages are Ready for Swift 6?

Build Information

Failed to build ShapeScript, reference 1.8.8 (52ef22), with Swift 6.1 for iOS using Xcode 16.3 on 1 May 2025 09:49:12 UTC.

Build Command

env DEVELOPER_DIR=/Applications/Xcode-16.3.0.app xcrun xcodebuild -IDEClonedSourcePackagesDirPathOverride=$PWD/.dependencies -skipMacroValidation -skipPackagePluginValidation -derivedDataPath $PWD/.derivedData build -scheme ShapeScript-Package -destination generic/platform=iOS

Build Log

WriteAuxiliaryFile /Users/admin/builder/spi-builder-workspace/.derivedData/Build/Intermediates.noindex/Euclid.build/Debug-iphoneos/Euclid.build/Objects-normal/arm64/Euclid.LinkFileList (in target 'Euclid' from project 'Euclid')
    cd /Users/admin/builder/spi-builder-workspace/.dependencies/checkouts/Euclid
    write-file /Users/admin/builder/spi-builder-workspace/.derivedData/Build/Intermediates.noindex/Euclid.build/Debug-iphoneos/Euclid.build/Objects-normal/arm64/Euclid.LinkFileList
WriteAuxiliaryFile /Users/admin/builder/spi-builder-workspace/.derivedData/Build/Intermediates.noindex/Euclid.build/Debug-iphoneos/Euclid.build/Objects-normal/arm64/Euclid.SwiftConstValuesFileList (in target 'Euclid' from project 'Euclid')
    cd /Users/admin/builder/spi-builder-workspace/.dependencies/checkouts/Euclid
    write-file /Users/admin/builder/spi-builder-workspace/.derivedData/Build/Intermediates.noindex/Euclid.build/Debug-iphoneos/Euclid.build/Objects-normal/arm64/Euclid.SwiftConstValuesFileList
WriteAuxiliaryFile /Users/admin/builder/spi-builder-workspace/.derivedData/Build/Intermediates.noindex/Euclid.build/Debug-iphoneos/Euclid.build/Objects-normal/arm64/Euclid_const_extract_protocols.json (in target 'Euclid' from project 'Euclid')
    cd /Users/admin/builder/spi-builder-workspace/.dependencies/checkouts/Euclid
    write-file /Users/admin/builder/spi-builder-workspace/.derivedData/Build/Intermediates.noindex/Euclid.build/Debug-iphoneos/Euclid.build/Objects-normal/arm64/Euclid_const_extract_protocols.json
WriteAuxiliaryFile /Users/admin/builder/spi-builder-workspace/.derivedData/Build/Intermediates.noindex/Euclid.build/Debug-iphoneos/Euclid.build/Objects-normal/arm64/Euclid.SwiftFileList (in target 'Euclid' from project 'Euclid')
    cd /Users/admin/builder/spi-builder-workspace/.dependencies/checkouts/Euclid
    write-file /Users/admin/builder/spi-builder-workspace/.derivedData/Build/Intermediates.noindex/Euclid.build/Debug-iphoneos/Euclid.build/Objects-normal/arm64/Euclid.SwiftFileList
WriteAuxiliaryFile /Users/admin/builder/spi-builder-workspace/.derivedData/Build/Intermediates.noindex/Euclid.build/Debug-iphoneos/Euclid.build/Objects-normal/arm64/Euclid-OutputFileMap.json (in target 'Euclid' from project 'Euclid')
    cd /Users/admin/builder/spi-builder-workspace/.dependencies/checkouts/Euclid
    write-file /Users/admin/builder/spi-builder-workspace/.derivedData/Build/Intermediates.noindex/Euclid.build/Debug-iphoneos/Euclid.build/Objects-normal/arm64/Euclid-OutputFileMap.json
WriteAuxiliaryFile /Users/admin/builder/spi-builder-workspace/.derivedData/Build/Intermediates.noindex/Euclid.build/Debug-iphoneos/Euclid.build/Euclid.modulemap (in target 'Euclid' from project 'Euclid')
    cd /Users/admin/builder/spi-builder-workspace/.dependencies/checkouts/Euclid
    write-file /Users/admin/builder/spi-builder-workspace/.derivedData/Build/Intermediates.noindex/Euclid.build/Debug-iphoneos/Euclid.build/Euclid.modulemap
WriteAuxiliaryFile /Users/admin/builder/spi-builder-workspace/.derivedData/Build/Intermediates.noindex/Euclid.build/Debug-iphoneos/Euclid.build/Euclid.DependencyStaticMetadataFileList (in target 'Euclid' from project 'Euclid')
    cd /Users/admin/builder/spi-builder-workspace/.dependencies/checkouts/Euclid
    write-file /Users/admin/builder/spi-builder-workspace/.derivedData/Build/Intermediates.noindex/Euclid.build/Debug-iphoneos/Euclid.build/Euclid.DependencyStaticMetadataFileList
WriteAuxiliaryFile /Users/admin/builder/spi-builder-workspace/.derivedData/Build/Intermediates.noindex/Euclid.build/Debug-iphoneos/Euclid.build/Euclid.DependencyMetadataFileList (in target 'Euclid' from project 'Euclid')
    cd /Users/admin/builder/spi-builder-workspace/.dependencies/checkouts/Euclid
    write-file /Users/admin/builder/spi-builder-workspace/.derivedData/Build/Intermediates.noindex/Euclid.build/Debug-iphoneos/Euclid.build/Euclid.DependencyMetadataFileList
Copy /Users/admin/builder/spi-builder-workspace/.derivedData/Build/Intermediates.noindex/GeneratedModuleMaps-iphoneos/LRUCache.modulemap /Users/admin/builder/spi-builder-workspace/.derivedData/Build/Intermediates.noindex/LRUCache.build/Debug-iphoneos/LRUCache.build/LRUCache.modulemap (in target 'LRUCache' from project 'LRUCache')
    cd /Users/admin/builder/spi-builder-workspace/.dependencies/checkouts/LRUCache
    builtin-copy -exclude .DS_Store -exclude CVS -exclude .svn -exclude .git -exclude .hg -resolve-src-symlinks /Users/admin/builder/spi-builder-workspace/.derivedData/Build/Intermediates.noindex/LRUCache.build/Debug-iphoneos/LRUCache.build/LRUCache.modulemap /Users/admin/builder/spi-builder-workspace/.derivedData/Build/Intermediates.noindex/GeneratedModuleMaps-iphoneos
Copy /Users/admin/builder/spi-builder-workspace/.derivedData/Build/Intermediates.noindex/GeneratedModuleMaps-iphoneos/Euclid.modulemap /Users/admin/builder/spi-builder-workspace/.derivedData/Build/Intermediates.noindex/Euclid.build/Debug-iphoneos/Euclid.build/Euclid.modulemap (in target 'Euclid' from project 'Euclid')
    cd /Users/admin/builder/spi-builder-workspace/.dependencies/checkouts/Euclid
    builtin-copy -exclude .DS_Store -exclude CVS -exclude .svn -exclude .git -exclude .hg -resolve-src-symlinks /Users/admin/builder/spi-builder-workspace/.derivedData/Build/Intermediates.noindex/Euclid.build/Debug-iphoneos/Euclid.build/Euclid.modulemap /Users/admin/builder/spi-builder-workspace/.derivedData/Build/Intermediates.noindex/GeneratedModuleMaps-iphoneos
SwiftDriver LRUCache normal arm64 com.apple.xcode.tools.swift.compiler (in target 'LRUCache' from project 'LRUCache')
    cd /Users/admin/builder/spi-builder-workspace/.swiftpm/xcode
    builtin-SwiftDriver -- /Applications/Xcode-16.3.0.app/Contents/Developer/Toolchains/XcodeDefault.xctoolchain/usr/bin/swiftc -module-name LRUCache -Onone -enforce-exclusivity\=checked @/Users/admin/builder/spi-builder-workspace/.derivedData/Build/Intermediates.noindex/LRUCache.build/Debug-iphoneos/LRUCache.build/Objects-normal/arm64/LRUCache.SwiftFileList -DSWIFT_PACKAGE -DDEBUG -stats-output-dir .stats -strict-concurrency\=complete -enable-upcoming-feature StrictConcurrency -enable-upcoming-feature DisableOutwardActorInference -enable-upcoming-feature GlobalActorIsolatedTypesUsability -enable-upcoming-feature InferSendableFromCaptures -plugin-path /Applications/Xcode-16.3.0.app/Contents/Developer/Toolchains/XcodeDefault.xctoolchain/usr/lib/swift/host/plugins/testing -enable-experimental-feature DebugDescriptionMacro -sdk /Applications/Xcode-16.3.0.app/Contents/Developer/Platforms/iPhoneOS.platform/Developer/SDKs/iPhoneOS18.4.sdk -target arm64-apple-ios12.0 -g -module-cache-path /Users/admin/builder/spi-builder-workspace/.derivedData/ModuleCache.noindex -Xfrontend -serialize-debugging-options -profile-coverage-mapping -profile-generate -enable-testing -suppress-warnings -index-store-path /Users/admin/builder/spi-builder-workspace/.derivedData/Index.noindex/DataStore -swift-version 5 -I /Users/admin/builder/spi-builder-workspace/.derivedData/Build/Products/Debug-iphoneos -I /Applications/Xcode-16.3.0.app/Contents/Developer/Platforms/iPhoneOS.platform/Developer/usr/lib -F /Users/admin/builder/spi-builder-workspace/.derivedData/Build/Products/Debug-iphoneos -F /Applications/Xcode-16.3.0.app/Contents/Developer/Platforms/iPhoneOS.platform/Developer/Library/Frameworks -F /Applications/Xcode-16.3.0.app/Contents/Developer/Platforms/iPhoneOS.platform/Developer/SDKs/iPhoneOS18.4.sdk/Developer/Library/Frameworks -parse-as-library -c -j10 -enable-batch-mode -incremental -Xcc -ivfsstatcache -Xcc /Users/admin/builder/spi-builder-workspace/.derivedData/SDKStatCaches.noindex/iphoneos18.4-22E235-339d34bc69d7fc736c3220795c36f340.sdkstatcache -output-file-map /Users/admin/builder/spi-builder-workspace/.derivedData/Build/Intermediates.noindex/LRUCache.build/Debug-iphoneos/LRUCache.build/Objects-normal/arm64/LRUCache-OutputFileMap.json -use-frontend-parseable-output -save-temps -no-color-diagnostics -serialize-diagnostics -emit-dependencies -emit-module -emit-module-path /Users/admin/builder/spi-builder-workspace/.derivedData/Build/Intermediates.noindex/LRUCache.build/Debug-iphoneos/LRUCache.build/Objects-normal/arm64/LRUCache.swiftmodule -validate-clang-modules-once -clang-build-session-file /Users/admin/builder/spi-builder-workspace/.derivedData/ModuleCache.noindex/Session.modulevalidation -Xcc -I/Users/admin/builder/spi-builder-workspace/.derivedData/Build/Intermediates.noindex/LRUCache.build/Debug-iphoneos/LRUCache.build/swift-overrides.hmap -emit-const-values -Xfrontend -const-gather-protocols-file -Xfrontend /Users/admin/builder/spi-builder-workspace/.derivedData/Build/Intermediates.noindex/LRUCache.build/Debug-iphoneos/LRUCache.build/Objects-normal/arm64/LRUCache_const_extract_protocols.json -Xcc -I/Users/admin/builder/spi-builder-workspace/.derivedData/Build/Products/Debug-iphoneos/include -Xcc -I/Users/admin/builder/spi-builder-workspace/.derivedData/Build/Intermediates.noindex/LRUCache.build/Debug-iphoneos/LRUCache.build/DerivedSources-normal/arm64 -Xcc -I/Users/admin/builder/spi-builder-workspace/.derivedData/Build/Intermediates.noindex/LRUCache.build/Debug-iphoneos/LRUCache.build/DerivedSources/arm64 -Xcc -I/Users/admin/builder/spi-builder-workspace/.derivedData/Build/Intermediates.noindex/LRUCache.build/Debug-iphoneos/LRUCache.build/DerivedSources -Xcc -DSWIFT_PACKAGE -Xcc -DDEBUG\=1 -emit-objc-header -emit-objc-header-path /Users/admin/builder/spi-builder-workspace/.derivedData/Build/Intermediates.noindex/LRUCache.build/Debug-iphoneos/LRUCache.build/Objects-normal/arm64/LRUCache-Swift.h -working-directory /Users/admin/builder/spi-builder-workspace/.swiftpm/xcode -experimental-emit-module-separately -disable-cmo
SwiftDriver SVGPath normal arm64 com.apple.xcode.tools.swift.compiler (in target 'SVGPath' from project 'SVGPath')
    cd /Users/admin/builder/spi-builder-workspace/.swiftpm/xcode
    builtin-SwiftDriver -- /Applications/Xcode-16.3.0.app/Contents/Developer/Toolchains/XcodeDefault.xctoolchain/usr/bin/swiftc -module-name SVGPath -Onone -enforce-exclusivity\=checked @/Users/admin/builder/spi-builder-workspace/.derivedData/Build/Intermediates.noindex/SVGPath.build/Debug-iphoneos/SVGPath.build/Objects-normal/arm64/SVGPath.SwiftFileList -DSWIFT_PACKAGE -DDEBUG -stats-output-dir .stats -strict-concurrency\=complete -enable-upcoming-feature StrictConcurrency -enable-upcoming-feature DisableOutwardActorInference -enable-upcoming-feature GlobalActorIsolatedTypesUsability -enable-upcoming-feature InferSendableFromCaptures -plugin-path /Applications/Xcode-16.3.0.app/Contents/Developer/Toolchains/XcodeDefault.xctoolchain/usr/lib/swift/host/plugins/testing -enable-experimental-feature DebugDescriptionMacro -sdk /Applications/Xcode-16.3.0.app/Contents/Developer/Platforms/iPhoneOS.platform/Developer/SDKs/iPhoneOS18.4.sdk -target arm64-apple-ios12.0 -g -module-cache-path /Users/admin/builder/spi-builder-workspace/.derivedData/ModuleCache.noindex -Xfrontend -serialize-debugging-options -profile-coverage-mapping -profile-generate -enable-testing -suppress-warnings -index-store-path /Users/admin/builder/spi-builder-workspace/.derivedData/Index.noindex/DataStore -swift-version 5 -I /Users/admin/builder/spi-builder-workspace/.derivedData/Build/Products/Debug-iphoneos -I /Applications/Xcode-16.3.0.app/Contents/Developer/Platforms/iPhoneOS.platform/Developer/usr/lib -F /Users/admin/builder/spi-builder-workspace/.derivedData/Build/Products/Debug-iphoneos -F /Applications/Xcode-16.3.0.app/Contents/Developer/Platforms/iPhoneOS.platform/Developer/Library/Frameworks -F /Applications/Xcode-16.3.0.app/Contents/Developer/Platforms/iPhoneOS.platform/Developer/SDKs/iPhoneOS18.4.sdk/Developer/Library/Frameworks -c -j10 -enable-batch-mode -incremental -Xcc -ivfsstatcache -Xcc /Users/admin/builder/spi-builder-workspace/.derivedData/SDKStatCaches.noindex/iphoneos18.4-22E235-339d34bc69d7fc736c3220795c36f340.sdkstatcache -output-file-map /Users/admin/builder/spi-builder-workspace/.derivedData/Build/Intermediates.noindex/SVGPath.build/Debug-iphoneos/SVGPath.build/Objects-normal/arm64/SVGPath-OutputFileMap.json -use-frontend-parseable-output -save-temps -no-color-diagnostics -serialize-diagnostics -emit-dependencies -emit-module -emit-module-path /Users/admin/builder/spi-builder-workspace/.derivedData/Build/Intermediates.noindex/SVGPath.build/Debug-iphoneos/SVGPath.build/Objects-normal/arm64/SVGPath.swiftmodule -validate-clang-modules-once -clang-build-session-file /Users/admin/builder/spi-builder-workspace/.derivedData/ModuleCache.noindex/Session.modulevalidation -Xcc -I/Users/admin/builder/spi-builder-workspace/.derivedData/Build/Intermediates.noindex/SVGPath.build/Debug-iphoneos/SVGPath.build/swift-overrides.hmap -emit-const-values -Xfrontend -const-gather-protocols-file -Xfrontend /Users/admin/builder/spi-builder-workspace/.derivedData/Build/Intermediates.noindex/SVGPath.build/Debug-iphoneos/SVGPath.build/Objects-normal/arm64/SVGPath_const_extract_protocols.json -Xcc -I/Users/admin/builder/spi-builder-workspace/.derivedData/Build/Products/Debug-iphoneos/include -Xcc -I/Users/admin/builder/spi-builder-workspace/.derivedData/Build/Intermediates.noindex/SVGPath.build/Debug-iphoneos/SVGPath.build/DerivedSources-normal/arm64 -Xcc -I/Users/admin/builder/spi-builder-workspace/.derivedData/Build/Intermediates.noindex/SVGPath.build/Debug-iphoneos/SVGPath.build/DerivedSources/arm64 -Xcc -I/Users/admin/builder/spi-builder-workspace/.derivedData/Build/Intermediates.noindex/SVGPath.build/Debug-iphoneos/SVGPath.build/DerivedSources -Xcc -DSWIFT_PACKAGE -Xcc -DDEBUG\=1 -emit-objc-header -emit-objc-header-path /Users/admin/builder/spi-builder-workspace/.derivedData/Build/Intermediates.noindex/SVGPath.build/Debug-iphoneos/SVGPath.build/Objects-normal/arm64/SVGPath-Swift.h -working-directory /Users/admin/builder/spi-builder-workspace/.swiftpm/xcode -experimental-emit-module-separately -disable-cmo
SwiftDriver Euclid normal arm64 com.apple.xcode.tools.swift.compiler (in target 'Euclid' from project 'Euclid')
    cd /Users/admin/builder/spi-builder-workspace/.swiftpm/xcode
    builtin-SwiftDriver -- /Applications/Xcode-16.3.0.app/Contents/Developer/Toolchains/XcodeDefault.xctoolchain/usr/bin/swiftc -module-name Euclid -Onone -enforce-exclusivity\=checked @/Users/admin/builder/spi-builder-workspace/.derivedData/Build/Intermediates.noindex/Euclid.build/Debug-iphoneos/Euclid.build/Objects-normal/arm64/Euclid.SwiftFileList -DSWIFT_PACKAGE -DDEBUG -stats-output-dir .stats -strict-concurrency\=complete -enable-upcoming-feature StrictConcurrency -enable-upcoming-feature DisableOutwardActorInference -enable-upcoming-feature GlobalActorIsolatedTypesUsability -enable-upcoming-feature InferSendableFromCaptures -plugin-path /Applications/Xcode-16.3.0.app/Contents/Developer/Toolchains/XcodeDefault.xctoolchain/usr/lib/swift/host/plugins/testing -enable-experimental-feature DebugDescriptionMacro -sdk /Applications/Xcode-16.3.0.app/Contents/Developer/Platforms/iPhoneOS.platform/Developer/SDKs/iPhoneOS18.4.sdk -target arm64-apple-ios12.0 -g -module-cache-path /Users/admin/builder/spi-builder-workspace/.derivedData/ModuleCache.noindex -Xfrontend -serialize-debugging-options -profile-coverage-mapping -profile-generate -enable-testing -suppress-warnings -index-store-path /Users/admin/builder/spi-builder-workspace/.derivedData/Index.noindex/DataStore -swift-version 5 -I /Users/admin/builder/spi-builder-workspace/.derivedData/Build/Products/Debug-iphoneos -I /Applications/Xcode-16.3.0.app/Contents/Developer/Platforms/iPhoneOS.platform/Developer/usr/lib -F /Users/admin/builder/spi-builder-workspace/.derivedData/Build/Products/Debug-iphoneos -F /Applications/Xcode-16.3.0.app/Contents/Developer/Platforms/iPhoneOS.platform/Developer/Library/Frameworks -F /Applications/Xcode-16.3.0.app/Contents/Developer/Platforms/iPhoneOS.platform/Developer/SDKs/iPhoneOS18.4.sdk/Developer/Library/Frameworks -c -j10 -enable-batch-mode -incremental -Xcc -ivfsstatcache -Xcc /Users/admin/builder/spi-builder-workspace/.derivedData/SDKStatCaches.noindex/iphoneos18.4-22E235-339d34bc69d7fc736c3220795c36f340.sdkstatcache -output-file-map /Users/admin/builder/spi-builder-workspace/.derivedData/Build/Intermediates.noindex/Euclid.build/Debug-iphoneos/Euclid.build/Objects-normal/arm64/Euclid-OutputFileMap.json -use-frontend-parseable-output -save-temps -no-color-diagnostics -serialize-diagnostics -emit-dependencies -emit-module -emit-module-path /Users/admin/builder/spi-builder-workspace/.derivedData/Build/Intermediates.noindex/Euclid.build/Debug-iphoneos/Euclid.build/Objects-normal/arm64/Euclid.swiftmodule -validate-clang-modules-once -clang-build-session-file /Users/admin/builder/spi-builder-workspace/.derivedData/ModuleCache.noindex/Session.modulevalidation -Xcc -I/Users/admin/builder/spi-builder-workspace/.derivedData/Build/Intermediates.noindex/Euclid.build/Debug-iphoneos/Euclid.build/swift-overrides.hmap -emit-const-values -Xfrontend -const-gather-protocols-file -Xfrontend /Users/admin/builder/spi-builder-workspace/.derivedData/Build/Intermediates.noindex/Euclid.build/Debug-iphoneos/Euclid.build/Objects-normal/arm64/Euclid_const_extract_protocols.json -Xcc -I/Users/admin/builder/spi-builder-workspace/.derivedData/Build/Products/Debug-iphoneos/include -Xcc -I/Users/admin/builder/spi-builder-workspace/.derivedData/Build/Intermediates.noindex/Euclid.build/Debug-iphoneos/Euclid.build/DerivedSources-normal/arm64 -Xcc -I/Users/admin/builder/spi-builder-workspace/.derivedData/Build/Intermediates.noindex/Euclid.build/Debug-iphoneos/Euclid.build/DerivedSources/arm64 -Xcc -I/Users/admin/builder/spi-builder-workspace/.derivedData/Build/Intermediates.noindex/Euclid.build/Debug-iphoneos/Euclid.build/DerivedSources -Xcc -DSWIFT_PACKAGE -Xcc -DDEBUG\=1 -emit-objc-header -emit-objc-header-path /Users/admin/builder/spi-builder-workspace/.derivedData/Build/Intermediates.noindex/Euclid.build/Debug-iphoneos/Euclid.build/Objects-normal/arm64/Euclid-Swift.h -working-directory /Users/admin/builder/spi-builder-workspace/.swiftpm/xcode -experimental-emit-module-separately -disable-cmo
SwiftEmitModule normal arm64 Emitting\ module\ for\ SVGPath (in target 'SVGPath' from project 'SVGPath')
EmitSwiftModule normal arm64 (in target 'SVGPath' from project 'SVGPath')
    cd /Users/admin/builder/spi-builder-workspace/.swiftpm/xcode

SwiftEmitModule normal arm64 Emitting\ module\ for\ LRUCache (in target 'LRUCache' from project 'LRUCache')
SwiftCompile normal arm64 /Users/admin/builder/spi-builder-workspace/.dependencies/checkouts/LRUCache/Sources/LRUCache.swift (in target 'LRUCache' from project 'LRUCache')
    cd /Users/admin/builder/spi-builder-workspace/.swiftpm/xcode

SwiftCompile normal arm64 Compiling\ SVGPath+CoreGraphics.swift /Users/admin/builder/spi-builder-workspace/.dependencies/checkouts/SVGPath/Sources/SVGPath+CoreGraphics.swift (in target 'SVGPath' from project 'SVGPath')
SwiftCompile normal arm64 /Users/admin/builder/spi-builder-workspace/.dependencies/checkouts/SVGPath/Sources/SVGPath+CoreGraphics.swift (in target 'SVGPath' from project 'SVGPath')
    cd /Users/admin/builder/spi-builder-workspace/.swiftpm/xcode

SwiftCompile normal arm64 Compiling\ SVGPath.swift /Users/admin/builder/spi-builder-workspace/.dependencies/checkouts/SVGPath/Sources/SVGPath.swift (in target 'SVGPath' from project 'SVGPath')
SwiftCompile normal arm64 /Users/admin/builder/spi-builder-workspace/.dependencies/checkouts/SVGPath/Sources/SVGPath.swift (in target 'SVGPath' from project 'SVGPath')
    cd /Users/admin/builder/spi-builder-workspace/.swiftpm/xcode

SwiftCompile normal arm64 Compiling\ LRUCache.swift /Users/admin/builder/spi-builder-workspace/.dependencies/checkouts/LRUCache/Sources/LRUCache.swift (in target 'LRUCache' from project 'LRUCache')
SwiftCompile normal arm64 /Users/admin/builder/spi-builder-workspace/.dependencies/checkouts/LRUCache/Sources/LRUCache.swift (in target 'LRUCache' from project 'LRUCache')
    cd /Users/admin/builder/spi-builder-workspace/.swiftpm/xcode

SwiftCompile normal arm64 Compiling\ Euclid+SIMD.swift,\ Euclid+SceneKit.swift,\ Euclid+UIKit.swift,\ Line.swift /Users/admin/builder/spi-builder-workspace/.dependencies/checkouts/Euclid/Sources/Euclid+SIMD.swift /Users/admin/builder/spi-builder-workspace/.dependencies/checkouts/Euclid/Sources/Euclid+SceneKit.swift /Users/admin/builder/spi-builder-workspace/.dependencies/checkouts/Euclid/Sources/Euclid+UIKit.swift /Users/admin/builder/spi-builder-workspace/.dependencies/checkouts/Euclid/Sources/Line.swift (in target 'Euclid' from project 'Euclid')
SwiftCompile normal arm64 /Users/admin/builder/spi-builder-workspace/.dependencies/checkouts/Euclid/Sources/Euclid+SIMD.swift (in target 'Euclid' from project 'Euclid')
    cd /Users/admin/builder/spi-builder-workspace/.swiftpm/xcode

SwiftCompile normal arm64 /Users/admin/builder/spi-builder-workspace/.dependencies/checkouts/Euclid/Sources/Euclid+SceneKit.swift (in target 'Euclid' from project 'Euclid')
    cd /Users/admin/builder/spi-builder-workspace/.swiftpm/xcode

SwiftCompile normal arm64 /Users/admin/builder/spi-builder-workspace/.dependencies/checkouts/Euclid/Sources/Euclid+UIKit.swift (in target 'Euclid' from project 'Euclid')
    cd /Users/admin/builder/spi-builder-workspace/.swiftpm/xcode

SwiftCompile normal arm64 /Users/admin/builder/spi-builder-workspace/.dependencies/checkouts/Euclid/Sources/Line.swift (in target 'Euclid' from project 'Euclid')
    cd /Users/admin/builder/spi-builder-workspace/.swiftpm/xcode

SwiftEmitModule normal arm64 Emitting\ module\ for\ Euclid (in target 'Euclid' from project 'Euclid')
EmitSwiftModule normal arm64 (in target 'Euclid' from project 'Euclid')
    cd /Users/admin/builder/spi-builder-workspace/.swiftpm/xcode

SwiftCompile normal arm64 Compiling\ Mesh+OBJ.swift,\ Mesh+STL.swift,\ Mesh+Shapes.swift /Users/admin/builder/spi-builder-workspace/.dependencies/checkouts/Euclid/Sources/Mesh+OBJ.swift /Users/admin/builder/spi-builder-workspace/.dependencies/checkouts/Euclid/Sources/Mesh+STL.swift /Users/admin/builder/spi-builder-workspace/.dependencies/checkouts/Euclid/Sources/Mesh+Shapes.swift (in target 'Euclid' from project 'Euclid')
SwiftCompile normal arm64 /Users/admin/builder/spi-builder-workspace/.dependencies/checkouts/Euclid/Sources/Mesh+OBJ.swift (in target 'Euclid' from project 'Euclid')
    cd /Users/admin/builder/spi-builder-workspace/.swiftpm/xcode

SwiftCompile normal arm64 /Users/admin/builder/spi-builder-workspace/.dependencies/checkouts/Euclid/Sources/Mesh+STL.swift (in target 'Euclid' from project 'Euclid')
    cd /Users/admin/builder/spi-builder-workspace/.swiftpm/xcode

SwiftCompile normal arm64 /Users/admin/builder/spi-builder-workspace/.dependencies/checkouts/Euclid/Sources/Mesh+Shapes.swift (in target 'Euclid' from project 'Euclid')
    cd /Users/admin/builder/spi-builder-workspace/.swiftpm/xcode

SwiftCompile normal arm64 Compiling\ Rotation.swift,\ Stretchable.swift,\ Transforms.swift /Users/admin/builder/spi-builder-workspace/.dependencies/checkouts/Euclid/Sources/Rotation.swift /Users/admin/builder/spi-builder-workspace/.dependencies/checkouts/Euclid/Sources/Stretchable.swift /Users/admin/builder/spi-builder-workspace/.dependencies/checkouts/Euclid/Sources/Transforms.swift (in target 'Euclid' from project 'Euclid')
SwiftCompile normal arm64 /Users/admin/builder/spi-builder-workspace/.dependencies/checkouts/Euclid/Sources/Rotation.swift (in target 'Euclid' from project 'Euclid')
    cd /Users/admin/builder/spi-builder-workspace/.swiftpm/xcode

SwiftCompile normal arm64 /Users/admin/builder/spi-builder-workspace/.dependencies/checkouts/Euclid/Sources/Stretchable.swift (in target 'Euclid' from project 'Euclid')
    cd /Users/admin/builder/spi-builder-workspace/.swiftpm/xcode

SwiftCompile normal arm64 /Users/admin/builder/spi-builder-workspace/.dependencies/checkouts/Euclid/Sources/Transforms.swift (in target 'Euclid' from project 'Euclid')
    cd /Users/admin/builder/spi-builder-workspace/.swiftpm/xcode

SwiftCompile normal arm64 Compiling\ Mesh+Texcoords.swift,\ Mesh.swift,\ Path+Shapes.swift /Users/admin/builder/spi-builder-workspace/.dependencies/checkouts/Euclid/Sources/Mesh+Texcoords.swift /Users/admin/builder/spi-builder-workspace/.dependencies/checkouts/Euclid/Sources/Mesh.swift /Users/admin/builder/spi-builder-workspace/.dependencies/checkouts/Euclid/Sources/Path+Shapes.swift (in target 'Euclid' from project 'Euclid')
SwiftCompile normal arm64 /Users/admin/builder/spi-builder-workspace/.dependencies/checkouts/Euclid/Sources/Mesh+Texcoords.swift (in target 'Euclid' from project 'Euclid')
    cd /Users/admin/builder/spi-builder-workspace/.swiftpm/xcode

SwiftCompile normal arm64 /Users/admin/builder/spi-builder-workspace/.dependencies/checkouts/Euclid/Sources/Mesh.swift (in target 'Euclid' from project 'Euclid')
    cd /Users/admin/builder/spi-builder-workspace/.swiftpm/xcode

SwiftCompile normal arm64 /Users/admin/builder/spi-builder-workspace/.dependencies/checkouts/Euclid/Sources/Path+Shapes.swift (in target 'Euclid' from project 'Euclid')
    cd /Users/admin/builder/spi-builder-workspace/.swiftpm/xcode

SwiftCompile normal arm64 Compiling\ LineSegment+CSG.swift,\ LineSegment.swift,\ Mesh+CSG.swift,\ Mesh+IO.swift /Users/admin/builder/spi-builder-workspace/.dependencies/checkouts/Euclid/Sources/LineSegment+CSG.swift /Users/admin/builder/spi-builder-workspace/.dependencies/checkouts/Euclid/Sources/LineSegment.swift /Users/admin/builder/spi-builder-workspace/.dependencies/checkouts/Euclid/Sources/Mesh+CSG.swift /Users/admin/builder/spi-builder-workspace/.dependencies/checkouts/Euclid/Sources/Mesh+IO.swift (in target 'Euclid' from project 'Euclid')
SwiftCompile normal arm64 /Users/admin/builder/spi-builder-workspace/.dependencies/checkouts/Euclid/Sources/LineSegment+CSG.swift (in target 'Euclid' from project 'Euclid')
    cd /Users/admin/builder/spi-builder-workspace/.swiftpm/xcode

SwiftCompile normal arm64 /Users/admin/builder/spi-builder-workspace/.dependencies/checkouts/Euclid/Sources/LineSegment.swift (in target 'Euclid' from project 'Euclid')
    cd /Users/admin/builder/spi-builder-workspace/.swiftpm/xcode

SwiftCompile normal arm64 /Users/admin/builder/spi-builder-workspace/.dependencies/checkouts/Euclid/Sources/Mesh+CSG.swift (in target 'Euclid' from project 'Euclid')
    cd /Users/admin/builder/spi-builder-workspace/.swiftpm/xcode

SwiftCompile normal arm64 /Users/admin/builder/spi-builder-workspace/.dependencies/checkouts/Euclid/Sources/Mesh+IO.swift (in target 'Euclid' from project 'Euclid')
    cd /Users/admin/builder/spi-builder-workspace/.swiftpm/xcode

SwiftDriverJobDiscovery normal arm64 Emitting module for SVGPath (in target 'SVGPath' from project 'SVGPath')
SwiftDriver\ Compilation\ Requirements SVGPath normal arm64 com.apple.xcode.tools.swift.compiler (in target 'SVGPath' from project 'SVGPath')
    cd /Users/admin/builder/spi-builder-workspace/.swiftpm/xcode
    builtin-Swift-Compilation-Requirements -- /Applications/Xcode-16.3.0.app/Contents/Developer/Toolchains/XcodeDefault.xctoolchain/usr/bin/swiftc -module-name SVGPath -Onone -enforce-exclusivity\=checked @/Users/admin/builder/spi-builder-workspace/.derivedData/Build/Intermediates.noindex/SVGPath.build/Debug-iphoneos/SVGPath.build/Objects-normal/arm64/SVGPath.SwiftFileList -DSWIFT_PACKAGE -DDEBUG -stats-output-dir .stats -strict-concurrency\=complete -enable-upcoming-feature StrictConcurrency -enable-upcoming-feature DisableOutwardActorInference -enable-upcoming-feature GlobalActorIsolatedTypesUsability -enable-upcoming-feature InferSendableFromCaptures -plugin-path /Applications/Xcode-16.3.0.app/Contents/Developer/Toolchains/XcodeDefault.xctoolchain/usr/lib/swift/host/plugins/testing -enable-experimental-feature DebugDescriptionMacro -sdk /Applications/Xcode-16.3.0.app/Contents/Developer/Platforms/iPhoneOS.platform/Developer/SDKs/iPhoneOS18.4.sdk -target arm64-apple-ios12.0 -g -module-cache-path /Users/admin/builder/spi-builder-workspace/.derivedData/ModuleCache.noindex -Xfrontend -serialize-debugging-options -profile-coverage-mapping -profile-generate -enable-testing -suppress-warnings -index-store-path /Users/admin/builder/spi-builder-workspace/.derivedData/Index.noindex/DataStore -swift-version 5 -I /Users/admin/builder/spi-builder-workspace/.derivedData/Build/Products/Debug-iphoneos -I /Applications/Xcode-16.3.0.app/Contents/Developer/Platforms/iPhoneOS.platform/Developer/usr/lib -F /Users/admin/builder/spi-builder-workspace/.derivedData/Build/Products/Debug-iphoneos -F /Applications/Xcode-16.3.0.app/Contents/Developer/Platforms/iPhoneOS.platform/Developer/Library/Frameworks -F /Applications/Xcode-16.3.0.app/Contents/Developer/Platforms/iPhoneOS.platform/Developer/SDKs/iPhoneOS18.4.sdk/Developer/Library/Frameworks -c -j10 -enable-batch-mode -incremental -Xcc -ivfsstatcache -Xcc /Users/admin/builder/spi-builder-workspace/.derivedData/SDKStatCaches.noindex/iphoneos18.4-22E235-339d34bc69d7fc736c3220795c36f340.sdkstatcache -output-file-map /Users/admin/builder/spi-builder-workspace/.derivedData/Build/Intermediates.noindex/SVGPath.build/Debug-iphoneos/SVGPath.build/Objects-normal/arm64/SVGPath-OutputFileMap.json -use-frontend-parseable-output -save-temps -no-color-diagnostics -serialize-diagnostics -emit-dependencies -emit-module -emit-module-path /Users/admin/builder/spi-builder-workspace/.derivedData/Build/Intermediates.noindex/SVGPath.build/Debug-iphoneos/SVGPath.build/Objects-normal/arm64/SVGPath.swiftmodule -validate-clang-modules-once -clang-build-session-file /Users/admin/builder/spi-builder-workspace/.derivedData/ModuleCache.noindex/Session.modulevalidation -Xcc -I/Users/admin/builder/spi-builder-workspace/.derivedData/Build/Intermediates.noindex/SVGPath.build/Debug-iphoneos/SVGPath.build/swift-overrides.hmap -emit-const-values -Xfrontend -const-gather-protocols-file -Xfrontend /Users/admin/builder/spi-builder-workspace/.derivedData/Build/Intermediates.noindex/SVGPath.build/Debug-iphoneos/SVGPath.build/Objects-normal/arm64/SVGPath_const_extract_protocols.json -Xcc -I/Users/admin/builder/spi-builder-workspace/.derivedData/Build/Products/Debug-iphoneos/include -Xcc -I/Users/admin/builder/spi-builder-workspace/.derivedData/Build/Intermediates.noindex/SVGPath.build/Debug-iphoneos/SVGPath.build/DerivedSources-normal/arm64 -Xcc -I/Users/admin/builder/spi-builder-workspace/.derivedData/Build/Intermediates.noindex/SVGPath.build/Debug-iphoneos/SVGPath.build/DerivedSources/arm64 -Xcc -I/Users/admin/builder/spi-builder-workspace/.derivedData/Build/Intermediates.noindex/SVGPath.build/Debug-iphoneos/SVGPath.build/DerivedSources -Xcc -DSWIFT_PACKAGE -Xcc -DDEBUG\=1 -emit-objc-header -emit-objc-header-path /Users/admin/builder/spi-builder-workspace/.derivedData/Build/Intermediates.noindex/SVGPath.build/Debug-iphoneos/SVGPath.build/Objects-normal/arm64/SVGPath-Swift.h -working-directory /Users/admin/builder/spi-builder-workspace/.swiftpm/xcode -experimental-emit-module-separately -disable-cmo
SwiftDriverJobDiscovery normal arm64 Compiling SVGPath.swift (in target 'SVGPath' from project 'SVGPath')
SwiftCompile normal arm64 Compiling\ Path.swift,\ PathPoint.swift,\ Plane.swift /Users/admin/builder/spi-builder-workspace/.dependencies/checkouts/Euclid/Sources/Path.swift /Users/admin/builder/spi-builder-workspace/.dependencies/checkouts/Euclid/Sources/PathPoint.swift /Users/admin/builder/spi-builder-workspace/.dependencies/checkouts/Euclid/Sources/Plane.swift (in target 'Euclid' from project 'Euclid')
SwiftCompile normal arm64 /Users/admin/builder/spi-builder-workspace/.dependencies/checkouts/Euclid/Sources/Path.swift (in target 'Euclid' from project 'Euclid')
    cd /Users/admin/builder/spi-builder-workspace/.swiftpm/xcode

SwiftCompile normal arm64 /Users/admin/builder/spi-builder-workspace/.dependencies/checkouts/Euclid/Sources/PathPoint.swift (in target 'Euclid' from project 'Euclid')
    cd /Users/admin/builder/spi-builder-workspace/.swiftpm/xcode

SwiftCompile normal arm64 /Users/admin/builder/spi-builder-workspace/.dependencies/checkouts/Euclid/Sources/Plane.swift (in target 'Euclid' from project 'Euclid')
    cd /Users/admin/builder/spi-builder-workspace/.swiftpm/xcode

SwiftMergeGeneratedHeaders /Users/admin/builder/spi-builder-workspace/.derivedData/Build/Intermediates.noindex/GeneratedModuleMaps-iphoneos/SVGPath-Swift.h /Users/admin/builder/spi-builder-workspace/.derivedData/Build/Intermediates.noindex/SVGPath.build/Debug-iphoneos/SVGPath.build/Objects-normal/arm64/SVGPath-Swift.h (in target 'SVGPath' from project 'SVGPath')
    cd /Users/admin/builder/spi-builder-workspace/.dependencies/checkouts/SVGPath
    builtin-swiftHeaderTool -arch arm64 /Users/admin/builder/spi-builder-workspace/.derivedData/Build/Intermediates.noindex/SVGPath.build/Debug-iphoneos/SVGPath.build/Objects-normal/arm64/SVGPath-Swift.h -o /Users/admin/builder/spi-builder-workspace/.derivedData/Build/Intermediates.noindex/GeneratedModuleMaps-iphoneos/SVGPath-Swift.h
SwiftDriverJobDiscovery normal arm64 Compiling SVGPath+CoreGraphics.swift (in target 'SVGPath' from project 'SVGPath')
Copy /Users/admin/builder/spi-builder-workspace/.derivedData/Build/Products/Debug-iphoneos/SVGPath.swiftmodule/arm64-apple-ios.swiftmodule /Users/admin/builder/spi-builder-workspace/.derivedData/Build/Intermediates.noindex/SVGPath.build/Debug-iphoneos/SVGPath.build/Objects-normal/arm64/SVGPath.swiftmodule (in target 'SVGPath' from project 'SVGPath')
    cd /Users/admin/builder/spi-builder-workspace/.dependencies/checkouts/SVGPath
    builtin-copy -exclude .DS_Store -exclude CVS -exclude .svn -exclude .git -exclude .hg -resolve-src-symlinks -rename /Users/admin/builder/spi-builder-workspace/.derivedData/Build/Intermediates.noindex/SVGPath.build/Debug-iphoneos/SVGPath.build/Objects-normal/arm64/SVGPath.swiftmodule /Users/admin/builder/spi-builder-workspace/.derivedData/Build/Products/Debug-iphoneos/SVGPath.swiftmodule/arm64-apple-ios.swiftmodule
Copy /Users/admin/builder/spi-builder-workspace/.derivedData/Build/Products/Debug-iphoneos/SVGPath.swiftmodule/arm64-apple-ios.swiftdoc /Users/admin/builder/spi-builder-workspace/.derivedData/Build/Intermediates.noindex/SVGPath.build/Debug-iphoneos/SVGPath.build/Objects-normal/arm64/SVGPath.swiftdoc (in target 'SVGPath' from project 'SVGPath')
    cd /Users/admin/builder/spi-builder-workspace/.dependencies/checkouts/SVGPath
    builtin-copy -exclude .DS_Store -exclude CVS -exclude .svn -exclude .git -exclude .hg -resolve-src-symlinks -rename /Users/admin/builder/spi-builder-workspace/.derivedData/Build/Intermediates.noindex/SVGPath.build/Debug-iphoneos/SVGPath.build/Objects-normal/arm64/SVGPath.swiftdoc /Users/admin/builder/spi-builder-workspace/.derivedData/Build/Products/Debug-iphoneos/SVGPath.swiftmodule/arm64-apple-ios.swiftdoc
Copy /Users/admin/builder/spi-builder-workspace/.derivedData/Build/Products/Debug-iphoneos/SVGPath.swiftmodule/arm64-apple-ios.abi.json /Users/admin/builder/spi-builder-workspace/.derivedData/Build/Intermediates.noindex/SVGPath.build/Debug-iphoneos/SVGPath.build/Objects-normal/arm64/SVGPath.abi.json (in target 'SVGPath' from project 'SVGPath')
    cd /Users/admin/builder/spi-builder-workspace/.dependencies/checkouts/SVGPath
    builtin-copy -exclude .DS_Store -exclude CVS -exclude .svn -exclude .git -exclude .hg -resolve-src-symlinks -rename /Users/admin/builder/spi-builder-workspace/.derivedData/Build/Intermediates.noindex/SVGPath.build/Debug-iphoneos/SVGPath.build/Objects-normal/arm64/SVGPath.abi.json /Users/admin/builder/spi-builder-workspace/.derivedData/Build/Products/Debug-iphoneos/SVGPath.swiftmodule/arm64-apple-ios.abi.json
Copy /Users/admin/builder/spi-builder-workspace/.derivedData/Build/Products/Debug-iphoneos/SVGPath.swiftmodule/Project/arm64-apple-ios.swiftsourceinfo /Users/admin/builder/spi-builder-workspace/.derivedData/Build/Intermediates.noindex/SVGPath.build/Debug-iphoneos/SVGPath.build/Objects-normal/arm64/SVGPath.swiftsourceinfo (in target 'SVGPath' from project 'SVGPath')
    cd /Users/admin/builder/spi-builder-workspace/.dependencies/checkouts/SVGPath
    builtin-copy -exclude .DS_Store -exclude CVS -exclude .svn -exclude .git -exclude .hg -resolve-src-symlinks -rename /Users/admin/builder/spi-builder-workspace/.derivedData/Build/Intermediates.noindex/SVGPath.build/Debug-iphoneos/SVGPath.build/Objects-normal/arm64/SVGPath.swiftsourceinfo /Users/admin/builder/spi-builder-workspace/.derivedData/Build/Products/Debug-iphoneos/SVGPath.swiftmodule/Project/arm64-apple-ios.swiftsourceinfo
SwiftDriver\ Compilation SVGPath normal arm64 com.apple.xcode.tools.swift.compiler (in target 'SVGPath' from project 'SVGPath')
    cd /Users/admin/builder/spi-builder-workspace/.swiftpm/xcode
    builtin-Swift-Compilation -- /Applications/Xcode-16.3.0.app/Contents/Developer/Toolchains/XcodeDefault.xctoolchain/usr/bin/swiftc -module-name SVGPath -Onone -enforce-exclusivity\=checked @/Users/admin/builder/spi-builder-workspace/.derivedData/Build/Intermediates.noindex/SVGPath.build/Debug-iphoneos/SVGPath.build/Objects-normal/arm64/SVGPath.SwiftFileList -DSWIFT_PACKAGE -DDEBUG -stats-output-dir .stats -strict-concurrency\=complete -enable-upcoming-feature StrictConcurrency -enable-upcoming-feature DisableOutwardActorInference -enable-upcoming-feature GlobalActorIsolatedTypesUsability -enable-upcoming-feature InferSendableFromCaptures -plugin-path /Applications/Xcode-16.3.0.app/Contents/Developer/Toolchains/XcodeDefault.xctoolchain/usr/lib/swift/host/plugins/testing -enable-experimental-feature DebugDescriptionMacro -sdk /Applications/Xcode-16.3.0.app/Contents/Developer/Platforms/iPhoneOS.platform/Developer/SDKs/iPhoneOS18.4.sdk -target arm64-apple-ios12.0 -g -module-cache-path /Users/admin/builder/spi-builder-workspace/.derivedData/ModuleCache.noindex -Xfrontend -serialize-debugging-options -profile-coverage-mapping -profile-generate -enable-testing -suppress-warnings -index-store-path /Users/admin/builder/spi-builder-workspace/.derivedData/Index.noindex/DataStore -swift-version 5 -I /Users/admin/builder/spi-builder-workspace/.derivedData/Build/Products/Debug-iphoneos -I /Applications/Xcode-16.3.0.app/Contents/Developer/Platforms/iPhoneOS.platform/Developer/usr/lib -F /Users/admin/builder/spi-builder-workspace/.derivedData/Build/Products/Debug-iphoneos -F /Applications/Xcode-16.3.0.app/Contents/Developer/Platforms/iPhoneOS.platform/Developer/Library/Frameworks -F /Applications/Xcode-16.3.0.app/Contents/Developer/Platforms/iPhoneOS.platform/Developer/SDKs/iPhoneOS18.4.sdk/Developer/Library/Frameworks -c -j10 -enable-batch-mode -incremental -Xcc -ivfsstatcache -Xcc /Users/admin/builder/spi-builder-workspace/.derivedData/SDKStatCaches.noindex/iphoneos18.4-22E235-339d34bc69d7fc736c3220795c36f340.sdkstatcache -output-file-map /Users/admin/builder/spi-builder-workspace/.derivedData/Build/Intermediates.noindex/SVGPath.build/Debug-iphoneos/SVGPath.build/Objects-normal/arm64/SVGPath-OutputFileMap.json -use-frontend-parseable-output -save-temps -no-color-diagnostics -serialize-diagnostics -emit-dependencies -emit-module -emit-module-path /Users/admin/builder/spi-builder-workspace/.derivedData/Build/Intermediates.noindex/SVGPath.build/Debug-iphoneos/SVGPath.build/Objects-normal/arm64/SVGPath.swiftmodule -validate-clang-modules-once -clang-build-session-file /Users/admin/builder/spi-builder-workspace/.derivedData/ModuleCache.noindex/Session.modulevalidation -Xcc -I/Users/admin/builder/spi-builder-workspace/.derivedData/Build/Intermediates.noindex/SVGPath.build/Debug-iphoneos/SVGPath.build/swift-overrides.hmap -emit-const-values -Xfrontend -const-gather-protocols-file -Xfrontend /Users/admin/builder/spi-builder-workspace/.derivedData/Build/Intermediates.noindex/SVGPath.build/Debug-iphoneos/SVGPath.build/Objects-normal/arm64/SVGPath_const_extract_protocols.json -Xcc -I/Users/admin/builder/spi-builder-workspace/.derivedData/Build/Products/Debug-iphoneos/include -Xcc -I/Users/admin/builder/spi-builder-workspace/.derivedData/Build/Intermediates.noindex/SVGPath.build/Debug-iphoneos/SVGPath.build/DerivedSources-normal/arm64 -Xcc -I/Users/admin/builder/spi-builder-workspace/.derivedData/Build/Intermediates.noindex/SVGPath.build/Debug-iphoneos/SVGPath.build/DerivedSources/arm64 -Xcc -I/Users/admin/builder/spi-builder-workspace/.derivedData/Build/Intermediates.noindex/SVGPath.build/Debug-iphoneos/SVGPath.build/DerivedSources -Xcc -DSWIFT_PACKAGE -Xcc -DDEBUG\=1 -emit-objc-header -emit-objc-header-path /Users/admin/builder/spi-builder-workspace/.derivedData/Build/Intermediates.noindex/SVGPath.build/Debug-iphoneos/SVGPath.build/Objects-normal/arm64/SVGPath-Swift.h -working-directory /Users/admin/builder/spi-builder-workspace/.swiftpm/xcode -experimental-emit-module-separately -disable-cmo
SwiftCompile normal arm64 Compiling\ Angle.swift,\ BSP.swift,\ Bounds.swift,\ Color.swift /Users/admin/builder/spi-builder-workspace/.dependencies/checkouts/Euclid/Sources/Angle.swift /Users/admin/builder/spi-builder-workspace/.dependencies/checkouts/Euclid/Sources/BSP.swift /Users/admin/builder/spi-builder-workspace/.dependencies/checkouts/Euclid/Sources/Bounds.swift /Users/admin/builder/spi-builder-workspace/.dependencies/checkouts/Euclid/Sources/Color.swift (in target 'Euclid' from project 'Euclid')
SwiftCompile normal arm64 /Users/admin/builder/spi-builder-workspace/.dependencies/checkouts/Euclid/Sources/Angle.swift (in target 'Euclid' from project 'Euclid')
    cd /Users/admin/builder/spi-builder-workspace/.swiftpm/xcode

SwiftCompile normal arm64 /Users/admin/builder/spi-builder-workspace/.dependencies/checkouts/Euclid/Sources/BSP.swift (in target 'Euclid' from project 'Euclid')
    cd /Users/admin/builder/spi-builder-workspace/.swiftpm/xcode

SwiftCompile normal arm64 /Users/admin/builder/spi-builder-workspace/.dependencies/checkouts/Euclid/Sources/Bounds.swift (in target 'Euclid' from project 'Euclid')
    cd /Users/admin/builder/spi-builder-workspace/.swiftpm/xcode

SwiftCompile normal arm64 /Users/admin/builder/spi-builder-workspace/.dependencies/checkouts/Euclid/Sources/Color.swift (in target 'Euclid' from project 'Euclid')
    cd /Users/admin/builder/spi-builder-workspace/.swiftpm/xcode

SwiftCompile normal arm64 Compiling\ Polygon+CSG.swift,\ Polygon.swift,\ Quaternion.swift /Users/admin/builder/spi-builder-workspace/.dependencies/checkouts/Euclid/Sources/Polygon+CSG.swift /Users/admin/builder/spi-builder-workspace/.dependencies/checkouts/Euclid/Sources/Polygon.swift /Users/admin/builder/spi-builder-workspace/.dependencies/checkouts/Euclid/Sources/Quaternion.swift (in target 'Euclid' from project 'Euclid')
SwiftCompile normal arm64 /Users/admin/builder/spi-builder-workspace/.dependencies/checkouts/Euclid/Sources/Polygon+CSG.swift (in target 'Euclid' from project 'Euclid')
    cd /Users/admin/builder/spi-builder-workspace/.swiftpm/xcode

SwiftCompile normal arm64 /Users/admin/builder/spi-builder-workspace/.dependencies/checkouts/Euclid/Sources/Polygon.swift (in target 'Euclid' from project 'Euclid')
    cd /Users/admin/builder/spi-builder-workspace/.swiftpm/xcode

SwiftCompile normal arm64 /Users/admin/builder/spi-builder-workspace/.dependencies/checkouts/Euclid/Sources/Quaternion.swift (in target 'Euclid' from project 'Euclid')
    cd /Users/admin/builder/spi-builder-workspace/.swiftpm/xcode

SwiftDriverJobDiscovery normal arm64 Emitting module for LRUCache (in target 'LRUCache' from project 'LRUCache')
SwiftDriver\ Compilation\ Requirements LRUCache normal arm64 com.apple.xcode.tools.swift.compiler (in target 'LRUCache' from project 'LRUCache')
    cd /Users/admin/builder/spi-builder-workspace/.swiftpm/xcode
    builtin-Swift-Compilation-Requirements -- /Applications/Xcode-16.3.0.app/Contents/Developer/Toolchains/XcodeDefault.xctoolchain/usr/bin/swiftc -module-name LRUCache -Onone -enforce-exclusivity\=checked @/Users/admin/builder/spi-builder-workspace/.derivedData/Build/Intermediates.noindex/LRUCache.build/Debug-iphoneos/LRUCache.build/Objects-normal/arm64/LRUCache.SwiftFileList -DSWIFT_PACKAGE -DDEBUG -stats-output-dir .stats -strict-concurrency\=complete -enable-upcoming-feature StrictConcurrency -enable-upcoming-feature DisableOutwardActorInference -enable-upcoming-feature GlobalActorIsolatedTypesUsability -enable-upcoming-feature InferSendableFromCaptures -plugin-path /Applications/Xcode-16.3.0.app/Contents/Developer/Toolchains/XcodeDefault.xctoolchain/usr/lib/swift/host/plugins/testing -enable-experimental-feature DebugDescriptionMacro -sdk /Applications/Xcode-16.3.0.app/Contents/Developer/Platforms/iPhoneOS.platform/Developer/SDKs/iPhoneOS18.4.sdk -target arm64-apple-ios12.0 -g -module-cache-path /Users/admin/builder/spi-builder-workspace/.derivedData/ModuleCache.noindex -Xfrontend -serialize-debugging-options -profile-coverage-mapping -profile-generate -enable-testing -suppress-warnings -index-store-path /Users/admin/builder/spi-builder-workspace/.derivedData/Index.noindex/DataStore -swift-version 5 -I /Users/admin/builder/spi-builder-workspace/.derivedData/Build/Products/Debug-iphoneos -I /Applications/Xcode-16.3.0.app/Contents/Developer/Platforms/iPhoneOS.platform/Developer/usr/lib -F /Users/admin/builder/spi-builder-workspace/.derivedData/Build/Products/Debug-iphoneos -F /Applications/Xcode-16.3.0.app/Contents/Developer/Platforms/iPhoneOS.platform/Developer/Library/Frameworks -F /Applications/Xcode-16.3.0.app/Contents/Developer/Platforms/iPhoneOS.platform/Developer/SDKs/iPhoneOS18.4.sdk/Developer/Library/Frameworks -parse-as-library -c -j10 -enable-batch-mode -incremental -Xcc -ivfsstatcache -Xcc /Users/admin/builder/spi-builder-workspace/.derivedData/SDKStatCaches.noindex/iphoneos18.4-22E235-339d34bc69d7fc736c3220795c36f340.sdkstatcache -output-file-map /Users/admin/builder/spi-builder-workspace/.derivedData/Build/Intermediates.noindex/LRUCache.build/Debug-iphoneos/LRUCache.build/Objects-normal/arm64/LRUCache-OutputFileMap.json -use-frontend-parseable-output -save-temps -no-color-diagnostics -serialize-diagnostics -emit-dependencies -emit-module -emit-module-path /Users/admin/builder/spi-builder-workspace/.derivedData/Build/Intermediates.noindex/LRUCache.build/Debug-iphoneos/LRUCache.build/Objects-normal/arm64/LRUCache.swiftmodule -validate-clang-modules-once -clang-build-session-file /Users/admin/builder/spi-builder-workspace/.derivedData/ModuleCache.noindex/Session.modulevalidation -Xcc -I/Users/admin/builder/spi-builder-workspace/.derivedData/Build/Intermediates.noindex/LRUCache.build/Debug-iphoneos/LRUCache.build/swift-overrides.hmap -emit-const-values -Xfrontend -const-gather-protocols-file -Xfrontend /Users/admin/builder/spi-builder-workspace/.derivedData/Build/Intermediates.noindex/LRUCache.build/Debug-iphoneos/LRUCache.build/Objects-normal/arm64/LRUCache_const_extract_protocols.json -Xcc -I/Users/admin/builder/spi-builder-workspace/.derivedData/Build/Products/Debug-iphoneos/include -Xcc -I/Users/admin/builder/spi-builder-workspace/.derivedData/Build/Intermediates.noindex/LRUCache.build/Debug-iphoneos/LRUCache.build/DerivedSources-normal/arm64 -Xcc -I/Users/admin/builder/spi-builder-workspace/.derivedData/Build/Intermediates.noindex/LRUCache.build/Debug-iphoneos/LRUCache.build/DerivedSources/arm64 -Xcc -I/Users/admin/builder/spi-builder-workspace/.derivedData/Build/Intermediates.noindex/LRUCache.build/Debug-iphoneos/LRUCache.build/DerivedSources -Xcc -DSWIFT_PACKAGE -Xcc -DDEBUG\=1 -emit-objc-header -emit-objc-header-path /Users/admin/builder/spi-builder-workspace/.derivedData/Build/Intermediates.noindex/LRUCache.build/Debug-iphoneos/LRUCache.build/Objects-normal/arm64/LRUCache-Swift.h -working-directory /Users/admin/builder/spi-builder-workspace/.swiftpm/xcode -experimental-emit-module-separately -disable-cmo
SwiftDriverJobDiscovery normal arm64 Compiling LRUCache.swift (in target 'LRUCache' from project 'LRUCache')
SwiftCompile normal arm64 Compiling\ Euclid+AppKit.swift,\ Euclid+CoreGraphics.swift,\ Euclid+CoreText.swift,\ Euclid+RealityKit.swift /Users/admin/builder/spi-builder-workspace/.dependencies/checkouts/Euclid/Sources/Euclid+AppKit.swift /Users/admin/builder/spi-builder-workspace/.dependencies/checkouts/Euclid/Sources/Euclid+CoreGraphics.swift /Users/admin/builder/spi-builder-workspace/.dependencies/checkouts/Euclid/Sources/Euclid+CoreText.swift /Users/admin/builder/spi-builder-workspace/.dependencies/checkouts/Euclid/Sources/Euclid+RealityKit.swift (in target 'Euclid' from project 'Euclid')
SwiftCompile normal arm64 /Users/admin/builder/spi-builder-workspace/.dependencies/checkouts/Euclid/Sources/Euclid+AppKit.swift (in target 'Euclid' from project 'Euclid')
    cd /Users/admin/builder/spi-builder-workspace/.swiftpm/xcode

SwiftCompile normal arm64 /Users/admin/builder/spi-builder-workspace/.dependencies/checkouts/Euclid/Sources/Euclid+CoreGraphics.swift (in target 'Euclid' from project 'Euclid')
    cd /Users/admin/builder/spi-builder-workspace/.swiftpm/xcode

SwiftCompile normal arm64 /Users/admin/builder/spi-builder-workspace/.dependencies/checkouts/Euclid/Sources/Euclid+CoreText.swift (in target 'Euclid' from project 'Euclid')
    cd /Users/admin/builder/spi-builder-workspace/.swiftpm/xcode

SwiftCompile normal arm64 /Users/admin/builder/spi-builder-workspace/.dependencies/checkouts/Euclid/Sources/Euclid+RealityKit.swift (in target 'Euclid' from project 'Euclid')
    cd /Users/admin/builder/spi-builder-workspace/.swiftpm/xcode

SwiftMergeGeneratedHeaders /Users/admin/builder/spi-builder-workspace/.derivedData/Build/Intermediates.noindex/GeneratedModuleMaps-iphoneos/LRUCache-Swift.h /Users/admin/builder/spi-builder-workspace/.derivedData/Build/Intermediates.noindex/LRUCache.build/Debug-iphoneos/LRUCache.build/Objects-normal/arm64/LRUCache-Swift.h (in target 'LRUCache' from project 'LRUCache')
    cd /Users/admin/builder/spi-builder-workspace/.dependencies/checkouts/LRUCache
    builtin-swiftHeaderTool -arch arm64 /Users/admin/builder/spi-builder-workspace/.derivedData/Build/Intermediates.noindex/LRUCache.build/Debug-iphoneos/LRUCache.build/Objects-normal/arm64/LRUCache-Swift.h -o /Users/admin/builder/spi-builder-workspace/.derivedData/Build/Intermediates.noindex/GeneratedModuleMaps-iphoneos/LRUCache-Swift.h
SwiftDriverJobDiscovery normal arm64 Emitting module for Euclid (in target 'Euclid' from project 'Euclid')
Copy /Users/admin/builder/spi-builder-workspace/.derivedData/Build/Products/Debug-iphoneos/LRUCache.swiftmodule/arm64-apple-ios.swiftmodule /Users/admin/builder/spi-builder-workspace/.derivedData/Build/Intermediates.noindex/LRUCache.build/Debug-iphoneos/LRUCache.build/Objects-normal/arm64/LRUCache.swiftmodule (in target 'LRUCache' from project 'LRUCache')
    cd /Users/admin/builder/spi-builder-workspace/.dependencies/checkouts/LRUCache
    builtin-copy -exclude .DS_Store -exclude CVS -exclude .svn -exclude .git -exclude .hg -resolve-src-symlinks -rename /Users/admin/builder/spi-builder-workspace/.derivedData/Build/Intermediates.noindex/LRUCache.build/Debug-iphoneos/LRUCache.build/Objects-normal/arm64/LRUCache.swiftmodule /Users/admin/builder/spi-builder-workspace/.derivedData/Build/Products/Debug-iphoneos/LRUCache.swiftmodule/arm64-apple-ios.swiftmodule
Copy /Users/admin/builder/spi-builder-workspace/.derivedData/Build/Products/Debug-iphoneos/LRUCache.swiftmodule/arm64-apple-ios.swiftdoc /Users/admin/builder/spi-builder-workspace/.derivedData/Build/Intermediates.noindex/LRUCache.build/Debug-iphoneos/LRUCache.build/Objects-normal/arm64/LRUCache.swiftdoc (in target 'LRUCache' from project 'LRUCache')
    cd /Users/admin/builder/spi-builder-workspace/.dependencies/checkouts/LRUCache
    builtin-copy -exclude .DS_Store -exclude CVS -exclude .svn -exclude .git -exclude .hg -resolve-src-symlinks -rename /Users/admin/builder/spi-builder-workspace/.derivedData/Build/Intermediates.noindex/LRUCache.build/Debug-iphoneos/LRUCache.build/Objects-normal/arm64/LRUCache.swiftdoc /Users/admin/builder/spi-builder-workspace/.derivedData/Build/Products/Debug-iphoneos/LRUCache.swiftmodule/arm64-apple-ios.swiftdoc
Copy /Users/admin/builder/spi-builder-workspace/.derivedData/Build/Products/Debug-iphoneos/LRUCache.swiftmodule/arm64-apple-ios.abi.json /Users/admin/builder/spi-builder-workspace/.derivedData/Build/Intermediates.noindex/LRUCache.build/Debug-iphoneos/LRUCache.build/Objects-normal/arm64/LRUCache.abi.json (in target 'LRUCache' from project 'LRUCache')
    cd /Users/admin/builder/spi-builder-workspace/.dependencies/checkouts/LRUCache
    builtin-copy -exclude .DS_Store -exclude CVS -exclude .svn -exclude .git -exclude .hg -resolve-src-symlinks -rename /Users/admin/builder/spi-builder-workspace/.derivedData/Build/Intermediates.noindex/LRUCache.build/Debug-iphoneos/LRUCache.build/Objects-normal/arm64/LRUCache.abi.json /Users/admin/builder/spi-builder-workspace/.derivedData/Build/Products/Debug-iphoneos/LRUCache.swiftmodule/arm64-apple-ios.abi.json
Copy /Users/admin/builder/spi-builder-workspace/.derivedData/Build/Products/Debug-iphoneos/LRUCache.swiftmodule/Project/arm64-apple-ios.swiftsourceinfo /Users/admin/builder/spi-builder-workspace/.derivedData/Build/Intermediates.noindex/LRUCache.build/Debug-iphoneos/LRUCache.build/Objects-normal/arm64/LRUCache.swiftsourceinfo (in target 'LRUCache' from project 'LRUCache')
    cd /Users/admin/builder/spi-builder-workspace/.dependencies/checkouts/LRUCache
    builtin-copy -exclude .DS_Store -exclude CVS -exclude .svn -exclude .git -exclude .hg -resolve-src-symlinks -rename /Users/admin/builder/spi-builder-workspace/.derivedData/Build/Intermediates.noindex/LRUCache.build/Debug-iphoneos/LRUCache.build/Objects-normal/arm64/LRUCache.swiftsourceinfo /Users/admin/builder/spi-builder-workspace/.derivedData/Build/Products/Debug-iphoneos/LRUCache.swiftmodule/Project/arm64-apple-ios.swiftsourceinfo
SwiftDriver\ Compilation\ Requirements Euclid normal arm64 com.apple.xcode.tools.swift.compiler (in target 'Euclid' from project 'Euclid')
    cd /Users/admin/builder/spi-builder-workspace/.swiftpm/xcode
    builtin-Swift-Compilation-Requirements -- /Applications/Xcode-16.3.0.app/Contents/Developer/Toolchains/XcodeDefault.xctoolchain/usr/bin/swiftc -module-name Euclid -Onone -enforce-exclusivity\=checked @/Users/admin/builder/spi-builder-workspace/.derivedData/Build/Intermediates.noindex/Euclid.build/Debug-iphoneos/Euclid.build/Objects-normal/arm64/Euclid.SwiftFileList -DSWIFT_PACKAGE -DDEBUG -stats-output-dir .stats -strict-concurrency\=complete -enable-upcoming-feature StrictConcurrency -enable-upcoming-feature DisableOutwardActorInference -enable-upcoming-feature GlobalActorIsolatedTypesUsability -enable-upcoming-feature InferSendableFromCaptures -plugin-path /Applications/Xcode-16.3.0.app/Contents/Developer/Toolchains/XcodeDefault.xctoolchain/usr/lib/swift/host/plugins/testing -enable-experimental-feature DebugDescriptionMacro -sdk /Applications/Xcode-16.3.0.app/Contents/Developer/Platforms/iPhoneOS.platform/Developer/SDKs/iPhoneOS18.4.sdk -target arm64-apple-ios12.0 -g -module-cache-path /Users/admin/builder/spi-builder-workspace/.derivedData/ModuleCache.noindex -Xfrontend -serialize-debugging-options -profile-coverage-mapping -profile-generate -enable-testing -suppress-warnings -index-store-path /Users/admin/builder/spi-builder-workspace/.derivedData/Index.noindex/DataStore -swift-version 5 -I /Users/admin/builder/spi-builder-workspace/.derivedData/Build/Products/Debug-iphoneos -I /Applications/Xcode-16.3.0.app/Contents/Developer/Platforms/iPhoneOS.platform/Developer/usr/lib -F /Users/admin/builder/spi-builder-workspace/.derivedData/Build/Products/Debug-iphoneos -F /Applications/Xcode-16.3.0.app/Contents/Developer/Platforms/iPhoneOS.platform/Developer/Library/Frameworks -F /Applications/Xcode-16.3.0.app/Contents/Developer/Platforms/iPhoneOS.platform/Developer/SDKs/iPhoneOS18.4.sdk/Developer/Library/Frameworks -c -j10 -enable-batch-mode -incremental -Xcc -ivfsstatcache -Xcc /Users/admin/builder/spi-builder-workspace/.derivedData/SDKStatCaches.noindex/iphoneos18.4-22E235-339d34bc69d7fc736c3220795c36f340.sdkstatcache -output-file-map /Users/admin/builder/spi-builder-workspace/.derivedData/Build/Intermediates.noindex/Euclid.build/Debug-iphoneos/Euclid.build/Objects-normal/arm64/Euclid-OutputFileMap.json -use-frontend-parseable-output -save-temps -no-color-diagnostics -serialize-diagnostics -emit-dependencies -emit-module -emit-module-path /Users/admin/builder/spi-builder-workspace/.derivedData/Build/Intermediates.noindex/Euclid.build/Debug-iphoneos/Euclid.build/Objects-normal/arm64/Euclid.swiftmodule -validate-clang-modules-once -clang-build-session-file /Users/admin/builder/spi-builder-workspace/.derivedData/ModuleCache.noindex/Session.modulevalidation -Xcc -I/Users/admin/builder/spi-builder-workspace/.derivedData/Build/Intermediates.noindex/Euclid.build/Debug-iphoneos/Euclid.build/swift-overrides.hmap -emit-const-values -Xfrontend -const-gather-protocols-file -Xfrontend /Users/admin/builder/spi-builder-workspace/.derivedData/Build/Intermediates.noindex/Euclid.build/Debug-iphoneos/Euclid.build/Objects-normal/arm64/Euclid_const_extract_protocols.json -Xcc -I/Users/admin/builder/spi-builder-workspace/.derivedData/Build/Products/Debug-iphoneos/include -Xcc -I/Users/admin/builder/spi-builder-workspace/.derivedData/Build/Intermediates.noindex/Euclid.build/Debug-iphoneos/Euclid.build/DerivedSources-normal/arm64 -Xcc -I/Users/admin/builder/spi-builder-workspace/.derivedData/Build/Intermediates.noindex/Euclid.build/Debug-iphoneos/Euclid.build/DerivedSources/arm64 -Xcc -I/Users/admin/builder/spi-builder-workspace/.derivedData/Build/Intermediates.noindex/Euclid.build/Debug-iphoneos/Euclid.build/DerivedSources -Xcc -DSWIFT_PACKAGE -Xcc -DDEBUG\=1 -emit-objc-header -emit-objc-header-path /Users/admin/builder/spi-builder-workspace/.derivedData/Build/Intermediates.noindex/Euclid.build/Debug-iphoneos/Euclid.build/Objects-normal/arm64/Euclid-Swift.h -working-directory /Users/admin/builder/spi-builder-workspace/.swiftpm/xcode -experimental-emit-module-separately -disable-cmo
SwiftDriver\ Compilation LRUCache normal arm64 com.apple.xcode.tools.swift.compiler (in target 'LRUCache' from project 'LRUCache')
    cd /Users/admin/builder/spi-builder-workspace/.swiftpm/xcode
    builtin-Swift-Compilation -- /Applications/Xcode-16.3.0.app/Contents/Developer/Toolchains/XcodeDefault.xctoolchain/usr/bin/swiftc -module-name LRUCache -Onone -enforce-exclusivity\=checked @/Users/admin/builder/spi-builder-workspace/.derivedData/Build/Intermediates.noindex/LRUCache.build/Debug-iphoneos/LRUCache.build/Objects-normal/arm64/LRUCache.SwiftFileList -DSWIFT_PACKAGE -DDEBUG -stats-output-dir .stats -strict-concurrency\=complete -enable-upcoming-feature StrictConcurrency -enable-upcoming-feature DisableOutwardActorInference -enable-upcoming-feature GlobalActorIsolatedTypesUsability -enable-upcoming-feature InferSendableFromCaptures -plugin-path /Applications/Xcode-16.3.0.app/Contents/Developer/Toolchains/XcodeDefault.xctoolchain/usr/lib/swift/host/plugins/testing -enable-experimental-feature DebugDescriptionMacro -sdk /Applications/Xcode-16.3.0.app/Contents/Developer/Platforms/iPhoneOS.platform/Developer/SDKs/iPhoneOS18.4.sdk -target arm64-apple-ios12.0 -g -module-cache-path /Users/admin/builder/spi-builder-workspace/.derivedData/ModuleCache.noindex -Xfrontend -serialize-debugging-options -profile-coverage-mapping -profile-generate -enable-testing -suppress-warnings -index-store-path /Users/admin/builder/spi-builder-workspace/.derivedData/Index.noindex/DataStore -swift-version 5 -I /Users/admin/builder/spi-builder-workspace/.derivedData/Build/Products/Debug-iphoneos -I /Applications/Xcode-16.3.0.app/Contents/Developer/Platforms/iPhoneOS.platform/Developer/usr/lib -F /Users/admin/builder/spi-builder-workspace/.derivedData/Build/Products/Debug-iphoneos -F /Applications/Xcode-16.3.0.app/Contents/Developer/Platforms/iPhoneOS.platform/Developer/Library/Frameworks -F /Applications/Xcode-16.3.0.app/Contents/Developer/Platforms/iPhoneOS.platform/Developer/SDKs/iPhoneOS18.4.sdk/Developer/Library/Frameworks -parse-as-library -c -j10 -enable-batch-mode -incremental -Xcc -ivfsstatcache -Xcc /Users/admin/builder/spi-builder-workspace/.derivedData/SDKStatCaches.noindex/iphoneos18.4-22E235-339d34bc69d7fc736c3220795c36f340.sdkstatcache -output-file-map /Users/admin/builder/spi-builder-workspace/.derivedData/Build/Intermediates.noindex/LRUCache.build/Debug-iphoneos/LRUCache.build/Objects-normal/arm64/LRUCache-OutputFileMap.json -use-frontend-parseable-output -save-temps -no-color-diagnostics -serialize-diagnostics -emit-dependencies -emit-module -emit-module-path /Users/admin/builder/spi-builder-workspace/.derivedData/Build/Intermediates.noindex/LRUCache.build/Debug-iphoneos/LRUCache.build/Objects-normal/arm64/LRUCache.swiftmodule -validate-clang-modules-once -clang-build-session-file /Users/admin/builder/spi-builder-workspace/.derivedData/ModuleCache.noindex/Session.modulevalidation -Xcc -I/Users/admin/builder/spi-builder-workspace/.derivedData/Build/Intermediates.noindex/LRUCache.build/Debug-iphoneos/LRUCache.build/swift-overrides.hmap -emit-const-values -Xfrontend -const-gather-protocols-file -Xfrontend /Users/admin/builder/spi-builder-workspace/.derivedData/Build/Intermediates.noindex/LRUCache.build/Debug-iphoneos/LRUCache.build/Objects-normal/arm64/LRUCache_const_extract_protocols.json -Xcc -I/Users/admin/builder/spi-builder-workspace/.derivedData/Build/Products/Debug-iphoneos/include -Xcc -I/Users/admin/builder/spi-builder-workspace/.derivedData/Build/Intermediates.noindex/LRUCache.build/Debug-iphoneos/LRUCache.build/DerivedSources-normal/arm64 -Xcc -I/Users/admin/builder/spi-builder-workspace/.derivedData/Build/Intermediates.noindex/LRUCache.build/Debug-iphoneos/LRUCache.build/DerivedSources/arm64 -Xcc -I/Users/admin/builder/spi-builder-workspace/.derivedData/Build/Intermediates.noindex/LRUCache.build/Debug-iphoneos/LRUCache.build/DerivedSources -Xcc -DSWIFT_PACKAGE -Xcc -DDEBUG\=1 -emit-objc-header -emit-objc-header-path /Users/admin/builder/spi-builder-workspace/.derivedData/Build/Intermediates.noindex/LRUCache.build/Debug-iphoneos/LRUCache.build/Objects-normal/arm64/LRUCache-Swift.h -working-directory /Users/admin/builder/spi-builder-workspace/.swiftpm/xcode -experimental-emit-module-separately -disable-cmo
SwiftCompile normal arm64 Compiling\ Utilities.swift,\ Vector.swift,\ Vertex.swift /Users/admin/builder/spi-builder-workspace/.dependencies/checkouts/Euclid/Sources/Utilities.swift /Users/admin/builder/spi-builder-workspace/.dependencies/checkouts/Euclid/Sources/Vector.swift /Users/admin/builder/spi-builder-workspace/.dependencies/checkouts/Euclid/Sources/Vertex.swift (in target 'Euclid' from project 'Euclid')
SwiftCompile normal arm64 /Users/admin/builder/spi-builder-workspace/.dependencies/checkouts/Euclid/Sources/Utilities.swift (in target 'Euclid' from project 'Euclid')
    cd /Users/admin/builder/spi-builder-workspace/.swiftpm/xcode

SwiftCompile normal arm64 /Users/admin/builder/spi-builder-workspace/.dependencies/checkouts/Euclid/Sources/Vector.swift (in target 'Euclid' from project 'Euclid')
    cd /Users/admin/builder/spi-builder-workspace/.swiftpm/xcode

SwiftCompile normal arm64 /Users/admin/builder/spi-builder-workspace/.dependencies/checkouts/Euclid/Sources/Vertex.swift (in target 'Euclid' from project 'Euclid')
    cd /Users/admin/builder/spi-builder-workspace/.swiftpm/xcode

SwiftMergeGeneratedHeaders /Users/admin/builder/spi-builder-workspace/.derivedData/Build/Intermediates.noindex/GeneratedModuleMaps-iphoneos/Euclid-Swift.h /Users/admin/builder/spi-builder-workspace/.derivedData/Build/Intermediates.noindex/Euclid.build/Debug-iphoneos/Euclid.build/Objects-normal/arm64/Euclid-Swift.h (in target 'Euclid' from project 'Euclid')
    cd /Users/admin/builder/spi-builder-workspace/.dependencies/checkouts/Euclid
    builtin-swiftHeaderTool -arch arm64 /Users/admin/builder/spi-builder-workspace/.derivedData/Build/Intermediates.noindex/Euclid.build/Debug-iphoneos/Euclid.build/Objects-normal/arm64/Euclid-Swift.h -o /Users/admin/builder/spi-builder-workspace/.derivedData/Build/Intermediates.noindex/GeneratedModuleMaps-iphoneos/Euclid-Swift.h
SwiftDriverJobDiscovery normal arm64 Compiling Angle.swift, BSP.swift, Bounds.swift, Color.swift (in target 'Euclid' from project 'Euclid')
Copy /Users/admin/builder/spi-builder-workspace/.derivedData/Build/Products/Debug-iphoneos/Euclid.swiftmodule/arm64-apple-ios.swiftmodule /Users/admin/builder/spi-builder-workspace/.derivedData/Build/Intermediates.noindex/Euclid.build/Debug-iphoneos/Euclid.build/Objects-normal/arm64/Euclid.swiftmodule (in target 'Euclid' from project 'Euclid')
    cd /Users/admin/builder/spi-builder-workspace/.dependencies/checkouts/Euclid
    builtin-copy -exclude .DS_Store -exclude CVS -exclude .svn -exclude .git -exclude .hg -resolve-src-symlinks -rename /Users/admin/builder/spi-builder-workspace/.derivedData/Build/Intermediates.noindex/Euclid.build/Debug-iphoneos/Euclid.build/Objects-normal/arm64/Euclid.swiftmodule /Users/admin/builder/spi-builder-workspace/.derivedData/Build/Products/Debug-iphoneos/Euclid.swiftmodule/arm64-apple-ios.swiftmodule
Copy /Users/admin/builder/spi-builder-workspace/.derivedData/Build/Products/Debug-iphoneos/Euclid.swiftmodule/arm64-apple-ios.swiftdoc /Users/admin/builder/spi-builder-workspace/.derivedData/Build/Intermediates.noindex/Euclid.build/Debug-iphoneos/Euclid.build/Objects-normal/arm64/Euclid.swiftdoc (in target 'Euclid' from project 'Euclid')
    cd /Users/admin/builder/spi-builder-workspace/.dependencies/checkouts/Euclid
    builtin-copy -exclude .DS_Store -exclude CVS -exclude .svn -exclude .git -exclude .hg -resolve-src-symlinks -rename /Users/admin/builder/spi-builder-workspace/.derivedData/Build/Intermediates.noindex/Euclid.build/Debug-iphoneos/Euclid.build/Objects-normal/arm64/Euclid.swiftdoc /Users/admin/builder/spi-builder-workspace/.derivedData/Build/Products/Debug-iphoneos/Euclid.swiftmodule/arm64-apple-ios.swiftdoc
Copy /Users/admin/builder/spi-builder-workspace/.derivedData/Build/Products/Debug-iphoneos/Euclid.swiftmodule/arm64-apple-ios.abi.json /Users/admin/builder/spi-builder-workspace/.derivedData/Build/Intermediates.noindex/Euclid.build/Debug-iphoneos/Euclid.build/Objects-normal/arm64/Euclid.abi.json (in target 'Euclid' from project 'Euclid')
    cd /Users/admin/builder/spi-builder-workspace/.dependencies/checkouts/Euclid
    builtin-copy -exclude .DS_Store -exclude CVS -exclude .svn -exclude .git -exclude .hg -resolve-src-symlinks -rename /Users/admin/builder/spi-builder-workspace/.derivedData/Build/Intermediates.noindex/Euclid.build/Debug-iphoneos/Euclid.build/Objects-normal/arm64/Euclid.abi.json /Users/admin/builder/spi-builder-workspace/.derivedData/Build/Products/Debug-iphoneos/Euclid.swiftmodule/arm64-apple-ios.abi.json
Copy /Users/admin/builder/spi-builder-workspace/.derivedData/Build/Products/Debug-iphoneos/Euclid.swiftmodule/Project/arm64-apple-ios.swiftsourceinfo /Users/admin/builder/spi-builder-workspace/.derivedData/Build/Intermediates.noindex/Euclid.build/Debug-iphoneos/Euclid.build/Objects-normal/arm64/Euclid.swiftsourceinfo (in target 'Euclid' from project 'Euclid')
    cd /Users/admin/builder/spi-builder-workspace/.dependencies/checkouts/Euclid
    builtin-copy -exclude .DS_Store -exclude CVS -exclude .svn -exclude .git -exclude .hg -resolve-src-symlinks -rename /Users/admin/builder/spi-builder-workspace/.derivedData/Build/Intermediates.noindex/Euclid.build/Debug-iphoneos/Euclid.build/Objects-normal/arm64/Euclid.swiftsourceinfo /Users/admin/builder/spi-builder-workspace/.derivedData/Build/Products/Debug-iphoneos/Euclid.swiftmodule/Project/arm64-apple-ios.swiftsourceinfo
Ld /Users/admin/builder/spi-builder-workspace/.derivedData/Build/Products/Debug-iphoneos/SVGPath.o normal (in target 'SVGPath' from project 'SVGPath')
    cd /Users/admin/builder/spi-builder-workspace/.dependencies/checkouts/SVGPath
    /Applications/Xcode-16.3.0.app/Contents/Developer/Toolchains/XcodeDefault.xctoolchain/usr/bin/clang -Xlinker -reproducible -target arm64-apple-ios12.0 -r -isysroot /Applications/Xcode-16.3.0.app/Contents/Developer/Platforms/iPhoneOS.platform/Developer/SDKs/iPhoneOS18.4.sdk -O0 -w -L/Users/admin/builder/spi-builder-workspace/.derivedData/Build/Intermediates.noindex/EagerLinkingTBDs/Debug-iphoneos -L/Users/admin/builder/spi-builder-workspace/.derivedData/Build/Products/Debug-iphoneos -L/Applications/Xcode-16.3.0.app/Contents/Developer/Platforms/iPhoneOS.platform/Developer/usr/lib -F/Users/admin/builder/spi-builder-workspace/.derivedData/Build/Intermediates.noindex/EagerLinkingTBDs/Debug-iphoneos -F/Users/admin/builder/spi-builder-workspace/.derivedData/Build/Products/Debug-iphoneos -iframework /Applications/Xcode-16.3.0.app/Contents/Developer/Platforms/iPhoneOS.platform/Developer/Library/Frameworks -iframework /Applications/Xcode-16.3.0.app/Contents/Developer/Platforms/iPhoneOS.platform/Developer/SDKs/iPhoneOS18.4.sdk/Developer/Library/Frameworks -filelist /Users/admin/builder/spi-builder-workspace/.derivedData/Build/Intermediates.noindex/SVGPath.build/Debug-iphoneos/SVGPath.build/Objects-normal/arm64/SVGPath.LinkFileList -nostdlib -Xlinker -object_path_lto -Xlinker /Users/admin/builder/spi-builder-workspace/.derivedData/Build/Intermediates.noindex/SVGPath.build/Debug-iphoneos/SVGPath.build/Objects-normal/arm64/SVGPath_lto.o -rdynamic -Xlinker -no_deduplicate -Xlinker -debug_variant -Xlinker -dependency_info -Xlinker /Users/admin/builder/spi-builder-workspace/.derivedData/Build/Intermediates.noindex/SVGPath.build/Debug-iphoneos/SVGPath.build/Objects-normal/arm64/SVGPath_dependency_info.dat -fobjc-link-runtime -L/Applications/Xcode-16.3.0.app/Contents/Developer/Toolchains/XcodeDefault.xctoolchain/usr/lib/swift/iphoneos -L/usr/lib/swift -Xlinker -add_ast_path -Xlinker /Users/admin/builder/spi-builder-workspace/.derivedData/Build/Intermediates.noindex/SVGPath.build/Debug-iphoneos/SVGPath.build/Objects-normal/arm64/SVGPath.swiftmodule -o /Users/admin/builder/spi-builder-workspace/.derivedData/Build/Products/Debug-iphoneos/SVGPath.o
Ld /Users/admin/builder/spi-builder-workspace/.derivedData/Build/Products/Debug-iphoneos/LRUCache.o normal (in target 'LRUCache' from project 'LRUCache')
    cd /Users/admin/builder/spi-builder-workspace/.dependencies/checkouts/LRUCache
    /Applications/Xcode-16.3.0.app/Contents/Developer/Toolchains/XcodeDefault.xctoolchain/usr/bin/clang -Xlinker -reproducible -target arm64-apple-ios12.0 -r -isysroot /Applications/Xcode-16.3.0.app/Contents/Developer/Platforms/iPhoneOS.platform/Developer/SDKs/iPhoneOS18.4.sdk -O0 -w -L/Users/admin/builder/spi-builder-workspace/.derivedData/Build/Intermediates.noindex/EagerLinkingTBDs/Debug-iphoneos -L/Users/admin/builder/spi-builder-workspace/.derivedData/Build/Products/Debug-iphoneos -L/Applications/Xcode-16.3.0.app/Contents/Developer/Platforms/iPhoneOS.platform/Developer/usr/lib -F/Users/admin/builder/spi-builder-workspace/.derivedData/Build/Intermediates.noindex/EagerLinkingTBDs/Debug-iphoneos -F/Users/admin/builder/spi-builder-workspace/.derivedData/Build/Products/Debug-iphoneos -iframework /Applications/Xcode-16.3.0.app/Contents/Developer/Platforms/iPhoneOS.platform/Developer/Library/Frameworks -iframework /Applications/Xcode-16.3.0.app/Contents/Developer/Platforms/iPhoneOS.platform/Developer/SDKs/iPhoneOS18.4.sdk/Developer/Library/Frameworks -filelist /Users/admin/builder/spi-builder-workspace/.derivedData/Build/Intermediates.noindex/LRUCache.build/Debug-iphoneos/LRUCache.build/Objects-normal/arm64/LRUCache.LinkFileList -nostdlib -Xlinker -object_path_lto -Xlinker /Users/admin/builder/spi-builder-workspace/.derivedData/Build/Intermediates.noindex/LRUCache.build/Debug-iphoneos/LRUCache.build/Objects-normal/arm64/LRUCache_lto.o -rdynamic -Xlinker -no_deduplicate -Xlinker -debug_variant -Xlinker -dependency_info -Xlinker /Users/admin/builder/spi-builder-workspace/.derivedData/Build/Intermediates.noindex/LRUCache.build/Debug-iphoneos/LRUCache.build/Objects-normal/arm64/LRUCache_dependency_info.dat -fobjc-link-runtime -L/Applications/Xcode-16.3.0.app/Contents/Developer/Toolchains/XcodeDefault.xctoolchain/usr/lib/swift/iphoneos -L/usr/lib/swift -Xlinker -add_ast_path -Xlinker /Users/admin/builder/spi-builder-workspace/.derivedData/Build/Intermediates.noindex/LRUCache.build/Debug-iphoneos/LRUCache.build/Objects-normal/arm64/LRUCache.swiftmodule -o /Users/admin/builder/spi-builder-workspace/.derivedData/Build/Products/Debug-iphoneos/LRUCache.o
ExtractAppIntentsMetadata (in target 'SVGPath' from project 'SVGPath')
    cd /Users/admin/builder/spi-builder-workspace/.dependencies/checkouts/SVGPath
    /Applications/Xcode-16.3.0.app/Contents/Developer/Toolchains/XcodeDefault.xctoolchain/usr/bin/appintentsmetadataprocessor --toolchain-dir /Applications/Xcode-16.3.0.app/Contents/Developer/Toolchains/XcodeDefault.xctoolchain --module-name SVGPath --sdk-root /Applications/Xcode-16.3.0.app/Contents/Developer/Platforms/iPhoneOS.platform/Developer/SDKs/iPhoneOS18.4.sdk --xcode-version 16E140 --platform-family iOS --deployment-target 12.0 --bundle-identifier svgpath.SVGPath --output /Users/admin/builder/spi-builder-workspace/.derivedData/Build/Products/Debug-iphoneos/SVGPath.appintents --target-triple arm64-apple-ios12.0 --binary-file /Users/admin/builder/spi-builder-workspace/.derivedData/Build/Products/Debug-iphoneos/SVGPath.o --dependency-file /Users/admin/builder/spi-builder-workspace/.derivedData/Build/Intermediates.noindex/SVGPath.build/Debug-iphoneos/SVGPath.build/Objects-normal/arm64/SVGPath_dependency_info.dat --stringsdata-file /Users/admin/builder/spi-builder-workspace/.derivedData/Build/Intermediates.noindex/SVGPath.build/Debug-iphoneos/SVGPath.build/Objects-normal/arm64/ExtractedAppShortcutsMetadata.stringsdata --source-file-list /Users/admin/builder/spi-builder-workspace/.derivedData/Build/Intermediates.noindex/SVGPath.build/Debug-iphoneos/SVGPath.build/Objects-normal/arm64/SVGPath.SwiftFileList --metadata-file-list /Users/admin/builder/spi-builder-workspace/.derivedData/Build/Intermediates.noindex/SVGPath.build/Debug-iphoneos/SVGPath.build/SVGPath.DependencyMetadataFileList --static-metadata-file-list /Users/admin/builder/spi-builder-workspace/.derivedData/Build/Intermediates.noindex/SVGPath.build/Debug-iphoneos/SVGPath.build/SVGPath.DependencyStaticMetadataFileList --swift-const-vals-list /Users/admin/builder/spi-builder-workspace/.derivedData/Build/Intermediates.noindex/SVGPath.build/Debug-iphoneos/SVGPath.build/Objects-normal/arm64/SVGPath.SwiftConstValuesFileList --force --compile-time-extraction --deployment-aware-processing --validate-assistant-intents --no-app-shortcuts-localization
2025-05-01 02:49:04.898 appintentsmetadataprocessor[847:4709] Starting appintentsmetadataprocessor export
2025-05-01 02:49:04.964 appintentsmetadataprocessor[847:4709] Extracted no relevant App Intents symbols, skipping writing output
SwiftDriverJobDiscovery normal arm64 Compiling Mesh+Texcoords.swift, Mesh.swift, Path+Shapes.swift (in target 'Euclid' from project 'Euclid')
ExtractAppIntentsMetadata (in target 'LRUCache' from project 'LRUCache')
    cd /Users/admin/builder/spi-builder-workspace/.dependencies/checkouts/LRUCache
    /Applications/Xcode-16.3.0.app/Contents/Developer/Toolchains/XcodeDefault.xctoolchain/usr/bin/appintentsmetadataprocessor --toolchain-dir /Applications/Xcode-16.3.0.app/Contents/Developer/Toolchains/XcodeDefault.xctoolchain --module-name LRUCache --sdk-root /Applications/Xcode-16.3.0.app/Contents/Developer/Platforms/iPhoneOS.platform/Developer/SDKs/iPhoneOS18.4.sdk --xcode-version 16E140 --platform-family iOS --deployment-target 12.0 --bundle-identifier lrucache.LRUCache --output /Users/admin/builder/spi-builder-workspace/.derivedData/Build/Products/Debug-iphoneos/LRUCache.appintents --target-triple arm64-apple-ios12.0 --binary-file /Users/admin/builder/spi-builder-workspace/.derivedData/Build/Products/Debug-iphoneos/LRUCache.o --dependency-file /Users/admin/builder/spi-builder-workspace/.derivedData/Build/Intermediates.noindex/LRUCache.build/Debug-iphoneos/LRUCache.build/Objects-normal/arm64/LRUCache_dependency_info.dat --stringsdata-file /Users/admin/builder/spi-builder-workspace/.derivedData/Build/Intermediates.noindex/LRUCache.build/Debug-iphoneos/LRUCache.build/Objects-normal/arm64/ExtractedAppShortcutsMetadata.stringsdata --source-file-list /Users/admin/builder/spi-builder-workspace/.derivedData/Build/Intermediates.noindex/LRUCache.build/Debug-iphoneos/LRUCache.build/Objects-normal/arm64/LRUCache.SwiftFileList --metadata-file-list /Users/admin/builder/spi-builder-workspace/.derivedData/Build/Intermediates.noindex/LRUCache.build/Debug-iphoneos/LRUCache.build/LRUCache.DependencyMetadataFileList --static-metadata-file-list /Users/admin/builder/spi-builder-workspace/.derivedData/Build/Intermediates.noindex/LRUCache.build/Debug-iphoneos/LRUCache.build/LRUCache.DependencyStaticMetadataFileList --swift-const-vals-list /Users/admin/builder/spi-builder-workspace/.derivedData/Build/Intermediates.noindex/LRUCache.build/Debug-iphoneos/LRUCache.build/Objects-normal/arm64/LRUCache.SwiftConstValuesFileList --force --compile-time-extraction --deployment-aware-processing --validate-assistant-intents --no-app-shortcuts-localization
2025-05-01 02:49:04.949 appintentsmetadataprocessor[848:4714] Starting appintentsmetadataprocessor export
2025-05-01 02:49:04.994 appintentsmetadataprocessor[848:4714] Extracted no relevant App Intents symbols, skipping writing output
SwiftDriverJobDiscovery normal arm64 Compiling Rotation.swift, Stretchable.swift, Transforms.swift (in target 'Euclid' from project 'Euclid')
SwiftDriver ShapeScript normal arm64 com.apple.xcode.tools.swift.compiler (in target 'ShapeScript' from project 'ShapeScript')
    cd /Users/admin/builder/spi-builder-workspace/.swiftpm/xcode
    builtin-SwiftDriver -- /Applications/Xcode-16.3.0.app/Contents/Developer/Toolchains/XcodeDefault.xctoolchain/usr/bin/swiftc -module-name ShapeScript -Onone -enforce-exclusivity\=checked @/Users/admin/builder/spi-builder-workspace/.derivedData/Build/Intermediates.noindex/ShapeScript.build/Debug-iphoneos/ShapeScript.build/Objects-normal/arm64/ShapeScript.SwiftFileList -DSWIFT_PACKAGE -DDEBUG -stats-output-dir .stats -strict-concurrency\=complete -enable-upcoming-feature StrictConcurrency -enable-upcoming-feature DisableOutwardActorInference -enable-upcoming-feature GlobalActorIsolatedTypesUsability -enable-upcoming-feature InferSendableFromCaptures -plugin-path /Applications/Xcode-16.3.0.app/Contents/Developer/Toolchains/XcodeDefault.xctoolchain/usr/lib/swift/host/plugins/testing -enable-experimental-feature DebugDescriptionMacro -sdk /Applications/Xcode-16.3.0.app/Contents/Developer/Platforms/iPhoneOS.platform/Developer/SDKs/iPhoneOS18.4.sdk -target arm64-apple-ios12.0 -g -module-cache-path /Users/admin/builder/spi-builder-workspace/.derivedData/ModuleCache.noindex -Xfrontend -serialize-debugging-options -profile-coverage-mapping -profile-generate -enable-testing -index-store-path /Users/admin/builder/spi-builder-workspace/.derivedData/Index.noindex/DataStore -swift-version 5 -I /Users/admin/builder/spi-builder-workspace/.derivedData/Build/Products/Debug-iphoneos -I /Applications/Xcode-16.3.0.app/Contents/Developer/Platforms/iPhoneOS.platform/Developer/usr/lib -F /Users/admin/builder/spi-builder-workspace/.derivedData/Build/Products/Debug-iphoneos/PackageFrameworks -F /Users/admin/builder/spi-builder-workspace/.derivedData/Build/Products/Debug-iphoneos/PackageFrameworks -F /Users/admin/builder/spi-builder-workspace/.derivedData/Build/Products/Debug-iphoneos/PackageFrameworks -F /Users/admin/builder/spi-builder-workspace/.derivedData/Build/Products/Debug-iphoneos -F /Applications/Xcode-16.3.0.app/Contents/Developer/Platforms/iPhoneOS.platform/Developer/Library/Frameworks -F /Applications/Xcode-16.3.0.app/Contents/Developer/Platforms/iPhoneOS.platform/Developer/SDKs/iPhoneOS18.4.sdk/Developer/Library/Frameworks -c -j10 -enable-batch-mode -incremental -Xcc -ivfsstatcache -Xcc /Users/admin/builder/spi-builder-workspace/.derivedData/SDKStatCaches.noindex/iphoneos18.4-22E235-339d34bc69d7fc736c3220795c36f340.sdkstatcache -output-file-map /Users/admin/builder/spi-builder-workspace/.derivedData/Build/Intermediates.noindex/ShapeScript.build/Debug-iphoneos/ShapeScript.build/Objects-normal/arm64/ShapeScript-OutputFileMap.json -use-frontend-parseable-output -save-temps -no-color-diagnostics -serialize-diagnostics -emit-dependencies -emit-module -emit-module-path /Users/admin/builder/spi-builder-workspace/.derivedData/Build/Intermediates.noindex/ShapeScript.build/Debug-iphoneos/ShapeScript.build/Objects-normal/arm64/ShapeScript.swiftmodule -validate-clang-modules-once -clang-build-session-file /Users/admin/builder/spi-builder-workspace/.derivedData/ModuleCache.noindex/Session.modulevalidation -Xcc -I/Users/admin/builder/spi-builder-workspace/.derivedData/Build/Intermediates.noindex/ShapeScript.build/Debug-iphoneos/ShapeScript.build/swift-overrides.hmap -emit-const-values -Xfrontend -const-gather-protocols-file -Xfrontend /Users/admin/builder/spi-builder-workspace/.derivedData/Build/Intermediates.noindex/ShapeScript.build/Debug-iphoneos/ShapeScript.build/Objects-normal/arm64/ShapeScript_const_extract_protocols.json -Xcc -I/Users/admin/builder/spi-builder-workspace/.derivedData/Build/Products/Debug-iphoneos/include -Xcc -I/Users/admin/builder/spi-builder-workspace/.derivedData/Build/Intermediates.noindex/ShapeScript.build/Debug-iphoneos/ShapeScript.build/DerivedSources-normal/arm64 -Xcc -I/Users/admin/builder/spi-builder-workspace/.derivedData/Build/Intermediates.noindex/ShapeScript.build/Debug-iphoneos/ShapeScript.build/DerivedSources/arm64 -Xcc -I/Users/admin/builder/spi-builder-workspace/.derivedData/Build/Intermediates.noindex/ShapeScript.build/Debug-iphoneos/ShapeScript.build/DerivedSources -Xcc -DSWIFT_PACKAGE -Xcc -DDEBUG\=1 -emit-objc-header -emit-objc-header-path /Users/admin/builder/spi-builder-workspace/.derivedData/Build/Intermediates.noindex/ShapeScript.build/Debug-iphoneos/ShapeScript.build/Objects-normal/arm64/ShapeScript-Swift.h -working-directory /Users/admin/builder/spi-builder-workspace/.swiftpm/xcode -experimental-emit-module-separately -disable-cmo
SwiftEmitModule normal arm64 Emitting\ module\ for\ ShapeScript (in target 'ShapeScript' from project 'ShapeScript')
EmitSwiftModule normal arm64 (in target 'ShapeScript' from project 'ShapeScript')
    cd /Users/admin/builder/spi-builder-workspace/.swiftpm/xcode

/Users/admin/builder/spi-builder-workspace/Viewer/CLI/CLI+Export.swift:10:8: warning: file 'CLI+Export.swift' is part of module 'ShapeScript'; ignoring import
import ShapeScript
       ^
/Users/admin/builder/spi-builder-workspace/Viewer/CLI/CLI.swift:11:8: warning: file 'CLI.swift' is part of module 'ShapeScript'; ignoring import
import ShapeScript
       ^
/Users/admin/builder/spi-builder-workspace/Viewer/CLI/Geometry+ModelInfo.swift:9:8: warning: file 'Geometry+ModelInfo.swift' is part of module 'ShapeScript'; ignoring import
import ShapeScript
       ^
/Users/admin/builder/spi-builder-workspace/Viewer/CLI/ProgramError+Formatting.swift:9:8: warning: file 'ProgramError+Formatting.swift' is part of module 'ShapeScript'; ignoring import
import ShapeScript
       ^
/Users/admin/builder/spi-builder-workspace/Viewer/CLI/CLI+Export.swift:34:29: error: cannot find type 'Geometry' in scope
    func export(_ geometry: Geometry, to url: URL, with options: ExportOptions) throws {
                            ^~~~~~~~
/Users/admin/builder/spi-builder-workspace/Viewer/CLI/CLI.swift:118:16: error: cannot find type 'EvaluationDelegate' in scope
extension CLI: EvaluationDelegate {
               ^~~~~~~~~~~~~~~~~~
/Users/admin/builder/spi-builder-workspace/Viewer/CLI/Geometry+ModelInfo.swift:11:11: error: cannot find type 'Geometry' in scope
extension Geometry {
          ^~~~~~~~
/Users/admin/builder/spi-builder-workspace/Viewer/CLI/ProgramError+Formatting.swift:11:11: error: cannot find type 'ProgramError' in scope
extension ProgramError {
          ^~~~~~~~~~~~
SwiftCompile normal arm64 Compiling\ CLI+Export.swift /Users/admin/builder/spi-builder-workspace/Viewer/CLI/CLI+Export.swift (in target 'ShapeScript' from project 'ShapeScript')
SwiftCompile normal arm64 /Users/admin/builder/spi-builder-workspace/Viewer/CLI/CLI+Export.swift (in target 'ShapeScript' from project 'ShapeScript')
    cd /Users/admin/builder/spi-builder-workspace/.swiftpm/xcode

SwiftCompile normal arm64 Compiling\ main.swift /Users/admin/builder/spi-builder-workspace/Viewer/CLI/main.swift (in target 'ShapeScript' from project 'ShapeScript')
SwiftCompile normal arm64 /Users/admin/builder/spi-builder-workspace/Viewer/CLI/main.swift (in target 'ShapeScript' from project 'ShapeScript')
    cd /Users/admin/builder/spi-builder-workspace/.swiftpm/xcode

SwiftDriverJobDiscovery normal arm64 Compiling LineSegment+CSG.swift, LineSegment.swift, Mesh+CSG.swift, Mesh+IO.swift (in target 'Euclid' from project 'Euclid')
SwiftCompile normal arm64 Compiling\ Geometry+ModelInfo.swift /Users/admin/builder/spi-builder-workspace/Viewer/CLI/Geometry+ModelInfo.swift (in target 'ShapeScript' from project 'ShapeScript')
Failed frontend command:
/Applications/Xcode-16.3.0.app/Contents/Developer/Toolchains/XcodeDefault.xctoolchain/usr/bin/swift-frontend -frontend -c /Users/admin/builder/spi-builder-workspace/Viewer/CLI/CLI+Export.swift /Users/admin/builder/spi-builder-workspace/Viewer/CLI/CLI.swift -primary-file /Users/admin/builder/spi-builder-workspace/Viewer/CLI/Geometry+ModelInfo.swift /Users/admin/builder/spi-builder-workspace/Viewer/CLI/ProgramError+Formatting.swift /Users/admin/builder/spi-builder-workspace/Viewer/CLI/main.swift -emit-dependencies-path /Users/admin/builder/spi-builder-workspace/.swiftpm/xcode/Geometry+ModelInfo.d -emit-const-values-path /Users/admin/builder/spi-builder-workspace/.swiftpm/xcode/Geometry+ModelInfo.swiftconstvalues -emit-reference-dependencies-path /Users/admin/builder/spi-builder-workspace/.swiftpm/xcode/Geometry+ModelInfo.swiftdeps -serialize-diagnostics-path /Users/admin/builder/spi-builder-workspace/.swiftpm/xcode/Geometry+ModelInfo.dia -target arm64-apple-ios12.0 -Xllvm -aarch64-use-tbi -enable-objc-interop -sdk /Applications/Xcode-16.3.0.app/Contents/Developer/Platforms/iPhoneOS.platform/Developer/SDKs/iPhoneOS18.4.sdk -I /Users/admin/builder/spi-builder-workspace/.derivedData/Build/Products/Debug-iphoneos -I /Applications/Xcode-16.3.0.app/Contents/Developer/Platforms/iPhoneOS.platform/Developer/usr/lib -F /Users/admin/builder/spi-builder-workspace/.derivedData/Build/Products/Debug-iphoneos/PackageFrameworks -F /Users/admin/builder/spi-builder-workspace/.derivedData/Build/Products/Debug-iphoneos/PackageFrameworks -F /Users/admin/builder/spi-builder-workspace/.derivedData/Build/Products/Debug-iphoneos/PackageFrameworks -F /Users/admin/builder/spi-builder-workspace/.derivedData/Build/Products/Debug-iphoneos -F /Applications/Xcode-16.3.0.app/Contents/Developer/Platforms/iPhoneOS.platform/Developer/Library/Frameworks -F /Applications/Xcode-16.3.0.app/Contents/Developer/Platforms/iPhoneOS.platform/Developer/SDKs/iPhoneOS18.4.sdk/Developer/Library/Frameworks -no-color-diagnostics -enable-testing -g -debug-info-format\=dwarf -dwarf-version\=4 -module-cache-path /Users/admin/builder/spi-builder-workspace/.derivedData/ModuleCache.noindex -profile-generate -profile-coverage-mapping -swift-version 5 -enforce-exclusivity\=checked -stats-output-dir /Users/admin/builder/spi-builder-workspace/.swiftpm/xcode/.stats -Onone -D SWIFT_PACKAGE -D DEBUG -serialize-debugging-options -const-gather-protocols-file /Users/admin/builder/spi-builder-workspace/.derivedData/Build/Intermediates.noindex/ShapeScript.build/Debug-iphoneos/ShapeScript.build/Objects-normal/arm64/ShapeScript_const_extract_protocols.json -enable-upcoming-feature StrictConcurrency -enable-upcoming-feature DisableOutwardActorInference -enable-upcoming-feature GlobalActorIsolatedTypesUsability -enable-upcoming-feature InferSendableFromCaptures -enable-experimental-feature DebugDescriptionMacro -strict-concurrency\=complete -empty-abi-descriptor -plugin-path /Applications/Xcode-16.3.0.app/Contents/Developer/Toolchains/XcodeDefault.xctoolchain/usr/lib/swift/host/plugins/testing -validate-clang-modules-once -clang-build-session-file /Users/admin/builder/spi-builder-workspace/.derivedData/ModuleCache.noindex/Session.modulevalidation -Xcc -working-directory -Xcc /Users/admin/builder/spi-builder-workspace/.swiftpm/xcode -resource-dir /Applications/Xcode-16.3.0.app/Contents/Developer/Toolchains/XcodeDefault.xctoolchain/usr/lib/swift -enable-anonymous-context-mangled-names -file-compilation-dir /Users/admin/builder/spi-builder-workspace/.swiftpm/xcode -Xcc -ivfsstatcache -Xcc /Users/admin/builder/spi-builder-workspace/.derivedData/SDKStatCaches.noindex/iphoneos18.4-22E235-339d34bc69d7fc736c3220795c36f340.sdkstatcache -Xcc -I/Users/admin/builder/spi-builder-workspace/.derivedData/Build/Intermediates.noindex/ShapeScript.build/Debug-iphoneos/ShapeScript.build/swift-overrides.hmap -Xcc -I/Users/admin/builder/spi-builder-workspace/.derivedData/Build/Products/Debug-iphoneos/include -Xcc -I/Users/admin/builder/spi-builder-workspace/.derivedData/Build/Intermediates.noindex/ShapeScript.build/Debug-iphoneos/ShapeScript.build/DerivedSources-normal/arm64 -Xcc -I/Users/admin/builder/spi-builder-workspace/.derivedData/Build/Intermediates.noindex/ShapeScript.build/Debug-iphoneos/ShapeScript.build/DerivedSources/arm64 -Xcc -I/Users/admin/builder/spi-builder-workspace/.derivedData/Build/Intermediates.noindex/ShapeScript.build/Debug-iphoneos/ShapeScript.build/DerivedSources -Xcc -DSWIFT_PACKAGE -Xcc -DDEBUG\=1 -module-name ShapeScript -frontend-parseable-output -disable-clang-spi -target-sdk-version 18.4 -target-sdk-name iphoneos18.4 -external-plugin-path /Applications/Xcode-16.3.0.app/Contents/Developer/Platforms/iPhoneOS.platform/Developer/usr/lib/swift/host/plugins\#/Applications/Xcode-16.3.0.app/Contents/Developer/Platforms/iPhoneOS.platform/Developer/usr/bin/swift-plugin-server -external-plugin-path /Applications/Xcode-16.3.0.app/Contents/Developer/Platforms/iPhoneOS.platform/Developer/usr/local/lib/swift/host/plugins\#/Applications/Xcode-16.3.0.app/Contents/Developer/Platforms/iPhoneOS.platform/Developer/usr/bin/swift-plugin-server -in-process-plugin-server-path /Applications/Xcode-16.3.0.app/Contents/Developer/Toolchains/XcodeDefault.xctoolchain/usr/lib/swift/host/libSwiftInProcPluginServer.dylib -plugin-path /Applications/Xcode-16.3.0.app/Contents/Developer/Toolchains/XcodeDefault.xctoolchain/usr/lib/swift/host/plugins -plugin-path /Applications/Xcode-16.3.0.app/Contents/Developer/Toolchains/XcodeDefault.xctoolchain/usr/local/lib/swift/host/plugins -o /Users/admin/builder/spi-builder-workspace/.swiftpm/xcode/Geometry+ModelInfo.o -index-store-path /Users/admin/builder/spi-builder-workspace/.derivedData/Index.noindex/DataStore -index-system-modules
SwiftCompile normal arm64 /Users/admin/builder/spi-builder-workspace/Viewer/CLI/Geometry+ModelInfo.swift (in target 'ShapeScript' from project 'ShapeScript')
    cd /Users/admin/builder/spi-builder-workspace/.swiftpm/xcode

/Users/admin/builder/spi-builder-workspace/Viewer/CLI/Geometry+ModelInfo.swift:9:8: warning: file 'Geometry+ModelInfo.swift' is part of module 'ShapeScript'; ignoring import
import ShapeScript
       ^
/Users/admin/builder/spi-builder-workspace/Viewer/CLI/Geometry+ModelInfo.swift:11:11: error: cannot find type 'Geometry' in scope
extension Geometry {
          ^~~~~~~~
SwiftDriverJobDiscovery normal arm64 Compiling Path.swift, PathPoint.swift, Plane.swift (in target 'Euclid' from project 'Euclid')
SwiftCompile normal arm64 Compiling\ ProgramError+Formatting.swift /Users/admin/builder/spi-builder-workspace/Viewer/CLI/ProgramError+Formatting.swift (in target 'ShapeScript' from project 'ShapeScript')
SwiftCompile normal arm64 /Users/admin/builder/spi-builder-workspace/Viewer/CLI/ProgramError+Formatting.swift (in target 'ShapeScript' from project 'ShapeScript')
    cd /Users/admin/builder/spi-builder-workspace/.swiftpm/xcode

SwiftCompile normal arm64 Compiling\ CLI.swift /Users/admin/builder/spi-builder-workspace/Viewer/CLI/CLI.swift (in target 'ShapeScript' from project 'ShapeScript')
SwiftCompile normal arm64 /Users/admin/builder/spi-builder-workspace/Viewer/CLI/CLI.swift (in target 'ShapeScript' from project 'ShapeScript')
    cd /Users/admin/builder/spi-builder-workspace/.swiftpm/xcode

SwiftDriverJobDiscovery normal arm64 Compiling Euclid+SIMD.swift, Euclid+SceneKit.swift, Euclid+UIKit.swift, Line.swift (in target 'Euclid' from project 'Euclid')
** BUILD FAILED **
The following build commands failed:
	EmitSwiftModule normal arm64 (in target 'ShapeScript' from project 'ShapeScript')
	SwiftCompile normal arm64 Compiling\ Geometry+ModelInfo.swift /Users/admin/builder/spi-builder-workspace/Viewer/CLI/Geometry+ModelInfo.swift (in target 'ShapeScript' from project 'ShapeScript')
	SwiftCompile normal arm64 /Users/admin/builder/spi-builder-workspace/Viewer/CLI/Geometry+ModelInfo.swift (in target 'ShapeScript' from project 'ShapeScript')
	Building workspace spi-builder-workspace with scheme ShapeScript-Package
(4 failures)
Command line invocation:
    /Applications/Xcode-16.3.0.app/Contents/Developer/usr/bin/xcodebuild -IDEClonedSourcePackagesDirPathOverride=/Users/admin/builder/spi-builder-workspace/.dependencies -resolvePackageDependencies
Resolve Package Graph
Resolved source packages:
  Euclid: https://github.com/nicklockwood/Euclid.git @ 0.7.11
  LRUCache: https://github.com/nicklockwood/LRUCache.git @ 1.0.7
  SVGPath: https://github.com/nicklockwood/SVGPath.git @ 1.1.6
  ShapeScript: /Users/admin/builder/spi-builder-workspace
resolved source packages: Euclid, LRUCache, SVGPath, ShapeScript
{
  "dependencies" : [
    {
      "identity" : "euclid",
      "requirement" : {
        "range" : [
          {
            "lower_bound" : "0.7.7",
            "upper_bound" : "0.8.0"
          }
        ]
      },
      "type" : "sourceControl",
      "url" : "https://github.com/nicklockwood/Euclid.git"
    },
    {
      "identity" : "lrucache",
      "requirement" : {
        "range" : [
          {
            "lower_bound" : "1.0.6",
            "upper_bound" : "1.1.0"
          }
        ]
      },
      "type" : "sourceControl",
      "url" : "https://github.com/nicklockwood/LRUCache.git"
    },
    {
      "identity" : "svgpath",
      "requirement" : {
        "range" : [
          {
            "lower_bound" : "1.1.5",
            "upper_bound" : "1.2.0"
          }
        ]
      },
      "type" : "sourceControl",
      "url" : "https://github.com/nicklockwood/SVGPath.git"
    }
  ],
  "manifest_display_name" : "ShapeScript",
  "name" : "ShapeScript",
  "path" : "/Users/admin/builder/spi-builder-workspace",
  "platforms" : [
    {
      "name" : "macos",
      "version" : "10.14"
    },
    {
      "name" : "ios",
      "version" : "11.0"
    },
    {
      "name" : "tvos",
      "version" : "11.0"
    }
  ],
  "products" : [
    {
      "name" : "ShapeScript",
      "targets" : [
        "ShapeScript"
      ],
      "type" : {
        "library" : [
          "automatic"
        ]
      }
    },
    {
      "name" : "shapescript",
      "targets" : [
        "CLI"
      ],
      "type" : {
        "executable" : null
      }
    }
  ],
  "targets" : [
    {
      "c99name" : "ShapeScriptTests",
      "module_type" : "SwiftTarget",
      "name" : "ShapeScriptTests",
      "path" : "ShapeScriptTests",
      "sources" : [
        "GeometryTests.swift",
        "ImportExportTests.swift",
        "InterpreterTests.swift",
        "LexerTests.swift",
        "LoggingTests.swift",
        "MemberTests.swift",
        "MetadataTests.swift",
        "ParserTests.swift",
        "PlatformTests.swift",
        "RegressionTests.swift",
        "SVGPathTests.swift",
        "StandardLibraryTests.swift",
        "StringMatchingTests.swift",
        "TestDelegate.swift",
        "TypesystemTests.swift"
      ],
      "target_dependencies" : [
        "ShapeScript"
      ],
      "type" : "test"
    },
    {
      "c99name" : "ShapeScript",
      "module_type" : "SwiftTarget",
      "name" : "ShapeScript",
      "path" : "ShapeScript",
      "product_dependencies" : [
        "Euclid",
        "LRUCache",
        "SVGPath"
      ],
      "product_memberships" : [
        "ShapeScript",
        "shapescript"
      ],
      "sources" : [
        "Euclid+Extensions.swift",
        "Euclid+SVGPath.swift",
        "EvaluationContext.swift",
        "EvaluationDelegate.swift",
        "Geometry.swift",
        "GeometryCache.swift",
        "GeometryType.swift",
        "Interpreter.swift",
        "Lexer.swift",
        "Material+Brightness.swift",
        "Material+SceneKit.swift",
        "Material.swift",
        "Members.swift",
        "Parser.swift",
        "ProgramError.swift",
        "RandomSequence.swift",
        "Scene+SceneKit.swift",
        "Scene.swift",
        "StandardLibrary.swift",
        "String+Matching.swift",
        "String+Ordinals.swift",
        "Symbols.swift",
        "Types.swift",
        "Value+JSON.swift",
        "Value+Logging.swift",
        "Values.swift"
      ],
      "type" : "library"
    },
    {
      "c99name" : "CLI",
      "module_type" : "SwiftTarget",
      "name" : "CLI",
      "path" : "Viewer/CLI",
      "product_memberships" : [
        "shapescript"
      ],
      "sources" : [
        "CLI+Export.swift",
        "CLI.swift",
        "Geometry+ModelInfo.swift",
        "ProgramError+Formatting.swift",
        "main.swift"
      ],
      "target_dependencies" : [
        "ShapeScript"
      ],
      "type" : "executable"
    }
  ],
  "tools_version" : "5.1"
}
{
  "workspace" : {
    "name" : "spi-builder-workspace",
    "schemes" : [
      "shapescript",
      "ShapeScript",
      "ShapeScript-Package"
    ]
  }
}
Running build ...
env DEVELOPER_DIR=/Applications/Xcode-16.3.0.app xcrun xcodebuild -IDEClonedSourcePackagesDirPathOverride=$PWD/.dependencies -skipMacroValidation -skipPackagePluginValidation -derivedDataPath $PWD/.derivedData build -scheme ShapeScript-Package -destination generic/platform=iOS
Command line invocation:
    /Applications/Xcode-16.3.0.app/Contents/Developer/usr/bin/xcodebuild -IDEClonedSourcePackagesDirPathOverride=/Users/admin/builder/spi-builder-workspace/.dependencies -skipMacroValidation -skipPackagePluginValidation -derivedDataPath /Users/admin/builder/spi-builder-workspace/.derivedData build -scheme ShapeScript-Package -destination generic/platform=iOS
Resolve Package Graph
Resolved source packages:
  Euclid: https://github.com/nicklockwood/Euclid.git @ 0.7.11
  SVGPath: https://github.com/nicklockwood/SVGPath.git @ 1.1.6
  LRUCache: https://github.com/nicklockwood/LRUCache.git @ 1.0.7
  ShapeScript: /Users/admin/builder/spi-builder-workspace
ComputePackagePrebuildTargetDependencyGraph
Prepare packages
CreateBuildRequest
SendProjectDescription
CreateBuildOperation
ComputeTargetDependencyGraph
note: Building targets in dependency order
note: Target dependency graph (9 targets)
    Target 'shapescript' in project 'ShapeScript'
        ➜ Explicit dependency on target 'ShapeScript' in project 'ShapeScript'
        ➜ Explicit dependency on target 'Euclid' in project 'Euclid'
        ➜ Explicit dependency on target 'LRUCache' in project 'LRUCache'
        ➜ Explicit dependency on target 'SVGPath' in project 'SVGPath'
    Target 'ShapeScript' in project 'ShapeScript'
        ➜ Explicit dependency on target 'ShapeScript' in project 'ShapeScript'
        ➜ Explicit dependency on target 'Euclid' in project 'Euclid'
        ➜ Explicit dependency on target 'LRUCache' in project 'LRUCache'
        ➜ Explicit dependency on target 'SVGPath' in project 'SVGPath'
    Target 'ShapeScript' in project 'ShapeScript'
        ➜ Explicit dependency on target 'Euclid' in project 'Euclid'
        ➜ Explicit dependency on target 'LRUCache' in project 'LRUCache'
        ➜ Explicit dependency on target 'SVGPath' in project 'SVGPath'
    Target 'SVGPath' in project 'SVGPath'
        ➜ Explicit dependency on target 'SVGPath' in project 'SVGPath'
    Target 'SVGPath' in project 'SVGPath' (no dependencies)
    Target 'LRUCache' in project 'LRUCache'
        ➜ Explicit dependency on target 'LRUCache' in project 'LRUCache'
    Target 'LRUCache' in project 'LRUCache' (no dependencies)
    Target 'Euclid' in project 'Euclid'
        ➜ Explicit dependency on target 'Euclid' in project 'Euclid'
    Target 'Euclid' in project 'Euclid' (no dependencies)
GatherProvisioningInputs
CreateBuildDescription
ExecuteExternalTool /Applications/Xcode-16.3.0.app/Contents/Developer/Toolchains/XcodeDefault.xctoolchain/usr/bin/swiftc --version
ExecuteExternalTool /Applications/Xcode-16.3.0.app/Contents/Developer/Toolchains/XcodeDefault.xctoolchain/usr/bin/clang -v -E -dM -isysroot /Applications/Xcode-16.3.0.app/Contents/Developer/Platforms/iPhoneOS.platform/Developer/SDKs/iPhoneOS18.4.sdk -x c -c /dev/null
ExecuteExternalTool /Applications/Xcode-16.3.0.app/Contents/Developer/Toolchains/XcodeDefault.xctoolchain/usr/bin/ld -version_details
Build description signature: ea269a44e3dfa29696607cdfa80f4040
Build description path: /Users/admin/builder/spi-builder-workspace/.derivedData/Build/Intermediates.noindex/XCBuildData/ea269a44e3dfa29696607cdfa80f4040.xcbuilddata
ClangStatCache /Applications/Xcode-16.3.0.app/Contents/Developer/Toolchains/XcodeDefault.xctoolchain/usr/bin/clang-stat-cache /Applications/Xcode-16.3.0.app/Contents/Developer/Platforms/iPhoneOS.platform/Developer/SDKs/iPhoneOS18.4.sdk /Users/admin/builder/spi-builder-workspace/.derivedData/SDKStatCaches.noindex/iphoneos18.4-22E235-339d34bc69d7fc736c3220795c36f340.sdkstatcache
    cd /Users/admin/builder/spi-builder-workspace/.swiftpm/xcode
    /Applications/Xcode-16.3.0.app/Contents/Developer/Toolchains/XcodeDefault.xctoolchain/usr/bin/clang-stat-cache /Applications/Xcode-16.3.0.app/Contents/Developer/Platforms/iPhoneOS.platform/Developer/SDKs/iPhoneOS18.4.sdk -o /Users/admin/builder/spi-builder-workspace/.derivedData/SDKStatCaches.noindex/iphoneos18.4-22E235-339d34bc69d7fc736c3220795c36f340.sdkstatcache
WriteAuxiliaryFile /Users/admin/builder/spi-builder-workspace/.derivedData/Build/Intermediates.noindex/ShapeScript.build/Debug-iphoneos/shapescript.build/Objects-normal/arm64/shapescript.LinkFileList (in target 'shapescript' from project 'ShapeScript')
    cd /Users/admin/builder/spi-builder-workspace
    write-file /Users/admin/builder/spi-builder-workspace/.derivedData/Build/Intermediates.noindex/ShapeScript.build/Debug-iphoneos/shapescript.build/Objects-normal/arm64/shapescript.LinkFileList
WriteAuxiliaryFile /Users/admin/builder/spi-builder-workspace/.derivedData/Build/Intermediates.noindex/ShapeScript.build/Debug-iphoneos/shapescript.build/shapescript.DependencyStaticMetadataFileList (in target 'shapescript' from project 'ShapeScript')
    cd /Users/admin/builder/spi-builder-workspace
    write-file /Users/admin/builder/spi-builder-workspace/.derivedData/Build/Intermediates.noindex/ShapeScript.build/Debug-iphoneos/shapescript.build/shapescript.DependencyStaticMetadataFileList
WriteAuxiliaryFile /Users/admin/builder/spi-builder-workspace/.derivedData/Build/Intermediates.noindex/ShapeScript.build/Debug-iphoneos/shapescript.build/Objects-normal/arm64/shapescript-OutputFileMap.json (in target 'shapescript' from project 'ShapeScript')
    cd /Users/admin/builder/spi-builder-workspace
    write-file /Users/admin/builder/spi-builder-workspace/.derivedData/Build/Intermediates.noindex/ShapeScript.build/Debug-iphoneos/shapescript.build/Objects-normal/arm64/shapescript-OutputFileMap.json
WriteAuxiliaryFile /Users/admin/builder/spi-builder-workspace/.derivedData/Build/Intermediates.noindex/ShapeScript.build/Debug-iphoneos/ShapeScript.build/Objects-normal/arm64/ShapeScript.SwiftFileList (in target 'ShapeScript' from project 'ShapeScript')
    cd /Users/admin/builder/spi-builder-workspace
    write-file /Users/admin/builder/spi-builder-workspace/.derivedData/Build/Intermediates.noindex/ShapeScript.build/Debug-iphoneos/ShapeScript.build/Objects-normal/arm64/ShapeScript.SwiftFileList
SwiftDriver LRUCache normal arm64 com.apple.xcode.tools.swift.compiler (in target 'LRUCache' from project 'LRUCache')
    cd /Users/admin/builder/spi-builder-workspace/.swiftpm/xcode
    builtin-SwiftDriver -- /Applications/Xcode-16.3.0.app/Contents/Developer/Toolchains/XcodeDefault.xctoolchain/usr/bin/swiftc -module-name LRUCache -Onone -enforce-exclusivity\=checked @/Users/admin/builder/spi-builder-workspace/.derivedData/Build/Intermediates.noindex/LRUCache.build/Debug-iphoneos/LRUCache.build/Objects-normal/arm64/LRUCache.SwiftFileList -DSWIFT_PACKAGE -DDEBUG -DXcode -plugin-path /Applications/Xcode-16.3.0.app/Contents/Developer/Toolchains/XcodeDefault.xctoolchain/usr/lib/swift/host/plugins/testing -enable-experimental-feature DebugDescriptionMacro -sdk /Applications/Xcode-16.3.0.app/Contents/Developer/Platforms/iPhoneOS.platform/Developer/SDKs/iPhoneOS18.4.sdk -target arm64-apple-ios12.0 -g -module-cache-path /Users/admin/builder/spi-builder-workspace/.derivedData/ModuleCache.noindex -Xfrontend -serialize-debugging-options -profile-coverage-mapping -profile-generate -enable-testing -suppress-warnings -index-store-path /Users/admin/builder/spi-builder-workspace/.derivedData/Index.noindex/DataStore -swift-version 5 -I /Users/admin/builder/spi-builder-workspace/.derivedData/Build/Products/Debug-iphoneos -I /Applications/Xcode-16.3.0.app/Contents/Developer/Platforms/iPhoneOS.platform/Developer/usr/lib -F /Users/admin/builder/spi-builder-workspace/.derivedData/Build/Products/Debug-iphoneos -F /Applications/Xcode-16.3.0.app/Contents/Developer/Platforms/iPhoneOS.platform/Developer/Library/Frameworks -F /Applications/Xcode-16.3.0.app/Contents/Developer/Platforms/iPhoneOS.platform/Developer/SDKs/iPhoneOS18.4.sdk/Developer/Library/Frameworks -parse-as-library -c -j10 -enable-batch-mode -incremental -Xcc -ivfsstatcache -Xcc /Users/admin/builder/spi-builder-workspace/.derivedData/SDKStatCaches.noindex/iphoneos18.4-22E235-339d34bc69d7fc736c3220795c36f340.sdkstatcache -output-file-map /Users/admin/builder/spi-builder-workspace/.derivedData/Build/Intermediates.noindex/LRUCache.build/Debug-iphoneos/LRUCache.build/Objects-normal/arm64/LRUCache-OutputFileMap.json -use-frontend-parseable-output -save-temps -no-color-diagnostics -serialize-diagnostics -emit-dependencies -emit-module -emit-module-path /Users/admin/builder/spi-builder-workspace/.derivedData/Build/Intermediates.noindex/LRUCache.build/Debug-iphoneos/LRUCache.build/Objects-normal/arm64/LRUCache.swiftmodule -validate-clang-modules-once -clang-build-session-file /Users/admin/builder/spi-builder-workspace/.derivedData/ModuleCache.noindex/Session.modulevalidation -Xcc -I/Users/admin/builder/spi-builder-workspace/.derivedData/Build/Intermediates.noindex/LRUCache.build/Debug-iphoneos/LRUCache.build/swift-overrides.hmap -emit-const-values -Xfrontend -const-gather-protocols-file -Xfrontend /Users/admin/builder/spi-builder-workspace/.derivedData/Build/Intermediates.noindex/LRUCache.build/Debug-iphoneos/LRUCache.build/Objects-normal/arm64/LRUCache_const_extract_protocols.json -Xcc -I/Users/admin/builder/spi-builder-workspace/.derivedData/Build/Products/Debug-iphoneos/include -Xcc -I/Users/admin/builder/spi-builder-workspace/.derivedData/Build/Intermediates.noindex/LRUCache.build/Debug-iphoneos/LRUCache.build/DerivedSources-normal/arm64 -Xcc -I/Users/admin/builder/spi-builder-workspace/.derivedData/Build/Intermediates.noindex/LRUCache.build/Debug-iphoneos/LRUCache.build/DerivedSources/arm64 -Xcc -I/Users/admin/builder/spi-builder-workspace/.derivedData/Build/Intermediates.noindex/LRUCache.build/Debug-iphoneos/LRUCache.build/DerivedSources -Xcc -DSWIFT_PACKAGE -Xcc -DDEBUG\=1 -emit-objc-header -emit-objc-header-path /Users/admin/builder/spi-builder-workspace/.derivedData/Build/Intermediates.noindex/LRUCache.build/Debug-iphoneos/LRUCache.build/Objects-normal/arm64/LRUCache-Swift.h -working-directory /Users/admin/builder/spi-builder-workspace/.swiftpm/xcode -experimental-emit-module-separately -disable-cmo
SwiftDriver SVGPath normal arm64 com.apple.xcode.tools.swift.compiler (in target 'SVGPath' from project 'SVGPath')
    cd /Users/admin/builder/spi-builder-workspace/.swiftpm/xcode
    builtin-SwiftDriver -- /Applications/Xcode-16.3.0.app/Contents/Developer/Toolchains/XcodeDefault.xctoolchain/usr/bin/swiftc -module-name SVGPath -Onone -enforce-exclusivity\=checked @/Users/admin/builder/spi-builder-workspace/.derivedData/Build/Intermediates.noindex/SVGPath.build/Debug-iphoneos/SVGPath.build/Objects-normal/arm64/SVGPath.SwiftFileList -DSWIFT_PACKAGE -DDEBUG -DXcode -plugin-path /Applications/Xcode-16.3.0.app/Contents/Developer/Toolchains/XcodeDefault.xctoolchain/usr/lib/swift/host/plugins/testing -enable-experimental-feature DebugDescriptionMacro -sdk /Applications/Xcode-16.3.0.app/Contents/Developer/Platforms/iPhoneOS.platform/Developer/SDKs/iPhoneOS18.4.sdk -target arm64-apple-ios12.0 -g -module-cache-path /Users/admin/builder/spi-builder-workspace/.derivedData/ModuleCache.noindex -Xfrontend -serialize-debugging-options -profile-coverage-mapping -profile-generate -enable-testing -suppress-warnings -index-store-path /Users/admin/builder/spi-builder-workspace/.derivedData/Index.noindex/DataStore -swift-version 5 -I /Users/admin/builder/spi-builder-workspace/.derivedData/Build/Products/Debug-iphoneos -I /Applications/Xcode-16.3.0.app/Contents/Developer/Platforms/iPhoneOS.platform/Developer/usr/lib -F /Users/admin/builder/spi-builder-workspace/.derivedData/Build/Products/Debug-iphoneos -F /Applications/Xcode-16.3.0.app/Contents/Developer/Platforms/iPhoneOS.platform/Developer/Library/Frameworks -F /Applications/Xcode-16.3.0.app/Contents/Developer/Platforms/iPhoneOS.platform/Developer/SDKs/iPhoneOS18.4.sdk/Developer/Library/Frameworks -c -j10 -enable-batch-mode -incremental -Xcc -ivfsstatcache -Xcc /Users/admin/builder/spi-builder-workspace/.derivedData/SDKStatCaches.noindex/iphoneos18.4-22E235-339d34bc69d7fc736c3220795c36f340.sdkstatcache -output-file-map /Users/admin/builder/spi-builder-workspace/.derivedData/Build/Intermediates.noindex/SVGPath.build/Debug-iphoneos/SVGPath.build/Objects-normal/arm64/SVGPath-OutputFileMap.json -use-frontend-parseable-output -save-temps -no-color-diagnostics -serialize-diagnostics -emit-dependencies -emit-module -emit-module-path /Users/admin/builder/spi-builder-workspace/.derivedData/Build/Intermediates.noindex/SVGPath.build/Debug-iphoneos/SVGPath.build/Objects-normal/arm64/SVGPath.swiftmodule -validate-clang-modules-once -clang-build-session-file /Users/admin/builder/spi-builder-workspace/.derivedData/ModuleCache.noindex/Session.modulevalidation -Xcc -I/Users/admin/builder/spi-builder-workspace/.derivedData/Build/Intermediates.noindex/SVGPath.build/Debug-iphoneos/SVGPath.build/swift-overrides.hmap -emit-const-values -Xfrontend -const-gather-protocols-file -Xfrontend /Users/admin/builder/spi-builder-workspace/.derivedData/Build/Intermediates.noindex/SVGPath.build/Debug-iphoneos/SVGPath.build/Objects-normal/arm64/SVGPath_const_extract_protocols.json -Xcc -I/Users/admin/builder/spi-builder-workspace/.derivedData/Build/Products/Debug-iphoneos/include -Xcc -I/Users/admin/builder/spi-builder-workspace/.derivedData/Build/Intermediates.noindex/SVGPath.build/Debug-iphoneos/SVGPath.build/DerivedSources-normal/arm64 -Xcc -I/Users/admin/builder/spi-builder-workspace/.derivedData/Build/Intermediates.noindex/SVGPath.build/Debug-iphoneos/SVGPath.build/DerivedSources/arm64 -Xcc -I/Users/admin/builder/spi-builder-workspace/.derivedData/Build/Intermediates.noindex/SVGPath.build/Debug-iphoneos/SVGPath.build/DerivedSources -Xcc -DSWIFT_PACKAGE -Xcc -DDEBUG\=1 -emit-objc-header -emit-objc-header-path /Users/admin/builder/spi-builder-workspace/.derivedData/Build/Intermediates.noindex/SVGPath.build/Debug-iphoneos/SVGPath.build/Objects-normal/arm64/SVGPath-Swift.h -working-directory /Users/admin/builder/spi-builder-workspace/.swiftpm/xcode -experimental-emit-module-separately -disable-cmo
SwiftDriver Euclid normal arm64 com.apple.xcode.tools.swift.compiler (in target 'Euclid' from project 'Euclid')
    cd /Users/admin/builder/spi-builder-workspace/.swiftpm/xcode
    builtin-SwiftDriver -- /Applications/Xcode-16.3.0.app/Contents/Developer/Toolchains/XcodeDefault.xctoolchain/usr/bin/swiftc -module-name Euclid -Onone -enforce-exclusivity\=checked @/Users/admin/builder/spi-builder-workspace/.derivedData/Build/Intermediates.noindex/Euclid.build/Debug-iphoneos/Euclid.build/Objects-normal/arm64/Euclid.SwiftFileList -DSWIFT_PACKAGE -DDEBUG -DXcode -plugin-path /Applications/Xcode-16.3.0.app/Contents/Developer/Toolchains/XcodeDefault.xctoolchain/usr/lib/swift/host/plugins/testing -enable-experimental-feature DebugDescriptionMacro -sdk /Applications/Xcode-16.3.0.app/Contents/Developer/Platforms/iPhoneOS.platform/Developer/SDKs/iPhoneOS18.4.sdk -target arm64-apple-ios12.0 -g -module-cache-path /Users/admin/builder/spi-builder-workspace/.derivedData/ModuleCache.noindex -Xfrontend -serialize-debugging-options -profile-coverage-mapping -profile-generate -enable-testing -suppress-warnings -index-store-path /Users/admin/builder/spi-builder-workspace/.derivedData/Index.noindex/DataStore -swift-version 5 -I /Users/admin/builder/spi-builder-workspace/.derivedData/Build/Products/Debug-iphoneos -I /Applications/Xcode-16.3.0.app/Contents/Developer/Platforms/iPhoneOS.platform/Developer/usr/lib -F /Users/admin/builder/spi-builder-workspace/.derivedData/Build/Products/Debug-iphoneos -F /Applications/Xcode-16.3.0.app/Contents/Developer/Platforms/iPhoneOS.platform/Developer/Library/Frameworks -F /Applications/Xcode-16.3.0.app/Contents/Developer/Platforms/iPhoneOS.platform/Developer/SDKs/iPhoneOS18.4.sdk/Developer/Library/Frameworks -c -j10 -enable-batch-mode -incremental -Xcc -ivfsstatcache -Xcc /Users/admin/builder/spi-builder-workspace/.derivedData/SDKStatCaches.noindex/iphoneos18.4-22E235-339d34bc69d7fc736c3220795c36f340.sdkstatcache -output-file-map /Users/admin/builder/spi-builder-workspace/.derivedData/Build/Intermediates.noindex/Euclid.build/Debug-iphoneos/Euclid.build/Objects-normal/arm64/Euclid-OutputFileMap.json -use-frontend-parseable-output -save-temps -no-color-diagnostics -serialize-diagnostics -emit-dependencies -emit-module -emit-module-path /Users/admin/builder/spi-builder-workspace/.derivedData/Build/Intermediates.noindex/Euclid.build/Debug-iphoneos/Euclid.build/Objects-normal/arm64/Euclid.swiftmodule -validate-clang-modules-once -clang-build-session-file /Users/admin/builder/spi-builder-workspace/.derivedData/ModuleCache.noindex/Session.modulevalidation -Xcc -I/Users/admin/builder/spi-builder-workspace/.derivedData/Build/Intermediates.noindex/Euclid.build/Debug-iphoneos/Euclid.build/swift-overrides.hmap -emit-const-values -Xfrontend -const-gather-protocols-file -Xfrontend /Users/admin/builder/spi-builder-workspace/.derivedData/Build/Intermediates.noindex/Euclid.build/Debug-iphoneos/Euclid.build/Objects-normal/arm64/Euclid_const_extract_protocols.json -Xcc -I/Users/admin/builder/spi-builder-workspace/.derivedData/Build/Products/Debug-iphoneos/include -Xcc -I/Users/admin/builder/spi-builder-workspace/.derivedData/Build/Intermediates.noindex/Euclid.build/Debug-iphoneos/Euclid.build/DerivedSources-normal/arm64 -Xcc -I/Users/admin/builder/spi-builder-workspace/.derivedData/Build/Intermediates.noindex/Euclid.build/Debug-iphoneos/Euclid.build/DerivedSources/arm64 -Xcc -I/Users/admin/builder/spi-builder-workspace/.derivedData/Build/Intermediates.noindex/Euclid.build/Debug-iphoneos/Euclid.build/DerivedSources -Xcc -DSWIFT_PACKAGE -Xcc -DDEBUG\=1 -emit-objc-header -emit-objc-header-path /Users/admin/builder/spi-builder-workspace/.derivedData/Build/Intermediates.noindex/Euclid.build/Debug-iphoneos/Euclid.build/Objects-normal/arm64/Euclid-Swift.h -working-directory /Users/admin/builder/spi-builder-workspace/.swiftpm/xcode -experimental-emit-module-separately -disable-cmo
SwiftEmitModule normal arm64 Emitting\ module\ for\ LRUCache (in target 'LRUCache' from project 'LRUCache')
SwiftCompile normal arm64 /Users/admin/builder/spi-builder-workspace/.dependencies/checkouts/LRUCache/Sources/LRUCache.swift (in target 'LRUCache' from project 'LRUCache')
    cd /Users/admin/builder/spi-builder-workspace/.swiftpm/xcode

SwiftCompile normal arm64 Compiling\ LRUCache.swift /Users/admin/builder/spi-builder-workspace/.dependencies/checkouts/LRUCache/Sources/LRUCache.swift (in target 'LRUCache' from project 'LRUCache')
SwiftCompile normal arm64 /Users/admin/builder/spi-builder-workspace/.dependencies/checkouts/LRUCache/Sources/LRUCache.swift (in target 'LRUCache' from project 'LRUCache')
    cd /Users/admin/builder/spi-builder-workspace/.swiftpm/xcode

SwiftEmitModule normal arm64 Emitting\ module\ for\ SVGPath (in target 'SVGPath' from project 'SVGPath')
EmitSwiftModule normal arm64 (in target 'SVGPath' from project 'SVGPath')
    cd /Users/admin/builder/spi-builder-workspace/.swiftpm/xcode

SwiftCompile normal arm64 Compiling\ SVGPath.swift /Users/admin/builder/spi-builder-workspace/.dependencies/checkouts/SVGPath/Sources/SVGPath.swift (in target 'SVGPath' from project 'SVGPath')
SwiftCompile normal arm64 /Users/admin/builder/spi-builder-workspace/.dependencies/checkouts/SVGPath/Sources/SVGPath.swift (in target 'SVGPath' from project 'SVGPath')
    cd /Users/admin/builder/spi-builder-workspace/.swiftpm/xcode

SwiftCompile normal arm64 Compiling\ SVGPath+CoreGraphics.swift /Users/admin/builder/spi-builder-workspace/.dependencies/checkouts/SVGPath/Sources/SVGPath+CoreGraphics.swift (in target 'SVGPath' from project 'SVGPath')
SwiftCompile normal arm64 /Users/admin/builder/spi-builder-workspace/.dependencies/checkouts/SVGPath/Sources/SVGPath+CoreGraphics.swift (in target 'SVGPath' from project 'SVGPath')
    cd /Users/admin/builder/spi-builder-workspace/.swiftpm/xcode

SwiftCompile normal arm64 Compiling\ Euclid+SIMD.swift,\ Euclid+SceneKit.swift,\ Euclid+UIKit.swift,\ Line.swift /Users/admin/builder/spi-builder-workspace/.dependencies/checkouts/Euclid/Sources/Euclid+SIMD.swift /Users/admin/builder/spi-builder-workspace/.dependencies/checkouts/Euclid/Sources/Euclid+SceneKit.swift /Users/admin/builder/spi-builder-workspace/.dependencies/checkouts/Euclid/Sources/Euclid+UIKit.swift /Users/admin/builder/spi-builder-workspace/.dependencies/checkouts/Euclid/Sources/Line.swift (in target 'Euclid' from project 'Euclid')
SwiftCompile normal arm64 /Users/admin/builder/spi-builder-workspace/.dependencies/checkouts/Euclid/Sources/Euclid+SIMD.swift (in target 'Euclid' from project 'Euclid')
    cd /Users/admin/builder/spi-builder-workspace/.swiftpm/xcode

SwiftCompile normal arm64 /Users/admin/builder/spi-builder-workspace/.dependencies/checkouts/Euclid/Sources/Euclid+SceneKit.swift (in target 'Euclid' from project 'Euclid')
    cd /Users/admin/builder/spi-builder-workspace/.swiftpm/xcode

SwiftCompile normal arm64 /Users/admin/builder/spi-builder-workspace/.dependencies/checkouts/Euclid/Sources/Euclid+UIKit.swift (in target 'Euclid' from project 'Euclid')
    cd /Users/admin/builder/spi-builder-workspace/.swiftpm/xcode

SwiftCompile normal arm64 /Users/admin/builder/spi-builder-workspace/.dependencies/checkouts/Euclid/Sources/Line.swift (in target 'Euclid' from project 'Euclid')
    cd /Users/admin/builder/spi-builder-workspace/.swiftpm/xcode

SwiftCompile normal arm64 Compiling\ Mesh+OBJ.swift,\ Mesh+STL.swift,\ Mesh+Shapes.swift /Users/admin/builder/spi-builder-workspace/.dependencies/checkouts/Euclid/Sources/Mesh+OBJ.swift /Users/admin/builder/spi-builder-workspace/.dependencies/checkouts/Euclid/Sources/Mesh+STL.swift /Users/admin/builder/spi-builder-workspace/.dependencies/checkouts/Euclid/Sources/Mesh+Shapes.swift (in target 'Euclid' from project 'Euclid')
SwiftCompile normal arm64 /Users/admin/builder/spi-builder-workspace/.dependencies/checkouts/Euclid/Sources/Mesh+OBJ.swift (in target 'Euclid' from project 'Euclid')
    cd /Users/admin/builder/spi-builder-workspace/.swiftpm/xcode

SwiftCompile normal arm64 /Users/admin/builder/spi-builder-workspace/.dependencies/checkouts/Euclid/Sources/Mesh+STL.swift (in target 'Euclid' from project 'Euclid')
    cd /Users/admin/builder/spi-builder-workspace/.swiftpm/xcode

SwiftCompile normal arm64 /Users/admin/builder/spi-builder-workspace/.dependencies/checkouts/Euclid/Sources/Mesh+Shapes.swift (in target 'Euclid' from project 'Euclid')
    cd /Users/admin/builder/spi-builder-workspace/.swiftpm/xcode

SwiftEmitModule normal arm64 Emitting\ module\ for\ Euclid (in target 'Euclid' from project 'Euclid')
EmitSwiftModule normal arm64 (in target 'Euclid' from project 'Euclid')
    cd /Users/admin/builder/spi-builder-workspace/.swiftpm/xcode

SwiftCompile normal arm64 Compiling\ LineSegment+CSG.swift,\ LineSegment.swift,\ Mesh+CSG.swift,\ Mesh+IO.swift /Users/admin/builder/spi-builder-workspace/.dependencies/checkouts/Euclid/Sources/LineSegment+CSG.swift /Users/admin/builder/spi-builder-workspace/.dependencies/checkouts/Euclid/Sources/LineSegment.swift /Users/admin/builder/spi-builder-workspace/.dependencies/checkouts/Euclid/Sources/Mesh+CSG.swift /Users/admin/builder/spi-builder-workspace/.dependencies/checkouts/Euclid/Sources/Mesh+IO.swift (in target 'Euclid' from project 'Euclid')
SwiftCompile normal arm64 /Users/admin/builder/spi-builder-workspace/.dependencies/checkouts/Euclid/Sources/LineSegment+CSG.swift (in target 'Euclid' from project 'Euclid')
    cd /Users/admin/builder/spi-builder-workspace/.swiftpm/xcode

SwiftCompile normal arm64 /Users/admin/builder/spi-builder-workspace/.dependencies/checkouts/Euclid/Sources/LineSegment.swift (in target 'Euclid' from project 'Euclid')
    cd /Users/admin/builder/spi-builder-workspace/.swiftpm/xcode

SwiftCompile normal arm64 /Users/admin/builder/spi-builder-workspace/.dependencies/checkouts/Euclid/Sources/Mesh+CSG.swift (in target 'Euclid' from project 'Euclid')
    cd /Users/admin/builder/spi-builder-workspace/.swiftpm/xcode

SwiftCompile normal arm64 /Users/admin/builder/spi-builder-workspace/.dependencies/checkouts/Euclid/Sources/Mesh+IO.swift (in target 'Euclid' from project 'Euclid')
    cd /Users/admin/builder/spi-builder-workspace/.swiftpm/xcode

SwiftCompile normal arm64 Compiling\ Polygon+CSG.swift,\ Polygon.swift,\ Quaternion.swift /Users/admin/builder/spi-builder-workspace/.dependencies/checkouts/Euclid/Sources/Polygon+CSG.swift /Users/admin/builder/spi-builder-workspace/.dependencies/checkouts/Euclid/Sources/Polygon.swift /Users/admin/builder/spi-builder-workspace/.dependencies/checkouts/Euclid/Sources/Quaternion.swift (in target 'Euclid' from project 'Euclid')
SwiftCompile normal arm64 /Users/admin/builder/spi-builder-workspace/.dependencies/checkouts/Euclid/Sources/Polygon+CSG.swift (in target 'Euclid' from project 'Euclid')
    cd /Users/admin/builder/spi-builder-workspace/.swiftpm/xcode

SwiftCompile normal arm64 /Users/admin/builder/spi-builder-workspace/.dependencies/checkouts/Euclid/Sources/Polygon.swift (in target 'Euclid' from project 'Euclid')
    cd /Users/admin/builder/spi-builder-workspace/.swiftpm/xcode

SwiftCompile normal arm64 /Users/admin/builder/spi-builder-workspace/.dependencies/checkouts/Euclid/Sources/Quaternion.swift (in target 'Euclid' from project 'Euclid')
    cd /Users/admin/builder/spi-builder-workspace/.swiftpm/xcode

SwiftCompile normal arm64 Compiling\ Angle.swift,\ BSP.swift,\ Bounds.swift,\ Color.swift /Users/admin/builder/spi-builder-workspace/.dependencies/checkouts/Euclid/Sources/Angle.swift /Users/admin/builder/spi-builder-workspace/.dependencies/checkouts/Euclid/Sources/BSP.swift /Users/admin/builder/spi-builder-workspace/.dependencies/checkouts/Euclid/Sources/Bounds.swift /Users/admin/builder/spi-builder-workspace/.dependencies/checkouts/Euclid/Sources/Color.swift (in target 'Euclid' from project 'Euclid')
SwiftCompile normal arm64 /Users/admin/builder/spi-builder-workspace/.dependencies/checkouts/Euclid/Sources/Angle.swift (in target 'Euclid' from project 'Euclid')
    cd /Users/admin/builder/spi-builder-workspace/.swiftpm/xcode

SwiftCompile normal arm64 /Users/admin/builder/spi-builder-workspace/.dependencies/checkouts/Euclid/Sources/BSP.swift (in target 'Euclid' from project 'Euclid')
    cd /Users/admin/builder/spi-builder-workspace/.swiftpm/xcode

SwiftCompile normal arm64 /Users/admin/builder/spi-builder-workspace/.dependencies/checkouts/Euclid/Sources/Bounds.swift (in target 'Euclid' from project 'Euclid')
    cd /Users/admin/builder/spi-builder-workspace/.swiftpm/xcode

SwiftCompile normal arm64 /Users/admin/builder/spi-builder-workspace/.dependencies/checkouts/Euclid/Sources/Color.swift (in target 'Euclid' from project 'Euclid')
    cd /Users/admin/builder/spi-builder-workspace/.swiftpm/xcode

SwiftDriverJobDiscovery normal arm64 Emitting module for SVGPath (in target 'SVGPath' from project 'SVGPath')
SwiftDriver\ Compilation\ Requirements SVGPath normal arm64 com.apple.xcode.tools.swift.compiler (in target 'SVGPath' from project 'SVGPath')
    cd /Users/admin/builder/spi-builder-workspace/.swiftpm/xcode
    builtin-Swift-Compilation-Requirements -- /Applications/Xcode-16.3.0.app/Contents/Developer/Toolchains/XcodeDefault.xctoolchain/usr/bin/swiftc -module-name SVGPath -Onone -enforce-exclusivity\=checked @/Users/admin/builder/spi-builder-workspace/.derivedData/Build/Intermediates.noindex/SVGPath.build/Debug-iphoneos/SVGPath.build/Objects-normal/arm64/SVGPath.SwiftFileList -DSWIFT_PACKAGE -DDEBUG -DXcode -plugin-path /Applications/Xcode-16.3.0.app/Contents/Developer/Toolchains/XcodeDefault.xctoolchain/usr/lib/swift/host/plugins/testing -enable-experimental-feature DebugDescriptionMacro -sdk /Applications/Xcode-16.3.0.app/Contents/Developer/Platforms/iPhoneOS.platform/Developer/SDKs/iPhoneOS18.4.sdk -target arm64-apple-ios12.0 -g -module-cache-path /Users/admin/builder/spi-builder-workspace/.derivedData/ModuleCache.noindex -Xfrontend -serialize-debugging-options -profile-coverage-mapping -profile-generate -enable-testing -suppress-warnings -index-store-path /Users/admin/builder/spi-builder-workspace/.derivedData/Index.noindex/DataStore -swift-version 5 -I /Users/admin/builder/spi-builder-workspace/.derivedData/Build/Products/Debug-iphoneos -I /Applications/Xcode-16.3.0.app/Contents/Developer/Platforms/iPhoneOS.platform/Developer/usr/lib -F /Users/admin/builder/spi-builder-workspace/.derivedData/Build/Products/Debug-iphoneos -F /Applications/Xcode-16.3.0.app/Contents/Developer/Platforms/iPhoneOS.platform/Developer/Library/Frameworks -F /Applications/Xcode-16.3.0.app/Contents/Developer/Platforms/iPhoneOS.platform/Developer/SDKs/iPhoneOS18.4.sdk/Developer/Library/Frameworks -c -j10 -enable-batch-mode -incremental -Xcc -ivfsstatcache -Xcc /Users/admin/builder/spi-builder-workspace/.derivedData/SDKStatCaches.noindex/iphoneos18.4-22E235-339d34bc69d7fc736c3220795c36f340.sdkstatcache -output-file-map /Users/admin/builder/spi-builder-workspace/.derivedData/Build/Intermediates.noindex/SVGPath.build/Debug-iphoneos/SVGPath.build/Objects-normal/arm64/SVGPath-OutputFileMap.json -use-frontend-parseable-output -save-temps -no-color-diagnostics -serialize-diagnostics -emit-dependencies -emit-module -emit-module-path /Users/admin/builder/spi-builder-workspace/.derivedData/Build/Intermediates.noindex/SVGPath.build/Debug-iphoneos/SVGPath.build/Objects-normal/arm64/SVGPath.swiftmodule -validate-clang-modules-once -clang-build-session-file /Users/admin/builder/spi-builder-workspace/.derivedData/ModuleCache.noindex/Session.modulevalidation -Xcc -I/Users/admin/builder/spi-builder-workspace/.derivedData/Build/Intermediates.noindex/SVGPath.build/Debug-iphoneos/SVGPath.build/swift-overrides.hmap -emit-const-values -Xfrontend -const-gather-protocols-file -Xfrontend /Users/admin/builder/spi-builder-workspace/.derivedData/Build/Intermediates.noindex/SVGPath.build/Debug-iphoneos/SVGPath.build/Objects-normal/arm64/SVGPath_const_extract_protocols.json -Xcc -I/Users/admin/builder/spi-builder-workspace/.derivedData/Build/Products/Debug-iphoneos/include -Xcc -I/Users/admin/builder/spi-builder-workspace/.derivedData/Build/Intermediates.noindex/SVGPath.build/Debug-iphoneos/SVGPath.build/DerivedSources-normal/arm64 -Xcc -I/Users/admin/builder/spi-builder-workspace/.derivedData/Build/Intermediates.noindex/SVGPath.build/Debug-iphoneos/SVGPath.build/DerivedSources/arm64 -Xcc -I/Users/admin/builder/spi-builder-workspace/.derivedData/Build/Intermediates.noindex/SVGPath.build/Debug-iphoneos/SVGPath.build/DerivedSources -Xcc -DSWIFT_PACKAGE -Xcc -DDEBUG\=1 -emit-objc-header -emit-objc-header-path /Users/admin/builder/spi-builder-workspace/.derivedData/Build/Intermediates.noindex/SVGPath.build/Debug-iphoneos/SVGPath.build/Objects-normal/arm64/SVGPath-Swift.h -working-directory /Users/admin/builder/spi-builder-workspace/.swiftpm/xcode -experimental-emit-module-separately -disable-cmo
SwiftDriverJobDiscovery normal arm64 Compiling SVGPath+CoreGraphics.swift (in target 'SVGPath' from project 'SVGPath')
SwiftCompile normal arm64 Compiling\ Euclid+AppKit.swift,\ Euclid+CoreGraphics.swift,\ Euclid+CoreText.swift,\ Euclid+RealityKit.swift /Users/admin/builder/spi-builder-workspace/.dependencies/checkouts/Euclid/Sources/Euclid+AppKit.swift /Users/admin/builder/spi-builder-workspace/.dependencies/checkouts/Euclid/Sources/Euclid+CoreGraphics.swift /Users/admin/builder/spi-builder-workspace/.dependencies/checkouts/Euclid/Sources/Euclid+CoreText.swift /Users/admin/builder/spi-builder-workspace/.dependencies/checkouts/Euclid/Sources/Euclid+RealityKit.swift (in target 'Euclid' from project 'Euclid')
Failed frontend command:
/Applications/Xcode-16.3.0.app/Contents/Developer/Toolchains/XcodeDefault.xctoolchain/usr/bin/swift-frontend -frontend -c /Users/admin/builder/spi-builder-workspace/.dependencies/checkouts/Euclid/Sources/Angle.swift /Users/admin/builder/spi-builder-workspace/.dependencies/checkouts/Euclid/Sources/BSP.swift /Users/admin/builder/spi-builder-workspace/.dependencies/checkouts/Euclid/Sources/Bounds.swift /Users/admin/builder/spi-builder-workspace/.dependencies/checkouts/Euclid/Sources/Color.swift -primary-file /Users/admin/builder/spi-builder-workspace/.dependencies/checkouts/Euclid/Sources/Euclid+AppKit.swift -primary-file /Users/admin/builder/spi-builder-workspace/.dependencies/checkouts/Euclid/Sources/Euclid+CoreGraphics.swift -primary-file /Users/admin/builder/spi-builder-workspace/.dependencies/checkouts/Euclid/Sources/Euclid+CoreText.swift -primary-file /Users/admin/builder/spi-builder-workspace/.dependencies/checkouts/Euclid/Sources/Euclid+RealityKit.swift /Users/admin/builder/spi-builder-workspace/.dependencies/checkouts/Euclid/Sources/Euclid+SIMD.swift /Users/admin/builder/spi-builder-workspace/.dependencies/checkouts/Euclid/Sources/Euclid+SceneKit.swift /Users/admin/builder/spi-builder-workspace/.dependencies/checkouts/Euclid/Sources/Euclid+UIKit.swift /Users/admin/builder/spi-builder-workspace/.dependencies/checkouts/Euclid/Sources/Line.swift /Users/admin/builder/spi-builder-workspace/.dependencies/checkouts/Euclid/Sources/LineSegment+CSG.swift /Users/admin/builder/spi-builder-workspace/.dependencies/checkouts/Euclid/Sources/LineSegment.swift /Users/admin/builder/spi-builder-workspace/.dependencies/checkouts/Euclid/Sources/Mesh+CSG.swift /Users/admin/builder/spi-builder-workspace/.dependencies/checkouts/Euclid/Sources/Mesh+IO.swift /Users/admin/builder/spi-builder-workspace/.dependencies/checkouts/Euclid/Sources/Mesh+OBJ.swift /Users/admin/builder/spi-builder-workspace/.dependencies/checkouts/Euclid/Sources/Mesh+STL.swift /Users/admin/builder/spi-builder-workspace/.dependencies/checkouts/Euclid/Sources/Mesh+Shapes.swift /Users/admin/builder/spi-builder-workspace/.dependencies/checkouts/Euclid/Sources/Mesh+Texcoords.swift /Users/admin/builder/spi-builder-workspace/.dependencies/checkouts/Euclid/Sources/Mesh.swift /Users/admin/builder/spi-builder-workspace/.dependencies/checkouts/Euclid/Sources/Path+Shapes.swift /Users/admin/builder/spi-builder-workspace/.dependencies/checkouts/Euclid/Sources/Path.swift /Users/admin/builder/spi-builder-workspace/.dependencies/checkouts/Euclid/Sources/PathPoint.swift /Users/admin/builder/spi-builder-workspace/.dependencies/checkouts/Euclid/Sources/Plane.swift /Users/admin/builder/spi-builder-workspace/.dependencies/checkouts/Euclid/Sources/Polygon+CSG.swift /Users/admin/builder/spi-builder-workspace/.dependencies/checkouts/Euclid/Sources/Polygon.swift /Users/admin/builder/spi-builder-workspace/.dependencies/checkouts/Euclid/Sources/Quaternion.swift /Users/admin/builder/spi-builder-workspace/.dependencies/checkouts/Euclid/Sources/Rotation.swift /Users/admin/builder/spi-builder-workspace/.dependencies/checkouts/Euclid/Sources/Stretchable.swift /Users/admin/builder/spi-builder-workspace/.dependencies/checkouts/Euclid/Sources/Transforms.swift /Users/admin/builder/spi-builder-workspace/.dependencies/checkouts/Euclid/Sources/Utilities.swift /Users/admin/builder/spi-builder-workspace/.dependencies/checkouts/Euclid/Sources/Vector.swift /Users/admin/builder/spi-builder-workspace/.dependencies/checkouts/Euclid/Sources/Vertex.swift -supplementary-output-file-map /Users/admin/builder/spi-builder-workspace/.derivedData/Build/Intermediates.noindex/Euclid.build/Debug-iphoneos/Euclid.build/Objects-normal/arm64/supplementaryOutputs-2 -target arm64-apple-ios12.0 -Xllvm -aarch64-use-tbi -enable-objc-interop -sdk /Applications/Xcode-16.3.0.app/Contents/Developer/Platforms/iPhoneOS.platform/Developer/SDKs/iPhoneOS18.4.sdk -I /Users/admin/builder/spi-builder-workspace/.derivedData/Build/Products/Debug-iphoneos -I /Applications/Xcode-16.3.0.app/Contents/Developer/Platforms/iPhoneOS.platform/Developer/usr/lib -F /Users/admin/builder/spi-builder-workspace/.derivedData/Build/Products/Debug-iphoneos -F /Applications/Xcode-16.3.0.app/Contents/Developer/Platforms/iPhoneOS.platform/Developer/Library/Frameworks -F /Applications/Xcode-16.3.0.app/Contents/Developer/Platforms/iPhoneOS.platform/Developer/SDKs/iPhoneOS18.4.sdk/Developer/Library/Frameworks -no-color-diagnostics -enable-testing -g -debug-info-format\=dwarf -dwarf-version\=4 -module-cache-path /Users/admin/builder/spi-builder-workspace/.derivedData/ModuleCache.noindex -suppress-warnings -profile-generate -profile-coverage-mapping -swift-version 5 -enforce-exclusivity\=checked -Onone -D SWIFT_PACKAGE -D DEBUG -D Xcode -serialize-debugging-options -const-gather-protocols-file /Users/admin/builder/spi-builder-workspace/.derivedData/Build/Intermediates.noindex/Euclid.build/Debug-iphoneos/Euclid.build/Objects-normal/arm64/Euclid_const_extract_protocols.json -enable-experimental-feature DebugDescriptionMacro -empty-abi-descriptor -plugin-path /Applications/Xcode-16.3.0.app/Contents/Developer/Toolchains/XcodeDefault.xctoolchain/usr/lib/swift/host/plugins/testing -validate-clang-modules-once -clang-build-session-file /Users/admin/builder/spi-builder-workspace/.derivedData/ModuleCache.noindex/Session.modulevalidation -Xcc -working-directory -Xcc /Users/admin/builder/spi-builder-workspace/.swiftpm/xcode -resource-dir /Applications/Xcode-16.3.0.app/Contents/Developer/Toolchains/XcodeDefault.xctoolchain/usr/lib/swift -enable-anonymous-context-mangled-names -file-compilation-dir /Users/admin/builder/spi-builder-workspace/.swiftpm/xcode -Xcc -ivfsstatcache -Xcc /Users/admin/builder/spi-builder-workspace/.derivedData/SDKStatCaches.noindex/iphoneos18.4-22E235-339d34bc69d7fc736c3220795c36f340.sdkstatcache -Xcc -I/Users/admin/builder/spi-builder-workspace/.derivedData/Build/Intermediates.noindex/Euclid.build/Debug-iphoneos/Euclid.build/swift-overrides.hmap -Xcc -I/Users/admin/builder/spi-builder-workspace/.derivedData/Build/Products/Debug-iphoneos/include -Xcc -I/Users/admin/builder/spi-builder-workspace/.derivedData/Build/Intermediates.noindex/Euclid.build/Debug-iphoneos/Euclid.build/DerivedSources-normal/arm64 -Xcc -I/Users/admin/builder/spi-builder-workspace/.derivedData/Build/Intermediates.noindex/Euclid.build/Debug-iphoneos/Euclid.build/DerivedSources/arm64 -Xcc -I/Users/admin/builder/spi-builder-workspace/.derivedData/Build/Intermediates.noindex/Euclid.build/Debug-iphoneos/Euclid.build/DerivedSources -Xcc -DSWIFT_PACKAGE -Xcc -DDEBUG\=1 -module-name Euclid -frontend-parseable-output -disable-clang-spi -target-sdk-version 18.4 -target-sdk-name iphoneos18.4 -external-plugin-path /Applications/Xcode-16.3.0.app/Contents/Developer/Platforms/iPhoneOS.platform/Developer/usr/lib/swift/host/plugins\#/Applications/Xcode-16.3.0.app/Contents/Developer/Platforms/iPhoneOS.platform/Developer/usr/bin/swift-plugin-server -external-plugin-path /Applications/Xcode-16.3.0.app/Contents/Developer/Platforms/iPhoneOS.platform/Developer/usr/local/lib/swift/host/plugins\#/Applications/Xcode-16.3.0.app/Contents/Developer/Platforms/iPhoneOS.platform/Developer/usr/bin/swift-plugin-server -in-process-plugin-server-path /Applications/Xcode-16.3.0.app/Contents/Developer/Toolchains/XcodeDefault.xctoolchain/usr/lib/swift/host/libSwiftInProcPluginServer.dylib -plugin-path /Applications/Xcode-16.3.0.app/Contents/Developer/Toolchains/XcodeDefault.xctoolchain/usr/lib/swift/host/plugins -plugin-path /Applications/Xcode-16.3.0.app/Contents/Developer/Toolchains/XcodeDefault.xctoolchain/usr/local/lib/swift/host/plugins -o /Users/admin/builder/spi-builder-workspace/.derivedData/Build/Intermediates.noindex/Euclid.build/Debug-iphoneos/Euclid.build/Objects-normal/arm64/Euclid+AppKit.o -o /Users/admin/builder/spi-builder-workspace/.derivedData/Build/Intermediates.noindex/Euclid.build/Debug-iphoneos/Euclid.build/Objects-normal/arm64/Euclid+CoreGraphics.o -o /Users/admin/builder/spi-builder-workspace/.derivedData/Build/Intermediates.noindex/Euclid.build/Debug-iphoneos/Euclid.build/Objects-normal/arm64/Euclid+CoreText.o -o /Users/admin/builder/spi-builder-workspace/.derivedData/Build/Intermediates.noindex/Euclid.build/Debug-iphoneos/Euclid.build/Objects-normal/arm64/Euclid+RealityKit.o -index-unit-output-path /Euclid.build/Debug-iphoneos/Euclid.build/Objects-normal/arm64/Euclid+AppKit.o -index-unit-output-path /Euclid.build/Debug-iphoneos/Euclid.build/Objects-normal/arm64/Euclid+CoreGraphics.o -index-unit-output-path /Euclid.build/Debug-iphoneos/Euclid.build/Objects-normal/arm64/Euclid+CoreText.o -index-unit-output-path /Euclid.build/Debug-iphoneos/Euclid.build/Objects-normal/arm64/Euclid+RealityKit.o -index-store-path /Users/admin/builder/spi-builder-workspace/.derivedData/Index.noindex/DataStore -index-system-modules
SwiftCompile normal arm64 /Users/admin/builder/spi-builder-workspace/.dependencies/checkouts/Euclid/Sources/Euclid+AppKit.swift (in target 'Euclid' from project 'Euclid')
    cd /Users/admin/builder/spi-builder-workspace/.swiftpm/xcode

SwiftCompile normal arm64 /Users/admin/builder/spi-builder-workspace/.dependencies/checkouts/Euclid/Sources/Euclid+CoreGraphics.swift (in target 'Euclid' from project 'Euclid')
    cd /Users/admin/builder/spi-builder-workspace/.swiftpm/xcode

SwiftCompile normal arm64 /Users/admin/builder/spi-builder-workspace/.dependencies/checkouts/Euclid/Sources/Euclid+CoreText.swift (in target 'Euclid' from project 'Euclid')
    cd /Users/admin/builder/spi-builder-workspace/.swiftpm/xcode

SwiftCompile normal arm64 /Users/admin/builder/spi-builder-workspace/.dependencies/checkouts/Euclid/Sources/Euclid+RealityKit.swift (in target 'Euclid' from project 'Euclid')
    cd /Users/admin/builder/spi-builder-workspace/.swiftpm/xcode

/Users/admin/builder/spi-builder-workspace/.dependencies/checkouts/Euclid/Sources/Euclid+RealityKit.swift:485:30: error: 'triangleFillMode' is only available in iOS 18.0 or newer
                    material.triangleFillMode = simpleMaterial.triangleFillMode
                             ^
/Users/admin/builder/spi-builder-workspace/.dependencies/checkouts/Euclid/Sources/Euclid+RealityKit.swift:485:30: note: add 'if #available' version check
                    material.triangleFillMode = simpleMaterial.triangleFillMode
                             ^
/Users/admin/builder/spi-builder-workspace/.dependencies/checkouts/Euclid/Sources/Euclid+RealityKit.swift:475:5: note: add @available attribute to enclosing initializer
    init(_ component: ModelComponent, materialLookup: RealityKitMaterialProvider? = nil) {
    ^
/Users/admin/builder/spi-builder-workspace/.dependencies/checkouts/Euclid/Sources/Euclid+RealityKit.swift:485:64: error: 'triangleFillMode' is only available in iOS 18.0 or newer
                    material.triangleFillMode = simpleMaterial.triangleFillMode
                                                               ^
/Users/admin/builder/spi-builder-workspace/.dependencies/checkouts/Euclid/Sources/Euclid+RealityKit.swift:485:64: note: add 'if #available' version check
                    material.triangleFillMode = simpleMaterial.triangleFillMode
                                                               ^
/Users/admin/builder/spi-builder-workspace/.dependencies/checkouts/Euclid/Sources/Euclid+RealityKit.swift:475:5: note: add @available attribute to enclosing initializer
    init(_ component: ModelComponent, materialLookup: RealityKitMaterialProvider? = nil) {
    ^
/Users/admin/builder/spi-builder-workspace/.dependencies/checkouts/Euclid/Sources/Euclid+RealityKit.swift:487:34: error: 'faceCulling' is only available in iOS 18.0 or newer
                        material.faceCulling = simpleMaterial.faceCulling
                                 ^
/Users/admin/builder/spi-builder-workspace/.dependencies/checkouts/Euclid/Sources/Euclid+RealityKit.swift:487:34: note: add 'if #available' version check
                        material.faceCulling = simpleMaterial.faceCulling
                                 ^
/Users/admin/builder/spi-builder-workspace/.dependencies/checkouts/Euclid/Sources/Euclid+RealityKit.swift:475:5: note: add @available attribute to enclosing initializer
    init(_ component: ModelComponent, materialLookup: RealityKitMaterialProvider? = nil) {
    ^
/Users/admin/builder/spi-builder-workspace/.dependencies/checkouts/Euclid/Sources/Euclid+RealityKit.swift:487:63: error: 'faceCulling' is only available in iOS 18.0 or newer
                        material.faceCulling = simpleMaterial.faceCulling
                                                              ^
/Users/admin/builder/spi-builder-workspace/.dependencies/checkouts/Euclid/Sources/Euclid+RealityKit.swift:487:63: note: add 'if #available' version check
                        material.faceCulling = simpleMaterial.faceCulling
                                                              ^
/Users/admin/builder/spi-builder-workspace/.dependencies/checkouts/Euclid/Sources/Euclid+RealityKit.swift:475:5: note: add @available attribute to enclosing initializer
    init(_ component: ModelComponent, materialLookup: RealityKitMaterialProvider? = nil) {
    ^
/Users/admin/builder/spi-builder-workspace/.dependencies/checkouts/Euclid/Sources/Euclid+RealityKit.swift:499:30: error: 'triangleFillMode' is only available in iOS 18.0 or newer
                    material.triangleFillMode = unlitMaterial.triangleFillMode
                             ^
/Users/admin/builder/spi-builder-workspace/.dependencies/checkouts/Euclid/Sources/Euclid+RealityKit.swift:499:30: note: add 'if #available' version check
                    material.triangleFillMode = unlitMaterial.triangleFillMode
                             ^
/Users/admin/builder/spi-builder-workspace/.dependencies/checkouts/Euclid/Sources/Euclid+RealityKit.swift:475:5: note: add @available attribute to enclosing initializer
    init(_ component: ModelComponent, materialLookup: RealityKitMaterialProvider? = nil) {
    ^
/Users/admin/builder/spi-builder-workspace/.dependencies/checkouts/Euclid/Sources/Euclid+RealityKit.swift:499:63: error: 'triangleFillMode' is only available in iOS 18.0 or newer
                    material.triangleFillMode = unlitMaterial.triangleFillMode
                                                              ^
/Users/admin/builder/spi-builder-workspace/.dependencies/checkouts/Euclid/Sources/Euclid+RealityKit.swift:499:63: note: add 'if #available' version check
                    material.triangleFillMode = unlitMaterial.triangleFillMode
                                                              ^
/Users/admin/builder/spi-builder-workspace/.dependencies/checkouts/Euclid/Sources/Euclid+RealityKit.swift:475:5: note: add @available attribute to enclosing initializer
    init(_ component: ModelComponent, materialLookup: RealityKitMaterialProvider? = nil) {
    ^
/Users/admin/builder/spi-builder-workspace/.dependencies/checkouts/Euclid/Sources/Euclid+RealityKit.swift:501:34: error: 'faceCulling' is only available in iOS 18.0 or newer
                        material.faceCulling = unlitMaterial.faceCulling
                                 ^
/Users/admin/builder/spi-builder-workspace/.dependencies/checkouts/Euclid/Sources/Euclid+RealityKit.swift:501:34: note: add 'if #available' version check
                        material.faceCulling = unlitMaterial.faceCulling
                                 ^
/Users/admin/builder/spi-builder-workspace/.dependencies/checkouts/Euclid/Sources/Euclid+RealityKit.swift:475:5: note: add @available attribute to enclosing initializer
    init(_ component: ModelComponent, materialLookup: RealityKitMaterialProvider? = nil) {
    ^
/Users/admin/builder/spi-builder-workspace/.dependencies/checkouts/Euclid/Sources/Euclid+RealityKit.swift:501:62: error: 'faceCulling' is only available in iOS 18.0 or newer
                        material.faceCulling = unlitMaterial.faceCulling
                                                             ^
/Users/admin/builder/spi-builder-workspace/.dependencies/checkouts/Euclid/Sources/Euclid+RealityKit.swift:501:62: note: add 'if #available' version check
                        material.faceCulling = unlitMaterial.faceCulling
                                                             ^
/Users/admin/builder/spi-builder-workspace/.dependencies/checkouts/Euclid/Sources/Euclid+RealityKit.swift:475:5: note: add @available attribute to enclosing initializer
    init(_ component: ModelComponent, materialLookup: RealityKitMaterialProvider? = nil) {
    ^
/Users/admin/builder/spi-builder-workspace/.dependencies/checkouts/Euclid/Sources/Euclid+RealityKit.swift:518:41: error: 'preferredViewingMode' is only available in iOS 18.0 or newer
                    material.controller.preferredViewingMode = videoMaterial.controller.preferredViewingMode
                                        ^
/Users/admin/builder/spi-builder-workspace/.dependencies/checkouts/Euclid/Sources/Euclid+RealityKit.swift:518:41: note: add 'if #available' version check
                    material.controller.preferredViewingMode = videoMaterial.controller.preferredViewingMode
                                        ^
/Users/admin/builder/spi-builder-workspace/.dependencies/checkouts/Euclid/Sources/Euclid+RealityKit.swift:475:5: note: add @available attribute to enclosing initializer
    init(_ component: ModelComponent, materialLookup: RealityKitMaterialProvider? = nil) {
    ^
/Users/admin/builder/spi-builder-workspace/.dependencies/checkouts/Euclid/Sources/Euclid+RealityKit.swift:518:89: error: 'preferredViewingMode' is only available in iOS 18.0 or newer
                    material.controller.preferredViewingMode = videoMaterial.controller.preferredViewingMode
                                                                                        ^
/Users/admin/builder/spi-builder-workspace/.dependencies/checkouts/Euclid/Sources/Euclid+RealityKit.swift:518:89: note: add 'if #available' version check
                    material.controller.preferredViewingMode = videoMaterial.controller.preferredViewingMode
                                                                                        ^
/Users/admin/builder/spi-builder-workspace/.dependencies/checkouts/Euclid/Sources/Euclid+RealityKit.swift:475:5: note: add @available attribute to enclosing initializer
    init(_ component: ModelComponent, materialLookup: RealityKitMaterialProvider? = nil) {
    ^
/Users/admin/builder/spi-builder-workspace/.dependencies/checkouts/Euclid/Sources/Euclid+RealityKit.swift:519:30: error: 'triangleFillMode' is only available in iOS 18.0 or newer
                    material.triangleFillMode = videoMaterial.triangleFillMode
                             ^
/Users/admin/builder/spi-builder-workspace/.dependencies/checkouts/Euclid/Sources/Euclid+RealityKit.swift:519:30: note: add 'if #available' version check
                    material.triangleFillMode = videoMaterial.triangleFillMode
                             ^
/Users/admin/builder/spi-builder-workspace/.dependencies/checkouts/Euclid/Sources/Euclid+RealityKit.swift:475:5: note: add @available attribute to enclosing initializer
    init(_ component: ModelComponent, materialLookup: RealityKitMaterialProvider? = nil) {
    ^
/Users/admin/builder/spi-builder-workspace/.dependencies/checkouts/Euclid/Sources/Euclid+RealityKit.swift:519:63: error: 'triangleFillMode' is only available in iOS 18.0 or newer
                    material.triangleFillMode = videoMaterial.triangleFillMode
                                                              ^
/Users/admin/builder/spi-builder-workspace/.dependencies/checkouts/Euclid/Sources/Euclid+RealityKit.swift:519:63: note: add 'if #available' version check
                    material.triangleFillMode = videoMaterial.triangleFillMode
                                                              ^
/Users/admin/builder/spi-builder-workspace/.dependencies/checkouts/Euclid/Sources/Euclid+RealityKit.swift:475:5: note: add @available attribute to enclosing initializer
    init(_ component: ModelComponent, materialLookup: RealityKitMaterialProvider? = nil) {
    ^
/Users/admin/builder/spi-builder-workspace/.dependencies/checkouts/Euclid/Sources/Euclid+RealityKit.swift:521:34: error: 'faceCulling' is only available in iOS 18.0 or newer
                        material.faceCulling = videoMaterial.faceCulling
                                 ^
/Users/admin/builder/spi-builder-workspace/.dependencies/checkouts/Euclid/Sources/Euclid+RealityKit.swift:521:34: note: add 'if #available' version check
                        material.faceCulling = videoMaterial.faceCulling
                                 ^
/Users/admin/builder/spi-builder-workspace/.dependencies/checkouts/Euclid/Sources/Euclid+RealityKit.swift:475:5: note: add @available attribute to enclosing initializer
    init(_ component: ModelComponent, materialLookup: RealityKitMaterialProvider? = nil) {
    ^
/Users/admin/builder/spi-builder-workspace/.dependencies/checkouts/Euclid/Sources/Euclid+RealityKit.swift:521:62: error: 'faceCulling' is only available in iOS 18.0 or newer
                        material.faceCulling = videoMaterial.faceCulling
                                                             ^
/Users/admin/builder/spi-builder-workspace/.dependencies/checkouts/Euclid/Sources/Euclid+RealityKit.swift:521:62: note: add 'if #available' version check
                        material.faceCulling = videoMaterial.faceCulling
                                                             ^
/Users/admin/builder/spi-builder-workspace/.dependencies/checkouts/Euclid/Sources/Euclid+RealityKit.swift:475:5: note: add @available attribute to enclosing initializer
    init(_ component: ModelComponent, materialLookup: RealityKitMaterialProvider? = nil) {
    ^
/Users/admin/builder/spi-builder-workspace/.dependencies/checkouts/Euclid/Sources/Euclid+RealityKit.swift:548:30: error: 'triangleFillMode' is only available in iOS 18.0 or newer
                    material.triangleFillMode = pbrMaterial.triangleFillMode
                             ^
/Users/admin/builder/spi-builder-workspace/.dependencies/checkouts/Euclid/Sources/Euclid+RealityKit.swift:548:30: note: add 'if #available' version check
                    material.triangleFillMode = pbrMaterial.triangleFillMode
                             ^
/Users/admin/builder/spi-builder-workspace/.dependencies/checkouts/Euclid/Sources/Euclid+RealityKit.swift:475:5: note: add @available attribute to enclosing initializer
    init(_ component: ModelComponent, materialLookup: RealityKitMaterialProvider? = nil) {
    ^
/Users/admin/builder/spi-builder-workspace/.dependencies/checkouts/Euclid/Sources/Euclid+RealityKit.swift:548:61: error: 'triangleFillMode' is only available in iOS 18.0 or newer
                    material.triangleFillMode = pbrMaterial.triangleFillMode
                                                            ^
/Users/admin/builder/spi-builder-workspace/.dependencies/checkouts/Euclid/Sources/Euclid+RealityKit.swift:548:61: note: add 'if #available' version check
                    material.triangleFillMode = pbrMaterial.triangleFillMode
                                                            ^
/Users/admin/builder/spi-builder-workspace/.dependencies/checkouts/Euclid/Sources/Euclid+RealityKit.swift:475:5: note: add @available attribute to enclosing initializer
    init(_ component: ModelComponent, materialLookup: RealityKitMaterialProvider? = nil) {
    ^
/Users/admin/builder/spi-builder-workspace/.dependencies/checkouts/Euclid/Sources/Euclid+RealityKit.swift:558:48: error: 'PortalMaterial' is only available in iOS 18.0 or newer
                   let portalMaterial = $0 as? PortalMaterial
                                               ^
/Users/admin/builder/spi-builder-workspace/.dependencies/checkouts/Euclid/Sources/Euclid+RealityKit.swift:558:48: note: add 'if #available' version check
                   let portalMaterial = $0 as? PortalMaterial
                                               ^
/Users/admin/builder/spi-builder-workspace/.dependencies/checkouts/Euclid/Sources/Euclid+RealityKit.swift:475:5: note: add @available attribute to enclosing initializer
    init(_ component: ModelComponent, materialLookup: RealityKitMaterialProvider? = nil) {
    ^
/Users/admin/builder/spi-builder-workspace/.dependencies/checkouts/Euclid/Sources/Euclid+RealityKit.swift:560:36: error: 'PortalMaterial' is only available in iOS 18.0 or newer
                    var material = PortalMaterial()
                                   ^
/Users/admin/builder/spi-builder-workspace/.dependencies/checkouts/Euclid/Sources/Euclid+RealityKit.swift:560:36: note: add 'if #available' version check
                    var material = PortalMaterial()
                                   ^
/Users/admin/builder/spi-builder-workspace/.dependencies/checkouts/Euclid/Sources/Euclid+RealityKit.swift:475:5: note: add @available attribute to enclosing initializer
    init(_ component: ModelComponent, materialLookup: RealityKitMaterialProvider? = nil) {
    ^
/Users/admin/builder/spi-builder-workspace/.dependencies/checkouts/Euclid/Sources/Euclid+RealityKit.swift:561:30: error: 'triangleFillMode' is only available in iOS 18.0 or newer
                    material.triangleFillMode = portalMaterial.triangleFillMode
                             ^
/Users/admin/builder/spi-builder-workspace/.dependencies/checkouts/Euclid/Sources/Euclid+RealityKit.swift:561:30: note: add 'if #available' version check
                    material.triangleFillMode = portalMaterial.triangleFillMode
                             ^
/Users/admin/builder/spi-builder-workspace/.dependencies/checkouts/Euclid/Sources/Euclid+RealityKit.swift:475:5: note: add @available attribute to enclosing initializer
    init(_ component: ModelComponent, materialLookup: RealityKitMaterialProvider? = nil) {
    ^
/Users/admin/builder/spi-builder-workspace/.dependencies/checkouts/Euclid/Sources/Euclid+RealityKit.swift:561:64: error: 'triangleFillMode' is only available in iOS 18.0 or newer
                    material.triangleFillMode = portalMaterial.triangleFillMode
                                                               ^
/Users/admin/builder/spi-builder-workspace/.dependencies/checkouts/Euclid/Sources/Euclid+RealityKit.swift:561:64: note: add 'if #available' version check
                    material.triangleFillMode = portalMaterial.triangleFillMode
                                                               ^
/Users/admin/builder/spi-builder-workspace/.dependencies/checkouts/Euclid/Sources/Euclid+RealityKit.swift:475:5: note: add @available attribute to enclosing initializer
    init(_ component: ModelComponent, materialLookup: RealityKitMaterialProvider? = nil) {
    ^
/Users/admin/builder/spi-builder-workspace/.dependencies/checkouts/Euclid/Sources/Euclid+RealityKit.swift:563:34: error: 'faceCulling' is only available in iOS 18.0 or newer
                        material.faceCulling = portalMaterial.faceCulling
                                 ^
/Users/admin/builder/spi-builder-workspace/.dependencies/checkouts/Euclid/Sources/Euclid+RealityKit.swift:563:34: note: add 'if #available' version check
                        material.faceCulling = portalMaterial.faceCulling
                                 ^
/Users/admin/builder/spi-builder-workspace/.dependencies/checkouts/Euclid/Sources/Euclid+RealityKit.swift:475:5: note: add @available attribute to enclosing initializer
    init(_ component: ModelComponent, materialLookup: RealityKitMaterialProvider? = nil) {
    ^
/Users/admin/builder/spi-builder-workspace/.dependencies/checkouts/Euclid/Sources/Euclid+RealityKit.swift:563:63: error: 'faceCulling' is only available in iOS 18.0 or newer
                        material.faceCulling = portalMaterial.faceCulling
                                                              ^
/Users/admin/builder/spi-builder-workspace/.dependencies/checkouts/Euclid/Sources/Euclid+RealityKit.swift:563:63: note: add 'if #available' version check
                        material.faceCulling = portalMaterial.faceCulling
                                                              ^
/Users/admin/builder/spi-builder-workspace/.dependencies/checkouts/Euclid/Sources/Euclid+RealityKit.swift:475:5: note: add @available attribute to enclosing initializer
    init(_ component: ModelComponent, materialLookup: RealityKitMaterialProvider? = nil) {
    ^
Copy /Users/admin/builder/spi-builder-workspace/.derivedData/Build/Products/Debug-iphoneos/SVGPath.swiftmodule/arm64-apple-ios.abi.json /Users/admin/builder/spi-builder-workspace/.derivedData/Build/Intermediates.noindex/SVGPath.build/Debug-iphoneos/SVGPath.build/Objects-normal/arm64/SVGPath.abi.json (in target 'SVGPath' from project 'SVGPath')
    cd /Users/admin/builder/spi-builder-workspace/.dependencies/checkouts/SVGPath
    builtin-copy -exclude .DS_Store -exclude CVS -exclude .svn -exclude .git -exclude .hg -resolve-src-symlinks -rename /Users/admin/builder/spi-builder-workspace/.derivedData/Build/Intermediates.noindex/SVGPath.build/Debug-iphoneos/SVGPath.build/Objects-normal/arm64/SVGPath.abi.json /Users/admin/builder/spi-builder-workspace/.derivedData/Build/Products/Debug-iphoneos/SVGPath.swiftmodule/arm64-apple-ios.abi.json
SwiftDriverJobDiscovery normal arm64 Emitting module for LRUCache (in target 'LRUCache' from project 'LRUCache')
SwiftDriver\ Compilation\ Requirements LRUCache normal arm64 com.apple.xcode.tools.swift.compiler (in target 'LRUCache' from project 'LRUCache')
    cd /Users/admin/builder/spi-builder-workspace/.swiftpm/xcode
    builtin-Swift-Compilation-Requirements -- /Applications/Xcode-16.3.0.app/Contents/Developer/Toolchains/XcodeDefault.xctoolchain/usr/bin/swiftc -module-name LRUCache -Onone -enforce-exclusivity\=checked @/Users/admin/builder/spi-builder-workspace/.derivedData/Build/Intermediates.noindex/LRUCache.build/Debug-iphoneos/LRUCache.build/Objects-normal/arm64/LRUCache.SwiftFileList -DSWIFT_PACKAGE -DDEBUG -DXcode -plugin-path /Applications/Xcode-16.3.0.app/Contents/Developer/Toolchains/XcodeDefault.xctoolchain/usr/lib/swift/host/plugins/testing -enable-experimental-feature DebugDescriptionMacro -sdk /Applications/Xcode-16.3.0.app/Contents/Developer/Platforms/iPhoneOS.platform/Developer/SDKs/iPhoneOS18.4.sdk -target arm64-apple-ios12.0 -g -module-cache-path /Users/admin/builder/spi-builder-workspace/.derivedData/ModuleCache.noindex -Xfrontend -serialize-debugging-options -profile-coverage-mapping -profile-generate -enable-testing -suppress-warnings -index-store-path /Users/admin/builder/spi-builder-workspace/.derivedData/Index.noindex/DataStore -swift-version 5 -I /Users/admin/builder/spi-builder-workspace/.derivedData/Build/Products/Debug-iphoneos -I /Applications/Xcode-16.3.0.app/Contents/Developer/Platforms/iPhoneOS.platform/Developer/usr/lib -F /Users/admin/builder/spi-builder-workspace/.derivedData/Build/Products/Debug-iphoneos -F /Applications/Xcode-16.3.0.app/Contents/Developer/Platforms/iPhoneOS.platform/Developer/Library/Frameworks -F /Applications/Xcode-16.3.0.app/Contents/Developer/Platforms/iPhoneOS.platform/Developer/SDKs/iPhoneOS18.4.sdk/Developer/Library/Frameworks -parse-as-library -c -j10 -enable-batch-mode -incremental -Xcc -ivfsstatcache -Xcc /Users/admin/builder/spi-builder-workspace/.derivedData/SDKStatCaches.noindex/iphoneos18.4-22E235-339d34bc69d7fc736c3220795c36f340.sdkstatcache -output-file-map /Users/admin/builder/spi-builder-workspace/.derivedData/Build/Intermediates.noindex/LRUCache.build/Debug-iphoneos/LRUCache.build/Objects-normal/arm64/LRUCache-OutputFileMap.json -use-frontend-parseable-output -save-temps -no-color-diagnostics -serialize-diagnostics -emit-dependencies -emit-module -emit-module-path /Users/admin/builder/spi-builder-workspace/.derivedData/Build/Intermediates.noindex/LRUCache.build/Debug-iphoneos/LRUCache.build/Objects-normal/arm64/LRUCache.swiftmodule -validate-clang-modules-once -clang-build-session-file /Users/admin/builder/spi-builder-workspace/.derivedData/ModuleCache.noindex/Session.modulevalidation -Xcc -I/Users/admin/builder/spi-builder-workspace/.derivedData/Build/Intermediates.noindex/LRUCache.build/Debug-iphoneos/LRUCache.build/swift-overrides.hmap -emit-const-values -Xfrontend -const-gather-protocols-file -Xfrontend /Users/admin/builder/spi-builder-workspace/.derivedData/Build/Intermediates.noindex/LRUCache.build/Debug-iphoneos/LRUCache.build/Objects-normal/arm64/LRUCache_const_extract_protocols.json -Xcc -I/Users/admin/builder/spi-builder-workspace/.derivedData/Build/Products/Debug-iphoneos/include -Xcc -I/Users/admin/builder/spi-builder-workspace/.derivedData/Build/Intermediates.noindex/LRUCache.build/Debug-iphoneos/LRUCache.build/DerivedSources-normal/arm64 -Xcc -I/Users/admin/builder/spi-builder-workspace/.derivedData/Build/Intermediates.noindex/LRUCache.build/Debug-iphoneos/LRUCache.build/DerivedSources/arm64 -Xcc -I/Users/admin/builder/spi-builder-workspace/.derivedData/Build/Intermediates.noindex/LRUCache.build/Debug-iphoneos/LRUCache.build/DerivedSources -Xcc -DSWIFT_PACKAGE -Xcc -DDEBUG\=1 -emit-objc-header -emit-objc-header-path /Users/admin/builder/spi-builder-workspace/.derivedData/Build/Intermediates.noindex/LRUCache.build/Debug-iphoneos/LRUCache.build/Objects-normal/arm64/LRUCache-Swift.h -working-directory /Users/admin/builder/spi-builder-workspace/.swiftpm/xcode -experimental-emit-module-separately -disable-cmo
SwiftCompile normal arm64 Compiling\ Rotation.swift,\ Stretchable.swift,\ Transforms.swift /Users/admin/builder/spi-builder-workspace/.dependencies/checkouts/Euclid/Sources/Rotation.swift /Users/admin/builder/spi-builder-workspace/.dependencies/checkouts/Euclid/Sources/Stretchable.swift /Users/admin/builder/spi-builder-workspace/.dependencies/checkouts/Euclid/Sources/Transforms.swift (in target 'Euclid' from project 'Euclid')
SwiftCompile normal arm64 /Users/admin/builder/spi-builder-workspace/.dependencies/checkouts/Euclid/Sources/Rotation.swift (in target 'Euclid' from project 'Euclid')
    cd /Users/admin/builder/spi-builder-workspace/.swiftpm/xcode

SwiftCompile normal arm64 /Users/admin/builder/spi-builder-workspace/.dependencies/checkouts/Euclid/Sources/Stretchable.swift (in target 'Euclid' from project 'Euclid')
    cd /Users/admin/builder/spi-builder-workspace/.swiftpm/xcode

SwiftCompile normal arm64 /Users/admin/builder/spi-builder-workspace/.dependencies/checkouts/Euclid/Sources/Transforms.swift (in target 'Euclid' from project 'Euclid')
    cd /Users/admin/builder/spi-builder-workspace/.swiftpm/xcode

Copy /Users/admin/builder/spi-builder-workspace/.derivedData/Build/Products/Debug-iphoneos/LRUCache.swiftmodule/arm64-apple-ios.abi.json /Users/admin/builder/spi-builder-workspace/.derivedData/Build/Intermediates.noindex/LRUCache.build/Debug-iphoneos/LRUCache.build/Objects-normal/arm64/LRUCache.abi.json (in target 'LRUCache' from project 'LRUCache')
    cd /Users/admin/builder/spi-builder-workspace/.dependencies/checkouts/LRUCache
    builtin-copy -exclude .DS_Store -exclude CVS -exclude .svn -exclude .git -exclude .hg -resolve-src-symlinks -rename /Users/admin/builder/spi-builder-workspace/.derivedData/Build/Intermediates.noindex/LRUCache.build/Debug-iphoneos/LRUCache.build/Objects-normal/arm64/LRUCache.abi.json /Users/admin/builder/spi-builder-workspace/.derivedData/Build/Products/Debug-iphoneos/LRUCache.swiftmodule/arm64-apple-ios.abi.json
SwiftDriverJobDiscovery normal arm64 Compiling LRUCache.swift (in target 'LRUCache' from project 'LRUCache')
SwiftCompile normal arm64 Compiling\ Path.swift,\ PathPoint.swift,\ Plane.swift /Users/admin/builder/spi-builder-workspace/.dependencies/checkouts/Euclid/Sources/Path.swift /Users/admin/builder/spi-builder-workspace/.dependencies/checkouts/Euclid/Sources/PathPoint.swift /Users/admin/builder/spi-builder-workspace/.dependencies/checkouts/Euclid/Sources/Plane.swift (in target 'Euclid' from project 'Euclid')
SwiftCompile normal arm64 /Users/admin/builder/spi-builder-workspace/.dependencies/checkouts/Euclid/Sources/Path.swift (in target 'Euclid' from project 'Euclid')
    cd /Users/admin/builder/spi-builder-workspace/.swiftpm/xcode

SwiftCompile normal arm64 /Users/admin/builder/spi-builder-workspace/.dependencies/checkouts/Euclid/Sources/PathPoint.swift (in target 'Euclid' from project 'Euclid')
    cd /Users/admin/builder/spi-builder-workspace/.swiftpm/xcode

SwiftCompile normal arm64 /Users/admin/builder/spi-builder-workspace/.dependencies/checkouts/Euclid/Sources/Plane.swift (in target 'Euclid' from project 'Euclid')
    cd /Users/admin/builder/spi-builder-workspace/.swiftpm/xcode

SwiftDriver\ Compilation LRUCache normal arm64 com.apple.xcode.tools.swift.compiler (in target 'LRUCache' from project 'LRUCache')
    cd /Users/admin/builder/spi-builder-workspace/.swiftpm/xcode
    builtin-Swift-Compilation -- /Applications/Xcode-16.3.0.app/Contents/Developer/Toolchains/XcodeDefault.xctoolchain/usr/bin/swiftc -module-name LRUCache -Onone -enforce-exclusivity\=checked @/Users/admin/builder/spi-builder-workspace/.derivedData/Build/Intermediates.noindex/LRUCache.build/Debug-iphoneos/LRUCache.build/Objects-normal/arm64/LRUCache.SwiftFileList -DSWIFT_PACKAGE -DDEBUG -DXcode -plugin-path /Applications/Xcode-16.3.0.app/Contents/Developer/Toolchains/XcodeDefault.xctoolchain/usr/lib/swift/host/plugins/testing -enable-experimental-feature DebugDescriptionMacro -sdk /Applications/Xcode-16.3.0.app/Contents/Developer/Platforms/iPhoneOS.platform/Developer/SDKs/iPhoneOS18.4.sdk -target arm64-apple-ios12.0 -g -module-cache-path /Users/admin/builder/spi-builder-workspace/.derivedData/ModuleCache.noindex -Xfrontend -serialize-debugging-options -profile-coverage-mapping -profile-generate -enable-testing -suppress-warnings -index-store-path /Users/admin/builder/spi-builder-workspace/.derivedData/Index.noindex/DataStore -swift-version 5 -I /Users/admin/builder/spi-builder-workspace/.derivedData/Build/Products/Debug-iphoneos -I /Applications/Xcode-16.3.0.app/Contents/Developer/Platforms/iPhoneOS.platform/Developer/usr/lib -F /Users/admin/builder/spi-builder-workspace/.derivedData/Build/Products/Debug-iphoneos -F /Applications/Xcode-16.3.0.app/Contents/Developer/Platforms/iPhoneOS.platform/Developer/Library/Frameworks -F /Applications/Xcode-16.3.0.app/Contents/Developer/Platforms/iPhoneOS.platform/Developer/SDKs/iPhoneOS18.4.sdk/Developer/Library/Frameworks -parse-as-library -c -j10 -enable-batch-mode -incremental -Xcc -ivfsstatcache -Xcc /Users/admin/builder/spi-builder-workspace/.derivedData/SDKStatCaches.noindex/iphoneos18.4-22E235-339d34bc69d7fc736c3220795c36f340.sdkstatcache -output-file-map /Users/admin/builder/spi-builder-workspace/.derivedData/Build/Intermediates.noindex/LRUCache.build/Debug-iphoneos/LRUCache.build/Objects-normal/arm64/LRUCache-OutputFileMap.json -use-frontend-parseable-output -save-temps -no-color-diagnostics -serialize-diagnostics -emit-dependencies -emit-module -emit-module-path /Users/admin/builder/spi-builder-workspace/.derivedData/Build/Intermediates.noindex/LRUCache.build/Debug-iphoneos/LRUCache.build/Objects-normal/arm64/LRUCache.swiftmodule -validate-clang-modules-once -clang-build-session-file /Users/admin/builder/spi-builder-workspace/.derivedData/ModuleCache.noindex/Session.modulevalidation -Xcc -I/Users/admin/builder/spi-builder-workspace/.derivedData/Build/Intermediates.noindex/LRUCache.build/Debug-iphoneos/LRUCache.build/swift-overrides.hmap -emit-const-values -Xfrontend -const-gather-protocols-file -Xfrontend /Users/admin/builder/spi-builder-workspace/.derivedData/Build/Intermediates.noindex/LRUCache.build/Debug-iphoneos/LRUCache.build/Objects-normal/arm64/LRUCache_const_extract_protocols.json -Xcc -I/Users/admin/builder/spi-builder-workspace/.derivedData/Build/Products/Debug-iphoneos/include -Xcc -I/Users/admin/builder/spi-builder-workspace/.derivedData/Build/Intermediates.noindex/LRUCache.build/Debug-iphoneos/LRUCache.build/DerivedSources-normal/arm64 -Xcc -I/Users/admin/builder/spi-builder-workspace/.derivedData/Build/Intermediates.noindex/LRUCache.build/Debug-iphoneos/LRUCache.build/DerivedSources/arm64 -Xcc -I/Users/admin/builder/spi-builder-workspace/.derivedData/Build/Intermediates.noindex/LRUCache.build/Debug-iphoneos/LRUCache.build/DerivedSources -Xcc -DSWIFT_PACKAGE -Xcc -DDEBUG\=1 -emit-objc-header -emit-objc-header-path /Users/admin/builder/spi-builder-workspace/.derivedData/Build/Intermediates.noindex/LRUCache.build/Debug-iphoneos/LRUCache.build/Objects-normal/arm64/LRUCache-Swift.h -working-directory /Users/admin/builder/spi-builder-workspace/.swiftpm/xcode -experimental-emit-module-separately -disable-cmo
SwiftDriverJobDiscovery normal arm64 Compiling SVGPath.swift (in target 'SVGPath' from project 'SVGPath')
SwiftCompile normal arm64 Compiling\ Utilities.swift,\ Vector.swift,\ Vertex.swift /Users/admin/builder/spi-builder-workspace/.dependencies/checkouts/Euclid/Sources/Utilities.swift /Users/admin/builder/spi-builder-workspace/.dependencies/checkouts/Euclid/Sources/Vector.swift /Users/admin/builder/spi-builder-workspace/.dependencies/checkouts/Euclid/Sources/Vertex.swift (in target 'Euclid' from project 'Euclid')
SwiftCompile normal arm64 /Users/admin/builder/spi-builder-workspace/.dependencies/checkouts/Euclid/Sources/Utilities.swift (in target 'Euclid' from project 'Euclid')
    cd /Users/admin/builder/spi-builder-workspace/.swiftpm/xcode

SwiftCompile normal arm64 /Users/admin/builder/spi-builder-workspace/.dependencies/checkouts/Euclid/Sources/Vector.swift (in target 'Euclid' from project 'Euclid')
    cd /Users/admin/builder/spi-builder-workspace/.swiftpm/xcode

SwiftCompile normal arm64 /Users/admin/builder/spi-builder-workspace/.dependencies/checkouts/Euclid/Sources/Vertex.swift (in target 'Euclid' from project 'Euclid')
    cd /Users/admin/builder/spi-builder-workspace/.swiftpm/xcode

SwiftDriver\ Compilation SVGPath normal arm64 com.apple.xcode.tools.swift.compiler (in target 'SVGPath' from project 'SVGPath')
    cd /Users/admin/builder/spi-builder-workspace/.swiftpm/xcode
    builtin-Swift-Compilation -- /Applications/Xcode-16.3.0.app/Contents/Developer/Toolchains/XcodeDefault.xctoolchain/usr/bin/swiftc -module-name SVGPath -Onone -enforce-exclusivity\=checked @/Users/admin/builder/spi-builder-workspace/.derivedData/Build/Intermediates.noindex/SVGPath.build/Debug-iphoneos/SVGPath.build/Objects-normal/arm64/SVGPath.SwiftFileList -DSWIFT_PACKAGE -DDEBUG -DXcode -plugin-path /Applications/Xcode-16.3.0.app/Contents/Developer/Toolchains/XcodeDefault.xctoolchain/usr/lib/swift/host/plugins/testing -enable-experimental-feature DebugDescriptionMacro -sdk /Applications/Xcode-16.3.0.app/Contents/Developer/Platforms/iPhoneOS.platform/Developer/SDKs/iPhoneOS18.4.sdk -target arm64-apple-ios12.0 -g -module-cache-path /Users/admin/builder/spi-builder-workspace/.derivedData/ModuleCache.noindex -Xfrontend -serialize-debugging-options -profile-coverage-mapping -profile-generate -enable-testing -suppress-warnings -index-store-path /Users/admin/builder/spi-builder-workspace/.derivedData/Index.noindex/DataStore -swift-version 5 -I /Users/admin/builder/spi-builder-workspace/.derivedData/Build/Products/Debug-iphoneos -I /Applications/Xcode-16.3.0.app/Contents/Developer/Platforms/iPhoneOS.platform/Developer/usr/lib -F /Users/admin/builder/spi-builder-workspace/.derivedData/Build/Products/Debug-iphoneos -F /Applications/Xcode-16.3.0.app/Contents/Developer/Platforms/iPhoneOS.platform/Developer/Library/Frameworks -F /Applications/Xcode-16.3.0.app/Contents/Developer/Platforms/iPhoneOS.platform/Developer/SDKs/iPhoneOS18.4.sdk/Developer/Library/Frameworks -c -j10 -enable-batch-mode -incremental -Xcc -ivfsstatcache -Xcc /Users/admin/builder/spi-builder-workspace/.derivedData/SDKStatCaches.noindex/iphoneos18.4-22E235-339d34bc69d7fc736c3220795c36f340.sdkstatcache -output-file-map /Users/admin/builder/spi-builder-workspace/.derivedData/Build/Intermediates.noindex/SVGPath.build/Debug-iphoneos/SVGPath.build/Objects-normal/arm64/SVGPath-OutputFileMap.json -use-frontend-parseable-output -save-temps -no-color-diagnostics -serialize-diagnostics -emit-dependencies -emit-module -emit-module-path /Users/admin/builder/spi-builder-workspace/.derivedData/Build/Intermediates.noindex/SVGPath.build/Debug-iphoneos/SVGPath.build/Objects-normal/arm64/SVGPath.swiftmodule -validate-clang-modules-once -clang-build-session-file /Users/admin/builder/spi-builder-workspace/.derivedData/ModuleCache.noindex/Session.modulevalidation -Xcc -I/Users/admin/builder/spi-builder-workspace/.derivedData/Build/Intermediates.noindex/SVGPath.build/Debug-iphoneos/SVGPath.build/swift-overrides.hmap -emit-const-values -Xfrontend -const-gather-protocols-file -Xfrontend /Users/admin/builder/spi-builder-workspace/.derivedData/Build/Intermediates.noindex/SVGPath.build/Debug-iphoneos/SVGPath.build/Objects-normal/arm64/SVGPath_const_extract_protocols.json -Xcc -I/Users/admin/builder/spi-builder-workspace/.derivedData/Build/Products/Debug-iphoneos/include -Xcc -I/Users/admin/builder/spi-builder-workspace/.derivedData/Build/Intermediates.noindex/SVGPath.build/Debug-iphoneos/SVGPath.build/DerivedSources-normal/arm64 -Xcc -I/Users/admin/builder/spi-builder-workspace/.derivedData/Build/Intermediates.noindex/SVGPath.build/Debug-iphoneos/SVGPath.build/DerivedSources/arm64 -Xcc -I/Users/admin/builder/spi-builder-workspace/.derivedData/Build/Intermediates.noindex/SVGPath.build/Debug-iphoneos/SVGPath.build/DerivedSources -Xcc -DSWIFT_PACKAGE -Xcc -DDEBUG\=1 -emit-objc-header -emit-objc-header-path /Users/admin/builder/spi-builder-workspace/.derivedData/Build/Intermediates.noindex/SVGPath.build/Debug-iphoneos/SVGPath.build/Objects-normal/arm64/SVGPath-Swift.h -working-directory /Users/admin/builder/spi-builder-workspace/.swiftpm/xcode -experimental-emit-module-separately -disable-cmo
SwiftDriverJobDiscovery normal arm64 Compiling LineSegment+CSG.swift, LineSegment.swift, Mesh+CSG.swift, Mesh+IO.swift (in target 'Euclid' from project 'Euclid')
SwiftCompile normal arm64 Compiling\ Mesh+Texcoords.swift,\ Mesh.swift,\ Path+Shapes.swift /Users/admin/builder/spi-builder-workspace/.dependencies/checkouts/Euclid/Sources/Mesh+Texcoords.swift /Users/admin/builder/spi-builder-workspace/.dependencies/checkouts/Euclid/Sources/Mesh.swift /Users/admin/builder/spi-builder-workspace/.dependencies/checkouts/Euclid/Sources/Path+Shapes.swift (in target 'Euclid' from project 'Euclid')
SwiftCompile normal arm64 /Users/admin/builder/spi-builder-workspace/.dependencies/checkouts/Euclid/Sources/Mesh+Texcoords.swift (in target 'Euclid' from project 'Euclid')
    cd /Users/admin/builder/spi-builder-workspace/.swiftpm/xcode

SwiftCompile normal arm64 /Users/admin/builder/spi-builder-workspace/.dependencies/checkouts/Euclid/Sources/Mesh.swift (in target 'Euclid' from project 'Euclid')
    cd /Users/admin/builder/spi-builder-workspace/.swiftpm/xcode

SwiftCompile normal arm64 /Users/admin/builder/spi-builder-workspace/.dependencies/checkouts/Euclid/Sources/Path+Shapes.swift (in target 'Euclid' from project 'Euclid')
    cd /Users/admin/builder/spi-builder-workspace/.swiftpm/xcode

SwiftDriverJobDiscovery normal arm64 Emitting module for Euclid (in target 'Euclid' from project 'Euclid')
Ld /Users/admin/builder/spi-builder-workspace/.derivedData/Build/Products/Debug-iphoneos/SVGPath.o normal (in target 'SVGPath' from project 'SVGPath')
    cd /Users/admin/builder/spi-builder-workspace/.dependencies/checkouts/SVGPath
    /Applications/Xcode-16.3.0.app/Contents/Developer/Toolchains/XcodeDefault.xctoolchain/usr/bin/clang -Xlinker -reproducible -target arm64-apple-ios12.0 -r -isysroot /Applications/Xcode-16.3.0.app/Contents/Developer/Platforms/iPhoneOS.platform/Developer/SDKs/iPhoneOS18.4.sdk -O0 -w -L/Users/admin/builder/spi-builder-workspace/.derivedData/Build/Intermediates.noindex/EagerLinkingTBDs/Debug-iphoneos -L/Users/admin/builder/spi-builder-workspace/.derivedData/Build/Products/Debug-iphoneos -L/Applications/Xcode-16.3.0.app/Contents/Developer/Platforms/iPhoneOS.platform/Developer/usr/lib -F/Users/admin/builder/spi-builder-workspace/.derivedData/Build/Intermediates.noindex/EagerLinkingTBDs/Debug-iphoneos -F/Users/admin/builder/spi-builder-workspace/.derivedData/Build/Products/Debug-iphoneos -iframework /Applications/Xcode-16.3.0.app/Contents/Developer/Platforms/iPhoneOS.platform/Developer/Library/Frameworks -iframework /Applications/Xcode-16.3.0.app/Contents/Developer/Platforms/iPhoneOS.platform/Developer/SDKs/iPhoneOS18.4.sdk/Developer/Library/Frameworks -filelist /Users/admin/builder/spi-builder-workspace/.derivedData/Build/Intermediates.noindex/SVGPath.build/Debug-iphoneos/SVGPath.build/Objects-normal/arm64/SVGPath.LinkFileList -nostdlib -Xlinker -object_path_lto -Xlinker /Users/admin/builder/spi-builder-workspace/.derivedData/Build/Intermediates.noindex/SVGPath.build/Debug-iphoneos/SVGPath.build/Objects-normal/arm64/SVGPath_lto.o -rdynamic -Xlinker -no_deduplicate -Xlinker -debug_variant -Xlinker -dependency_info -Xlinker /Users/admin/builder/spi-builder-workspace/.derivedData/Build/Intermediates.noindex/SVGPath.build/Debug-iphoneos/SVGPath.build/Objects-normal/arm64/SVGPath_dependency_info.dat -fobjc-link-runtime -L/Applications/Xcode-16.3.0.app/Contents/Developer/Toolchains/XcodeDefault.xctoolchain/usr/lib/swift/iphoneos -L/usr/lib/swift -Xlinker -add_ast_path -Xlinker /Users/admin/builder/spi-builder-workspace/.derivedData/Build/Intermediates.noindex/SVGPath.build/Debug-iphoneos/SVGPath.build/Objects-normal/arm64/SVGPath.swiftmodule -o /Users/admin/builder/spi-builder-workspace/.derivedData/Build/Products/Debug-iphoneos/SVGPath.o
SwiftDriver\ Compilation\ Requirements Euclid normal arm64 com.apple.xcode.tools.swift.compiler (in target 'Euclid' from project 'Euclid')
    cd /Users/admin/builder/spi-builder-workspace/.swiftpm/xcode
    builtin-Swift-Compilation-Requirements -- /Applications/Xcode-16.3.0.app/Contents/Developer/Toolchains/XcodeDefault.xctoolchain/usr/bin/swiftc -module-name Euclid -Onone -enforce-exclusivity\=checked @/Users/admin/builder/spi-builder-workspace/.derivedData/Build/Intermediates.noindex/Euclid.build/Debug-iphoneos/Euclid.build/Objects-normal/arm64/Euclid.SwiftFileList -DSWIFT_PACKAGE -DDEBUG -DXcode -plugin-path /Applications/Xcode-16.3.0.app/Contents/Developer/Toolchains/XcodeDefault.xctoolchain/usr/lib/swift/host/plugins/testing -enable-experimental-feature DebugDescriptionMacro -sdk /Applications/Xcode-16.3.0.app/Contents/Developer/Platforms/iPhoneOS.platform/Developer/SDKs/iPhoneOS18.4.sdk -target arm64-apple-ios12.0 -g -module-cache-path /Users/admin/builder/spi-builder-workspace/.derivedData/ModuleCache.noindex -Xfrontend -serialize-debugging-options -profile-coverage-mapping -profile-generate -enable-testing -suppress-warnings -index-store-path /Users/admin/builder/spi-builder-workspace/.derivedData/Index.noindex/DataStore -swift-version 5 -I /Users/admin/builder/spi-builder-workspace/.derivedData/Build/Products/Debug-iphoneos -I /Applications/Xcode-16.3.0.app/Contents/Developer/Platforms/iPhoneOS.platform/Developer/usr/lib -F /Users/admin/builder/spi-builder-workspace/.derivedData/Build/Products/Debug-iphoneos -F /Applications/Xcode-16.3.0.app/Contents/Developer/Platforms/iPhoneOS.platform/Developer/Library/Frameworks -F /Applications/Xcode-16.3.0.app/Contents/Developer/Platforms/iPhoneOS.platform/Developer/SDKs/iPhoneOS18.4.sdk/Developer/Library/Frameworks -c -j10 -enable-batch-mode -incremental -Xcc -ivfsstatcache -Xcc /Users/admin/builder/spi-builder-workspace/.derivedData/SDKStatCaches.noindex/iphoneos18.4-22E235-339d34bc69d7fc736c3220795c36f340.sdkstatcache -output-file-map /Users/admin/builder/spi-builder-workspace/.derivedData/Build/Intermediates.noindex/Euclid.build/Debug-iphoneos/Euclid.build/Objects-normal/arm64/Euclid-OutputFileMap.json -use-frontend-parseable-output -save-temps -no-color-diagnostics -serialize-diagnostics -emit-dependencies -emit-module -emit-module-path /Users/admin/builder/spi-builder-workspace/.derivedData/Build/Intermediates.noindex/Euclid.build/Debug-iphoneos/Euclid.build/Objects-normal/arm64/Euclid.swiftmodule -validate-clang-modules-once -clang-build-session-file /Users/admin/builder/spi-builder-workspace/.derivedData/ModuleCache.noindex/Session.modulevalidation -Xcc -I/Users/admin/builder/spi-builder-workspace/.derivedData/Build/Intermediates.noindex/Euclid.build/Debug-iphoneos/Euclid.build/swift-overrides.hmap -emit-const-values -Xfrontend -const-gather-protocols-file -Xfrontend /Users/admin/builder/spi-builder-workspace/.derivedData/Build/Intermediates.noindex/Euclid.build/Debug-iphoneos/Euclid.build/Objects-normal/arm64/Euclid_const_extract_protocols.json -Xcc -I/Users/admin/builder/spi-builder-workspace/.derivedData/Build/Products/Debug-iphoneos/include -Xcc -I/Users/admin/builder/spi-builder-workspace/.derivedData/Build/Intermediates.noindex/Euclid.build/Debug-iphoneos/Euclid.build/DerivedSources-normal/arm64 -Xcc -I/Users/admin/builder/spi-builder-workspace/.derivedData/Build/Intermediates.noindex/Euclid.build/Debug-iphoneos/Euclid.build/DerivedSources/arm64 -Xcc -I/Users/admin/builder/spi-builder-workspace/.derivedData/Build/Intermediates.noindex/Euclid.build/Debug-iphoneos/Euclid.build/DerivedSources -Xcc -DSWIFT_PACKAGE -Xcc -DDEBUG\=1 -emit-objc-header -emit-objc-header-path /Users/admin/builder/spi-builder-workspace/.derivedData/Build/Intermediates.noindex/Euclid.build/Debug-iphoneos/Euclid.build/Objects-normal/arm64/Euclid-Swift.h -working-directory /Users/admin/builder/spi-builder-workspace/.swiftpm/xcode -experimental-emit-module-separately -disable-cmo
ExtractAppIntentsMetadata (in target 'SVGPath' from project 'SVGPath')
    cd /Users/admin/builder/spi-builder-workspace/.dependencies/checkouts/SVGPath
    /Applications/Xcode-16.3.0.app/Contents/Developer/Toolchains/XcodeDefault.xctoolchain/usr/bin/appintentsmetadataprocessor --toolchain-dir /Applications/Xcode-16.3.0.app/Contents/Developer/Toolchains/XcodeDefault.xctoolchain --module-name SVGPath --sdk-root /Applications/Xcode-16.3.0.app/Contents/Developer/Platforms/iPhoneOS.platform/Developer/SDKs/iPhoneOS18.4.sdk --xcode-version 16E140 --platform-family iOS --deployment-target 12.0 --bundle-identifier svgpath.SVGPath --output /Users/admin/builder/spi-builder-workspace/.derivedData/Build/Products/Debug-iphoneos/SVGPath.appintents --target-triple arm64-apple-ios12.0 --binary-file /Users/admin/builder/spi-builder-workspace/.derivedData/Build/Products/Debug-iphoneos/SVGPath.o --dependency-file /Users/admin/builder/spi-builder-workspace/.derivedData/Build/Intermediates.noindex/SVGPath.build/Debug-iphoneos/SVGPath.build/Objects-normal/arm64/SVGPath_dependency_info.dat --stringsdata-file /Users/admin/builder/spi-builder-workspace/.derivedData/Build/Intermediates.noindex/SVGPath.build/Debug-iphoneos/SVGPath.build/Objects-normal/arm64/ExtractedAppShortcutsMetadata.stringsdata --source-file-list /Users/admin/builder/spi-builder-workspace/.derivedData/Build/Intermediates.noindex/SVGPath.build/Debug-iphoneos/SVGPath.build/Objects-normal/arm64/SVGPath.SwiftFileList --metadata-file-list /Users/admin/builder/spi-builder-workspace/.derivedData/Build/Intermediates.noindex/SVGPath.build/Debug-iphoneos/SVGPath.build/SVGPath.DependencyMetadataFileList --static-metadata-file-list /Users/admin/builder/spi-builder-workspace/.derivedData/Build/Intermediates.noindex/SVGPath.build/Debug-iphoneos/SVGPath.build/SVGPath.DependencyStaticMetadataFileList --swift-const-vals-list /Users/admin/builder/spi-builder-workspace/.derivedData/Build/Intermediates.noindex/SVGPath.build/Debug-iphoneos/SVGPath.build/Objects-normal/arm64/SVGPath.SwiftConstValuesFileList --force --compile-time-extraction --deployment-aware-processing --validate-assistant-intents --no-app-shortcuts-localization
2025-05-01 02:49:11.906 appintentsmetadataprocessor[888:4977] Starting appintentsmetadataprocessor export
2025-05-01 02:49:11.946 appintentsmetadataprocessor[888:4977] Extracted no relevant App Intents symbols, skipping writing output
Copy /Users/admin/builder/spi-builder-workspace/.derivedData/Build/Products/Debug-iphoneos/Euclid.swiftmodule/arm64-apple-ios.abi.json /Users/admin/builder/spi-builder-workspace/.derivedData/Build/Intermediates.noindex/Euclid.build/Debug-iphoneos/Euclid.build/Objects-normal/arm64/Euclid.abi.json (in target 'Euclid' from project 'Euclid')
    cd /Users/admin/builder/spi-builder-workspace/.dependencies/checkouts/Euclid
    builtin-copy -exclude .DS_Store -exclude CVS -exclude .svn -exclude .git -exclude .hg -resolve-src-symlinks -rename /Users/admin/builder/spi-builder-workspace/.derivedData/Build/Intermediates.noindex/Euclid.build/Debug-iphoneos/Euclid.build/Objects-normal/arm64/Euclid.abi.json /Users/admin/builder/spi-builder-workspace/.derivedData/Build/Products/Debug-iphoneos/Euclid.swiftmodule/arm64-apple-ios.abi.json
SwiftDriverJobDiscovery normal arm64 Compiling Euclid+SIMD.swift, Euclid+SceneKit.swift, Euclid+UIKit.swift, Line.swift (in target 'Euclid' from project 'Euclid')
SwiftDriver ShapeScript normal arm64 com.apple.xcode.tools.swift.compiler (in target 'ShapeScript' from project 'ShapeScript')
    cd /Users/admin/builder/spi-builder-workspace/.swiftpm/xcode
    builtin-SwiftDriver -- /Applications/Xcode-16.3.0.app/Contents/Developer/Toolchains/XcodeDefault.xctoolchain/usr/bin/swiftc -module-name ShapeScript -Onone -enforce-exclusivity\=checked @/Users/admin/builder/spi-builder-workspace/.derivedData/Build/Intermediates.noindex/ShapeScript.build/Debug-iphoneos/ShapeScript.build/Objects-normal/arm64/ShapeScript.SwiftFileList -DSWIFT_PACKAGE -DDEBUG -DXcode -plugin-path /Applications/Xcode-16.3.0.app/Contents/Developer/Toolchains/XcodeDefault.xctoolchain/usr/lib/swift/host/plugins/testing -enable-experimental-feature DebugDescriptionMacro -sdk /Applications/Xcode-16.3.0.app/Contents/Developer/Platforms/iPhoneOS.platform/Developer/SDKs/iPhoneOS18.4.sdk -target arm64-apple-ios12.0 -g -module-cache-path /Users/admin/builder/spi-builder-workspace/.derivedData/ModuleCache.noindex -Xfrontend -serialize-debugging-options -profile-coverage-mapping -profile-generate -enable-testing -index-store-path /Users/admin/builder/spi-builder-workspace/.derivedData/Index.noindex/DataStore -swift-version 5 -I /Users/admin/builder/spi-builder-workspace/.derivedData/Build/Products/Debug-iphoneos -I /Applications/Xcode-16.3.0.app/Contents/Developer/Platforms/iPhoneOS.platform/Developer/usr/lib -F /Users/admin/builder/spi-builder-workspace/.derivedData/Build/Products/Debug-iphoneos/PackageFrameworks -F /Users/admin/builder/spi-builder-workspace/.derivedData/Build/Products/Debug-iphoneos/PackageFrameworks -F /Users/admin/builder/spi-builder-workspace/.derivedData/Build/Products/Debug-iphoneos/PackageFrameworks -F /Users/admin/builder/spi-builder-workspace/.derivedData/Build/Products/Debug-iphoneos -F /Applications/Xcode-16.3.0.app/Contents/Developer/Platforms/iPhoneOS.platform/Developer/Library/Frameworks -F /Applications/Xcode-16.3.0.app/Contents/Developer/Platforms/iPhoneOS.platform/Developer/SDKs/iPhoneOS18.4.sdk/Developer/Library/Frameworks -c -j10 -enable-batch-mode -incremental -Xcc -ivfsstatcache -Xcc /Users/admin/builder/spi-builder-workspace/.derivedData/SDKStatCaches.noindex/iphoneos18.4-22E235-339d34bc69d7fc736c3220795c36f340.sdkstatcache -output-file-map /Users/admin/builder/spi-builder-workspace/.derivedData/Build/Intermediates.noindex/ShapeScript.build/Debug-iphoneos/ShapeScript.build/Objects-normal/arm64/ShapeScript-OutputFileMap.json -use-frontend-parseable-output -save-temps -no-color-diagnostics -serialize-diagnostics -emit-dependencies -emit-module -emit-module-path /Users/admin/builder/spi-builder-workspace/.derivedData/Build/Intermediates.noindex/ShapeScript.build/Debug-iphoneos/ShapeScript.build/Objects-normal/arm64/ShapeScript.swiftmodule -validate-clang-modules-once -clang-build-session-file /Users/admin/builder/spi-builder-workspace/.derivedData/ModuleCache.noindex/Session.modulevalidation -Xcc -I/Users/admin/builder/spi-builder-workspace/.derivedData/Build/Intermediates.noindex/ShapeScript.build/Debug-iphoneos/ShapeScript.build/swift-overrides.hmap -emit-const-values -Xfrontend -const-gather-protocols-file -Xfrontend /Users/admin/builder/spi-builder-workspace/.derivedData/Build/Intermediates.noindex/ShapeScript.build/Debug-iphoneos/ShapeScript.build/Objects-normal/arm64/ShapeScript_const_extract_protocols.json -Xcc -I/Users/admin/builder/spi-builder-workspace/.derivedData/Build/Products/Debug-iphoneos/include -Xcc -I/Users/admin/builder/spi-builder-workspace/.derivedData/Build/Intermediates.noindex/ShapeScript.build/Debug-iphoneos/ShapeScript.build/DerivedSources-normal/arm64 -Xcc -I/Users/admin/builder/spi-builder-workspace/.derivedData/Build/Intermediates.noindex/ShapeScript.build/Debug-iphoneos/ShapeScript.build/DerivedSources/arm64 -Xcc -I/Users/admin/builder/spi-builder-workspace/.derivedData/Build/Intermediates.noindex/ShapeScript.build/Debug-iphoneos/ShapeScript.build/DerivedSources -Xcc -DSWIFT_PACKAGE -Xcc -DDEBUG\=1 -emit-objc-header -emit-objc-header-path /Users/admin/builder/spi-builder-workspace/.derivedData/Build/Intermediates.noindex/ShapeScript.build/Debug-iphoneos/ShapeScript.build/Objects-normal/arm64/ShapeScript-Swift.h -working-directory /Users/admin/builder/spi-builder-workspace/.swiftpm/xcode -experimental-emit-module-separately -disable-cmo
SwiftEmitModule normal arm64 Emitting\ module\ for\ ShapeScript (in target 'ShapeScript' from project 'ShapeScript')
EmitSwiftModule normal arm64 (in target 'ShapeScript' from project 'ShapeScript')
    cd /Users/admin/builder/spi-builder-workspace/.swiftpm/xcode

SwiftCompile normal arm64 Compiling\ Members.swift,\ Parser.swift,\ ProgramError.swift /Users/admin/builder/spi-builder-workspace/ShapeScript/Members.swift /Users/admin/builder/spi-builder-workspace/ShapeScript/Parser.swift /Users/admin/builder/spi-builder-workspace/ShapeScript/ProgramError.swift (in target 'ShapeScript' from project 'ShapeScript')
SwiftCompile normal arm64 /Users/admin/builder/spi-builder-workspace/ShapeScript/Members.swift (in target 'ShapeScript' from project 'ShapeScript')
    cd /Users/admin/builder/spi-builder-workspace/.swiftpm/xcode

SwiftCompile normal arm64 /Users/admin/builder/spi-builder-workspace/ShapeScript/Parser.swift (in target 'ShapeScript' from project 'ShapeScript')
    cd /Users/admin/builder/spi-builder-workspace/.swiftpm/xcode

SwiftCompile normal arm64 /Users/admin/builder/spi-builder-workspace/ShapeScript/ProgramError.swift (in target 'ShapeScript' from project 'ShapeScript')
    cd /Users/admin/builder/spi-builder-workspace/.swiftpm/xcode

SwiftCompile normal arm64 Compiling\ EvaluationDelegate.swift,\ Geometry.swift,\ GeometryCache.swift /Users/admin/builder/spi-builder-workspace/ShapeScript/EvaluationDelegate.swift /Users/admin/builder/spi-builder-workspace/ShapeScript/Geometry.swift /Users/admin/builder/spi-builder-workspace/ShapeScript/GeometryCache.swift (in target 'ShapeScript' from project 'ShapeScript')
SwiftCompile normal arm64 /Users/admin/builder/spi-builder-workspace/ShapeScript/EvaluationDelegate.swift (in target 'ShapeScript' from project 'ShapeScript')
    cd /Users/admin/builder/spi-builder-workspace/.swiftpm/xcode

SwiftCompile normal arm64 /Users/admin/builder/spi-builder-workspace/ShapeScript/Geometry.swift (in target 'ShapeScript' from project 'ShapeScript')
    cd /Users/admin/builder/spi-builder-workspace/.swiftpm/xcode

SwiftCompile normal arm64 /Users/admin/builder/spi-builder-workspace/ShapeScript/GeometryCache.swift (in target 'ShapeScript' from project 'ShapeScript')
    cd /Users/admin/builder/spi-builder-workspace/.swiftpm/xcode

SwiftDriverJobDiscovery normal arm64 Compiling Angle.swift, BSP.swift, Bounds.swift, Color.swift (in target 'Euclid' from project 'Euclid')
SwiftCompile normal arm64 Compiling\ GeometryType.swift,\ Interpreter.swift,\ Lexer.swift /Users/admin/builder/spi-builder-workspace/ShapeScript/GeometryType.swift /Users/admin/builder/spi-builder-workspace/ShapeScript/Interpreter.swift /Users/admin/builder/spi-builder-workspace/ShapeScript/Lexer.swift (in target 'ShapeScript' from project 'ShapeScript')
SwiftCompile normal arm64 /Users/admin/builder/spi-builder-workspace/ShapeScript/GeometryType.swift (in target 'ShapeScript' from project 'ShapeScript')
    cd /Users/admin/builder/spi-builder-workspace/.swiftpm/xcode

SwiftCompile normal arm64 /Users/admin/builder/spi-builder-workspace/ShapeScript/Interpreter.swift (in target 'ShapeScript' from project 'ShapeScript')
    cd /Users/admin/builder/spi-builder-workspace/.swiftpm/xcode

SwiftCompile normal arm64 /Users/admin/builder/spi-builder-workspace/ShapeScript/Lexer.swift (in target 'ShapeScript' from project 'ShapeScript')
    cd /Users/admin/builder/spi-builder-workspace/.swiftpm/xcode

SwiftDriverJobDiscovery normal arm64 Compiling Rotation.swift, Stretchable.swift, Transforms.swift (in target 'Euclid' from project 'Euclid')
SwiftCompile normal arm64 Compiling\ RandomSequence.swift,\ Scene+SceneKit.swift,\ Scene.swift /Users/admin/builder/spi-builder-workspace/ShapeScript/RandomSequence.swift /Users/admin/builder/spi-builder-workspace/ShapeScript/Scene+SceneKit.swift /Users/admin/builder/spi-builder-workspace/ShapeScript/Scene.swift (in target 'ShapeScript' from project 'ShapeScript')
SwiftCompile normal arm64 /Users/admin/builder/spi-builder-workspace/ShapeScript/RandomSequence.swift (in target 'ShapeScript' from project 'ShapeScript')
    cd /Users/admin/builder/spi-builder-workspace/.swiftpm/xcode

SwiftCompile normal arm64 /Users/admin/builder/spi-builder-workspace/ShapeScript/Scene+SceneKit.swift (in target 'ShapeScript' from project 'ShapeScript')
    cd /Users/admin/builder/spi-builder-workspace/.swiftpm/xcode

SwiftCompile normal arm64 /Users/admin/builder/spi-builder-workspace/ShapeScript/Scene.swift (in target 'ShapeScript' from project 'ShapeScript')
    cd /Users/admin/builder/spi-builder-workspace/.swiftpm/xcode

SwiftDriverJobDiscovery normal arm64 Compiling Path.swift, PathPoint.swift, Plane.swift (in target 'Euclid' from project 'Euclid')
SwiftCompile normal arm64 Compiling\ String+Ordinals.swift,\ Symbols.swift /Users/admin/builder/spi-builder-workspace/ShapeScript/String+Ordinals.swift /Users/admin/builder/spi-builder-workspace/ShapeScript/Symbols.swift (in target 'ShapeScript' from project 'ShapeScript')
SwiftCompile normal arm64 /Users/admin/builder/spi-builder-workspace/ShapeScript/String+Ordinals.swift (in target 'ShapeScript' from project 'ShapeScript')
    cd /Users/admin/builder/spi-builder-workspace/.swiftpm/xcode

SwiftCompile normal arm64 /Users/admin/builder/spi-builder-workspace/ShapeScript/Symbols.swift (in target 'ShapeScript' from project 'ShapeScript')
    cd /Users/admin/builder/spi-builder-workspace/.swiftpm/xcode

SwiftDriverJobDiscovery normal arm64 Compiling Utilities.swift, Vector.swift, Vertex.swift (in target 'Euclid' from project 'Euclid')
SwiftCompile normal arm64 Compiling\ Value+Logging.swift,\ Values.swift /Users/admin/builder/spi-builder-workspace/ShapeScript/Value+Logging.swift /Users/admin/builder/spi-builder-workspace/ShapeScript/Values.swift (in target 'ShapeScript' from project 'ShapeScript')
SwiftCompile normal arm64 /Users/admin/builder/spi-builder-workspace/ShapeScript/Value+Logging.swift (in target 'ShapeScript' from project 'ShapeScript')
    cd /Users/admin/builder/spi-builder-workspace/.swiftpm/xcode

SwiftCompile normal arm64 /Users/admin/builder/spi-builder-workspace/ShapeScript/Values.swift (in target 'ShapeScript' from project 'ShapeScript')
    cd /Users/admin/builder/spi-builder-workspace/.swiftpm/xcode

SwiftDriverJobDiscovery normal arm64 Compiling Mesh+Texcoords.swift, Mesh.swift, Path+Shapes.swift (in target 'Euclid' from project 'Euclid')
SwiftCompile normal arm64 Compiling\ Euclid+Extensions.swift,\ Euclid+SVGPath.swift,\ EvaluationContext.swift /Users/admin/builder/spi-builder-workspace/ShapeScript/Euclid+Extensions.swift /Users/admin/builder/spi-builder-workspace/ShapeScript/Euclid+SVGPath.swift /Users/admin/builder/spi-builder-workspace/ShapeScript/EvaluationContext.swift (in target 'ShapeScript' from project 'ShapeScript')
Command SwiftCompile failed with a nonzero exit code
** BUILD FAILED **
The following build commands failed:
	SwiftCompile normal arm64 Compiling\ Euclid+AppKit.swift,\ Euclid+CoreGraphics.swift,\ Euclid+CoreText.swift,\ Euclid+RealityKit.swift /Users/admin/builder/spi-builder-workspace/.dependencies/checkouts/Euclid/Sources/Euclid+AppKit.swift /Users/admin/builder/spi-builder-workspace/.dependencies/checkouts/Euclid/Sources/Euclid+CoreGraphics.swift /Users/admin/builder/spi-builder-workspace/.dependencies/checkouts/Euclid/Sources/Euclid+CoreText.swift /Users/admin/builder/spi-builder-workspace/.dependencies/checkouts/Euclid/Sources/Euclid+RealityKit.swift (in target 'Euclid' from project 'Euclid')
	SwiftCompile normal arm64 /Users/admin/builder/spi-builder-workspace/.dependencies/checkouts/Euclid/Sources/Euclid+RealityKit.swift (in target 'Euclid' from project 'Euclid')
	SwiftCompile normal arm64 Compiling\ Euclid+Extensions.swift,\ Euclid+SVGPath.swift,\ EvaluationContext.swift /Users/admin/builder/spi-builder-workspace/ShapeScript/Euclid+Extensions.swift /Users/admin/builder/spi-builder-workspace/ShapeScript/Euclid+SVGPath.swift /Users/admin/builder/spi-builder-workspace/ShapeScript/EvaluationContext.swift (in target 'ShapeScript' from project 'ShapeScript')
	Building workspace spi-builder-workspace with scheme ShapeScript-Package
(4 failures)
BUILD FAILURE 6.1 iOS