Build Information
Failed to build BBAlert, reference 1.0.9 (b16627
), with Swift 6.2 (beta) for macOS (SPM) on 18 Jun 2025 18:11:10 UTC.
Build Command
env DEVELOPER_DIR=/Applications/Xcode-26.0.0-Beta.app xcrun swift build --arch arm64
Build Log
========================================
RunAll
========================================
Builder version: 4.64.0
Interrupt handler set up.
========================================
Checkout
========================================
Clone URL: https://github.com/bibinjacobpulickal/BBAlert.git
Reference: 1.0.9
Initialized empty Git repository in /Users/admin/builder/spi-builder-workspace/.git/
From https://github.com/bibinjacobpulickal/BBAlert
* tag 1.0.9 -> FETCH_HEAD
HEAD is now at b166276 Removed default parameter for present method to avoid ambiguity.
Cloned https://github.com/bibinjacobpulickal/BBAlert.git
Revision (git rev-parse @):
b166276aa8a1333098f6007b8af0c46c2700b504
SUCCESS checkout https://github.com/bibinjacobpulickal/BBAlert.git at 1.0.9
========================================
Build
========================================
Selected platform: macosSpm
Swift version: 6.2
Building package at path: $PWD
https://github.com/bibinjacobpulickal/BBAlert.git
Running build ...
env DEVELOPER_DIR=/Applications/Xcode-26.0.0-Beta.app xcrun swift build --arch arm64
Building for debugging...
[0/2] Write sources
[1/2] Write swift-version-1EA4D86E10B52AF.txt
[3/6] Compiling BBAlert BBAlertPresentable.swift
/Users/admin/builder/spi-builder-workspace/Sources/BBAlert/BBAlert.swift:8:8: error: no such module 'UIKit'
6 | //
7 |
8 | import UIKit
| `- error: no such module 'UIKit'
9 |
10 | public typealias BBAlert = UIAlertController
error: emit-module command failed with exit code 1 (use -v to see invocation)
[4/6] Emitting module BBAlert
/Users/admin/builder/spi-builder-workspace/Sources/BBAlert/BBAlert.swift:8:8: error: no such module 'UIKit'
6 | //
7 |
8 | import UIKit
| `- error: no such module 'UIKit'
9 |
10 | public typealias BBAlert = UIAlertController
[5/6] Compiling BBAlert BBAlert.swift
/Users/admin/builder/spi-builder-workspace/Sources/BBAlert/BBAlert.swift:8:8: error: no such module 'UIKit'
6 | //
7 |
8 | import UIKit
| `- error: no such module 'UIKit'
9 |
10 | public typealias BBAlert = UIAlertController
[6/6] Compiling BBAlert BBAlertDismissible.swift
/Users/admin/builder/spi-builder-workspace/Sources/BBAlert/BBAlert.swift:8:8: error: no such module 'UIKit'
6 | //
7 |
8 | import UIKit
| `- error: no such module 'UIKit'
9 |
10 | public typealias BBAlert = UIAlertController
BUILD FAILURE 6.2 macosSpm