Build Information
Failed to build CQRS, reference dev (acd555
), with Swift 6.1 for visionOS using Xcode 16.3 on 30 Apr 2025 05:13:10 UTC.
Build Command
env DEVELOPER_DIR=/Applications/Xcode-16.3.0.app xcrun xcodebuild -IDEClonedSourcePackagesDirPathOverride=$PWD/.dependencies -skipMacroValidation -skipPackagePluginValidation -derivedDataPath $PWD/.derivedData build -scheme CQRS -destination generic/platform=xrOS
Build Log
========================================
RunAll
========================================
Builder version: 4.61.1
Interrupt handler set up.
========================================
Checkout
========================================
Clone URL: https://github.com/space-code/cqrs.git
Reference: dev
Initialized empty Git repository in /Users/admin/builder/spi-builder-workspace/.git/
From https://github.com/space-code/cqrs
* branch dev -> FETCH_HEAD
* [new branch] dev -> origin/dev
HEAD is now at acd5550 Update the project
Cloned https://github.com/space-code/cqrs.git
Revision (git rev-parse @):
acd55506d5639a7b83e6405f7d802d16fd135231
SUCCESS checkout https://github.com/space-code/cqrs.git at dev
========================================
Build
========================================
Selected platform: visionOS
Swift version: 6.1
Building package at path: $PWD
https://github.com/space-code/cqrs.git
https://github.com/space-code/cqrs.git
{
"dependencies" : [
{
"identity" : "dip",
"requirement" : {
"range" : [
{
"lower_bound" : "7.1.1",
"upper_bound" : "8.0.0"
}
]
},
"type" : "sourceControl",
"url" : "https://github.com/AliSoftware/Dip"
}
],
"manifest_display_name" : "CQRS",
"name" : "CQRS",
"path" : "/Users/admin/builder/spi-builder-workspace",
"platforms" : [
{
"name" : "macos",
"version" : "13.0"
},
{
"name" : "ios",
"version" : "16.0"
},
{
"name" : "watchos",
"version" : "9.0"
},
{
"name" : "tvos",
"version" : "16.0"
},
{
"name" : "visionos",
"version" : "1.0"
}
],
"products" : [
{
"name" : "CQRS",
"targets" : [
"CQRS"
],
"type" : {
"library" : [
"automatic"
]
}
}
],
"targets" : [
{
"c99name" : "CQRSTests",
"module_type" : "SwiftTarget",
"name" : "CQRSTests",
"path" : "Tests/CQRSTests",
"sources" : [
"Classes/Command/CommandDispatcherTests.swift",
"Classes/Query/QueryDispatcherTests.swift",
"Helpers/Mocks/Commands/CommandMock.swift",
"Helpers/Mocks/Commands/SecondCommandMock.swift",
"Helpers/Mocks/Handlers/CommandHandlerMock.swift",
"Helpers/Mocks/Handlers/QueryHandlerMock.swift",
"Helpers/Mocks/Handlers/SecondCommandHandlerMock.swift",
"Helpers/Mocks/Queries/QueryMock.swift"
],
"target_dependencies" : [
"CQRS"
],
"type" : "test"
},
{
"c99name" : "CQRS",
"module_type" : "SwiftTarget",
"name" : "CQRS",
"path" : "Sources/CQRS",
"product_dependencies" : [
"Dip"
],
"product_memberships" : [
"CQRS"
],
"sources" : [
"Classes/Command/CommandDispatcher.swift",
"Classes/Command/Interfaces/ICommand.swift",
"Classes/Command/Interfaces/ICommandDispatcher.swift",
"Classes/Command/Interfaces/ICommandHandler.swift",
"Classes/Helpers/Container/DependencyContainer.swift",
"Classes/Helpers/Container/IDependencyContainer.swift",
"Classes/Models/CQRSError.swift",
"Classes/Query/Interfaces/IQuery.swift",
"Classes/Query/Interfaces/IQueryDispatcher.swift",
"Classes/Query/Interfaces/IQueryHandler.swift",
"Classes/Query/QueryDispatcher.swift"
],
"type" : "library"
}
],
"tools_version" : "6.0"
}
Command line invocation:
/Applications/Xcode-16.3.0.app/Contents/Developer/usr/bin/xcodebuild -IDEClonedSourcePackagesDirPathOverride=/Users/admin/builder/spi-builder-workspace/.dependencies -resolvePackageDependencies
Resolve Package Graph
Fetching from https://github.com/AliSoftware/Dip
Creating working copy of package ‘Dip’
Checking out 7.1.1 of package ‘Dip’
Resolve Package Graph
Resolved source packages:
Dip: https://github.com/AliSoftware/Dip @ 7.1.1
CQRS: /Users/admin/builder/spi-builder-workspace
resolved source packages: Dip, CQRS
{
"dependencies" : [
{
"identity" : "dip",
"requirement" : {
"range" : [
{
"lower_bound" : "7.1.1",
"upper_bound" : "8.0.0"
}
]
},
"type" : "sourceControl",
"url" : "https://github.com/AliSoftware/Dip"
}
],
"manifest_display_name" : "CQRS",
"name" : "CQRS",
"path" : "/Users/admin/builder/spi-builder-workspace",
"platforms" : [
{
"name" : "macos",
"version" : "13.0"
},
{
"name" : "ios",
"version" : "16.0"
},
{
"name" : "watchos",
"version" : "9.0"
},
{
"name" : "tvos",
"version" : "16.0"
},
{
"name" : "visionos",
"version" : "1.0"
}
],
"products" : [
{
"name" : "CQRS",
"targets" : [
"CQRS"
],
"type" : {
"library" : [
"automatic"
]
}
}
],
"targets" : [
{
"c99name" : "CQRSTests",
"module_type" : "SwiftTarget",
"name" : "CQRSTests",
"path" : "Tests/CQRSTests",
"sources" : [
"Classes/Command/CommandDispatcherTests.swift",
"Classes/Query/QueryDispatcherTests.swift",
"Helpers/Mocks/Commands/CommandMock.swift",
"Helpers/Mocks/Commands/SecondCommandMock.swift",
"Helpers/Mocks/Handlers/CommandHandlerMock.swift",
"Helpers/Mocks/Handlers/QueryHandlerMock.swift",
"Helpers/Mocks/Handlers/SecondCommandHandlerMock.swift",
"Helpers/Mocks/Queries/QueryMock.swift"
],
"target_dependencies" : [
"CQRS"
],
"type" : "test"
},
{
"c99name" : "CQRS",
"module_type" : "SwiftTarget",
"name" : "CQRS",
"path" : "Sources/CQRS",
"product_dependencies" : [
"Dip"
],
"product_memberships" : [
"CQRS"
],
"sources" : [
"Classes/Command/CommandDispatcher.swift",
"Classes/Command/Interfaces/ICommand.swift",
"Classes/Command/Interfaces/ICommandDispatcher.swift",
"Classes/Command/Interfaces/ICommandHandler.swift",
"Classes/Helpers/Container/DependencyContainer.swift",
"Classes/Helpers/Container/IDependencyContainer.swift",
"Classes/Models/CQRSError.swift",
"Classes/Query/Interfaces/IQuery.swift",
"Classes/Query/Interfaces/IQueryDispatcher.swift",
"Classes/Query/Interfaces/IQueryHandler.swift",
"Classes/Query/QueryDispatcher.swift"
],
"type" : "library"
}
],
"tools_version" : "6.0"
}
{
"workspace" : {
"name" : "spi-builder-workspace",
"schemes" : [
"CQRS"
]
}
}
Running build ...
env DEVELOPER_DIR=/Applications/Xcode-16.3.0.app xcrun xcodebuild -IDEClonedSourcePackagesDirPathOverride=$PWD/.dependencies -skipMacroValidation -skipPackagePluginValidation -derivedDataPath $PWD/.derivedData build -scheme CQRS -destination generic/platform=xrOS OTHER_SWIFT_FLAGS=-stats-output-dir .stats
Command line invocation:
/Applications/Xcode-16.3.0.app/Contents/Developer/usr/bin/xcodebuild -IDEClonedSourcePackagesDirPathOverride=/Users/admin/builder/spi-builder-workspace/.dependencies -skipMacroValidation -skipPackagePluginValidation -derivedDataPath /Users/admin/builder/spi-builder-workspace/.derivedData build -scheme CQRS -destination generic/platform=xrOS "OTHER_SWIFT_FLAGS=-stats-output-dir .stats"
Build settings from command line:
OTHER_SWIFT_FLAGS = -stats-output-dir .stats
Resolve Package Graph
Resolve Package Graph
Resolved source packages:
CQRS: /Users/admin/builder/spi-builder-workspace
Dip: https://github.com/AliSoftware/Dip @ 7.1.1
ComputePackagePrebuildTargetDependencyGraph
Prepare packages
CreateBuildRequest
SendProjectDescription
CreateBuildOperation
ComputeTargetDependencyGraph
note: Building targets in dependency order
note: Target dependency graph (5 targets)
Target 'CQRSTests' in project 'CQRS'
➜ Explicit dependency on target 'CQRS' in project 'CQRS'
➜ Explicit dependency on target 'Dip' in project 'Dip'
Target 'CQRS' in project 'CQRS'
➜ Explicit dependency on target 'CQRS' in project 'CQRS'
➜ Explicit dependency on target 'Dip' in project 'Dip'
Target 'CQRS' in project 'CQRS'
➜ Explicit dependency on target 'Dip' in project 'Dip'
Target 'Dip' in project 'Dip'
➜ Explicit dependency on target 'Dip' in project 'Dip'
Target 'Dip' in project 'Dip' (no dependencies)
GatherProvisioningInputs
CreateBuildDescription
ExecuteExternalTool /Applications/Xcode-16.3.0.app/Contents/Developer/Toolchains/XcodeDefault.xctoolchain/usr/bin/swiftc --version
ExecuteExternalTool /Applications/Xcode-16.3.0.app/Contents/Developer/Toolchains/XcodeDefault.xctoolchain/usr/bin/clang -v -E -dM -isysroot /Applications/Xcode-16.3.0.app/Contents/Developer/Platforms/XROS.platform/Developer/SDKs/XROS2.4.sdk -x c -c /dev/null
ExecuteExternalTool /Applications/Xcode-16.3.0.app/Contents/Developer/Toolchains/XcodeDefault.xctoolchain/usr/bin/ld -version_details
Build description signature: 2ea4e694868fe44a045021fad70ca23b
Build description path: /Users/admin/builder/spi-builder-workspace/.derivedData/Build/Intermediates.noindex/XCBuildData/2ea4e694868fe44a045021fad70ca23b.xcbuilddata
ClangStatCache /Applications/Xcode-16.3.0.app/Contents/Developer/Toolchains/XcodeDefault.xctoolchain/usr/bin/clang-stat-cache /Applications/Xcode-16.3.0.app/Contents/Developer/Platforms/XROS.platform/Developer/SDKs/XROS2.4.sdk /Users/admin/builder/spi-builder-workspace/.derivedData/SDKStatCaches.noindex/xros2.4-22O233-407b76dbb837030756cbe1ab3f0b01b6.sdkstatcache
cd /Users/admin/builder/spi-builder-workspace/.swiftpm/xcode
/Applications/Xcode-16.3.0.app/Contents/Developer/Toolchains/XcodeDefault.xctoolchain/usr/bin/clang-stat-cache /Applications/Xcode-16.3.0.app/Contents/Developer/Platforms/XROS.platform/Developer/SDKs/XROS2.4.sdk -o /Users/admin/builder/spi-builder-workspace/.derivedData/SDKStatCaches.noindex/xros2.4-22O233-407b76dbb837030756cbe1ab3f0b01b6.sdkstatcache
CreateBuildDirectory /Users/admin/builder/spi-builder-workspace/.derivedData/Build/Products
cd /Users/admin/builder/spi-builder-workspace/.swiftpm/xcode
builtin-create-build-directory /Users/admin/builder/spi-builder-workspace/.derivedData/Build/Products
CreateBuildDirectory /Users/admin/builder/spi-builder-workspace/.derivedData/Build/Intermediates.noindex
cd /Users/admin/builder/spi-builder-workspace/.swiftpm/xcode
builtin-create-build-directory /Users/admin/builder/spi-builder-workspace/.derivedData/Build/Intermediates.noindex
CreateBuildDirectory /Users/admin/builder/spi-builder-workspace/.derivedData/Build/Products/Debug-xros
cd /Users/admin/builder/spi-builder-workspace/.swiftpm/xcode
builtin-create-build-directory /Users/admin/builder/spi-builder-workspace/.derivedData/Build/Products/Debug-xros
CreateBuildDirectory /Users/admin/builder/spi-builder-workspace/.derivedData/Build/Intermediates.noindex/EagerLinkingTBDs/Debug-xros
cd /Users/admin/builder/spi-builder-workspace/.swiftpm/xcode
builtin-create-build-directory /Users/admin/builder/spi-builder-workspace/.derivedData/Build/Intermediates.noindex/EagerLinkingTBDs/Debug-xros
CreateBuildDirectory /Users/admin/builder/spi-builder-workspace/.derivedData/Build/Products/Debug-xros/PackageFrameworks
cd /Users/admin/builder/spi-builder-workspace/.swiftpm/xcode
builtin-create-build-directory /Users/admin/builder/spi-builder-workspace/.derivedData/Build/Products/Debug-xros/PackageFrameworks
WriteAuxiliaryFile /Users/admin/builder/spi-builder-workspace/.derivedData/Build/Intermediates.noindex/Dip.build/Debug-xros/Dip.build/Dip.modulemap (in target 'Dip' from project 'Dip')
cd /Users/admin/builder/spi-builder-workspace/.dependencies/checkouts/Dip
write-file /Users/admin/builder/spi-builder-workspace/.derivedData/Build/Intermediates.noindex/Dip.build/Debug-xros/Dip.build/Dip.modulemap
WriteAuxiliaryFile /Users/admin/builder/spi-builder-workspace/.derivedData/Build/Intermediates.noindex/Dip.build/Debug-xros/Dip.build/Dip.DependencyMetadataFileList (in target 'Dip' from project 'Dip')
cd /Users/admin/builder/spi-builder-workspace/.dependencies/checkouts/Dip
write-file /Users/admin/builder/spi-builder-workspace/.derivedData/Build/Intermediates.noindex/Dip.build/Debug-xros/Dip.build/Dip.DependencyMetadataFileList
WriteAuxiliaryFile /Users/admin/builder/spi-builder-workspace/.derivedData/Build/Intermediates.noindex/Dip.build/Debug-xros/Dip.build/Dip.DependencyStaticMetadataFileList (in target 'Dip' from project 'Dip')
cd /Users/admin/builder/spi-builder-workspace/.dependencies/checkouts/Dip
write-file /Users/admin/builder/spi-builder-workspace/.derivedData/Build/Intermediates.noindex/Dip.build/Debug-xros/Dip.build/Dip.DependencyStaticMetadataFileList
WriteAuxiliaryFile /Users/admin/builder/spi-builder-workspace/.derivedData/Build/Intermediates.noindex/Dip.build/Debug-xros/Dip.build/Objects-normal/arm64/Dip.SwiftFileList (in target 'Dip' from project 'Dip')
cd /Users/admin/builder/spi-builder-workspace/.dependencies/checkouts/Dip
write-file /Users/admin/builder/spi-builder-workspace/.derivedData/Build/Intermediates.noindex/Dip.build/Debug-xros/Dip.build/Objects-normal/arm64/Dip.SwiftFileList
WriteAuxiliaryFile /Users/admin/builder/spi-builder-workspace/.derivedData/Build/Intermediates.noindex/Dip.build/Debug-xros/Dip.build/Objects-normal/arm64/Dip_const_extract_protocols.json (in target 'Dip' from project 'Dip')
cd /Users/admin/builder/spi-builder-workspace/.dependencies/checkouts/Dip
write-file /Users/admin/builder/spi-builder-workspace/.derivedData/Build/Intermediates.noindex/Dip.build/Debug-xros/Dip.build/Objects-normal/arm64/Dip_const_extract_protocols.json
WriteAuxiliaryFile /Users/admin/builder/spi-builder-workspace/.derivedData/Build/Intermediates.noindex/Dip.build/Debug-xros/Dip.build/Objects-normal/arm64/Dip.SwiftConstValuesFileList (in target 'Dip' from project 'Dip')
cd /Users/admin/builder/spi-builder-workspace/.dependencies/checkouts/Dip
write-file /Users/admin/builder/spi-builder-workspace/.derivedData/Build/Intermediates.noindex/Dip.build/Debug-xros/Dip.build/Objects-normal/arm64/Dip.SwiftConstValuesFileList
WriteAuxiliaryFile /Users/admin/builder/spi-builder-workspace/.derivedData/Build/Intermediates.noindex/Dip.build/Debug-xros/Dip.build/Objects-normal/arm64/Dip-OutputFileMap.json (in target 'Dip' from project 'Dip')
cd /Users/admin/builder/spi-builder-workspace/.dependencies/checkouts/Dip
write-file /Users/admin/builder/spi-builder-workspace/.derivedData/Build/Intermediates.noindex/Dip.build/Debug-xros/Dip.build/Objects-normal/arm64/Dip-OutputFileMap.json
WriteAuxiliaryFile /Users/admin/builder/spi-builder-workspace/.derivedData/Build/Intermediates.noindex/Dip.build/Debug-xros/Dip.build/Objects-normal/arm64/Dip.LinkFileList (in target 'Dip' from project 'Dip')
cd /Users/admin/builder/spi-builder-workspace/.dependencies/checkouts/Dip
write-file /Users/admin/builder/spi-builder-workspace/.derivedData/Build/Intermediates.noindex/Dip.build/Debug-xros/Dip.build/Objects-normal/arm64/Dip.LinkFileList
WriteAuxiliaryFile /Users/admin/builder/spi-builder-workspace/.derivedData/Build/Intermediates.noindex/CQRS.build/Debug-xros/CQRSTests.build/empty-CQRSTests.plist (in target 'CQRSTests' from project 'CQRS')
cd /Users/admin/builder/spi-builder-workspace
write-file /Users/admin/builder/spi-builder-workspace/.derivedData/Build/Intermediates.noindex/CQRS.build/Debug-xros/CQRSTests.build/empty-CQRSTests.plist
WriteAuxiliaryFile /Users/admin/builder/spi-builder-workspace/.derivedData/Build/Intermediates.noindex/CQRS.build/Debug-xros/CQRSTests.build/Objects-normal/arm64/CQRSTests.SwiftConstValuesFileList (in target 'CQRSTests' from project 'CQRS')
cd /Users/admin/builder/spi-builder-workspace
write-file /Users/admin/builder/spi-builder-workspace/.derivedData/Build/Intermediates.noindex/CQRS.build/Debug-xros/CQRSTests.build/Objects-normal/arm64/CQRSTests.SwiftConstValuesFileList
WriteAuxiliaryFile /Users/admin/builder/spi-builder-workspace/.derivedData/Build/Intermediates.noindex/CQRS.build/Debug-xros/CQRSTests.build/Objects-normal/arm64/CQRSTests.SwiftFileList (in target 'CQRSTests' from project 'CQRS')
cd /Users/admin/builder/spi-builder-workspace
write-file /Users/admin/builder/spi-builder-workspace/.derivedData/Build/Intermediates.noindex/CQRS.build/Debug-xros/CQRSTests.build/Objects-normal/arm64/CQRSTests.SwiftFileList
WriteAuxiliaryFile /Users/admin/builder/spi-builder-workspace/.derivedData/Build/Intermediates.noindex/CQRS.build/Debug-xros/CQRSTests.build/Objects-normal/arm64/CQRSTests_const_extract_protocols.json (in target 'CQRSTests' from project 'CQRS')
cd /Users/admin/builder/spi-builder-workspace
write-file /Users/admin/builder/spi-builder-workspace/.derivedData/Build/Intermediates.noindex/CQRS.build/Debug-xros/CQRSTests.build/Objects-normal/arm64/CQRSTests_const_extract_protocols.json
Copy /Users/admin/builder/spi-builder-workspace/.derivedData/Build/Intermediates.noindex/GeneratedModuleMaps-xros/Dip.modulemap /Users/admin/builder/spi-builder-workspace/.derivedData/Build/Intermediates.noindex/Dip.build/Debug-xros/Dip.build/Dip.modulemap (in target 'Dip' from project 'Dip')
cd /Users/admin/builder/spi-builder-workspace/.dependencies/checkouts/Dip
builtin-copy -exclude .DS_Store -exclude CVS -exclude .svn -exclude .git -exclude .hg -resolve-src-symlinks /Users/admin/builder/spi-builder-workspace/.derivedData/Build/Intermediates.noindex/Dip.build/Debug-xros/Dip.build/Dip.modulemap /Users/admin/builder/spi-builder-workspace/.derivedData/Build/Intermediates.noindex/GeneratedModuleMaps-xros
WriteAuxiliaryFile /Users/admin/builder/spi-builder-workspace/.derivedData/Build/Intermediates.noindex/CQRS.build/Debug-xros/CQRSTests.build/Objects-normal/arm64/CQRSTests.LinkFileList (in target 'CQRSTests' from project 'CQRS')
cd /Users/admin/builder/spi-builder-workspace
write-file /Users/admin/builder/spi-builder-workspace/.derivedData/Build/Intermediates.noindex/CQRS.build/Debug-xros/CQRSTests.build/Objects-normal/arm64/CQRSTests.LinkFileList
WriteAuxiliaryFile /Users/admin/builder/spi-builder-workspace/.derivedData/Build/Intermediates.noindex/CQRS.build/Debug-xros/CQRSTests.build/Objects-normal/arm64/CQRSTests-OutputFileMap.json (in target 'CQRSTests' from project 'CQRS')
cd /Users/admin/builder/spi-builder-workspace
write-file /Users/admin/builder/spi-builder-workspace/.derivedData/Build/Intermediates.noindex/CQRS.build/Debug-xros/CQRSTests.build/Objects-normal/arm64/CQRSTests-OutputFileMap.json
WriteAuxiliaryFile /Users/admin/builder/spi-builder-workspace/.derivedData/Build/Intermediates.noindex/CQRS.build/Debug-xros/CQRSTests.build/CQRSTests.DependencyStaticMetadataFileList (in target 'CQRSTests' from project 'CQRS')
cd /Users/admin/builder/spi-builder-workspace
write-file /Users/admin/builder/spi-builder-workspace/.derivedData/Build/Intermediates.noindex/CQRS.build/Debug-xros/CQRSTests.build/CQRSTests.DependencyStaticMetadataFileList
WriteAuxiliaryFile /Users/admin/builder/spi-builder-workspace/.derivedData/Build/Intermediates.noindex/CQRS.build/Debug-xros/CQRSTests.build/CQRSTests.DependencyMetadataFileList (in target 'CQRSTests' from project 'CQRS')
cd /Users/admin/builder/spi-builder-workspace
write-file /Users/admin/builder/spi-builder-workspace/.derivedData/Build/Intermediates.noindex/CQRS.build/Debug-xros/CQRSTests.build/CQRSTests.DependencyMetadataFileList
WriteAuxiliaryFile /Users/admin/builder/spi-builder-workspace/.derivedData/Build/Intermediates.noindex/CQRS.build/Debug-xros/CQRS.build/Objects-normal/arm64/CQRS_const_extract_protocols.json (in target 'CQRS' from project 'CQRS')
cd /Users/admin/builder/spi-builder-workspace
write-file /Users/admin/builder/spi-builder-workspace/.derivedData/Build/Intermediates.noindex/CQRS.build/Debug-xros/CQRS.build/Objects-normal/arm64/CQRS_const_extract_protocols.json
WriteAuxiliaryFile /Users/admin/builder/spi-builder-workspace/.derivedData/Build/Intermediates.noindex/CQRS.build/Debug-xros/CQRS.build/Objects-normal/arm64/CQRS.SwiftFileList (in target 'CQRS' from project 'CQRS')
cd /Users/admin/builder/spi-builder-workspace
write-file /Users/admin/builder/spi-builder-workspace/.derivedData/Build/Intermediates.noindex/CQRS.build/Debug-xros/CQRS.build/Objects-normal/arm64/CQRS.SwiftFileList
WriteAuxiliaryFile /Users/admin/builder/spi-builder-workspace/.derivedData/Build/Intermediates.noindex/CQRS.build/Debug-xros/CQRS.build/Objects-normal/arm64/CQRS.SwiftConstValuesFileList (in target 'CQRS' from project 'CQRS')
cd /Users/admin/builder/spi-builder-workspace
write-file /Users/admin/builder/spi-builder-workspace/.derivedData/Build/Intermediates.noindex/CQRS.build/Debug-xros/CQRS.build/Objects-normal/arm64/CQRS.SwiftConstValuesFileList
WriteAuxiliaryFile /Users/admin/builder/spi-builder-workspace/.derivedData/Build/Intermediates.noindex/CQRS.build/Debug-xros/CQRS.build/Objects-normal/arm64/CQRS.LinkFileList (in target 'CQRS' from project 'CQRS')
cd /Users/admin/builder/spi-builder-workspace
write-file /Users/admin/builder/spi-builder-workspace/.derivedData/Build/Intermediates.noindex/CQRS.build/Debug-xros/CQRS.build/Objects-normal/arm64/CQRS.LinkFileList
WriteAuxiliaryFile /Users/admin/builder/spi-builder-workspace/.derivedData/Build/Intermediates.noindex/CQRS.build/Debug-xros/CQRS.build/Objects-normal/arm64/CQRS-OutputFileMap.json (in target 'CQRS' from project 'CQRS')
cd /Users/admin/builder/spi-builder-workspace
write-file /Users/admin/builder/spi-builder-workspace/.derivedData/Build/Intermediates.noindex/CQRS.build/Debug-xros/CQRS.build/Objects-normal/arm64/CQRS-OutputFileMap.json
WriteAuxiliaryFile /Users/admin/builder/spi-builder-workspace/.derivedData/Build/Intermediates.noindex/CQRS.build/Debug-xros/CQRS.build/CQRS.modulemap (in target 'CQRS' from project 'CQRS')
cd /Users/admin/builder/spi-builder-workspace
write-file /Users/admin/builder/spi-builder-workspace/.derivedData/Build/Intermediates.noindex/CQRS.build/Debug-xros/CQRS.build/CQRS.modulemap
WriteAuxiliaryFile /Users/admin/builder/spi-builder-workspace/.derivedData/Build/Intermediates.noindex/CQRS.build/Debug-xros/CQRS.build/CQRS.DependencyStaticMetadataFileList (in target 'CQRS' from project 'CQRS')
cd /Users/admin/builder/spi-builder-workspace
write-file /Users/admin/builder/spi-builder-workspace/.derivedData/Build/Intermediates.noindex/CQRS.build/Debug-xros/CQRS.build/CQRS.DependencyStaticMetadataFileList
WriteAuxiliaryFile /Users/admin/builder/spi-builder-workspace/.derivedData/Build/Intermediates.noindex/CQRS.build/Debug-xros/CQRS.build/CQRS.DependencyMetadataFileList (in target 'CQRS' from project 'CQRS')
cd /Users/admin/builder/spi-builder-workspace
write-file /Users/admin/builder/spi-builder-workspace/.derivedData/Build/Intermediates.noindex/CQRS.build/Debug-xros/CQRS.build/CQRS.DependencyMetadataFileList
MkDir /Users/admin/builder/spi-builder-workspace/.derivedData/Build/Products/Debug-xros/CQRSTests.xctest (in target 'CQRSTests' from project 'CQRS')
cd /Users/admin/builder/spi-builder-workspace
/bin/mkdir -p /Users/admin/builder/spi-builder-workspace/.derivedData/Build/Products/Debug-xros/CQRSTests.xctest
Copy /Users/admin/builder/spi-builder-workspace/.derivedData/Build/Intermediates.noindex/GeneratedModuleMaps-xros/CQRS.modulemap /Users/admin/builder/spi-builder-workspace/.derivedData/Build/Intermediates.noindex/CQRS.build/Debug-xros/CQRS.build/CQRS.modulemap (in target 'CQRS' from project 'CQRS')
cd /Users/admin/builder/spi-builder-workspace
builtin-copy -exclude .DS_Store -exclude CVS -exclude .svn -exclude .git -exclude .hg -resolve-src-symlinks /Users/admin/builder/spi-builder-workspace/.derivedData/Build/Intermediates.noindex/CQRS.build/Debug-xros/CQRS.build/CQRS.modulemap /Users/admin/builder/spi-builder-workspace/.derivedData/Build/Intermediates.noindex/GeneratedModuleMaps-xros
SwiftDriver Dip normal arm64 com.apple.xcode.tools.swift.compiler (in target 'Dip' from project 'Dip')
cd /Users/admin/builder/spi-builder-workspace/.swiftpm/xcode
builtin-SwiftDriver -- /Applications/Xcode-16.3.0.app/Contents/Developer/Toolchains/XcodeDefault.xctoolchain/usr/bin/swiftc -module-name Dip -Onone -enforce-exclusivity\=checked @/Users/admin/builder/spi-builder-workspace/.derivedData/Build/Intermediates.noindex/Dip.build/Debug-xros/Dip.build/Objects-normal/arm64/Dip.SwiftFileList -DSWIFT_PACKAGE -DDEBUG -stats-output-dir .stats -plugin-path /Applications/Xcode-16.3.0.app/Contents/Developer/Toolchains/XcodeDefault.xctoolchain/usr/lib/swift/host/plugins/testing -enable-experimental-feature DebugDescriptionMacro -sdk /Applications/Xcode-16.3.0.app/Contents/Developer/Platforms/XROS.platform/Developer/SDKs/XROS2.4.sdk -target arm64-apple-xros1.0 -g -module-cache-path /Users/admin/builder/spi-builder-workspace/.derivedData/ModuleCache.noindex -Xfrontend -serialize-debugging-options -profile-coverage-mapping -profile-generate -enable-testing -suppress-warnings -index-store-path /Users/admin/builder/spi-builder-workspace/.derivedData/Index.noindex/DataStore -swift-version 5 -I /Users/admin/builder/spi-builder-workspace/.derivedData/Build/Products/Debug-xros -I /Applications/Xcode-16.3.0.app/Contents/Developer/Platforms/XROS.platform/Developer/usr/lib -F /Users/admin/builder/spi-builder-workspace/.derivedData/Build/Products/Debug-xros -F /Applications/Xcode-16.3.0.app/Contents/Developer/Platforms/XROS.platform/Developer/Library/Frameworks -F /Applications/Xcode-16.3.0.app/Contents/Developer/Platforms/XROS.platform/Developer/SDKs/XROS2.4.sdk/Developer/Library/Frameworks -c -j10 -enable-batch-mode -incremental -Xcc -ivfsstatcache -Xcc /Users/admin/builder/spi-builder-workspace/.derivedData/SDKStatCaches.noindex/xros2.4-22O233-407b76dbb837030756cbe1ab3f0b01b6.sdkstatcache -output-file-map /Users/admin/builder/spi-builder-workspace/.derivedData/Build/Intermediates.noindex/Dip.build/Debug-xros/Dip.build/Objects-normal/arm64/Dip-OutputFileMap.json -use-frontend-parseable-output -save-temps -no-color-diagnostics -serialize-diagnostics -emit-dependencies -emit-module -emit-module-path /Users/admin/builder/spi-builder-workspace/.derivedData/Build/Intermediates.noindex/Dip.build/Debug-xros/Dip.build/Objects-normal/arm64/Dip.swiftmodule -validate-clang-modules-once -clang-build-session-file /Users/admin/builder/spi-builder-workspace/.derivedData/ModuleCache.noindex/Session.modulevalidation -Xcc -I/Users/admin/builder/spi-builder-workspace/.derivedData/Build/Intermediates.noindex/Dip.build/Debug-xros/Dip.build/swift-overrides.hmap -emit-const-values -Xfrontend -const-gather-protocols-file -Xfrontend /Users/admin/builder/spi-builder-workspace/.derivedData/Build/Intermediates.noindex/Dip.build/Debug-xros/Dip.build/Objects-normal/arm64/Dip_const_extract_protocols.json -Xcc -I/Users/admin/builder/spi-builder-workspace/.derivedData/Build/Products/Debug-xros/include -Xcc -I/Users/admin/builder/spi-builder-workspace/.derivedData/Build/Intermediates.noindex/Dip.build/Debug-xros/Dip.build/DerivedSources-normal/arm64 -Xcc -I/Users/admin/builder/spi-builder-workspace/.derivedData/Build/Intermediates.noindex/Dip.build/Debug-xros/Dip.build/DerivedSources/arm64 -Xcc -I/Users/admin/builder/spi-builder-workspace/.derivedData/Build/Intermediates.noindex/Dip.build/Debug-xros/Dip.build/DerivedSources -Xcc -DSWIFT_PACKAGE -Xcc -DDEBUG\=1 -emit-objc-header -emit-objc-header-path /Users/admin/builder/spi-builder-workspace/.derivedData/Build/Intermediates.noindex/Dip.build/Debug-xros/Dip.build/Objects-normal/arm64/Dip-Swift.h -working-directory /Users/admin/builder/spi-builder-workspace/.swiftpm/xcode -experimental-emit-module-separately -disable-cmo
SwiftCompile normal arm64 Compiling\ Compatibility.swift,\ ComponentScope.swift /Users/admin/builder/spi-builder-workspace/.dependencies/checkouts/Dip/Sources/Compatibility.swift /Users/admin/builder/spi-builder-workspace/.dependencies/checkouts/Dip/Sources/ComponentScope.swift (in target 'Dip' from project 'Dip')
SwiftCompile normal arm64 /Users/admin/builder/spi-builder-workspace/.dependencies/checkouts/Dip/Sources/Compatibility.swift (in target 'Dip' from project 'Dip')
cd /Users/admin/builder/spi-builder-workspace/.swiftpm/xcode
SwiftCompile normal arm64 /Users/admin/builder/spi-builder-workspace/.dependencies/checkouts/Dip/Sources/ComponentScope.swift (in target 'Dip' from project 'Dip')
cd /Users/admin/builder/spi-builder-workspace/.swiftpm/xcode
SwiftCompile normal arm64 Compiling\ DipError.swift /Users/admin/builder/spi-builder-workspace/.dependencies/checkouts/Dip/Sources/DipError.swift (in target 'Dip' from project 'Dip')
SwiftCompile normal arm64 /Users/admin/builder/spi-builder-workspace/.dependencies/checkouts/Dip/Sources/DipError.swift (in target 'Dip' from project 'Dip')
cd /Users/admin/builder/spi-builder-workspace/.swiftpm/xcode
SwiftCompile normal arm64 Compiling\ Resolve.swift /Users/admin/builder/spi-builder-workspace/.dependencies/checkouts/Dip/Sources/Resolve.swift (in target 'Dip' from project 'Dip')
SwiftCompile normal arm64 /Users/admin/builder/spi-builder-workspace/.dependencies/checkouts/Dip/Sources/Resolve.swift (in target 'Dip' from project 'Dip')
cd /Users/admin/builder/spi-builder-workspace/.swiftpm/xcode
SwiftCompile normal arm64 Compiling\ Definition.swift,\ Dip.swift /Users/admin/builder/spi-builder-workspace/.dependencies/checkouts/Dip/Sources/Definition.swift /Users/admin/builder/spi-builder-workspace/.dependencies/checkouts/Dip/Sources/Dip.swift (in target 'Dip' from project 'Dip')
SwiftCompile normal arm64 /Users/admin/builder/spi-builder-workspace/.dependencies/checkouts/Dip/Sources/Definition.swift (in target 'Dip' from project 'Dip')
cd /Users/admin/builder/spi-builder-workspace/.swiftpm/xcode
SwiftCompile normal arm64 /Users/admin/builder/spi-builder-workspace/.dependencies/checkouts/Dip/Sources/Dip.swift (in target 'Dip' from project 'Dip')
cd /Users/admin/builder/spi-builder-workspace/.swiftpm/xcode
SwiftCompile normal arm64 Compiling\ RuntimeArguments.swift /Users/admin/builder/spi-builder-workspace/.dependencies/checkouts/Dip/Sources/RuntimeArguments.swift (in target 'Dip' from project 'Dip')
SwiftCompile normal arm64 /Users/admin/builder/spi-builder-workspace/.dependencies/checkouts/Dip/Sources/RuntimeArguments.swift (in target 'Dip' from project 'Dip')
cd /Users/admin/builder/spi-builder-workspace/.swiftpm/xcode
SwiftCompile normal arm64 Compiling\ StoryboardInstantiatable.swift /Users/admin/builder/spi-builder-workspace/.dependencies/checkouts/Dip/Sources/StoryboardInstantiatable.swift (in target 'Dip' from project 'Dip')
SwiftCompile normal arm64 /Users/admin/builder/spi-builder-workspace/.dependencies/checkouts/Dip/Sources/StoryboardInstantiatable.swift (in target 'Dip' from project 'Dip')
cd /Users/admin/builder/spi-builder-workspace/.swiftpm/xcode
SwiftEmitModule normal arm64 Emitting\ module\ for\ Dip (in target 'Dip' from project 'Dip')
Failed frontend command:
/Applications/Xcode-16.3.0.app/Contents/Developer/Toolchains/XcodeDefault.xctoolchain/usr/bin/swift-frontend -frontend -emit-module -experimental-skip-non-inlinable-function-bodies-without-types /Users/admin/builder/spi-builder-workspace/.dependencies/checkouts/Dip/Sources/AutoInjection.swift /Users/admin/builder/spi-builder-workspace/.dependencies/checkouts/Dip/Sources/AutoWiring.swift /Users/admin/builder/spi-builder-workspace/.dependencies/checkouts/Dip/Sources/Compatibility.swift /Users/admin/builder/spi-builder-workspace/.dependencies/checkouts/Dip/Sources/ComponentScope.swift /Users/admin/builder/spi-builder-workspace/.dependencies/checkouts/Dip/Sources/Definition.swift /Users/admin/builder/spi-builder-workspace/.dependencies/checkouts/Dip/Sources/Dip.swift /Users/admin/builder/spi-builder-workspace/.dependencies/checkouts/Dip/Sources/DipError.swift /Users/admin/builder/spi-builder-workspace/.dependencies/checkouts/Dip/Sources/Register.swift /Users/admin/builder/spi-builder-workspace/.dependencies/checkouts/Dip/Sources/Resolve.swift /Users/admin/builder/spi-builder-workspace/.dependencies/checkouts/Dip/Sources/RuntimeArguments.swift /Users/admin/builder/spi-builder-workspace/.dependencies/checkouts/Dip/Sources/StoryboardInstantiatable.swift /Users/admin/builder/spi-builder-workspace/.dependencies/checkouts/Dip/Sources/TypeForwarding.swift /Users/admin/builder/spi-builder-workspace/.dependencies/checkouts/Dip/Sources/Utils.swift -target arm64-apple-xros1.0 -Xllvm -aarch64-use-tbi -enable-objc-interop -stack-check -sdk /Applications/Xcode-16.3.0.app/Contents/Developer/Platforms/XROS.platform/Developer/SDKs/XROS2.4.sdk -I /Users/admin/builder/spi-builder-workspace/.derivedData/Build/Products/Debug-xros -I /Applications/Xcode-16.3.0.app/Contents/Developer/Platforms/XROS.platform/Developer/usr/lib -F /Users/admin/builder/spi-builder-workspace/.derivedData/Build/Products/Debug-xros -F /Applications/Xcode-16.3.0.app/Contents/Developer/Platforms/XROS.platform/Developer/Library/Frameworks -F /Applications/Xcode-16.3.0.app/Contents/Developer/Platforms/XROS.platform/Developer/SDKs/XROS2.4.sdk/Developer/Library/Frameworks -no-color-diagnostics -enable-testing -g -debug-info-format\=dwarf -dwarf-version\=4 -module-cache-path /Users/admin/builder/spi-builder-workspace/.derivedData/ModuleCache.noindex -suppress-warnings -profile-generate -profile-coverage-mapping -swift-version 5 -enforce-exclusivity\=checked -stats-output-dir /Users/admin/builder/spi-builder-workspace/.swiftpm/xcode/.stats -Onone -D SWIFT_PACKAGE -D DEBUG -serialize-debugging-options -const-gather-protocols-file /Users/admin/builder/spi-builder-workspace/.derivedData/Build/Intermediates.noindex/Dip.build/Debug-xros/Dip.build/Objects-normal/arm64/Dip_const_extract_protocols.json -enable-experimental-feature DebugDescriptionMacro -empty-abi-descriptor -plugin-path /Applications/Xcode-16.3.0.app/Contents/Developer/Toolchains/XcodeDefault.xctoolchain/usr/lib/swift/host/plugins/testing -validate-clang-modules-once -clang-build-session-file /Users/admin/builder/spi-builder-workspace/.derivedData/ModuleCache.noindex/Session.modulevalidation -Xcc -working-directory -Xcc /Users/admin/builder/spi-builder-workspace/.swiftpm/xcode -resource-dir /Applications/Xcode-16.3.0.app/Contents/Developer/Toolchains/XcodeDefault.xctoolchain/usr/lib/swift -enable-anonymous-context-mangled-names -file-compilation-dir /Users/admin/builder/spi-builder-workspace/.swiftpm/xcode -Xcc -ivfsstatcache -Xcc /Users/admin/builder/spi-builder-workspace/.derivedData/SDKStatCaches.noindex/xros2.4-22O233-407b76dbb837030756cbe1ab3f0b01b6.sdkstatcache -Xcc -I/Users/admin/builder/spi-builder-workspace/.derivedData/Build/Intermediates.noindex/Dip.build/Debug-xros/Dip.build/swift-overrides.hmap -Xcc -I/Users/admin/builder/spi-builder-workspace/.derivedData/Build/Products/Debug-xros/include -Xcc -I/Users/admin/builder/spi-builder-workspace/.derivedData/Build/Intermediates.noindex/Dip.build/Debug-xros/Dip.build/DerivedSources-normal/arm64 -Xcc -I/Users/admin/builder/spi-builder-workspace/.derivedData/Build/Intermediates.noindex/Dip.build/Debug-xros/Dip.build/DerivedSources/arm64 -Xcc -I/Users/admin/builder/spi-builder-workspace/.derivedData/Build/Intermediates.noindex/Dip.build/Debug-xros/Dip.build/DerivedSources -Xcc -DSWIFT_PACKAGE -Xcc -DDEBUG\=1 -module-name Dip -frontend-parseable-output -disable-clang-spi -target-sdk-version 2.4 -target-sdk-name xros2.4 -external-plugin-path /Applications/Xcode-16.3.0.app/Contents/Developer/Platforms/XROS.platform/Developer/usr/lib/swift/host/plugins\#/Applications/Xcode-16.3.0.app/Contents/Developer/Platforms/XROS.platform/Developer/usr/bin/swift-plugin-server -external-plugin-path /Applications/Xcode-16.3.0.app/Contents/Developer/Platforms/XROS.platform/Developer/usr/local/lib/swift/host/plugins\#/Applications/Xcode-16.3.0.app/Contents/Developer/Platforms/XROS.platform/Developer/usr/bin/swift-plugin-server -in-process-plugin-server-path /Applications/Xcode-16.3.0.app/Contents/Developer/Toolchains/XcodeDefault.xctoolchain/usr/lib/swift/host/libSwiftInProcPluginServer.dylib -plugin-path /Applications/Xcode-16.3.0.app/Contents/Developer/Toolchains/XcodeDefault.xctoolchain/usr/lib/swift/host/plugins -plugin-path /Applications/Xcode-16.3.0.app/Contents/Developer/Toolchains/XcodeDefault.xctoolchain/usr/local/lib/swift/host/plugins -emit-module-doc-path /Users/admin/builder/spi-builder-workspace/.derivedData/Build/Intermediates.noindex/Dip.build/Debug-xros/Dip.build/Objects-normal/arm64/Dip.swiftdoc -emit-module-source-info-path /Users/admin/builder/spi-builder-workspace/.derivedData/Build/Intermediates.noindex/Dip.build/Debug-xros/Dip.build/Objects-normal/arm64/Dip.swiftsourceinfo -emit-objc-header-path /Users/admin/builder/spi-builder-workspace/.derivedData/Build/Intermediates.noindex/Dip.build/Debug-xros/Dip.build/Objects-normal/arm64/Dip-Swift.h -serialize-diagnostics-path /Users/admin/builder/spi-builder-workspace/.derivedData/Build/Intermediates.noindex/Dip.build/Debug-xros/Dip.build/Objects-normal/arm64/Dip-master-emit-module.dia -emit-dependencies-path /Users/admin/builder/spi-builder-workspace/.derivedData/Build/Intermediates.noindex/Dip.build/Debug-xros/Dip.build/Objects-normal/arm64/Dip-master-emit-module.d -o /Users/admin/builder/spi-builder-workspace/.derivedData/Build/Intermediates.noindex/Dip.build/Debug-xros/Dip.build/Objects-normal/arm64/Dip.swiftmodule -emit-abi-descriptor-path /Users/admin/builder/spi-builder-workspace/.derivedData/Build/Intermediates.noindex/Dip.build/Debug-xros/Dip.build/Objects-normal/arm64/Dip.abi.json
EmitSwiftModule normal arm64 (in target 'Dip' from project 'Dip')
cd /Users/admin/builder/spi-builder-workspace/.swiftpm/xcode
/Users/admin/builder/spi-builder-workspace/.dependencies/checkouts/Dip/Sources/StoryboardInstantiatable.swift:211:8: error: no such module 'WatchKit'
import WatchKit
^
SwiftCompile normal arm64 Compiling\ Utils.swift /Users/admin/builder/spi-builder-workspace/.dependencies/checkouts/Dip/Sources/Utils.swift (in target 'Dip' from project 'Dip')
SwiftCompile normal arm64 /Users/admin/builder/spi-builder-workspace/.dependencies/checkouts/Dip/Sources/Utils.swift (in target 'Dip' from project 'Dip')
cd /Users/admin/builder/spi-builder-workspace/.swiftpm/xcode
SwiftCompile normal arm64 Compiling\ TypeForwarding.swift /Users/admin/builder/spi-builder-workspace/.dependencies/checkouts/Dip/Sources/TypeForwarding.swift (in target 'Dip' from project 'Dip')
SwiftCompile normal arm64 /Users/admin/builder/spi-builder-workspace/.dependencies/checkouts/Dip/Sources/TypeForwarding.swift (in target 'Dip' from project 'Dip')
cd /Users/admin/builder/spi-builder-workspace/.swiftpm/xcode
SwiftCompile normal arm64 Compiling\ Register.swift /Users/admin/builder/spi-builder-workspace/.dependencies/checkouts/Dip/Sources/Register.swift (in target 'Dip' from project 'Dip')
SwiftCompile normal arm64 /Users/admin/builder/spi-builder-workspace/.dependencies/checkouts/Dip/Sources/Register.swift (in target 'Dip' from project 'Dip')
cd /Users/admin/builder/spi-builder-workspace/.swiftpm/xcode
SwiftCompile normal arm64 Compiling\ AutoInjection.swift,\ AutoWiring.swift /Users/admin/builder/spi-builder-workspace/.dependencies/checkouts/Dip/Sources/AutoInjection.swift /Users/admin/builder/spi-builder-workspace/.dependencies/checkouts/Dip/Sources/AutoWiring.swift (in target 'Dip' from project 'Dip')
Command SwiftCompile failed with a nonzero exit code
** BUILD FAILED **
The following build commands failed:
SwiftEmitModule normal arm64 Emitting\ module\ for\ Dip (in target 'Dip' from project 'Dip')
EmitSwiftModule normal arm64 (in target 'Dip' from project 'Dip')
SwiftCompile normal arm64 Compiling\ AutoInjection.swift,\ AutoWiring.swift /Users/admin/builder/spi-builder-workspace/.dependencies/checkouts/Dip/Sources/AutoInjection.swift /Users/admin/builder/spi-builder-workspace/.dependencies/checkouts/Dip/Sources/AutoWiring.swift (in target 'Dip' from project 'Dip')
Building workspace spi-builder-workspace with scheme CQRS
(4 failures)
Command line invocation:
/Applications/Xcode-16.3.0.app/Contents/Developer/usr/bin/xcodebuild -IDEClonedSourcePackagesDirPathOverride=/Users/admin/builder/spi-builder-workspace/.dependencies -resolvePackageDependencies
Resolve Package Graph
Resolved source packages:
Dip: https://github.com/AliSoftware/Dip @ 7.1.1
CQRS: /Users/admin/builder/spi-builder-workspace
resolved source packages: Dip, CQRS
{
"dependencies" : [
{
"identity" : "dip",
"requirement" : {
"range" : [
{
"lower_bound" : "7.1.1",
"upper_bound" : "8.0.0"
}
]
},
"type" : "sourceControl",
"url" : "https://github.com/AliSoftware/Dip"
}
],
"manifest_display_name" : "CQRS",
"name" : "CQRS",
"path" : "/Users/admin/builder/spi-builder-workspace",
"platforms" : [
{
"name" : "macos",
"version" : "13.0"
},
{
"name" : "ios",
"version" : "16.0"
},
{
"name" : "watchos",
"version" : "9.0"
},
{
"name" : "tvos",
"version" : "16.0"
},
{
"name" : "visionos",
"version" : "1.0"
}
],
"products" : [
{
"name" : "CQRS",
"targets" : [
"CQRS"
],
"type" : {
"library" : [
"automatic"
]
}
}
],
"targets" : [
{
"c99name" : "CQRSTests",
"module_type" : "SwiftTarget",
"name" : "CQRSTests",
"path" : "Tests/CQRSTests",
"sources" : [
"Classes/Command/CommandDispatcherTests.swift",
"Classes/Query/QueryDispatcherTests.swift",
"Helpers/Mocks/Commands/CommandMock.swift",
"Helpers/Mocks/Commands/SecondCommandMock.swift",
"Helpers/Mocks/Handlers/CommandHandlerMock.swift",
"Helpers/Mocks/Handlers/QueryHandlerMock.swift",
"Helpers/Mocks/Handlers/SecondCommandHandlerMock.swift",
"Helpers/Mocks/Queries/QueryMock.swift"
],
"target_dependencies" : [
"CQRS"
],
"type" : "test"
},
{
"c99name" : "CQRS",
"module_type" : "SwiftTarget",
"name" : "CQRS",
"path" : "Sources/CQRS",
"product_dependencies" : [
"Dip"
],
"product_memberships" : [
"CQRS"
],
"sources" : [
"Classes/Command/CommandDispatcher.swift",
"Classes/Command/Interfaces/ICommand.swift",
"Classes/Command/Interfaces/ICommandDispatcher.swift",
"Classes/Command/Interfaces/ICommandHandler.swift",
"Classes/Helpers/Container/DependencyContainer.swift",
"Classes/Helpers/Container/IDependencyContainer.swift",
"Classes/Models/CQRSError.swift",
"Classes/Query/Interfaces/IQuery.swift",
"Classes/Query/Interfaces/IQueryDispatcher.swift",
"Classes/Query/Interfaces/IQueryHandler.swift",
"Classes/Query/QueryDispatcher.swift"
],
"type" : "library"
}
],
"tools_version" : "6.0"
}
{
"workspace" : {
"name" : "spi-builder-workspace",
"schemes" : [
"CQRS"
]
}
}
Running build ...
env DEVELOPER_DIR=/Applications/Xcode-16.3.0.app xcrun xcodebuild -IDEClonedSourcePackagesDirPathOverride=$PWD/.dependencies -skipMacroValidation -skipPackagePluginValidation -derivedDataPath $PWD/.derivedData build -scheme CQRS -destination generic/platform=xrOS
Command line invocation:
/Applications/Xcode-16.3.0.app/Contents/Developer/usr/bin/xcodebuild -IDEClonedSourcePackagesDirPathOverride=/Users/admin/builder/spi-builder-workspace/.dependencies -skipMacroValidation -skipPackagePluginValidation -derivedDataPath /Users/admin/builder/spi-builder-workspace/.derivedData build -scheme CQRS -destination generic/platform=xrOS
Resolve Package Graph
Resolved source packages:
CQRS: /Users/admin/builder/spi-builder-workspace
Dip: https://github.com/AliSoftware/Dip @ 7.1.1
ComputePackagePrebuildTargetDependencyGraph
Prepare packages
CreateBuildRequest
SendProjectDescription
CreateBuildOperation
ComputeTargetDependencyGraph
note: Building targets in dependency order
note: Target dependency graph (5 targets)
Target 'CQRSTests' in project 'CQRS'
➜ Explicit dependency on target 'CQRS' in project 'CQRS'
➜ Explicit dependency on target 'Dip' in project 'Dip'
Target 'CQRS' in project 'CQRS'
➜ Explicit dependency on target 'CQRS' in project 'CQRS'
➜ Explicit dependency on target 'Dip' in project 'Dip'
Target 'CQRS' in project 'CQRS'
➜ Explicit dependency on target 'Dip' in project 'Dip'
Target 'Dip' in project 'Dip'
➜ Explicit dependency on target 'Dip' in project 'Dip'
Target 'Dip' in project 'Dip' (no dependencies)
GatherProvisioningInputs
CreateBuildDescription
ExecuteExternalTool /Applications/Xcode-16.3.0.app/Contents/Developer/Toolchains/XcodeDefault.xctoolchain/usr/bin/swiftc --version
ExecuteExternalTool /Applications/Xcode-16.3.0.app/Contents/Developer/Toolchains/XcodeDefault.xctoolchain/usr/bin/clang -v -E -dM -isysroot /Applications/Xcode-16.3.0.app/Contents/Developer/Platforms/XROS.platform/Developer/SDKs/XROS2.4.sdk -x c -c /dev/null
ExecuteExternalTool /Applications/Xcode-16.3.0.app/Contents/Developer/Toolchains/XcodeDefault.xctoolchain/usr/bin/ld -version_details
Build description signature: 179f763f59ca9b52219d8515ca24c9d8
Build description path: /Users/admin/builder/spi-builder-workspace/.derivedData/Build/Intermediates.noindex/XCBuildData/179f763f59ca9b52219d8515ca24c9d8.xcbuilddata
ClangStatCache /Applications/Xcode-16.3.0.app/Contents/Developer/Toolchains/XcodeDefault.xctoolchain/usr/bin/clang-stat-cache /Applications/Xcode-16.3.0.app/Contents/Developer/Platforms/XROS.platform/Developer/SDKs/XROS2.4.sdk /Users/admin/builder/spi-builder-workspace/.derivedData/SDKStatCaches.noindex/xros2.4-22O233-407b76dbb837030756cbe1ab3f0b01b6.sdkstatcache
cd /Users/admin/builder/spi-builder-workspace/.swiftpm/xcode
/Applications/Xcode-16.3.0.app/Contents/Developer/Toolchains/XcodeDefault.xctoolchain/usr/bin/clang-stat-cache /Applications/Xcode-16.3.0.app/Contents/Developer/Platforms/XROS.platform/Developer/SDKs/XROS2.4.sdk -o /Users/admin/builder/spi-builder-workspace/.derivedData/SDKStatCaches.noindex/xros2.4-22O233-407b76dbb837030756cbe1ab3f0b01b6.sdkstatcache
SwiftDriver Dip normal arm64 com.apple.xcode.tools.swift.compiler (in target 'Dip' from project 'Dip')
cd /Users/admin/builder/spi-builder-workspace/.swiftpm/xcode
builtin-SwiftDriver -- /Applications/Xcode-16.3.0.app/Contents/Developer/Toolchains/XcodeDefault.xctoolchain/usr/bin/swiftc -module-name Dip -Onone -enforce-exclusivity\=checked @/Users/admin/builder/spi-builder-workspace/.derivedData/Build/Intermediates.noindex/Dip.build/Debug-xros/Dip.build/Objects-normal/arm64/Dip.SwiftFileList -DSWIFT_PACKAGE -DDEBUG -DXcode -plugin-path /Applications/Xcode-16.3.0.app/Contents/Developer/Toolchains/XcodeDefault.xctoolchain/usr/lib/swift/host/plugins/testing -enable-experimental-feature DebugDescriptionMacro -sdk /Applications/Xcode-16.3.0.app/Contents/Developer/Platforms/XROS.platform/Developer/SDKs/XROS2.4.sdk -target arm64-apple-xros1.0 -g -module-cache-path /Users/admin/builder/spi-builder-workspace/.derivedData/ModuleCache.noindex -Xfrontend -serialize-debugging-options -profile-coverage-mapping -profile-generate -enable-testing -suppress-warnings -index-store-path /Users/admin/builder/spi-builder-workspace/.derivedData/Index.noindex/DataStore -swift-version 5 -I /Users/admin/builder/spi-builder-workspace/.derivedData/Build/Products/Debug-xros -I /Applications/Xcode-16.3.0.app/Contents/Developer/Platforms/XROS.platform/Developer/usr/lib -F /Users/admin/builder/spi-builder-workspace/.derivedData/Build/Products/Debug-xros -F /Applications/Xcode-16.3.0.app/Contents/Developer/Platforms/XROS.platform/Developer/Library/Frameworks -F /Applications/Xcode-16.3.0.app/Contents/Developer/Platforms/XROS.platform/Developer/SDKs/XROS2.4.sdk/Developer/Library/Frameworks -c -j10 -enable-batch-mode -incremental -Xcc -ivfsstatcache -Xcc /Users/admin/builder/spi-builder-workspace/.derivedData/SDKStatCaches.noindex/xros2.4-22O233-407b76dbb837030756cbe1ab3f0b01b6.sdkstatcache -output-file-map /Users/admin/builder/spi-builder-workspace/.derivedData/Build/Intermediates.noindex/Dip.build/Debug-xros/Dip.build/Objects-normal/arm64/Dip-OutputFileMap.json -use-frontend-parseable-output -save-temps -no-color-diagnostics -serialize-diagnostics -emit-dependencies -emit-module -emit-module-path /Users/admin/builder/spi-builder-workspace/.derivedData/Build/Intermediates.noindex/Dip.build/Debug-xros/Dip.build/Objects-normal/arm64/Dip.swiftmodule -validate-clang-modules-once -clang-build-session-file /Users/admin/builder/spi-builder-workspace/.derivedData/ModuleCache.noindex/Session.modulevalidation -Xcc -I/Users/admin/builder/spi-builder-workspace/.derivedData/Build/Intermediates.noindex/Dip.build/Debug-xros/Dip.build/swift-overrides.hmap -emit-const-values -Xfrontend -const-gather-protocols-file -Xfrontend /Users/admin/builder/spi-builder-workspace/.derivedData/Build/Intermediates.noindex/Dip.build/Debug-xros/Dip.build/Objects-normal/arm64/Dip_const_extract_protocols.json -Xcc -I/Users/admin/builder/spi-builder-workspace/.derivedData/Build/Products/Debug-xros/include -Xcc -I/Users/admin/builder/spi-builder-workspace/.derivedData/Build/Intermediates.noindex/Dip.build/Debug-xros/Dip.build/DerivedSources-normal/arm64 -Xcc -I/Users/admin/builder/spi-builder-workspace/.derivedData/Build/Intermediates.noindex/Dip.build/Debug-xros/Dip.build/DerivedSources/arm64 -Xcc -I/Users/admin/builder/spi-builder-workspace/.derivedData/Build/Intermediates.noindex/Dip.build/Debug-xros/Dip.build/DerivedSources -Xcc -DSWIFT_PACKAGE -Xcc -DDEBUG\=1 -emit-objc-header -emit-objc-header-path /Users/admin/builder/spi-builder-workspace/.derivedData/Build/Intermediates.noindex/Dip.build/Debug-xros/Dip.build/Objects-normal/arm64/Dip-Swift.h -working-directory /Users/admin/builder/spi-builder-workspace/.swiftpm/xcode -experimental-emit-module-separately -disable-cmo
SwiftCompile normal arm64 Compiling\ Definition.swift,\ Dip.swift /Users/admin/builder/spi-builder-workspace/.dependencies/checkouts/Dip/Sources/Definition.swift /Users/admin/builder/spi-builder-workspace/.dependencies/checkouts/Dip/Sources/Dip.swift (in target 'Dip' from project 'Dip')
SwiftCompile normal arm64 /Users/admin/builder/spi-builder-workspace/.dependencies/checkouts/Dip/Sources/Definition.swift (in target 'Dip' from project 'Dip')
cd /Users/admin/builder/spi-builder-workspace/.swiftpm/xcode
SwiftCompile normal arm64 /Users/admin/builder/spi-builder-workspace/.dependencies/checkouts/Dip/Sources/Dip.swift (in target 'Dip' from project 'Dip')
cd /Users/admin/builder/spi-builder-workspace/.swiftpm/xcode
SwiftCompile normal arm64 Compiling\ Compatibility.swift,\ ComponentScope.swift /Users/admin/builder/spi-builder-workspace/.dependencies/checkouts/Dip/Sources/Compatibility.swift /Users/admin/builder/spi-builder-workspace/.dependencies/checkouts/Dip/Sources/ComponentScope.swift (in target 'Dip' from project 'Dip')
SwiftCompile normal arm64 /Users/admin/builder/spi-builder-workspace/.dependencies/checkouts/Dip/Sources/Compatibility.swift (in target 'Dip' from project 'Dip')
cd /Users/admin/builder/spi-builder-workspace/.swiftpm/xcode
SwiftCompile normal arm64 /Users/admin/builder/spi-builder-workspace/.dependencies/checkouts/Dip/Sources/ComponentScope.swift (in target 'Dip' from project 'Dip')
cd /Users/admin/builder/spi-builder-workspace/.swiftpm/xcode
SwiftCompile normal arm64 Compiling\ DipError.swift /Users/admin/builder/spi-builder-workspace/.dependencies/checkouts/Dip/Sources/DipError.swift (in target 'Dip' from project 'Dip')
SwiftCompile normal arm64 /Users/admin/builder/spi-builder-workspace/.dependencies/checkouts/Dip/Sources/DipError.swift (in target 'Dip' from project 'Dip')
cd /Users/admin/builder/spi-builder-workspace/.swiftpm/xcode
SwiftCompile normal arm64 Compiling\ Register.swift /Users/admin/builder/spi-builder-workspace/.dependencies/checkouts/Dip/Sources/Register.swift (in target 'Dip' from project 'Dip')
SwiftCompile normal arm64 /Users/admin/builder/spi-builder-workspace/.dependencies/checkouts/Dip/Sources/Register.swift (in target 'Dip' from project 'Dip')
cd /Users/admin/builder/spi-builder-workspace/.swiftpm/xcode
SwiftCompile normal arm64 Compiling\ RuntimeArguments.swift /Users/admin/builder/spi-builder-workspace/.dependencies/checkouts/Dip/Sources/RuntimeArguments.swift (in target 'Dip' from project 'Dip')
SwiftCompile normal arm64 /Users/admin/builder/spi-builder-workspace/.dependencies/checkouts/Dip/Sources/RuntimeArguments.swift (in target 'Dip' from project 'Dip')
cd /Users/admin/builder/spi-builder-workspace/.swiftpm/xcode
SwiftCompile normal arm64 Compiling\ Resolve.swift /Users/admin/builder/spi-builder-workspace/.dependencies/checkouts/Dip/Sources/Resolve.swift (in target 'Dip' from project 'Dip')
SwiftCompile normal arm64 /Users/admin/builder/spi-builder-workspace/.dependencies/checkouts/Dip/Sources/Resolve.swift (in target 'Dip' from project 'Dip')
cd /Users/admin/builder/spi-builder-workspace/.swiftpm/xcode
SwiftCompile normal arm64 Compiling\ StoryboardInstantiatable.swift /Users/admin/builder/spi-builder-workspace/.dependencies/checkouts/Dip/Sources/StoryboardInstantiatable.swift (in target 'Dip' from project 'Dip')
SwiftCompile normal arm64 /Users/admin/builder/spi-builder-workspace/.dependencies/checkouts/Dip/Sources/StoryboardInstantiatable.swift (in target 'Dip' from project 'Dip')
cd /Users/admin/builder/spi-builder-workspace/.swiftpm/xcode
SwiftCompile normal arm64 Compiling\ TypeForwarding.swift /Users/admin/builder/spi-builder-workspace/.dependencies/checkouts/Dip/Sources/TypeForwarding.swift (in target 'Dip' from project 'Dip')
SwiftCompile normal arm64 /Users/admin/builder/spi-builder-workspace/.dependencies/checkouts/Dip/Sources/TypeForwarding.swift (in target 'Dip' from project 'Dip')
cd /Users/admin/builder/spi-builder-workspace/.swiftpm/xcode
SwiftEmitModule normal arm64 Emitting\ module\ for\ Dip (in target 'Dip' from project 'Dip')
Failed frontend command:
/Applications/Xcode-16.3.0.app/Contents/Developer/Toolchains/XcodeDefault.xctoolchain/usr/bin/swift-frontend -frontend -emit-module -experimental-skip-non-inlinable-function-bodies-without-types /Users/admin/builder/spi-builder-workspace/.dependencies/checkouts/Dip/Sources/AutoInjection.swift /Users/admin/builder/spi-builder-workspace/.dependencies/checkouts/Dip/Sources/AutoWiring.swift /Users/admin/builder/spi-builder-workspace/.dependencies/checkouts/Dip/Sources/Compatibility.swift /Users/admin/builder/spi-builder-workspace/.dependencies/checkouts/Dip/Sources/ComponentScope.swift /Users/admin/builder/spi-builder-workspace/.dependencies/checkouts/Dip/Sources/Definition.swift /Users/admin/builder/spi-builder-workspace/.dependencies/checkouts/Dip/Sources/Dip.swift /Users/admin/builder/spi-builder-workspace/.dependencies/checkouts/Dip/Sources/DipError.swift /Users/admin/builder/spi-builder-workspace/.dependencies/checkouts/Dip/Sources/Register.swift /Users/admin/builder/spi-builder-workspace/.dependencies/checkouts/Dip/Sources/Resolve.swift /Users/admin/builder/spi-builder-workspace/.dependencies/checkouts/Dip/Sources/RuntimeArguments.swift /Users/admin/builder/spi-builder-workspace/.dependencies/checkouts/Dip/Sources/StoryboardInstantiatable.swift /Users/admin/builder/spi-builder-workspace/.dependencies/checkouts/Dip/Sources/TypeForwarding.swift /Users/admin/builder/spi-builder-workspace/.dependencies/checkouts/Dip/Sources/Utils.swift -target arm64-apple-xros1.0 -Xllvm -aarch64-use-tbi -enable-objc-interop -stack-check -sdk /Applications/Xcode-16.3.0.app/Contents/Developer/Platforms/XROS.platform/Developer/SDKs/XROS2.4.sdk -I /Users/admin/builder/spi-builder-workspace/.derivedData/Build/Products/Debug-xros -I /Applications/Xcode-16.3.0.app/Contents/Developer/Platforms/XROS.platform/Developer/usr/lib -F /Users/admin/builder/spi-builder-workspace/.derivedData/Build/Products/Debug-xros -F /Applications/Xcode-16.3.0.app/Contents/Developer/Platforms/XROS.platform/Developer/Library/Frameworks -F /Applications/Xcode-16.3.0.app/Contents/Developer/Platforms/XROS.platform/Developer/SDKs/XROS2.4.sdk/Developer/Library/Frameworks -no-color-diagnostics -enable-testing -g -debug-info-format\=dwarf -dwarf-version\=4 -module-cache-path /Users/admin/builder/spi-builder-workspace/.derivedData/ModuleCache.noindex -suppress-warnings -profile-generate -profile-coverage-mapping -swift-version 5 -enforce-exclusivity\=checked -Onone -D SWIFT_PACKAGE -D DEBUG -D Xcode -serialize-debugging-options -const-gather-protocols-file /Users/admin/builder/spi-builder-workspace/.derivedData/Build/Intermediates.noindex/Dip.build/Debug-xros/Dip.build/Objects-normal/arm64/Dip_const_extract_protocols.json -enable-experimental-feature DebugDescriptionMacro -empty-abi-descriptor -plugin-path /Applications/Xcode-16.3.0.app/Contents/Developer/Toolchains/XcodeDefault.xctoolchain/usr/lib/swift/host/plugins/testing -validate-clang-modules-once -clang-build-session-file /Users/admin/builder/spi-builder-workspace/.derivedData/ModuleCache.noindex/Session.modulevalidation -Xcc -working-directory -Xcc /Users/admin/builder/spi-builder-workspace/.swiftpm/xcode -resource-dir /Applications/Xcode-16.3.0.app/Contents/Developer/Toolchains/XcodeDefault.xctoolchain/usr/lib/swift -enable-anonymous-context-mangled-names -file-compilation-dir /Users/admin/builder/spi-builder-workspace/.swiftpm/xcode -Xcc -ivfsstatcache -Xcc /Users/admin/builder/spi-builder-workspace/.derivedData/SDKStatCaches.noindex/xros2.4-22O233-407b76dbb837030756cbe1ab3f0b01b6.sdkstatcache -Xcc -I/Users/admin/builder/spi-builder-workspace/.derivedData/Build/Intermediates.noindex/Dip.build/Debug-xros/Dip.build/swift-overrides.hmap -Xcc -I/Users/admin/builder/spi-builder-workspace/.derivedData/Build/Products/Debug-xros/include -Xcc -I/Users/admin/builder/spi-builder-workspace/.derivedData/Build/Intermediates.noindex/Dip.build/Debug-xros/Dip.build/DerivedSources-normal/arm64 -Xcc -I/Users/admin/builder/spi-builder-workspace/.derivedData/Build/Intermediates.noindex/Dip.build/Debug-xros/Dip.build/DerivedSources/arm64 -Xcc -I/Users/admin/builder/spi-builder-workspace/.derivedData/Build/Intermediates.noindex/Dip.build/Debug-xros/Dip.build/DerivedSources -Xcc -DSWIFT_PACKAGE -Xcc -DDEBUG\=1 -module-name Dip -frontend-parseable-output -disable-clang-spi -target-sdk-version 2.4 -target-sdk-name xros2.4 -external-plugin-path /Applications/Xcode-16.3.0.app/Contents/Developer/Platforms/XROS.platform/Developer/usr/lib/swift/host/plugins\#/Applications/Xcode-16.3.0.app/Contents/Developer/Platforms/XROS.platform/Developer/usr/bin/swift-plugin-server -external-plugin-path /Applications/Xcode-16.3.0.app/Contents/Developer/Platforms/XROS.platform/Developer/usr/local/lib/swift/host/plugins\#/Applications/Xcode-16.3.0.app/Contents/Developer/Platforms/XROS.platform/Developer/usr/bin/swift-plugin-server -in-process-plugin-server-path /Applications/Xcode-16.3.0.app/Contents/Developer/Toolchains/XcodeDefault.xctoolchain/usr/lib/swift/host/libSwiftInProcPluginServer.dylib -plugin-path /Applications/Xcode-16.3.0.app/Contents/Developer/Toolchains/XcodeDefault.xctoolchain/usr/lib/swift/host/plugins -plugin-path /Applications/Xcode-16.3.0.app/Contents/Developer/Toolchains/XcodeDefault.xctoolchain/usr/local/lib/swift/host/plugins -emit-module-doc-path /Users/admin/builder/spi-builder-workspace/.derivedData/Build/Intermediates.noindex/Dip.build/Debug-xros/Dip.build/Objects-normal/arm64/Dip.swiftdoc -emit-module-source-info-path /Users/admin/builder/spi-builder-workspace/.derivedData/Build/Intermediates.noindex/Dip.build/Debug-xros/Dip.build/Objects-normal/arm64/Dip.swiftsourceinfo -emit-objc-header-path /Users/admin/builder/spi-builder-workspace/.derivedData/Build/Intermediates.noindex/Dip.build/Debug-xros/Dip.build/Objects-normal/arm64/Dip-Swift.h -serialize-diagnostics-path /Users/admin/builder/spi-builder-workspace/.derivedData/Build/Intermediates.noindex/Dip.build/Debug-xros/Dip.build/Objects-normal/arm64/Dip-master-emit-module.dia -emit-dependencies-path /Users/admin/builder/spi-builder-workspace/.derivedData/Build/Intermediates.noindex/Dip.build/Debug-xros/Dip.build/Objects-normal/arm64/Dip-master-emit-module.d -o /Users/admin/builder/spi-builder-workspace/.derivedData/Build/Intermediates.noindex/Dip.build/Debug-xros/Dip.build/Objects-normal/arm64/Dip.swiftmodule -emit-abi-descriptor-path /Users/admin/builder/spi-builder-workspace/.derivedData/Build/Intermediates.noindex/Dip.build/Debug-xros/Dip.build/Objects-normal/arm64/Dip.abi.json
EmitSwiftModule normal arm64 (in target 'Dip' from project 'Dip')
cd /Users/admin/builder/spi-builder-workspace/.swiftpm/xcode
/Users/admin/builder/spi-builder-workspace/.dependencies/checkouts/Dip/Sources/StoryboardInstantiatable.swift:211:8: error: no such module 'WatchKit'
import WatchKit
^
SwiftCompile normal arm64 Compiling\ Utils.swift /Users/admin/builder/spi-builder-workspace/.dependencies/checkouts/Dip/Sources/Utils.swift (in target 'Dip' from project 'Dip')
SwiftCompile normal arm64 /Users/admin/builder/spi-builder-workspace/.dependencies/checkouts/Dip/Sources/Utils.swift (in target 'Dip' from project 'Dip')
cd /Users/admin/builder/spi-builder-workspace/.swiftpm/xcode
SwiftCompile normal arm64 Compiling\ AutoInjection.swift,\ AutoWiring.swift /Users/admin/builder/spi-builder-workspace/.dependencies/checkouts/Dip/Sources/AutoInjection.swift /Users/admin/builder/spi-builder-workspace/.dependencies/checkouts/Dip/Sources/AutoWiring.swift (in target 'Dip' from project 'Dip')
Command SwiftCompile failed with a nonzero exit code
** BUILD FAILED **
The following build commands failed:
SwiftEmitModule normal arm64 Emitting\ module\ for\ Dip (in target 'Dip' from project 'Dip')
EmitSwiftModule normal arm64 (in target 'Dip' from project 'Dip')
SwiftCompile normal arm64 Compiling\ AutoInjection.swift,\ AutoWiring.swift /Users/admin/builder/spi-builder-workspace/.dependencies/checkouts/Dip/Sources/AutoInjection.swift /Users/admin/builder/spi-builder-workspace/.dependencies/checkouts/Dip/Sources/AutoWiring.swift (in target 'Dip' from project 'Dip')
Building workspace spi-builder-workspace with scheme CQRS
(4 failures)
BUILD FAILURE 6.1 visionOS