The Swift Package Index logo.Swift Package Index

Track the adoption of Swift 6 strict concurrency checks for data race safety. How many packages are Ready for Swift 6?

Build Information

Failed to build Elephant, reference 0.1.2 (c6cb1d), with Swift 6.1 for macOS (Xcode) using Xcode 16.3 on 27 Apr 2025 08:53:54 UTC.

Build Command

env DEVELOPER_DIR=/Applications/Xcode-16.3.0.app xcrun xcodebuild -IDEClonedSourcePackagesDirPathOverride=$PWD/.dependencies -skipMacroValidation -skipPackagePluginValidation -derivedDataPath $PWD/.derivedData build -scheme Elephant-Package -destination platform=macOS,arch=arm64

Build Log

========================================
RunAll
========================================
Builder version: 4.61.0
Interrupt handler set up.
========================================
Checkout
========================================
Clone URL: https://github.com/s2mr/Elephant.git
Reference: 0.1.2
Initialized empty Git repository in /Users/admin/builder/spi-builder-workspace/.git/
From https://github.com/s2mr/Elephant
 * tag               0.1.2      -> FETCH_HEAD
HEAD is now at c6cb1d4 Update README
Cloned https://github.com/s2mr/Elephant.git
Revision (git rev-parse @):
c6cb1d4e39a3cceadf44c0b95e11230e3eec0904
SUCCESS checkout https://github.com/s2mr/Elephant.git at 0.1.2
========================================
Build
========================================
Selected platform:         macosXcodebuild
Swift version:             6.1
Building package at path:  $PWD
https://github.com/s2mr/Elephant.git
https://github.com/s2mr/Elephant.git
{
  "dependencies" : [
  ],
  "manifest_display_name" : "Elephant",
  "name" : "Elephant",
  "path" : "/Users/admin/builder/spi-builder-workspace",
  "platforms" : [
    {
      "name" : "ios",
      "version" : "11.0"
    }
  ],
  "products" : [
    {
      "name" : "Elephant",
      "targets" : [
        "Elephant"
      ],
      "type" : {
        "library" : [
          "automatic"
        ]
      }
    }
  ],
  "targets" : [
    {
      "c99name" : "ElephantTests",
      "module_type" : "SwiftTarget",
      "name" : "ElephantTests",
      "path" : "Tests/ElephantTests",
      "sources" : [
        "ElephantTests.swift"
      ],
      "target_dependencies" : [
        "Elephant"
      ],
      "type" : "test"
    },
    {
      "c99name" : "Elephant",
      "module_type" : "SwiftTarget",
      "name" : "Elephant",
      "path" : "Sources/Elephant",
      "product_memberships" : [
        "Elephant"
      ],
      "sources" : [
        "AnimationOwner.swift",
        "JavaScriptExecutor.swift",
        "SVGLoader.swift",
        "SVGView.swift"
      ],
      "type" : "library"
    }
  ],
  "tools_version" : "5.5"
}
Command line invocation:
    /Applications/Xcode-16.3.0.app/Contents/Developer/usr/bin/xcodebuild -IDEClonedSourcePackagesDirPathOverride=/Users/admin/builder/spi-builder-workspace/.dependencies -resolvePackageDependencies
resolved source packages:
{
  "dependencies" : [
  ],
  "manifest_display_name" : "Elephant",
  "name" : "Elephant",
  "path" : "/Users/admin/builder/spi-builder-workspace",
  "platforms" : [
    {
      "name" : "ios",
      "version" : "11.0"
    }
  ],
  "products" : [
    {
      "name" : "Elephant",
      "targets" : [
        "Elephant"
      ],
      "type" : {
        "library" : [
          "automatic"
        ]
      }
    }
  ],
  "targets" : [
    {
      "c99name" : "ElephantTests",
      "module_type" : "SwiftTarget",
      "name" : "ElephantTests",
      "path" : "Tests/ElephantTests",
      "sources" : [
        "ElephantTests.swift"
      ],
      "target_dependencies" : [
        "Elephant"
      ],
      "type" : "test"
    },
    {
      "c99name" : "Elephant",
      "module_type" : "SwiftTarget",
      "name" : "Elephant",
      "path" : "Sources/Elephant",
      "product_memberships" : [
        "Elephant"
      ],
      "sources" : [
        "AnimationOwner.swift",
        "JavaScriptExecutor.swift",
        "SVGLoader.swift",
        "SVGView.swift"
      ],
      "type" : "library"
    }
  ],
  "tools_version" : "5.5"
}
{
  "project" : {
    "configurations" : [
      "Debug",
      "Release"
    ],
    "name" : "Elephant",
    "schemes" : [
      "Elephant",
      "Elephant-Package"
    ],
    "targets" : [
      "Elephant",
      "ElephantPackageDescription",
      "ElephantPackageTests",
      "ElephantTests"
    ]
  }
}
Running build ...
env DEVELOPER_DIR=/Applications/Xcode-16.3.0.app xcrun xcodebuild -IDEClonedSourcePackagesDirPathOverride=$PWD/.dependencies -skipMacroValidation -skipPackagePluginValidation -derivedDataPath $PWD/.derivedData build -scheme Elephant-Package -destination platform=macOS,arch=arm64 OTHER_SWIFT_FLAGS=-stats-output-dir .stats -strict-concurrency=complete -enable-upcoming-feature StrictConcurrency -enable-upcoming-feature DisableOutwardActorInference -enable-upcoming-feature GlobalActorIsolatedTypesUsability -enable-upcoming-feature InferSendableFromCaptures
Command line invocation:
    /Applications/Xcode-16.3.0.app/Contents/Developer/usr/bin/xcodebuild -IDEClonedSourcePackagesDirPathOverride=/Users/admin/builder/spi-builder-workspace/.dependencies -skipMacroValidation -skipPackagePluginValidation -derivedDataPath /Users/admin/builder/spi-builder-workspace/.derivedData build -scheme Elephant-Package -destination platform=macOS,arch=arm64 "OTHER_SWIFT_FLAGS=-stats-output-dir .stats -strict-concurrency=complete -enable-upcoming-feature StrictConcurrency -enable-upcoming-feature DisableOutwardActorInference -enable-upcoming-feature GlobalActorIsolatedTypesUsability -enable-upcoming-feature InferSendableFromCaptures"
Build settings from command line:
    OTHER_SWIFT_FLAGS = -stats-output-dir .stats -strict-concurrency=complete -enable-upcoming-feature StrictConcurrency -enable-upcoming-feature DisableOutwardActorInference -enable-upcoming-feature GlobalActorIsolatedTypesUsability -enable-upcoming-feature InferSendableFromCaptures
ComputePackagePrebuildTargetDependencyGraph
Prepare packages
CreateBuildRequest
SendProjectDescription
CreateBuildOperation
ComputeTargetDependencyGraph
note: Building targets in dependency order
note: Target dependency graph (1 target)
    Target 'Elephant' in project 'Elephant' (no dependencies)
GatherProvisioningInputs
CreateBuildDescription
ExecuteExternalTool /Applications/Xcode-16.3.0.app/Contents/Developer/Toolchains/XcodeDefault.xctoolchain/usr/bin/clang -v -E -dM -isysroot /Applications/Xcode-16.3.0.app/Contents/Developer/Platforms/MacOSX.platform/Developer/SDKs/MacOSX15.4.sdk -x c -c /dev/null
ExecuteExternalTool /Applications/Xcode-16.3.0.app/Contents/Developer/Toolchains/XcodeDefault.xctoolchain/usr/bin/swiftc --version
ExecuteExternalTool /Applications/Xcode-16.3.0.app/Contents/Developer/Toolchains/XcodeDefault.xctoolchain/usr/bin/ld -version_details
Build description signature: 51e5f9c096cd90da41abfdab45ab1c84
Build description path: /Users/admin/builder/spi-builder-workspace/.derivedData/Build/Intermediates.noindex/XCBuildData/51e5f9c096cd90da41abfdab45ab1c84.xcbuilddata
CreateBuildDirectory /Users/admin/builder/spi-builder-workspace/.derivedData/Build/Intermediates.noindex
    cd /Users/admin/builder/spi-builder-workspace/Elephant.xcodeproj
    builtin-create-build-directory /Users/admin/builder/spi-builder-workspace/.derivedData/Build/Intermediates.noindex
CreateBuildDirectory /Users/admin/builder/spi-builder-workspace/.derivedData/Build/Products
    cd /Users/admin/builder/spi-builder-workspace/Elephant.xcodeproj
    builtin-create-build-directory /Users/admin/builder/spi-builder-workspace/.derivedData/Build/Products
ClangStatCache /Applications/Xcode-16.3.0.app/Contents/Developer/Toolchains/XcodeDefault.xctoolchain/usr/bin/clang-stat-cache /Applications/Xcode-16.3.0.app/Contents/Developer/Platforms/MacOSX.platform/Developer/SDKs/MacOSX15.4.sdk /Users/admin/builder/spi-builder-workspace/.derivedData/SDKStatCaches.noindex/macosx15.4-24E241-8287b8f5db97e746a1562fbca0c9d29b.sdkstatcache
    cd /Users/admin/builder/spi-builder-workspace/Elephant.xcodeproj
    /Applications/Xcode-16.3.0.app/Contents/Developer/Toolchains/XcodeDefault.xctoolchain/usr/bin/clang-stat-cache /Applications/Xcode-16.3.0.app/Contents/Developer/Platforms/MacOSX.platform/Developer/SDKs/MacOSX15.4.sdk -o /Users/admin/builder/spi-builder-workspace/.derivedData/SDKStatCaches.noindex/macosx15.4-24E241-8287b8f5db97e746a1562fbca0c9d29b.sdkstatcache
CreateBuildDirectory /Users/admin/builder/spi-builder-workspace/.derivedData/Build/Intermediates.noindex/EagerLinkingTBDs/Debug
    cd /Users/admin/builder/spi-builder-workspace/Elephant.xcodeproj
    builtin-create-build-directory /Users/admin/builder/spi-builder-workspace/.derivedData/Build/Intermediates.noindex/EagerLinkingTBDs/Debug
CreateBuildDirectory /Users/admin/builder/spi-builder-workspace/.derivedData/Build/Products/Debug
    cd /Users/admin/builder/spi-builder-workspace/Elephant.xcodeproj
    builtin-create-build-directory /Users/admin/builder/spi-builder-workspace/.derivedData/Build/Products/Debug
SymLink /Users/admin/builder/spi-builder-workspace/.derivedData/Build/Products/Debug/Elephant.framework/Resources Versions/Current/Resources (in target 'Elephant' from project 'Elephant')
    cd /Users/admin/builder/spi-builder-workspace
    /bin/ln -sfh Versions/Current/Resources /Users/admin/builder/spi-builder-workspace/.derivedData/Build/Products/Debug/Elephant.framework/Resources
SymLink /Users/admin/builder/spi-builder-workspace/.derivedData/Build/Products/Debug/Elephant.framework/Versions/Current A (in target 'Elephant' from project 'Elephant')
    cd /Users/admin/builder/spi-builder-workspace
    /bin/ln -sfh A /Users/admin/builder/spi-builder-workspace/.derivedData/Build/Products/Debug/Elephant.framework/Versions/Current
SymLink /Users/admin/builder/spi-builder-workspace/.derivedData/Build/Products/Debug/Elephant.framework/Modules Versions/Current/Modules (in target 'Elephant' from project 'Elephant')
    cd /Users/admin/builder/spi-builder-workspace
    /bin/ln -sfh Versions/Current/Modules /Users/admin/builder/spi-builder-workspace/.derivedData/Build/Products/Debug/Elephant.framework/Modules
WriteAuxiliaryFile /Users/admin/builder/spi-builder-workspace/.derivedData/Build/Intermediates.noindex/Elephant.build/Debug/Elephant.build/Elephant.DependencyMetadataFileList (in target 'Elephant' from project 'Elephant')
    cd /Users/admin/builder/spi-builder-workspace
    write-file /Users/admin/builder/spi-builder-workspace/.derivedData/Build/Intermediates.noindex/Elephant.build/Debug/Elephant.build/Elephant.DependencyMetadataFileList
WriteAuxiliaryFile /Users/admin/builder/spi-builder-workspace/.derivedData/Build/Intermediates.noindex/Elephant.build/Debug/Elephant.build/Elephant.DependencyStaticMetadataFileList (in target 'Elephant' from project 'Elephant')
    cd /Users/admin/builder/spi-builder-workspace
    write-file /Users/admin/builder/spi-builder-workspace/.derivedData/Build/Intermediates.noindex/Elephant.build/Debug/Elephant.build/Elephant.DependencyStaticMetadataFileList
SymLink /Users/admin/builder/spi-builder-workspace/.derivedData/Build/Products/Debug/Elephant.framework/Headers Versions/Current/Headers (in target 'Elephant' from project 'Elephant')
    cd /Users/admin/builder/spi-builder-workspace
    /bin/ln -sfh Versions/Current/Headers /Users/admin/builder/spi-builder-workspace/.derivedData/Build/Products/Debug/Elephant.framework/Headers
SymLink /Users/admin/builder/spi-builder-workspace/.derivedData/Build/Products/Debug/Elephant.framework/Elephant Versions/Current/Elephant (in target 'Elephant' from project 'Elephant')
    cd /Users/admin/builder/spi-builder-workspace
    /bin/ln -sfh Versions/Current/Elephant /Users/admin/builder/spi-builder-workspace/.derivedData/Build/Products/Debug/Elephant.framework/Elephant
WriteAuxiliaryFile /Users/admin/builder/spi-builder-workspace/.derivedData/Build/Intermediates.noindex/Elephant.build/Debug/Elephant.build/Objects-normal/arm64/Elephant.LinkFileList (in target 'Elephant' from project 'Elephant')
    cd /Users/admin/builder/spi-builder-workspace
    write-file /Users/admin/builder/spi-builder-workspace/.derivedData/Build/Intermediates.noindex/Elephant.build/Debug/Elephant.build/Objects-normal/arm64/Elephant.LinkFileList
WriteAuxiliaryFile /Users/admin/builder/spi-builder-workspace/.derivedData/Build/Intermediates.noindex/Elephant.build/Debug/Elephant.build/Objects-normal/arm64/Elephant_const_extract_protocols.json (in target 'Elephant' from project 'Elephant')
    cd /Users/admin/builder/spi-builder-workspace
    write-file /Users/admin/builder/spi-builder-workspace/.derivedData/Build/Intermediates.noindex/Elephant.build/Debug/Elephant.build/Objects-normal/arm64/Elephant_const_extract_protocols.json
WriteAuxiliaryFile /Users/admin/builder/spi-builder-workspace/.derivedData/Build/Intermediates.noindex/Elephant.build/Debug/Elephant.build/Objects-normal/arm64/Elephant.SwiftFileList (in target 'Elephant' from project 'Elephant')
    cd /Users/admin/builder/spi-builder-workspace
    write-file /Users/admin/builder/spi-builder-workspace/.derivedData/Build/Intermediates.noindex/Elephant.build/Debug/Elephant.build/Objects-normal/arm64/Elephant.SwiftFileList
MkDir /Users/admin/builder/spi-builder-workspace/.derivedData/Build/Products/Debug/Elephant.framework/Versions/A/Resources (in target 'Elephant' from project 'Elephant')
    cd /Users/admin/builder/spi-builder-workspace
    /bin/mkdir -p /Users/admin/builder/spi-builder-workspace/.derivedData/Build/Products/Debug/Elephant.framework/Versions/A/Resources
WriteAuxiliaryFile /Users/admin/builder/spi-builder-workspace/.derivedData/Build/Intermediates.noindex/Elephant.build/Debug/Elephant.build/Objects-normal/arm64/Elephant.SwiftConstValuesFileList (in target 'Elephant' from project 'Elephant')
    cd /Users/admin/builder/spi-builder-workspace
    write-file /Users/admin/builder/spi-builder-workspace/.derivedData/Build/Intermediates.noindex/Elephant.build/Debug/Elephant.build/Objects-normal/arm64/Elephant.SwiftConstValuesFileList
WriteAuxiliaryFile /Users/admin/builder/spi-builder-workspace/.derivedData/Build/Intermediates.noindex/Elephant.build/Debug/Elephant.build/Objects-normal/arm64/Elephant-OutputFileMap.json (in target 'Elephant' from project 'Elephant')
    cd /Users/admin/builder/spi-builder-workspace
    write-file /Users/admin/builder/spi-builder-workspace/.derivedData/Build/Intermediates.noindex/Elephant.build/Debug/Elephant.build/Objects-normal/arm64/Elephant-OutputFileMap.json
MkDir /Users/admin/builder/spi-builder-workspace/.derivedData/Build/Products/Debug/Elephant.framework/Versions/A/Headers (in target 'Elephant' from project 'Elephant')
    cd /Users/admin/builder/spi-builder-workspace
    /bin/mkdir -p /Users/admin/builder/spi-builder-workspace/.derivedData/Build/Products/Debug/Elephant.framework/Versions/A/Headers
MkDir /Users/admin/builder/spi-builder-workspace/.derivedData/Build/Products/Debug/Elephant.framework/Versions/A (in target 'Elephant' from project 'Elephant')
    cd /Users/admin/builder/spi-builder-workspace
    /bin/mkdir -p /Users/admin/builder/spi-builder-workspace/.derivedData/Build/Products/Debug/Elephant.framework/Versions/A
MkDir /Users/admin/builder/spi-builder-workspace/.derivedData/Build/Products/Debug/Elephant.framework/Versions (in target 'Elephant' from project 'Elephant')
    cd /Users/admin/builder/spi-builder-workspace
    /bin/mkdir -p /Users/admin/builder/spi-builder-workspace/.derivedData/Build/Products/Debug/Elephant.framework/Versions
MkDir /Users/admin/builder/spi-builder-workspace/.derivedData/Build/Products/Debug/Elephant.framework (in target 'Elephant' from project 'Elephant')
    cd /Users/admin/builder/spi-builder-workspace
    /bin/mkdir -p /Users/admin/builder/spi-builder-workspace/.derivedData/Build/Products/Debug/Elephant.framework
ProcessInfoPlistFile /Users/admin/builder/spi-builder-workspace/.derivedData/Build/Products/Debug/Elephant.framework/Versions/A/Resources/Info.plist /Users/admin/builder/spi-builder-workspace/Elephant.xcodeproj/Elephant_Info.plist (in target 'Elephant' from project 'Elephant')
    cd /Users/admin/builder/spi-builder-workspace
    builtin-infoPlistUtility /Users/admin/builder/spi-builder-workspace/Elephant.xcodeproj/Elephant_Info.plist -producttype com.apple.product-type.framework -expandbuildsettings -platform macosx -o /Users/admin/builder/spi-builder-workspace/.derivedData/Build/Products/Debug/Elephant.framework/Versions/A/Resources/Info.plist
SwiftDriver Elephant normal arm64 com.apple.xcode.tools.swift.compiler (in target 'Elephant' from project 'Elephant')
    cd /Users/admin/builder/spi-builder-workspace
    builtin-SwiftDriver -- /Applications/Xcode-16.3.0.app/Contents/Developer/Toolchains/XcodeDefault.xctoolchain/usr/bin/swiftc -module-name Elephant -Onone -enforce-exclusivity\=checked @/Users/admin/builder/spi-builder-workspace/.derivedData/Build/Intermediates.noindex/Elephant.build/Debug/Elephant.build/Objects-normal/arm64/Elephant.SwiftFileList -DSWIFT_PACKAGE -DDEBUG -stats-output-dir .stats -strict-concurrency\=complete -enable-upcoming-feature StrictConcurrency -enable-upcoming-feature DisableOutwardActorInference -enable-upcoming-feature GlobalActorIsolatedTypesUsability -enable-upcoming-feature InferSendableFromCaptures -enable-bare-slash-regex -enable-experimental-feature DebugDescriptionMacro -sdk /Applications/Xcode-16.3.0.app/Contents/Developer/Platforms/MacOSX.platform/Developer/SDKs/MacOSX15.4.sdk -target arm64-apple-macos10.13 -g -module-cache-path /Users/admin/builder/spi-builder-workspace/.derivedData/ModuleCache.noindex -Xfrontend -serialize-debugging-options -enable-testing -index-store-path /Users/admin/builder/spi-builder-workspace/.derivedData/Index.noindex/DataStore -swift-version 5 -I /Users/admin/builder/spi-builder-workspace/.derivedData/Build/Products/Debug -F /Users/admin/builder/spi-builder-workspace/.derivedData/Build/Products/Debug -F /Applications/Xcode-16.3.0.app/Contents/Developer/Platforms/MacOSX.platform/Developer/Library/Frameworks -c -j10 -enable-batch-mode -incremental -Xcc -ivfsstatcache -Xcc /Users/admin/builder/spi-builder-workspace/.derivedData/SDKStatCaches.noindex/macosx15.4-24E241-8287b8f5db97e746a1562fbca0c9d29b.sdkstatcache -output-file-map /Users/admin/builder/spi-builder-workspace/.derivedData/Build/Intermediates.noindex/Elephant.build/Debug/Elephant.build/Objects-normal/arm64/Elephant-OutputFileMap.json -use-frontend-parseable-output -save-temps -no-color-diagnostics -serialize-diagnostics -emit-dependencies -emit-module -emit-module-path /Users/admin/builder/spi-builder-workspace/.derivedData/Build/Intermediates.noindex/Elephant.build/Debug/Elephant.build/Objects-normal/arm64/Elephant.swiftmodule -validate-clang-modules-once -clang-build-session-file /Users/admin/builder/spi-builder-workspace/.derivedData/ModuleCache.noindex/Session.modulevalidation -Xcc -I/Users/admin/builder/spi-builder-workspace/.derivedData/Build/Intermediates.noindex/Elephant.build/Debug/Elephant.build/swift-overrides.hmap -emit-const-values -Xfrontend -const-gather-protocols-file -Xfrontend /Users/admin/builder/spi-builder-workspace/.derivedData/Build/Intermediates.noindex/Elephant.build/Debug/Elephant.build/Objects-normal/arm64/Elephant_const_extract_protocols.json -Xcc -I/Users/admin/builder/spi-builder-workspace/.derivedData/Build/Products/Debug/include -Xcc -I/Users/admin/builder/spi-builder-workspace/.derivedData/Build/Intermediates.noindex/Elephant.build/Debug/Elephant.build/DerivedSources-normal/arm64 -Xcc -I/Users/admin/builder/spi-builder-workspace/.derivedData/Build/Intermediates.noindex/Elephant.build/Debug/Elephant.build/DerivedSources/arm64 -Xcc -I/Users/admin/builder/spi-builder-workspace/.derivedData/Build/Intermediates.noindex/Elephant.build/Debug/Elephant.build/DerivedSources -Xcc -DSWIFT_PACKAGE\=1 -Xcc -DDEBUG\=1 -emit-objc-header -emit-objc-header-path /Users/admin/builder/spi-builder-workspace/.derivedData/Build/Intermediates.noindex/Elephant.build/Debug/Elephant.build/Objects-normal/arm64/Elephant-Swift.h -working-directory /Users/admin/builder/spi-builder-workspace -experimental-emit-module-separately -disable-cmo
SwiftCompile normal arm64 Compiling\ AnimationOwner.swift /Users/admin/builder/spi-builder-workspace/Sources/Elephant/AnimationOwner.swift (in target 'Elephant' from project 'Elephant')
SwiftCompile normal arm64 /Users/admin/builder/spi-builder-workspace/Sources/Elephant/AnimationOwner.swift (in target 'Elephant' from project 'Elephant')
    cd /Users/admin/builder/spi-builder-workspace

SwiftCompile normal arm64 Compiling\ SVGLoader.swift /Users/admin/builder/spi-builder-workspace/Sources/Elephant/SVGLoader.swift (in target 'Elephant' from project 'Elephant')
SwiftCompile normal arm64 /Users/admin/builder/spi-builder-workspace/Sources/Elephant/SVGLoader.swift (in target 'Elephant' from project 'Elephant')
    cd /Users/admin/builder/spi-builder-workspace

SwiftEmitModule normal arm64 Emitting\ module\ for\ Elephant (in target 'Elephant' from project 'Elephant')
Error opening -stats-output-dir file '/Users/admin/builder/spi-builder-workspace/.stats/stats-1745744026218736-swift-frontend-Elephant-all-arm64_apple_macos10.13-swiftmodule-Onone-3583226482.json' for writing
===-------------------------------------------------------------------------===
                               Swift compilation
===-------------------------------------------------------------------------===
  Total Execution Time: 0.4676 seconds (9.5840 wall clock)
   ---User Time---   --System Time--   --User+System--   ---Wall Time---  --- Name ---
   0.0661 ( 25.8%)   0.0650 ( 30.8%)   0.1311 ( 28.0%)   4.6392 ( 48.4%)  parse-and-resolve-imports
   0.0661 ( 25.8%)   0.0649 ( 30.7%)   0.1310 ( 28.0%)   4.6391 ( 48.4%)  Import resolution
   0.0014 (  0.6%)   0.0060 (  2.8%)   0.0074 (  1.6%)   0.1069 (  1.1%)  load-stdlib
   0.0344 ( 13.4%)   0.0216 ( 10.2%)   0.0560 ( 12.0%)   0.0563 (  0.6%)  perform-sema
   0.0342 ( 13.3%)   0.0216 ( 10.2%)   0.0558 ( 11.9%)   0.0560 (  0.6%)  Type checking and Semantic analysis
   0.0338 ( 13.2%)   0.0215 ( 10.2%)   0.0553 ( 11.8%)   0.0555 (  0.6%)  typecheck-decl
   0.0106 (  4.1%)   0.0029 (  1.4%)   0.0135 (  2.9%)   0.0135 (  0.1%)  typecheck-expr
   0.0052 (  2.0%)   0.0064 (  3.0%)   0.0117 (  2.5%)   0.0116 (  0.1%)  import-clang-decl
   0.0034 (  1.3%)   0.0008 (  0.4%)   0.0042 (  0.9%)   0.0042 (  0.0%)  build-rewrite-system
   0.0009 (  0.4%)   0.0005 (  0.2%)   0.0014 (  0.3%)   0.0014 (  0.0%)  load-all-members
   0.0001 (  0.1%)   0.0000 (  0.0%)   0.0001 (  0.0%)   0.0001 (  0.0%)  precheck-target
   0.0001 (  0.0%)   0.0000 (  0.0%)   0.0001 (  0.0%)   0.0001 (  0.0%)  perform-whole-module-type-checking
   0.0000 (  0.0%)   0.0000 (  0.0%)   0.0000 (  0.0%)   0.0000 (  0.0%)  source-file-populate-cache
   0.0000 (  0.0%)   0.0000 (  0.0%)   0.0000 (  0.0%)   0.0000 (  0.0%)  module-populate-cache
   0.0000 (  0.0%)   0.0000 (  0.0%)   0.0000 (  0.0%)   0.0000 (  0.0%)  AST verification
   0.2564 (100.0%)   0.2112 (100.0%)   0.4676 (100.0%)   9.5840 (100.0%)  Total
===-------------------------------------------------------------------------===
                                Running Program
===-------------------------------------------------------------------------===
  Total Execution Time: 0.1980 seconds (4.8062 wall clock)
   ---User Time---   --System Time--   --User+System--   ---Wall Time---  --- Name ---
   0.1024 (100.0%)   0.0956 (100.0%)   0.1980 (100.0%)   4.8062 (100.0%)  Building Target
   0.1024 (100.0%)   0.0956 (100.0%)   0.1980 (100.0%)   4.8062 (100.0%)  Total
Failed frontend command:
/Applications/Xcode-16.3.0.app/Contents/Developer/Toolchains/XcodeDefault.xctoolchain/usr/bin/swift-frontend -frontend -emit-module -experimental-skip-non-inlinable-function-bodies-without-types /Users/admin/builder/spi-builder-workspace/Sources/Elephant/AnimationOwner.swift /Users/admin/builder/spi-builder-workspace/Sources/Elephant/JavaScriptExecutor.swift /Users/admin/builder/spi-builder-workspace/Sources/Elephant/SVGLoader.swift /Users/admin/builder/spi-builder-workspace/Sources/Elephant/SVGView.swift -target arm64-apple-macos10.13 -Xllvm -aarch64-use-tbi -enable-objc-interop -sdk /Applications/Xcode-16.3.0.app/Contents/Developer/Platforms/MacOSX.platform/Developer/SDKs/MacOSX15.4.sdk -I /Users/admin/builder/spi-builder-workspace/.derivedData/Build/Products/Debug -F /Users/admin/builder/spi-builder-workspace/.derivedData/Build/Products/Debug -F /Applications/Xcode-16.3.0.app/Contents/Developer/Platforms/MacOSX.platform/Developer/Library/Frameworks -no-color-diagnostics -enable-testing -g -debug-info-format\=dwarf -dwarf-version\=4 -module-cache-path /Users/admin/builder/spi-builder-workspace/.derivedData/ModuleCache.noindex -swift-version 5 -enforce-exclusivity\=checked -stats-output-dir /Users/admin/builder/spi-builder-workspace/.stats -Onone -D SWIFT_PACKAGE -D DEBUG -serialize-debugging-options -const-gather-protocols-file /Users/admin/builder/spi-builder-workspace/.derivedData/Build/Intermediates.noindex/Elephant.build/Debug/Elephant.build/Objects-normal/arm64/Elephant_const_extract_protocols.json -enable-upcoming-feature StrictConcurrency -enable-upcoming-feature DisableOutwardActorInference -enable-upcoming-feature GlobalActorIsolatedTypesUsability -enable-upcoming-feature InferSendableFromCaptures -enable-experimental-feature DebugDescriptionMacro -enable-bare-slash-regex -strict-concurrency\=complete -empty-abi-descriptor -validate-clang-modules-once -clang-build-session-file /Users/admin/builder/spi-builder-workspace/.derivedData/ModuleCache.noindex/Session.modulevalidation -Xcc -working-directory -Xcc /Users/admin/builder/spi-builder-workspace -resource-dir /Applications/Xcode-16.3.0.app/Contents/Developer/Toolchains/XcodeDefault.xctoolchain/usr/lib/swift -enable-anonymous-context-mangled-names -file-compilation-dir /Users/admin/builder/spi-builder-workspace -Xcc -ivfsstatcache -Xcc /Users/admin/builder/spi-builder-workspace/.derivedData/SDKStatCaches.noindex/macosx15.4-24E241-8287b8f5db97e746a1562fbca0c9d29b.sdkstatcache -Xcc -I/Users/admin/builder/spi-builder-workspace/.derivedData/Build/Intermediates.noindex/Elephant.build/Debug/Elephant.build/swift-overrides.hmap -Xcc -I/Users/admin/builder/spi-builder-workspace/.derivedData/Build/Products/Debug/include -Xcc -I/Users/admin/builder/spi-builder-workspace/.derivedData/Build/Intermediates.noindex/Elephant.build/Debug/Elephant.build/DerivedSources-normal/arm64 -Xcc -I/Users/admin/builder/spi-builder-workspace/.derivedData/Build/Intermediates.noindex/Elephant.build/Debug/Elephant.build/DerivedSources/arm64 -Xcc -I/Users/admin/builder/spi-builder-workspace/.derivedData/Build/Intermediates.noindex/Elephant.build/Debug/Elephant.build/DerivedSources -Xcc -DSWIFT_PACKAGE\=1 -Xcc -DDEBUG\=1 -module-name Elephant -frontend-parseable-output -disable-clang-spi -target-sdk-version 15.4 -target-sdk-name macosx15.4 -external-plugin-path /Applications/Xcode-16.3.0.app/Contents/Developer/Platforms/MacOSX.platform/Developer/usr/lib/swift/host/plugins\#/Applications/Xcode-16.3.0.app/Contents/Developer/Platforms/MacOSX.platform/Developer/usr/bin/swift-plugin-server -external-plugin-path /Applications/Xcode-16.3.0.app/Contents/Developer/Platforms/MacOSX.platform/Developer/usr/local/lib/swift/host/plugins\#/Applications/Xcode-16.3.0.app/Contents/Developer/Platforms/MacOSX.platform/Developer/usr/bin/swift-plugin-server -in-process-plugin-server-path /Applications/Xcode-16.3.0.app/Contents/Developer/Toolchains/XcodeDefault.xctoolchain/usr/lib/swift/host/libSwiftInProcPluginServer.dylib -plugin-path /Applications/Xcode-16.3.0.app/Contents/Developer/Toolchains/XcodeDefault.xctoolchain/usr/lib/swift/host/plugins -plugin-path /Applications/Xcode-16.3.0.app/Contents/Developer/Toolchains/XcodeDefault.xctoolchain/usr/local/lib/swift/host/plugins -emit-module-doc-path /Users/admin/builder/spi-builder-workspace/.derivedData/Build/Intermediates.noindex/Elephant.build/Debug/Elephant.build/Objects-normal/arm64/Elephant.swiftdoc -emit-module-source-info-path /Users/admin/builder/spi-builder-workspace/.derivedData/Build/Intermediates.noindex/Elephant.build/Debug/Elephant.build/Objects-normal/arm64/Elephant.swiftsourceinfo -emit-objc-header-path /Users/admin/builder/spi-builder-workspace/.derivedData/Build/Intermediates.noindex/Elephant.build/Debug/Elephant.build/Objects-normal/arm64/Elephant-Swift.h -serialize-diagnostics-path /Users/admin/builder/spi-builder-workspace/.derivedData/Build/Intermediates.noindex/Elephant.build/Debug/Elephant.build/Objects-normal/arm64/Elephant-master-emit-module.dia -emit-dependencies-path /Users/admin/builder/spi-builder-workspace/.derivedData/Build/Intermediates.noindex/Elephant.build/Debug/Elephant.build/Objects-normal/arm64/Elephant-master-emit-module.d -o /Users/admin/builder/spi-builder-workspace/.derivedData/Build/Intermediates.noindex/Elephant.build/Debug/Elephant.build/Objects-normal/arm64/Elephant.swiftmodule -emit-abi-descriptor-path /Users/admin/builder/spi-builder-workspace/.derivedData/Build/Intermediates.noindex/Elephant.build/Debug/Elephant.build/Objects-normal/arm64/Elephant.abi.json
EmitSwiftModule normal arm64 (in target 'Elephant' from project 'Elephant')
    cd /Users/admin/builder/spi-builder-workspace

/Users/admin/builder/spi-builder-workspace/Sources/Elephant/SVGView.swift:1:8: error: no such module 'UIKit'
import UIKit
       ^
SwiftCompile normal arm64 Compiling\ SVGView.swift /Users/admin/builder/spi-builder-workspace/Sources/Elephant/SVGView.swift (in target 'Elephant' from project 'Elephant')
SwiftCompile normal arm64 /Users/admin/builder/spi-builder-workspace/Sources/Elephant/SVGView.swift (in target 'Elephant' from project 'Elephant')
    cd /Users/admin/builder/spi-builder-workspace

SwiftCompile normal arm64 Compiling\ JavaScriptExecutor.swift /Users/admin/builder/spi-builder-workspace/Sources/Elephant/JavaScriptExecutor.swift (in target 'Elephant' from project 'Elephant')
SwiftCompile normal arm64 /Users/admin/builder/spi-builder-workspace/Sources/Elephant/JavaScriptExecutor.swift (in target 'Elephant' from project 'Elephant')
    cd /Users/admin/builder/spi-builder-workspace

--- xcodebuild: WARNING: Using the first of multiple matching destinations:
{ platform:macOS, arch:arm64, id:07e0517ea2e46790e3243a97f379caf7d7316194, name:My Mac }
{ platform:macOS, arch:arm64, variant:Mac Catalyst, id:07e0517ea2e46790e3243a97f379caf7d7316194, name:My Mac }
{ platform:macOS, arch:arm64, variant:DriverKit, id:07e0517ea2e46790e3243a97f379caf7d7316194, name:My Mac }
** BUILD FAILED **
The following build commands failed:
	SwiftEmitModule normal arm64 Emitting\ module\ for\ Elephant (in target 'Elephant' from project 'Elephant')
	EmitSwiftModule normal arm64 (in target 'Elephant' from project 'Elephant')
	Building project Elephant with scheme Elephant-Package
(3 failures)
Command line invocation:
    /Applications/Xcode-16.3.0.app/Contents/Developer/usr/bin/xcodebuild -IDEClonedSourcePackagesDirPathOverride=/Users/admin/builder/spi-builder-workspace/.dependencies -resolvePackageDependencies
resolved source packages:
{
  "dependencies" : [
  ],
  "manifest_display_name" : "Elephant",
  "name" : "Elephant",
  "path" : "/Users/admin/builder/spi-builder-workspace",
  "platforms" : [
    {
      "name" : "ios",
      "version" : "11.0"
    }
  ],
  "products" : [
    {
      "name" : "Elephant",
      "targets" : [
        "Elephant"
      ],
      "type" : {
        "library" : [
          "automatic"
        ]
      }
    }
  ],
  "targets" : [
    {
      "c99name" : "ElephantTests",
      "module_type" : "SwiftTarget",
      "name" : "ElephantTests",
      "path" : "Tests/ElephantTests",
      "sources" : [
        "ElephantTests.swift"
      ],
      "target_dependencies" : [
        "Elephant"
      ],
      "type" : "test"
    },
    {
      "c99name" : "Elephant",
      "module_type" : "SwiftTarget",
      "name" : "Elephant",
      "path" : "Sources/Elephant",
      "product_memberships" : [
        "Elephant"
      ],
      "sources" : [
        "AnimationOwner.swift",
        "JavaScriptExecutor.swift",
        "SVGLoader.swift",
        "SVGView.swift"
      ],
      "type" : "library"
    }
  ],
  "tools_version" : "5.5"
}
{
  "project" : {
    "configurations" : [
      "Debug",
      "Release"
    ],
    "name" : "Elephant",
    "schemes" : [
      "Elephant",
      "Elephant-Package"
    ],
    "targets" : [
      "Elephant",
      "ElephantPackageDescription",
      "ElephantPackageTests",
      "ElephantTests"
    ]
  }
}
Running build ...
env DEVELOPER_DIR=/Applications/Xcode-16.3.0.app xcrun xcodebuild -IDEClonedSourcePackagesDirPathOverride=$PWD/.dependencies -skipMacroValidation -skipPackagePluginValidation -derivedDataPath $PWD/.derivedData build -scheme Elephant-Package -destination platform=macOS,arch=arm64
Command line invocation:
    /Applications/Xcode-16.3.0.app/Contents/Developer/usr/bin/xcodebuild -IDEClonedSourcePackagesDirPathOverride=/Users/admin/builder/spi-builder-workspace/.dependencies -skipMacroValidation -skipPackagePluginValidation -derivedDataPath /Users/admin/builder/spi-builder-workspace/.derivedData build -scheme Elephant-Package -destination platform=macOS,arch=arm64
ComputePackagePrebuildTargetDependencyGraph
Prepare packages
CreateBuildRequest
SendProjectDescription
CreateBuildOperation
ComputeTargetDependencyGraph
note: Building targets in dependency order
note: Target dependency graph (1 target)
    Target 'Elephant' in project 'Elephant' (no dependencies)
GatherProvisioningInputs
CreateBuildDescription
ExecuteExternalTool /Applications/Xcode-16.3.0.app/Contents/Developer/Toolchains/XcodeDefault.xctoolchain/usr/bin/clang -v -E -dM -isysroot /Applications/Xcode-16.3.0.app/Contents/Developer/Platforms/MacOSX.platform/Developer/SDKs/MacOSX15.4.sdk -x c -c /dev/null
ExecuteExternalTool /Applications/Xcode-16.3.0.app/Contents/Developer/Toolchains/XcodeDefault.xctoolchain/usr/bin/swiftc --version
ExecuteExternalTool /Applications/Xcode-16.3.0.app/Contents/Developer/Toolchains/XcodeDefault.xctoolchain/usr/bin/ld -version_details
Build description signature: 5a5594112bc6cbf435228f59fea2a7f4
Build description path: /Users/admin/builder/spi-builder-workspace/.derivedData/Build/Intermediates.noindex/XCBuildData/5a5594112bc6cbf435228f59fea2a7f4.xcbuilddata
ClangStatCache /Applications/Xcode-16.3.0.app/Contents/Developer/Toolchains/XcodeDefault.xctoolchain/usr/bin/clang-stat-cache /Applications/Xcode-16.3.0.app/Contents/Developer/Platforms/MacOSX.platform/Developer/SDKs/MacOSX15.4.sdk /Users/admin/builder/spi-builder-workspace/.derivedData/SDKStatCaches.noindex/macosx15.4-24E241-8287b8f5db97e746a1562fbca0c9d29b.sdkstatcache
    cd /Users/admin/builder/spi-builder-workspace/Elephant.xcodeproj
    /Applications/Xcode-16.3.0.app/Contents/Developer/Toolchains/XcodeDefault.xctoolchain/usr/bin/clang-stat-cache /Applications/Xcode-16.3.0.app/Contents/Developer/Platforms/MacOSX.platform/Developer/SDKs/MacOSX15.4.sdk -o /Users/admin/builder/spi-builder-workspace/.derivedData/SDKStatCaches.noindex/macosx15.4-24E241-8287b8f5db97e746a1562fbca0c9d29b.sdkstatcache
ProcessInfoPlistFile /Users/admin/builder/spi-builder-workspace/.derivedData/Build/Products/Debug/Elephant.framework/Versions/A/Resources/Info.plist /Users/admin/builder/spi-builder-workspace/Elephant.xcodeproj/Elephant_Info.plist (in target 'Elephant' from project 'Elephant')
    cd /Users/admin/builder/spi-builder-workspace
    builtin-infoPlistUtility /Users/admin/builder/spi-builder-workspace/Elephant.xcodeproj/Elephant_Info.plist -producttype com.apple.product-type.framework -expandbuildsettings -platform macosx -o /Users/admin/builder/spi-builder-workspace/.derivedData/Build/Products/Debug/Elephant.framework/Versions/A/Resources/Info.plist
SwiftDriver Elephant normal arm64 com.apple.xcode.tools.swift.compiler (in target 'Elephant' from project 'Elephant')
    cd /Users/admin/builder/spi-builder-workspace
    builtin-SwiftDriver -- /Applications/Xcode-16.3.0.app/Contents/Developer/Toolchains/XcodeDefault.xctoolchain/usr/bin/swiftc -module-name Elephant -Onone -enforce-exclusivity\=checked @/Users/admin/builder/spi-builder-workspace/.derivedData/Build/Intermediates.noindex/Elephant.build/Debug/Elephant.build/Objects-normal/arm64/Elephant.SwiftFileList -DSWIFT_PACKAGE -DDEBUG -DXcode -enable-bare-slash-regex -enable-experimental-feature DebugDescriptionMacro -sdk /Applications/Xcode-16.3.0.app/Contents/Developer/Platforms/MacOSX.platform/Developer/SDKs/MacOSX15.4.sdk -target arm64-apple-macos10.13 -g -module-cache-path /Users/admin/builder/spi-builder-workspace/.derivedData/ModuleCache.noindex -Xfrontend -serialize-debugging-options -enable-testing -index-store-path /Users/admin/builder/spi-builder-workspace/.derivedData/Index.noindex/DataStore -swift-version 5 -I /Users/admin/builder/spi-builder-workspace/.derivedData/Build/Products/Debug -F /Users/admin/builder/spi-builder-workspace/.derivedData/Build/Products/Debug -F /Applications/Xcode-16.3.0.app/Contents/Developer/Platforms/MacOSX.platform/Developer/Library/Frameworks -c -j10 -enable-batch-mode -incremental -Xcc -ivfsstatcache -Xcc /Users/admin/builder/spi-builder-workspace/.derivedData/SDKStatCaches.noindex/macosx15.4-24E241-8287b8f5db97e746a1562fbca0c9d29b.sdkstatcache -output-file-map /Users/admin/builder/spi-builder-workspace/.derivedData/Build/Intermediates.noindex/Elephant.build/Debug/Elephant.build/Objects-normal/arm64/Elephant-OutputFileMap.json -use-frontend-parseable-output -save-temps -no-color-diagnostics -serialize-diagnostics -emit-dependencies -emit-module -emit-module-path /Users/admin/builder/spi-builder-workspace/.derivedData/Build/Intermediates.noindex/Elephant.build/Debug/Elephant.build/Objects-normal/arm64/Elephant.swiftmodule -validate-clang-modules-once -clang-build-session-file /Users/admin/builder/spi-builder-workspace/.derivedData/ModuleCache.noindex/Session.modulevalidation -Xcc -I/Users/admin/builder/spi-builder-workspace/.derivedData/Build/Intermediates.noindex/Elephant.build/Debug/Elephant.build/swift-overrides.hmap -emit-const-values -Xfrontend -const-gather-protocols-file -Xfrontend /Users/admin/builder/spi-builder-workspace/.derivedData/Build/Intermediates.noindex/Elephant.build/Debug/Elephant.build/Objects-normal/arm64/Elephant_const_extract_protocols.json -Xcc -I/Users/admin/builder/spi-builder-workspace/.derivedData/Build/Products/Debug/include -Xcc -I/Users/admin/builder/spi-builder-workspace/.derivedData/Build/Intermediates.noindex/Elephant.build/Debug/Elephant.build/DerivedSources-normal/arm64 -Xcc -I/Users/admin/builder/spi-builder-workspace/.derivedData/Build/Intermediates.noindex/Elephant.build/Debug/Elephant.build/DerivedSources/arm64 -Xcc -I/Users/admin/builder/spi-builder-workspace/.derivedData/Build/Intermediates.noindex/Elephant.build/Debug/Elephant.build/DerivedSources -Xcc -DSWIFT_PACKAGE\=1 -Xcc -DDEBUG\=1 -emit-objc-header -emit-objc-header-path /Users/admin/builder/spi-builder-workspace/.derivedData/Build/Intermediates.noindex/Elephant.build/Debug/Elephant.build/Objects-normal/arm64/Elephant-Swift.h -working-directory /Users/admin/builder/spi-builder-workspace -experimental-emit-module-separately -disable-cmo
SwiftCompile normal arm64 Compiling\ SVGLoader.swift /Users/admin/builder/spi-builder-workspace/Sources/Elephant/SVGLoader.swift (in target 'Elephant' from project 'Elephant')
SwiftCompile normal arm64 /Users/admin/builder/spi-builder-workspace/Sources/Elephant/SVGLoader.swift (in target 'Elephant' from project 'Elephant')
    cd /Users/admin/builder/spi-builder-workspace

SwiftEmitModule normal arm64 Emitting\ module\ for\ Elephant (in target 'Elephant' from project 'Elephant')
Failed frontend command:
/Applications/Xcode-16.3.0.app/Contents/Developer/Toolchains/XcodeDefault.xctoolchain/usr/bin/swift-frontend -frontend -emit-module -experimental-skip-non-inlinable-function-bodies-without-types /Users/admin/builder/spi-builder-workspace/Sources/Elephant/AnimationOwner.swift /Users/admin/builder/spi-builder-workspace/Sources/Elephant/JavaScriptExecutor.swift /Users/admin/builder/spi-builder-workspace/Sources/Elephant/SVGLoader.swift /Users/admin/builder/spi-builder-workspace/Sources/Elephant/SVGView.swift -target arm64-apple-macos10.13 -Xllvm -aarch64-use-tbi -enable-objc-interop -sdk /Applications/Xcode-16.3.0.app/Contents/Developer/Platforms/MacOSX.platform/Developer/SDKs/MacOSX15.4.sdk -I /Users/admin/builder/spi-builder-workspace/.derivedData/Build/Products/Debug -F /Users/admin/builder/spi-builder-workspace/.derivedData/Build/Products/Debug -F /Applications/Xcode-16.3.0.app/Contents/Developer/Platforms/MacOSX.platform/Developer/Library/Frameworks -no-color-diagnostics -enable-testing -g -debug-info-format\=dwarf -dwarf-version\=4 -module-cache-path /Users/admin/builder/spi-builder-workspace/.derivedData/ModuleCache.noindex -swift-version 5 -enforce-exclusivity\=checked -Onone -D SWIFT_PACKAGE -D DEBUG -D Xcode -serialize-debugging-options -const-gather-protocols-file /Users/admin/builder/spi-builder-workspace/.derivedData/Build/Intermediates.noindex/Elephant.build/Debug/Elephant.build/Objects-normal/arm64/Elephant_const_extract_protocols.json -enable-experimental-feature DebugDescriptionMacro -enable-bare-slash-regex -empty-abi-descriptor -validate-clang-modules-once -clang-build-session-file /Users/admin/builder/spi-builder-workspace/.derivedData/ModuleCache.noindex/Session.modulevalidation -Xcc -working-directory -Xcc /Users/admin/builder/spi-builder-workspace -resource-dir /Applications/Xcode-16.3.0.app/Contents/Developer/Toolchains/XcodeDefault.xctoolchain/usr/lib/swift -enable-anonymous-context-mangled-names -file-compilation-dir /Users/admin/builder/spi-builder-workspace -Xcc -ivfsstatcache -Xcc /Users/admin/builder/spi-builder-workspace/.derivedData/SDKStatCaches.noindex/macosx15.4-24E241-8287b8f5db97e746a1562fbca0c9d29b.sdkstatcache -Xcc -I/Users/admin/builder/spi-builder-workspace/.derivedData/Build/Intermediates.noindex/Elephant.build/Debug/Elephant.build/swift-overrides.hmap -Xcc -I/Users/admin/builder/spi-builder-workspace/.derivedData/Build/Products/Debug/include -Xcc -I/Users/admin/builder/spi-builder-workspace/.derivedData/Build/Intermediates.noindex/Elephant.build/Debug/Elephant.build/DerivedSources-normal/arm64 -Xcc -I/Users/admin/builder/spi-builder-workspace/.derivedData/Build/Intermediates.noindex/Elephant.build/Debug/Elephant.build/DerivedSources/arm64 -Xcc -I/Users/admin/builder/spi-builder-workspace/.derivedData/Build/Intermediates.noindex/Elephant.build/Debug/Elephant.build/DerivedSources -Xcc -DSWIFT_PACKAGE\=1 -Xcc -DDEBUG\=1 -module-name Elephant -frontend-parseable-output -disable-clang-spi -target-sdk-version 15.4 -target-sdk-name macosx15.4 -external-plugin-path /Applications/Xcode-16.3.0.app/Contents/Developer/Platforms/MacOSX.platform/Developer/usr/lib/swift/host/plugins\#/Applications/Xcode-16.3.0.app/Contents/Developer/Platforms/MacOSX.platform/Developer/usr/bin/swift-plugin-server -external-plugin-path /Applications/Xcode-16.3.0.app/Contents/Developer/Platforms/MacOSX.platform/Developer/usr/local/lib/swift/host/plugins\#/Applications/Xcode-16.3.0.app/Contents/Developer/Platforms/MacOSX.platform/Developer/usr/bin/swift-plugin-server -in-process-plugin-server-path /Applications/Xcode-16.3.0.app/Contents/Developer/Toolchains/XcodeDefault.xctoolchain/usr/lib/swift/host/libSwiftInProcPluginServer.dylib -plugin-path /Applications/Xcode-16.3.0.app/Contents/Developer/Toolchains/XcodeDefault.xctoolchain/usr/lib/swift/host/plugins -plugin-path /Applications/Xcode-16.3.0.app/Contents/Developer/Toolchains/XcodeDefault.xctoolchain/usr/local/lib/swift/host/plugins -emit-module-doc-path /Users/admin/builder/spi-builder-workspace/.derivedData/Build/Intermediates.noindex/Elephant.build/Debug/Elephant.build/Objects-normal/arm64/Elephant.swiftdoc -emit-module-source-info-path /Users/admin/builder/spi-builder-workspace/.derivedData/Build/Intermediates.noindex/Elephant.build/Debug/Elephant.build/Objects-normal/arm64/Elephant.swiftsourceinfo -emit-objc-header-path /Users/admin/builder/spi-builder-workspace/.derivedData/Build/Intermediates.noindex/Elephant.build/Debug/Elephant.build/Objects-normal/arm64/Elephant-Swift.h -serialize-diagnostics-path /Users/admin/builder/spi-builder-workspace/.derivedData/Build/Intermediates.noindex/Elephant.build/Debug/Elephant.build/Objects-normal/arm64/Elephant-master-emit-module.dia -emit-dependencies-path /Users/admin/builder/spi-builder-workspace/.derivedData/Build/Intermediates.noindex/Elephant.build/Debug/Elephant.build/Objects-normal/arm64/Elephant-master-emit-module.d -o /Users/admin/builder/spi-builder-workspace/.derivedData/Build/Intermediates.noindex/Elephant.build/Debug/Elephant.build/Objects-normal/arm64/Elephant.swiftmodule -emit-abi-descriptor-path /Users/admin/builder/spi-builder-workspace/.derivedData/Build/Intermediates.noindex/Elephant.build/Debug/Elephant.build/Objects-normal/arm64/Elephant.abi.json
EmitSwiftModule normal arm64 (in target 'Elephant' from project 'Elephant')
    cd /Users/admin/builder/spi-builder-workspace

/Users/admin/builder/spi-builder-workspace/Sources/Elephant/SVGView.swift:1:8: error: no such module 'UIKit'
import UIKit
       ^
SwiftCompile normal arm64 Compiling\ AnimationOwner.swift /Users/admin/builder/spi-builder-workspace/Sources/Elephant/AnimationOwner.swift (in target 'Elephant' from project 'Elephant')
SwiftCompile normal arm64 /Users/admin/builder/spi-builder-workspace/Sources/Elephant/AnimationOwner.swift (in target 'Elephant' from project 'Elephant')
    cd /Users/admin/builder/spi-builder-workspace

SwiftCompile normal arm64 Compiling\ JavaScriptExecutor.swift /Users/admin/builder/spi-builder-workspace/Sources/Elephant/JavaScriptExecutor.swift (in target 'Elephant' from project 'Elephant')
SwiftCompile normal arm64 /Users/admin/builder/spi-builder-workspace/Sources/Elephant/JavaScriptExecutor.swift (in target 'Elephant' from project 'Elephant')
    cd /Users/admin/builder/spi-builder-workspace

SwiftCompile normal arm64 Compiling\ SVGView.swift /Users/admin/builder/spi-builder-workspace/Sources/Elephant/SVGView.swift (in target 'Elephant' from project 'Elephant')
SwiftCompile normal arm64 /Users/admin/builder/spi-builder-workspace/Sources/Elephant/SVGView.swift (in target 'Elephant' from project 'Elephant')
    cd /Users/admin/builder/spi-builder-workspace

--- xcodebuild: WARNING: Using the first of multiple matching destinations:
{ platform:macOS, arch:arm64, id:07e0517ea2e46790e3243a97f379caf7d7316194, name:My Mac }
{ platform:macOS, arch:arm64, variant:Mac Catalyst, id:07e0517ea2e46790e3243a97f379caf7d7316194, name:My Mac }
{ platform:macOS, arch:arm64, variant:DriverKit, id:07e0517ea2e46790e3243a97f379caf7d7316194, name:My Mac }
** BUILD FAILED **
The following build commands failed:
	SwiftEmitModule normal arm64 Emitting\ module\ for\ Elephant (in target 'Elephant' from project 'Elephant')
	EmitSwiftModule normal arm64 (in target 'Elephant' from project 'Elephant')
	Building project Elephant with scheme Elephant-Package
(3 failures)
BUILD FAILURE 6.1 macosXcodebuild