The Swift Package Index logo.Swift Package Index

Track the adoption of Swift 6 strict concurrency checks for data race safety. How many packages are Ready for Swift 6?

Build Information

Failed to build XcodeEditor, reference master (f3234d), with Swift 6.0 for Linux on 27 Nov 2024 12:17:45 UTC.

Build Command

bash -c docker run --pull=always --rm -v "checkouts-4609320-1":/host -w "$PWD" registry.gitlab.com/finestructure/spi-images:basic-6.0-latest swift build --triple x86_64-unknown-linux-gnu -Xswiftc -Xfrontend -Xswiftc -stats-output-dir -Xswiftc -Xfrontend -Xswiftc .stats -Xswiftc -strict-concurrency=complete -Xswiftc -enable-upcoming-feature -Xswiftc StrictConcurrency -Xswiftc -enable-upcoming-feature -Xswiftc DisableOutwardActorInference -Xswiftc -enable-upcoming-feature -Xswiftc GlobalActorIsolatedTypesUsability -Xswiftc -enable-upcoming-feature -Xswiftc InferSendableFromCaptures 2>&1

Build Log

========================================
RunAll
========================================
Builder version: 4.58.0
Interrupt handler set up.
========================================
Checkout
========================================
Clone URL: https://github.com/appsquickly/XcodeEditor.git
Reference: master
Initialized empty Git repository in /host/spi-builder-workspace/.git/
hint: Using 'master' as the name for the initial branch. This default branch name
hint: is subject to change. To configure the initial branch name to use in all
hint: of your new repositories, which will suppress this warning, call:
hint:
hint: 	git config --global init.defaultBranch <name>
hint:
hint: Names commonly chosen instead of 'master' are 'main', 'trunk' and
hint: 'development'. The just-created branch can be renamed via this command:
hint:
hint: 	git branch -m <name>
From https://github.com/appsquickly/XcodeEditor
 * branch            master     -> FETCH_HEAD
 * [new branch]      master     -> origin/master
HEAD is now at f3234db Merge pull request #90 from lvsti/spm-support
Cloned https://github.com/appsquickly/XcodeEditor.git
Revision (git rev-parse @):
f3234db7fc40d8e917e169bc937ed03ca76ba885
SUCCESS checkout https://github.com/appsquickly/XcodeEditor.git at master
========================================
Build
========================================
Selected platform:         linux
Swift version:             6.0
Building package at path:  $PWD
https://github.com/appsquickly/XcodeEditor.git
Running build ...
bash -c docker run --pull=always --rm -v "checkouts-4609320-1":/host -w "$PWD" registry.gitlab.com/finestructure/spi-images:basic-6.0-latest swift build --triple x86_64-unknown-linux-gnu -Xswiftc -Xfrontend -Xswiftc -stats-output-dir -Xswiftc -Xfrontend -Xswiftc .stats -Xswiftc -strict-concurrency=complete -Xswiftc -enable-upcoming-feature -Xswiftc StrictConcurrency -Xswiftc -enable-upcoming-feature -Xswiftc DisableOutwardActorInference -Xswiftc -enable-upcoming-feature -Xswiftc GlobalActorIsolatedTypesUsability -Xswiftc -enable-upcoming-feature -Xswiftc InferSendableFromCaptures 2>&1
basic-6.0-latest: Pulling from finestructure/spi-images
Digest: sha256:47d26c99ca4f1ac0a332c85fd5b13ff4390e72115219984a57a68fe9d1063a05
Status: Image is up to date for registry.gitlab.com/finestructure/spi-images:basic-6.0-latest
Building for debugging...
In file included from /host/spi-builder-workspace/Source/XcodeSourceFileType.m:14:
/host/spi-builder-workspace/Source/Include/XcodeSourceFileType.h:12:9: fatal error: 'Foundation/Foundation.h' file not found
   12 | #import <Foundation/Foundation.h>
      |         ^~~~~~~~~~~~~~~~~~~~~~~~~
1 error generated.
[0/21] Compiling XcodeEditor XcodeSourceFileType.m
In file included from /host/spi-builder-workspace/Source/XCFrameworkDefinition.m:14:
/host/spi-builder-workspace/Source/Include/XCFrameworkDefinition.h:14:9: fatal error: 'Foundation/Foundation.h' file not found
   14 | #import <Foundation/Foundation.h>
      |         ^~~~~~~~~~~~~~~~~~~~~~~~~
1 error generated.
In file included from /host/spi-builder-workspace/Source/XCClassDefinition.m:16:
/host/spi-builder-workspace/Source/Include/XCClassDefinition.h:13:9: fatal error: 'Foundation/Foundation.h' file not found
   13 | #import <Foundation/Foundation.h>
      |         ^~~~~~~~~~~~~~~~~~~~~~~~~
1 error generated.
In file included from /host/spi-builder-workspace/Source/XCBuildShellScript.m:9:
/host/spi-builder-workspace/Source/Include/XCBuildShellScript.h:9:9: fatal error: 'Foundation/Foundation.h' file not found
    9 | #import <Foundation/Foundation.h>
      |         ^~~~~~~~~~~~~~~~~~~~~~~~~
1 error generated.
[0/21] Compiling XcodeEditor XCBuildShellScript.m
[0/21] Compiling XcodeEditor XCClassDefinition.m
In file included from /host/spi-builder-workspace/Source/XCBuildShellScriptDefinition.m:9:
/host/spi-builder-workspace/Source/Include/XCBuildShellScriptDefinition.h:9:9: fatal error: 'Foundation/Foundation.h' file not found
    9 | #import <Foundation/Foundation.h>
      |         ^~~~~~~~~~~~~~~~~~~~~~~~~
1 error generated.
In file included from /host/spi-builder-workspace/Source/XcodeSourceTreeType.m:12:
/host/spi-builder-workspace/Source/Include/XcodeSourceTreeType.h:12:9: fatal error: 'Foundation/Foundation.h' file not found
   12 | #import <Foundation/Foundation.h>
      |         ^~~~~~~~~~~~~~~~~~~~~~~~~
1 error generated.
[0/21] Compiling XcodeEditor XCBuildShellScriptDefinition.m
[0/21] Compiling XcodeEditor XcodeSourceTreeType.m
In file included from /host/spi-builder-workspace/Source/XCFileOperationQueue.m:14:
/host/spi-builder-workspace/Source/Include/XCFileOperationQueue.h:13:9: fatal error: 'Foundation/Foundation.h' file not found
   13 | #import <Foundation/Foundation.h>
      |         ^~~~~~~~~~~~~~~~~~~~~~~~~
1 error generated.
[0/21] Compiling XcodeEditor XCFileOperationQueue.m
[0/21] Compiling XcodeEditor XCFrameworkDefinition.m
In file included from /host/spi-builder-workspace/Source/XcodeMemberType.m:12:
/host/spi-builder-workspace/Source/Include/XcodeMemberType.h:12:9: fatal error: 'Foundation/Foundation.h' file not found
   12 | #import <Foundation/Foundation.h>
      |         ^~~~~~~~~~~~~~~~~~~~~~~~~
1 error generated.
[0/21] Compiling XcodeEditor XcodeMemberType.m
BUILD FAILURE 6.0 linux