The Swift Package Index logo.Swift Package Index

Track the adoption of Swift 6 strict concurrency checks for data race safety. How many packages are Ready for Swift 6?

Build Information

Failed to build ScreenNavigatorKit, reference main (3ef664), with Swift 6.1 for watchOS using Xcode 16.3 on 28 Apr 2025 03:03:53 UTC.

Build Command

env DEVELOPER_DIR=/Applications/Xcode-16.3.0.app xcrun xcodebuild -IDEClonedSourcePackagesDirPathOverride=$PWD/.dependencies -skipMacroValidation -skipPackagePluginValidation -derivedDataPath $PWD/.derivedData build -scheme ScreenNavigatorKit -destination generic/platform=watchOS

Build Log

========================================
RunAll
========================================
Builder version: 4.61.0
Interrupt handler set up.
========================================
Checkout
========================================
Clone URL: https://github.com/Ernest0-Production/ScreenNavigatorKit.git
Reference: main
Initialized empty Git repository in /Users/admin/builder/spi-builder-workspace/.git/
From https://github.com/Ernest0-Production/ScreenNavigatorKit
 * branch            main       -> FETCH_HEAD
 * [new branch]      main       -> origin/main
HEAD is now at 3ef6644 Update README.md
Cloned https://github.com/Ernest0-Production/ScreenNavigatorKit.git
Revision (git rev-parse @):
3ef6644c62014e678e63546112645b8093309ced
SUCCESS checkout https://github.com/Ernest0-Production/ScreenNavigatorKit.git at main
========================================
Build
========================================
Selected platform:         watchOS
Swift version:             6.1
Building package at path:  $PWD
https://github.com/Ernest0-Production/ScreenNavigatorKit.git
https://github.com/Ernest0-Production/ScreenNavigatorKit.git
{
  "dependencies" : [
  ],
  "manifest_display_name" : "ScreenNavigatorKit",
  "name" : "ScreenNavigatorKit",
  "path" : "/Users/admin/builder/spi-builder-workspace",
  "platforms" : [
    {
      "name" : "ios",
      "version" : "14.0"
    }
  ],
  "products" : [
    {
      "name" : "ScreenNavigatorKit",
      "targets" : [
        "ScreenNavigatorKit"
      ],
      "type" : {
        "library" : [
          "automatic"
        ]
      }
    }
  ],
  "targets" : [
    {
      "c99name" : "ScreenNavigatorKitTests",
      "module_type" : "SwiftTarget",
      "name" : "ScreenNavigatorKitTests",
      "path" : "Tests/ScreenNavigatorKitTests",
      "sources" : [
        "ScreenNavigatorKitTests.swift"
      ],
      "target_dependencies" : [
        "ScreenNavigatorKit"
      ],
      "type" : "test"
    },
    {
      "c99name" : "ScreenNavigatorKit",
      "module_type" : "SwiftTarget",
      "name" : "ScreenNavigatorKit",
      "path" : "Sources/ScreenNavigatorKit",
      "product_memberships" : [
        "ScreenNavigatorKit"
      ],
      "sources" : [
        "Internal/Helpers/AnySequence+first.swift",
        "Internal/Helpers/Binding+isNotNil.swift",
        "Internal/Helpers/Binding+removeDublicates.swift",
        "Internal/Helpers/Binding+when.swift",
        "Internal/Helpers/View+appear.swift",
        "Internal/Helpers/View+asAny.swift",
        "ModalStack/ModalStackController.swift",
        "ModalStack/ModalStackView.swift",
        "ModalStack/ModalToggle.swift",
        "ModalStack/PresentationStyle.swift",
        "ModalStack/View+fullScreenCover.swift",
        "ModalStack/View+sheet.swift",
        "NavigationStack/NavigationStackController.swift",
        "NavigationStack/NavigationStackView.swift",
        "NavigationStack/PushToggle.swift",
        "NavigationStack/View+push.swift"
      ],
      "type" : "library"
    }
  ],
  "tools_version" : "5.7.1"
}
Command line invocation:
    /Applications/Xcode-16.3.0.app/Contents/Developer/usr/bin/xcodebuild -IDEClonedSourcePackagesDirPathOverride=/Users/admin/builder/spi-builder-workspace/.dependencies -resolvePackageDependencies
Resolve Package Graph
Resolved source packages:
  ScreenNavigatorKit: /Users/admin/builder/spi-builder-workspace
resolved source packages: ScreenNavigatorKit
{
  "dependencies" : [
  ],
  "manifest_display_name" : "ScreenNavigatorKit",
  "name" : "ScreenNavigatorKit",
  "path" : "/Users/admin/builder/spi-builder-workspace",
  "platforms" : [
    {
      "name" : "ios",
      "version" : "14.0"
    }
  ],
  "products" : [
    {
      "name" : "ScreenNavigatorKit",
      "targets" : [
        "ScreenNavigatorKit"
      ],
      "type" : {
        "library" : [
          "automatic"
        ]
      }
    }
  ],
  "targets" : [
    {
      "c99name" : "ScreenNavigatorKitTests",
      "module_type" : "SwiftTarget",
      "name" : "ScreenNavigatorKitTests",
      "path" : "Tests/ScreenNavigatorKitTests",
      "sources" : [
        "ScreenNavigatorKitTests.swift"
      ],
      "target_dependencies" : [
        "ScreenNavigatorKit"
      ],
      "type" : "test"
    },
    {
      "c99name" : "ScreenNavigatorKit",
      "module_type" : "SwiftTarget",
      "name" : "ScreenNavigatorKit",
      "path" : "Sources/ScreenNavigatorKit",
      "product_memberships" : [
        "ScreenNavigatorKit"
      ],
      "sources" : [
        "Internal/Helpers/AnySequence+first.swift",
        "Internal/Helpers/Binding+isNotNil.swift",
        "Internal/Helpers/Binding+removeDublicates.swift",
        "Internal/Helpers/Binding+when.swift",
        "Internal/Helpers/View+appear.swift",
        "Internal/Helpers/View+asAny.swift",
        "ModalStack/ModalStackController.swift",
        "ModalStack/ModalStackView.swift",
        "ModalStack/ModalToggle.swift",
        "ModalStack/PresentationStyle.swift",
        "ModalStack/View+fullScreenCover.swift",
        "ModalStack/View+sheet.swift",
        "NavigationStack/NavigationStackController.swift",
        "NavigationStack/NavigationStackView.swift",
        "NavigationStack/PushToggle.swift",
        "NavigationStack/View+push.swift"
      ],
      "type" : "library"
    }
  ],
  "tools_version" : "5.7.1"
}
{
  "workspace" : {
    "name" : "spi-builder-workspace",
    "schemes" : [
      "ScreenNavigatorKit"
    ]
  }
}
Running build ...
env DEVELOPER_DIR=/Applications/Xcode-16.3.0.app xcrun xcodebuild -IDEClonedSourcePackagesDirPathOverride=$PWD/.dependencies -skipMacroValidation -skipPackagePluginValidation -derivedDataPath $PWD/.derivedData build -scheme ScreenNavigatorKit -destination generic/platform=watchOS OTHER_SWIFT_FLAGS=-stats-output-dir .stats -strict-concurrency=complete -enable-upcoming-feature StrictConcurrency -enable-upcoming-feature DisableOutwardActorInference -enable-upcoming-feature GlobalActorIsolatedTypesUsability -enable-upcoming-feature InferSendableFromCaptures
Command line invocation:
    /Applications/Xcode-16.3.0.app/Contents/Developer/usr/bin/xcodebuild -IDEClonedSourcePackagesDirPathOverride=/Users/admin/builder/spi-builder-workspace/.dependencies -skipMacroValidation -skipPackagePluginValidation -derivedDataPath /Users/admin/builder/spi-builder-workspace/.derivedData build -scheme ScreenNavigatorKit -destination generic/platform=watchOS "OTHER_SWIFT_FLAGS=-stats-output-dir .stats -strict-concurrency=complete -enable-upcoming-feature StrictConcurrency -enable-upcoming-feature DisableOutwardActorInference -enable-upcoming-feature GlobalActorIsolatedTypesUsability -enable-upcoming-feature InferSendableFromCaptures"
Build settings from command line:
    OTHER_SWIFT_FLAGS = -stats-output-dir .stats -strict-concurrency=complete -enable-upcoming-feature StrictConcurrency -enable-upcoming-feature DisableOutwardActorInference -enable-upcoming-feature GlobalActorIsolatedTypesUsability -enable-upcoming-feature InferSendableFromCaptures
Resolve Package Graph
Resolved source packages:
  ScreenNavigatorKit: /Users/admin/builder/spi-builder-workspace
ComputePackagePrebuildTargetDependencyGraph
Prepare packages
CreateBuildRequest
SendProjectDescription
CreateBuildOperation
ComputeTargetDependencyGraph
note: Building targets in dependency order
note: Target dependency graph (2 targets)
    Target 'ScreenNavigatorKit' in project 'ScreenNavigatorKit'
        ➜ Explicit dependency on target 'ScreenNavigatorKit' in project 'ScreenNavigatorKit'
    Target 'ScreenNavigatorKit' in project 'ScreenNavigatorKit' (no dependencies)
GatherProvisioningInputs
CreateBuildDescription
ExecuteExternalTool /Applications/Xcode-16.3.0.app/Contents/Developer/Toolchains/XcodeDefault.xctoolchain/usr/bin/clang -v -E -dM -isysroot /Applications/Xcode-16.3.0.app/Contents/Developer/Platforms/WatchOS.platform/Developer/SDKs/WatchOS11.4.sdk -x c -c /dev/null
ExecuteExternalTool /Applications/Xcode-16.3.0.app/Contents/Developer/Toolchains/XcodeDefault.xctoolchain/usr/bin/swiftc --version
ExecuteExternalTool /Applications/Xcode-16.3.0.app/Contents/Developer/Toolchains/XcodeDefault.xctoolchain/usr/bin/ld -version_details
Build description signature: 549367f6a6bd8539c8286d090e531412
Build description path: /Users/admin/builder/spi-builder-workspace/.derivedData/Build/Intermediates.noindex/XCBuildData/549367f6a6bd8539c8286d090e531412.xcbuilddata
ClangStatCache /Applications/Xcode-16.3.0.app/Contents/Developer/Toolchains/XcodeDefault.xctoolchain/usr/bin/clang-stat-cache /Applications/Xcode-16.3.0.app/Contents/Developer/Platforms/WatchOS.platform/Developer/SDKs/WatchOS11.4.sdk /Users/admin/builder/spi-builder-workspace/.derivedData/SDKStatCaches.noindex/watchos11.4-22T246-43efb940ff07ba2497b70ec94253f576.sdkstatcache
    cd /Users/admin/builder/spi-builder-workspace/.swiftpm/xcode
    /Applications/Xcode-16.3.0.app/Contents/Developer/Toolchains/XcodeDefault.xctoolchain/usr/bin/clang-stat-cache /Applications/Xcode-16.3.0.app/Contents/Developer/Platforms/WatchOS.platform/Developer/SDKs/WatchOS11.4.sdk -o /Users/admin/builder/spi-builder-workspace/.derivedData/SDKStatCaches.noindex/watchos11.4-22T246-43efb940ff07ba2497b70ec94253f576.sdkstatcache
CreateBuildDirectory /Users/admin/builder/spi-builder-workspace/.derivedData/Build/Products
    cd /Users/admin/builder/spi-builder-workspace/.swiftpm/xcode
    builtin-create-build-directory /Users/admin/builder/spi-builder-workspace/.derivedData/Build/Products
CreateBuildDirectory /Users/admin/builder/spi-builder-workspace/.derivedData/Build/Intermediates.noindex
    cd /Users/admin/builder/spi-builder-workspace/.swiftpm/xcode
    builtin-create-build-directory /Users/admin/builder/spi-builder-workspace/.derivedData/Build/Intermediates.noindex
CreateBuildDirectory /Users/admin/builder/spi-builder-workspace/.derivedData/Build/Products/Debug-watchos
    cd /Users/admin/builder/spi-builder-workspace/.swiftpm/xcode
    builtin-create-build-directory /Users/admin/builder/spi-builder-workspace/.derivedData/Build/Products/Debug-watchos
CreateBuildDirectory /Users/admin/builder/spi-builder-workspace/.derivedData/Build/Intermediates.noindex/EagerLinkingTBDs/Debug-watchos
    cd /Users/admin/builder/spi-builder-workspace/.swiftpm/xcode
    builtin-create-build-directory /Users/admin/builder/spi-builder-workspace/.derivedData/Build/Intermediates.noindex/EagerLinkingTBDs/Debug-watchos
CreateBuildDirectory /Users/admin/builder/spi-builder-workspace/.derivedData/Build/Products/Debug-watchos/PackageFrameworks
    cd /Users/admin/builder/spi-builder-workspace/.swiftpm/xcode
    builtin-create-build-directory /Users/admin/builder/spi-builder-workspace/.derivedData/Build/Products/Debug-watchos/PackageFrameworks
WriteAuxiliaryFile /Users/admin/builder/spi-builder-workspace/.derivedData/Build/Intermediates.noindex/ScreenNavigatorKit.build/Debug-watchos/ScreenNavigatorKit.build/ScreenNavigatorKit.modulemap (in target 'ScreenNavigatorKit' from project 'ScreenNavigatorKit')
    cd /Users/admin/builder/spi-builder-workspace
    write-file /Users/admin/builder/spi-builder-workspace/.derivedData/Build/Intermediates.noindex/ScreenNavigatorKit.build/Debug-watchos/ScreenNavigatorKit.build/ScreenNavigatorKit.modulemap
WriteAuxiliaryFile /Users/admin/builder/spi-builder-workspace/.derivedData/Build/Intermediates.noindex/ScreenNavigatorKit.build/Debug-watchos/ScreenNavigatorKit.build/ScreenNavigatorKit.DependencyStaticMetadataFileList (in target 'ScreenNavigatorKit' from project 'ScreenNavigatorKit')
    cd /Users/admin/builder/spi-builder-workspace
    write-file /Users/admin/builder/spi-builder-workspace/.derivedData/Build/Intermediates.noindex/ScreenNavigatorKit.build/Debug-watchos/ScreenNavigatorKit.build/ScreenNavigatorKit.DependencyStaticMetadataFileList
WriteAuxiliaryFile /Users/admin/builder/spi-builder-workspace/.derivedData/Build/Intermediates.noindex/ScreenNavigatorKit.build/Debug-watchos/ScreenNavigatorKit.build/ScreenNavigatorKit.DependencyMetadataFileList (in target 'ScreenNavigatorKit' from project 'ScreenNavigatorKit')
    cd /Users/admin/builder/spi-builder-workspace
    write-file /Users/admin/builder/spi-builder-workspace/.derivedData/Build/Intermediates.noindex/ScreenNavigatorKit.build/Debug-watchos/ScreenNavigatorKit.build/ScreenNavigatorKit.DependencyMetadataFileList
WriteAuxiliaryFile /Users/admin/builder/spi-builder-workspace/.derivedData/Build/Intermediates.noindex/ScreenNavigatorKit.build/Debug-watchos/ScreenNavigatorKit.build/Objects-normal/arm64_32/ScreenNavigatorKit-OutputFileMap.json (in target 'ScreenNavigatorKit' from project 'ScreenNavigatorKit')
    cd /Users/admin/builder/spi-builder-workspace
    write-file /Users/admin/builder/spi-builder-workspace/.derivedData/Build/Intermediates.noindex/ScreenNavigatorKit.build/Debug-watchos/ScreenNavigatorKit.build/Objects-normal/arm64_32/ScreenNavigatorKit-OutputFileMap.json
WriteAuxiliaryFile /Users/admin/builder/spi-builder-workspace/.derivedData/Build/Intermediates.noindex/ScreenNavigatorKit.build/Debug-watchos/ScreenNavigatorKit.build/Objects-normal/arm64/ScreenNavigatorKit-OutputFileMap.json (in target 'ScreenNavigatorKit' from project 'ScreenNavigatorKit')
    cd /Users/admin/builder/spi-builder-workspace
    write-file /Users/admin/builder/spi-builder-workspace/.derivedData/Build/Intermediates.noindex/ScreenNavigatorKit.build/Debug-watchos/ScreenNavigatorKit.build/Objects-normal/arm64/ScreenNavigatorKit-OutputFileMap.json
WriteAuxiliaryFile /Users/admin/builder/spi-builder-workspace/.derivedData/Build/Intermediates.noindex/ScreenNavigatorKit.build/Debug-watchos/ScreenNavigatorKit.build/Objects-normal/arm64_32/ScreenNavigatorKit_const_extract_protocols.json (in target 'ScreenNavigatorKit' from project 'ScreenNavigatorKit')
    cd /Users/admin/builder/spi-builder-workspace
    write-file /Users/admin/builder/spi-builder-workspace/.derivedData/Build/Intermediates.noindex/ScreenNavigatorKit.build/Debug-watchos/ScreenNavigatorKit.build/Objects-normal/arm64_32/ScreenNavigatorKit_const_extract_protocols.json
WriteAuxiliaryFile /Users/admin/builder/spi-builder-workspace/.derivedData/Build/Intermediates.noindex/ScreenNavigatorKit.build/Debug-watchos/ScreenNavigatorKit.build/Objects-normal/arm64/ScreenNavigatorKit_const_extract_protocols.json (in target 'ScreenNavigatorKit' from project 'ScreenNavigatorKit')
    cd /Users/admin/builder/spi-builder-workspace
    write-file /Users/admin/builder/spi-builder-workspace/.derivedData/Build/Intermediates.noindex/ScreenNavigatorKit.build/Debug-watchos/ScreenNavigatorKit.build/Objects-normal/arm64/ScreenNavigatorKit_const_extract_protocols.json
WriteAuxiliaryFile /Users/admin/builder/spi-builder-workspace/.derivedData/Build/Intermediates.noindex/ScreenNavigatorKit.build/Debug-watchos/ScreenNavigatorKit.build/Objects-normal/armv7k/ScreenNavigatorKit-OutputFileMap.json (in target 'ScreenNavigatorKit' from project 'ScreenNavigatorKit')
    cd /Users/admin/builder/spi-builder-workspace
    write-file /Users/admin/builder/spi-builder-workspace/.derivedData/Build/Intermediates.noindex/ScreenNavigatorKit.build/Debug-watchos/ScreenNavigatorKit.build/Objects-normal/armv7k/ScreenNavigatorKit-OutputFileMap.json
WriteAuxiliaryFile /Users/admin/builder/spi-builder-workspace/.derivedData/Build/Intermediates.noindex/ScreenNavigatorKit.build/Debug-watchos/ScreenNavigatorKit.build/Objects-normal/armv7k/ScreenNavigatorKit_const_extract_protocols.json (in target 'ScreenNavigatorKit' from project 'ScreenNavigatorKit')
    cd /Users/admin/builder/spi-builder-workspace
    write-file /Users/admin/builder/spi-builder-workspace/.derivedData/Build/Intermediates.noindex/ScreenNavigatorKit.build/Debug-watchos/ScreenNavigatorKit.build/Objects-normal/armv7k/ScreenNavigatorKit_const_extract_protocols.json
WriteAuxiliaryFile /Users/admin/builder/spi-builder-workspace/.derivedData/Build/Intermediates.noindex/ScreenNavigatorKit.build/Debug-watchos/ScreenNavigatorKit.build/Objects-normal/armv7k/ScreenNavigatorKit.SwiftFileList (in target 'ScreenNavigatorKit' from project 'ScreenNavigatorKit')
    cd /Users/admin/builder/spi-builder-workspace
    write-file /Users/admin/builder/spi-builder-workspace/.derivedData/Build/Intermediates.noindex/ScreenNavigatorKit.build/Debug-watchos/ScreenNavigatorKit.build/Objects-normal/armv7k/ScreenNavigatorKit.SwiftFileList
WriteAuxiliaryFile /Users/admin/builder/spi-builder-workspace/.derivedData/Build/Intermediates.noindex/ScreenNavigatorKit.build/Debug-watchos/ScreenNavigatorKit.build/Objects-normal/armv7k/ScreenNavigatorKit.SwiftConstValuesFileList (in target 'ScreenNavigatorKit' from project 'ScreenNavigatorKit')
    cd /Users/admin/builder/spi-builder-workspace
    write-file /Users/admin/builder/spi-builder-workspace/.derivedData/Build/Intermediates.noindex/ScreenNavigatorKit.build/Debug-watchos/ScreenNavigatorKit.build/Objects-normal/armv7k/ScreenNavigatorKit.SwiftConstValuesFileList
WriteAuxiliaryFile /Users/admin/builder/spi-builder-workspace/.derivedData/Build/Intermediates.noindex/ScreenNavigatorKit.build/Debug-watchos/ScreenNavigatorKit.build/Objects-normal/armv7k/ScreenNavigatorKit.LinkFileList (in target 'ScreenNavigatorKit' from project 'ScreenNavigatorKit')
    cd /Users/admin/builder/spi-builder-workspace
    write-file /Users/admin/builder/spi-builder-workspace/.derivedData/Build/Intermediates.noindex/ScreenNavigatorKit.build/Debug-watchos/ScreenNavigatorKit.build/Objects-normal/armv7k/ScreenNavigatorKit.LinkFileList
WriteAuxiliaryFile /Users/admin/builder/spi-builder-workspace/.derivedData/Build/Intermediates.noindex/ScreenNavigatorKit.build/Debug-watchos/ScreenNavigatorKit.build/Objects-normal/arm64_32/ScreenNavigatorKit.SwiftFileList (in target 'ScreenNavigatorKit' from project 'ScreenNavigatorKit')
    cd /Users/admin/builder/spi-builder-workspace
    write-file /Users/admin/builder/spi-builder-workspace/.derivedData/Build/Intermediates.noindex/ScreenNavigatorKit.build/Debug-watchos/ScreenNavigatorKit.build/Objects-normal/arm64_32/ScreenNavigatorKit.SwiftFileList
WriteAuxiliaryFile /Users/admin/builder/spi-builder-workspace/.derivedData/Build/Intermediates.noindex/ScreenNavigatorKit.build/Debug-watchos/ScreenNavigatorKit.build/Objects-normal/arm64_32/ScreenNavigatorKit.SwiftConstValuesFileList (in target 'ScreenNavigatorKit' from project 'ScreenNavigatorKit')
    cd /Users/admin/builder/spi-builder-workspace
    write-file /Users/admin/builder/spi-builder-workspace/.derivedData/Build/Intermediates.noindex/ScreenNavigatorKit.build/Debug-watchos/ScreenNavigatorKit.build/Objects-normal/arm64_32/ScreenNavigatorKit.SwiftConstValuesFileList
WriteAuxiliaryFile /Users/admin/builder/spi-builder-workspace/.derivedData/Build/Intermediates.noindex/ScreenNavigatorKit.build/Debug-watchos/ScreenNavigatorKit.build/Objects-normal/arm64_32/ScreenNavigatorKit.LinkFileList (in target 'ScreenNavigatorKit' from project 'ScreenNavigatorKit')
    cd /Users/admin/builder/spi-builder-workspace
    write-file /Users/admin/builder/spi-builder-workspace/.derivedData/Build/Intermediates.noindex/ScreenNavigatorKit.build/Debug-watchos/ScreenNavigatorKit.build/Objects-normal/arm64_32/ScreenNavigatorKit.LinkFileList
WriteAuxiliaryFile /Users/admin/builder/spi-builder-workspace/.derivedData/Build/Intermediates.noindex/ScreenNavigatorKit.build/Debug-watchos/ScreenNavigatorKit.build/Objects-normal/arm64/ScreenNavigatorKit.SwiftFileList (in target 'ScreenNavigatorKit' from project 'ScreenNavigatorKit')
    cd /Users/admin/builder/spi-builder-workspace
    write-file /Users/admin/builder/spi-builder-workspace/.derivedData/Build/Intermediates.noindex/ScreenNavigatorKit.build/Debug-watchos/ScreenNavigatorKit.build/Objects-normal/arm64/ScreenNavigatorKit.SwiftFileList
WriteAuxiliaryFile /Users/admin/builder/spi-builder-workspace/.derivedData/Build/Intermediates.noindex/ScreenNavigatorKit.build/Debug-watchos/ScreenNavigatorKit.build/Objects-normal/arm64/ScreenNavigatorKit.SwiftConstValuesFileList (in target 'ScreenNavigatorKit' from project 'ScreenNavigatorKit')
    cd /Users/admin/builder/spi-builder-workspace
    write-file /Users/admin/builder/spi-builder-workspace/.derivedData/Build/Intermediates.noindex/ScreenNavigatorKit.build/Debug-watchos/ScreenNavigatorKit.build/Objects-normal/arm64/ScreenNavigatorKit.SwiftConstValuesFileList
WriteAuxiliaryFile /Users/admin/builder/spi-builder-workspace/.derivedData/Build/Intermediates.noindex/ScreenNavigatorKit.build/Debug-watchos/ScreenNavigatorKit.build/Objects-normal/arm64/ScreenNavigatorKit.LinkFileList (in target 'ScreenNavigatorKit' from project 'ScreenNavigatorKit')
    cd /Users/admin/builder/spi-builder-workspace
    write-file /Users/admin/builder/spi-builder-workspace/.derivedData/Build/Intermediates.noindex/ScreenNavigatorKit.build/Debug-watchos/ScreenNavigatorKit.build/Objects-normal/arm64/ScreenNavigatorKit.LinkFileList
Copy /Users/admin/builder/spi-builder-workspace/.derivedData/Build/Intermediates.noindex/GeneratedModuleMaps-watchos/ScreenNavigatorKit.modulemap /Users/admin/builder/spi-builder-workspace/.derivedData/Build/Intermediates.noindex/ScreenNavigatorKit.build/Debug-watchos/ScreenNavigatorKit.build/ScreenNavigatorKit.modulemap (in target 'ScreenNavigatorKit' from project 'ScreenNavigatorKit')
    cd /Users/admin/builder/spi-builder-workspace
    builtin-copy -exclude .DS_Store -exclude CVS -exclude .svn -exclude .git -exclude .hg -resolve-src-symlinks /Users/admin/builder/spi-builder-workspace/.derivedData/Build/Intermediates.noindex/ScreenNavigatorKit.build/Debug-watchos/ScreenNavigatorKit.build/ScreenNavigatorKit.modulemap /Users/admin/builder/spi-builder-workspace/.derivedData/Build/Intermediates.noindex/GeneratedModuleMaps-watchos
SwiftDriver ScreenNavigatorKit normal arm64 com.apple.xcode.tools.swift.compiler (in target 'ScreenNavigatorKit' from project 'ScreenNavigatorKit')
    cd /Users/admin/builder/spi-builder-workspace/.swiftpm/xcode
    builtin-SwiftDriver -- /Applications/Xcode-16.3.0.app/Contents/Developer/Toolchains/XcodeDefault.xctoolchain/usr/bin/swiftc -module-name ScreenNavigatorKit -Onone -enforce-exclusivity\=checked @/Users/admin/builder/spi-builder-workspace/.derivedData/Build/Intermediates.noindex/ScreenNavigatorKit.build/Debug-watchos/ScreenNavigatorKit.build/Objects-normal/arm64/ScreenNavigatorKit.SwiftFileList -DSWIFT_PACKAGE -DDEBUG -stats-output-dir .stats -strict-concurrency\=complete -enable-upcoming-feature StrictConcurrency -enable-upcoming-feature DisableOutwardActorInference -enable-upcoming-feature GlobalActorIsolatedTypesUsability -enable-upcoming-feature InferSendableFromCaptures -plugin-path /Applications/Xcode-16.3.0.app/Contents/Developer/Toolchains/XcodeDefault.xctoolchain/usr/lib/swift/host/plugins/testing -enable-experimental-feature DebugDescriptionMacro -sdk /Applications/Xcode-16.3.0.app/Contents/Developer/Platforms/WatchOS.platform/Developer/SDKs/WatchOS11.4.sdk -target arm64-apple-watchos7.0 -g -module-cache-path /Users/admin/builder/spi-builder-workspace/.derivedData/ModuleCache.noindex -Xfrontend -serialize-debugging-options -profile-coverage-mapping -profile-generate -enable-testing -index-store-path /Users/admin/builder/spi-builder-workspace/.derivedData/Index.noindex/DataStore -swift-version 5 -I /Users/admin/builder/spi-builder-workspace/.derivedData/Build/Products/Debug-watchos -I /Applications/Xcode-16.3.0.app/Contents/Developer/Platforms/WatchOS.platform/Developer/usr/lib -F /Users/admin/builder/spi-builder-workspace/.derivedData/Build/Products/Debug-watchos -F /Applications/Xcode-16.3.0.app/Contents/Developer/Platforms/WatchOS.platform/Developer/Library/Frameworks -F /Applications/Xcode-16.3.0.app/Contents/Developer/Platforms/WatchOS.platform/Developer/SDKs/WatchOS11.4.sdk/Developer/Library/Frameworks -c -j10 -enable-batch-mode -incremental -Xcc -ivfsstatcache -Xcc /Users/admin/builder/spi-builder-workspace/.derivedData/SDKStatCaches.noindex/watchos11.4-22T246-43efb940ff07ba2497b70ec94253f576.sdkstatcache -output-file-map /Users/admin/builder/spi-builder-workspace/.derivedData/Build/Intermediates.noindex/ScreenNavigatorKit.build/Debug-watchos/ScreenNavigatorKit.build/Objects-normal/arm64/ScreenNavigatorKit-OutputFileMap.json -use-frontend-parseable-output -save-temps -no-color-diagnostics -serialize-diagnostics -emit-dependencies -emit-module -emit-module-path /Users/admin/builder/spi-builder-workspace/.derivedData/Build/Intermediates.noindex/ScreenNavigatorKit.build/Debug-watchos/ScreenNavigatorKit.build/Objects-normal/arm64/ScreenNavigatorKit.swiftmodule -validate-clang-modules-once -clang-build-session-file /Users/admin/builder/spi-builder-workspace/.derivedData/ModuleCache.noindex/Session.modulevalidation -Xcc -I/Users/admin/builder/spi-builder-workspace/.derivedData/Build/Intermediates.noindex/ScreenNavigatorKit.build/Debug-watchos/ScreenNavigatorKit.build/swift-overrides.hmap -emit-const-values -Xfrontend -const-gather-protocols-file -Xfrontend /Users/admin/builder/spi-builder-workspace/.derivedData/Build/Intermediates.noindex/ScreenNavigatorKit.build/Debug-watchos/ScreenNavigatorKit.build/Objects-normal/arm64/ScreenNavigatorKit_const_extract_protocols.json -Xcc -I/Users/admin/builder/spi-builder-workspace/.derivedData/Build/Products/Debug-watchos/include -Xcc -I/Users/admin/builder/spi-builder-workspace/.derivedData/Build/Intermediates.noindex/ScreenNavigatorKit.build/Debug-watchos/ScreenNavigatorKit.build/DerivedSources-normal/arm64 -Xcc -I/Users/admin/builder/spi-builder-workspace/.derivedData/Build/Intermediates.noindex/ScreenNavigatorKit.build/Debug-watchos/ScreenNavigatorKit.build/DerivedSources/arm64 -Xcc -I/Users/admin/builder/spi-builder-workspace/.derivedData/Build/Intermediates.noindex/ScreenNavigatorKit.build/Debug-watchos/ScreenNavigatorKit.build/DerivedSources -Xcc -DSWIFT_PACKAGE -Xcc -DDEBUG\=1 -emit-objc-header -emit-objc-header-path /Users/admin/builder/spi-builder-workspace/.derivedData/Build/Intermediates.noindex/ScreenNavigatorKit.build/Debug-watchos/ScreenNavigatorKit.build/Objects-normal/arm64/ScreenNavigatorKit-Swift.h -working-directory /Users/admin/builder/spi-builder-workspace/.swiftpm/xcode -experimental-emit-module-separately -disable-cmo
SwiftDriver ScreenNavigatorKit normal arm64_32 com.apple.xcode.tools.swift.compiler (in target 'ScreenNavigatorKit' from project 'ScreenNavigatorKit')
    cd /Users/admin/builder/spi-builder-workspace/.swiftpm/xcode
    builtin-SwiftDriver -- /Applications/Xcode-16.3.0.app/Contents/Developer/Toolchains/XcodeDefault.xctoolchain/usr/bin/swiftc -module-name ScreenNavigatorKit -Onone -enforce-exclusivity\=checked @/Users/admin/builder/spi-builder-workspace/.derivedData/Build/Intermediates.noindex/ScreenNavigatorKit.build/Debug-watchos/ScreenNavigatorKit.build/Objects-normal/arm64_32/ScreenNavigatorKit.SwiftFileList -DSWIFT_PACKAGE -DDEBUG -stats-output-dir .stats -strict-concurrency\=complete -enable-upcoming-feature StrictConcurrency -enable-upcoming-feature DisableOutwardActorInference -enable-upcoming-feature GlobalActorIsolatedTypesUsability -enable-upcoming-feature InferSendableFromCaptures -plugin-path /Applications/Xcode-16.3.0.app/Contents/Developer/Toolchains/XcodeDefault.xctoolchain/usr/lib/swift/host/plugins/testing -enable-experimental-feature DebugDescriptionMacro -sdk /Applications/Xcode-16.3.0.app/Contents/Developer/Platforms/WatchOS.platform/Developer/SDKs/WatchOS11.4.sdk -target arm64_32-apple-watchos7.0 -g -module-cache-path /Users/admin/builder/spi-builder-workspace/.derivedData/ModuleCache.noindex -Xfrontend -serialize-debugging-options -profile-coverage-mapping -profile-generate -enable-testing -index-store-path /Users/admin/builder/spi-builder-workspace/.derivedData/Index.noindex/DataStore -swift-version 5 -I /Users/admin/builder/spi-builder-workspace/.derivedData/Build/Products/Debug-watchos -I /Applications/Xcode-16.3.0.app/Contents/Developer/Platforms/WatchOS.platform/Developer/usr/lib -F /Users/admin/builder/spi-builder-workspace/.derivedData/Build/Products/Debug-watchos -F /Applications/Xcode-16.3.0.app/Contents/Developer/Platforms/WatchOS.platform/Developer/Library/Frameworks -F /Applications/Xcode-16.3.0.app/Contents/Developer/Platforms/WatchOS.platform/Developer/SDKs/WatchOS11.4.sdk/Developer/Library/Frameworks -c -j10 -enable-batch-mode -incremental -Xcc -ivfsstatcache -Xcc /Users/admin/builder/spi-builder-workspace/.derivedData/SDKStatCaches.noindex/watchos11.4-22T246-43efb940ff07ba2497b70ec94253f576.sdkstatcache -output-file-map /Users/admin/builder/spi-builder-workspace/.derivedData/Build/Intermediates.noindex/ScreenNavigatorKit.build/Debug-watchos/ScreenNavigatorKit.build/Objects-normal/arm64_32/ScreenNavigatorKit-OutputFileMap.json -use-frontend-parseable-output -save-temps -no-color-diagnostics -serialize-diagnostics -emit-dependencies -emit-module -emit-module-path /Users/admin/builder/spi-builder-workspace/.derivedData/Build/Intermediates.noindex/ScreenNavigatorKit.build/Debug-watchos/ScreenNavigatorKit.build/Objects-normal/arm64_32/ScreenNavigatorKit.swiftmodule -validate-clang-modules-once -clang-build-session-file /Users/admin/builder/spi-builder-workspace/.derivedData/ModuleCache.noindex/Session.modulevalidation -Xcc -I/Users/admin/builder/spi-builder-workspace/.derivedData/Build/Intermediates.noindex/ScreenNavigatorKit.build/Debug-watchos/ScreenNavigatorKit.build/swift-overrides.hmap -emit-const-values -Xfrontend -const-gather-protocols-file -Xfrontend /Users/admin/builder/spi-builder-workspace/.derivedData/Build/Intermediates.noindex/ScreenNavigatorKit.build/Debug-watchos/ScreenNavigatorKit.build/Objects-normal/arm64_32/ScreenNavigatorKit_const_extract_protocols.json -Xcc -I/Users/admin/builder/spi-builder-workspace/.derivedData/Build/Products/Debug-watchos/include -Xcc -I/Users/admin/builder/spi-builder-workspace/.derivedData/Build/Intermediates.noindex/ScreenNavigatorKit.build/Debug-watchos/ScreenNavigatorKit.build/DerivedSources-normal/arm64_32 -Xcc -I/Users/admin/builder/spi-builder-workspace/.derivedData/Build/Intermediates.noindex/ScreenNavigatorKit.build/Debug-watchos/ScreenNavigatorKit.build/DerivedSources/arm64_32 -Xcc -I/Users/admin/builder/spi-builder-workspace/.derivedData/Build/Intermediates.noindex/ScreenNavigatorKit.build/Debug-watchos/ScreenNavigatorKit.build/DerivedSources -Xcc -DSWIFT_PACKAGE -Xcc -DDEBUG\=1 -emit-objc-header -emit-objc-header-path /Users/admin/builder/spi-builder-workspace/.derivedData/Build/Intermediates.noindex/ScreenNavigatorKit.build/Debug-watchos/ScreenNavigatorKit.build/Objects-normal/arm64_32/ScreenNavigatorKit-Swift.h -working-directory /Users/admin/builder/spi-builder-workspace/.swiftpm/xcode -experimental-emit-module-separately -disable-cmo
SwiftDriver ScreenNavigatorKit normal armv7k com.apple.xcode.tools.swift.compiler (in target 'ScreenNavigatorKit' from project 'ScreenNavigatorKit')
    cd /Users/admin/builder/spi-builder-workspace/.swiftpm/xcode
    builtin-SwiftDriver -- /Applications/Xcode-16.3.0.app/Contents/Developer/Toolchains/XcodeDefault.xctoolchain/usr/bin/swiftc -module-name ScreenNavigatorKit -Onone -enforce-exclusivity\=checked @/Users/admin/builder/spi-builder-workspace/.derivedData/Build/Intermediates.noindex/ScreenNavigatorKit.build/Debug-watchos/ScreenNavigatorKit.build/Objects-normal/armv7k/ScreenNavigatorKit.SwiftFileList -DSWIFT_PACKAGE -DDEBUG -stats-output-dir .stats -strict-concurrency\=complete -enable-upcoming-feature StrictConcurrency -enable-upcoming-feature DisableOutwardActorInference -enable-upcoming-feature GlobalActorIsolatedTypesUsability -enable-upcoming-feature InferSendableFromCaptures -plugin-path /Applications/Xcode-16.3.0.app/Contents/Developer/Toolchains/XcodeDefault.xctoolchain/usr/lib/swift/host/plugins/testing -enable-experimental-feature DebugDescriptionMacro -sdk /Applications/Xcode-16.3.0.app/Contents/Developer/Platforms/WatchOS.platform/Developer/SDKs/WatchOS11.4.sdk -target armv7k-apple-watchos7.0 -g -module-cache-path /Users/admin/builder/spi-builder-workspace/.derivedData/ModuleCache.noindex -Xfrontend -serialize-debugging-options -profile-coverage-mapping -profile-generate -enable-testing -index-store-path /Users/admin/builder/spi-builder-workspace/.derivedData/Index.noindex/DataStore -swift-version 5 -I /Users/admin/builder/spi-builder-workspace/.derivedData/Build/Products/Debug-watchos -I /Applications/Xcode-16.3.0.app/Contents/Developer/Platforms/WatchOS.platform/Developer/usr/lib -F /Users/admin/builder/spi-builder-workspace/.derivedData/Build/Products/Debug-watchos -F /Applications/Xcode-16.3.0.app/Contents/Developer/Platforms/WatchOS.platform/Developer/Library/Frameworks -F /Applications/Xcode-16.3.0.app/Contents/Developer/Platforms/WatchOS.platform/Developer/SDKs/WatchOS11.4.sdk/Developer/Library/Frameworks -c -j10 -enable-batch-mode -incremental -Xcc -ivfsstatcache -Xcc /Users/admin/builder/spi-builder-workspace/.derivedData/SDKStatCaches.noindex/watchos11.4-22T246-43efb940ff07ba2497b70ec94253f576.sdkstatcache -output-file-map /Users/admin/builder/spi-builder-workspace/.derivedData/Build/Intermediates.noindex/ScreenNavigatorKit.build/Debug-watchos/ScreenNavigatorKit.build/Objects-normal/armv7k/ScreenNavigatorKit-OutputFileMap.json -use-frontend-parseable-output -save-temps -no-color-diagnostics -serialize-diagnostics -emit-dependencies -emit-module -emit-module-path /Users/admin/builder/spi-builder-workspace/.derivedData/Build/Intermediates.noindex/ScreenNavigatorKit.build/Debug-watchos/ScreenNavigatorKit.build/Objects-normal/armv7k/ScreenNavigatorKit.swiftmodule -validate-clang-modules-once -clang-build-session-file /Users/admin/builder/spi-builder-workspace/.derivedData/ModuleCache.noindex/Session.modulevalidation -Xcc -I/Users/admin/builder/spi-builder-workspace/.derivedData/Build/Intermediates.noindex/ScreenNavigatorKit.build/Debug-watchos/ScreenNavigatorKit.build/swift-overrides.hmap -emit-const-values -Xfrontend -const-gather-protocols-file -Xfrontend /Users/admin/builder/spi-builder-workspace/.derivedData/Build/Intermediates.noindex/ScreenNavigatorKit.build/Debug-watchos/ScreenNavigatorKit.build/Objects-normal/armv7k/ScreenNavigatorKit_const_extract_protocols.json -Xcc -I/Users/admin/builder/spi-builder-workspace/.derivedData/Build/Products/Debug-watchos/include -Xcc -I/Users/admin/builder/spi-builder-workspace/.derivedData/Build/Intermediates.noindex/ScreenNavigatorKit.build/Debug-watchos/ScreenNavigatorKit.build/DerivedSources-normal/armv7k -Xcc -I/Users/admin/builder/spi-builder-workspace/.derivedData/Build/Intermediates.noindex/ScreenNavigatorKit.build/Debug-watchos/ScreenNavigatorKit.build/DerivedSources/armv7k -Xcc -I/Users/admin/builder/spi-builder-workspace/.derivedData/Build/Intermediates.noindex/ScreenNavigatorKit.build/Debug-watchos/ScreenNavigatorKit.build/DerivedSources -Xcc -DSWIFT_PACKAGE -Xcc -DDEBUG\=1 -emit-objc-header -emit-objc-header-path /Users/admin/builder/spi-builder-workspace/.derivedData/Build/Intermediates.noindex/ScreenNavigatorKit.build/Debug-watchos/ScreenNavigatorKit.build/Objects-normal/armv7k/ScreenNavigatorKit-Swift.h -working-directory /Users/admin/builder/spi-builder-workspace/.swiftpm/xcode -experimental-emit-module-separately -disable-cmo
SwiftEmitModule normal armv7k Emitting\ module\ for\ ScreenNavigatorKit (in target 'ScreenNavigatorKit' from project 'ScreenNavigatorKit')
EmitSwiftModule normal armv7k (in target 'ScreenNavigatorKit' from project 'ScreenNavigatorKit')
    cd /Users/admin/builder/spi-builder-workspace/.swiftpm/xcode

SwiftEmitModule normal arm64 Emitting\ module\ for\ ScreenNavigatorKit (in target 'ScreenNavigatorKit' from project 'ScreenNavigatorKit')
EmitSwiftModule normal arm64 (in target 'ScreenNavigatorKit' from project 'ScreenNavigatorKit')
    cd /Users/admin/builder/spi-builder-workspace/.swiftpm/xcode

SwiftCompile normal armv7k Compiling\ Binding+removeDublicates.swift,\ Binding+when.swift /Users/admin/builder/spi-builder-workspace/Sources/ScreenNavigatorKit/Internal/Helpers/Binding+removeDublicates.swift /Users/admin/builder/spi-builder-workspace/Sources/ScreenNavigatorKit/Internal/Helpers/Binding+when.swift (in target 'ScreenNavigatorKit' from project 'ScreenNavigatorKit')
SwiftCompile normal armv7k /Users/admin/builder/spi-builder-workspace/Sources/ScreenNavigatorKit/Internal/Helpers/Binding+removeDublicates.swift (in target 'ScreenNavigatorKit' from project 'ScreenNavigatorKit')
    cd /Users/admin/builder/spi-builder-workspace/.swiftpm/xcode

/Users/admin/builder/spi-builder-workspace/Sources/ScreenNavigatorKit/Internal/Helpers/Binding+removeDublicates.swift:13:13: warning: capture of 'self' with non-sendable type 'Binding<Value>' in a '@Sendable' closure
            self.wrappedValue
            ^
/Users/admin/builder/spi-builder-workspace/Sources/ScreenNavigatorKit/Internal/Helpers/Binding+removeDublicates.swift:15:31: warning: capture of 'self' with non-sendable type 'Binding<Value>' in a '@Sendable' closure
            guard newValue != self.wrappedValue else {
                              ^
SwiftCompile normal armv7k /Users/admin/builder/spi-builder-workspace/Sources/ScreenNavigatorKit/Internal/Helpers/Binding+when.swift (in target 'ScreenNavigatorKit' from project 'ScreenNavigatorKit')
    cd /Users/admin/builder/spi-builder-workspace/.swiftpm/xcode

/Users/admin/builder/spi-builder-workspace/Sources/ScreenNavigatorKit/Internal/Helpers/Binding+when.swift:14:26: warning: capture of 'self' with non-sendable type 'Binding<Optional<Wrapped>>' in a '@Sendable' closure
                isTrue ? self.wrappedValue : nil
                         ^
/Users/admin/builder/spi-builder-workspace/Sources/ScreenNavigatorKit/Internal/Helpers/Binding+when.swift:11:15: note: consider making generic parameter 'Wrapped' conform to the 'Sendable' protocol
    func when<Wrapped>(_ isTrue: Bool) -> Binding<Value> where Value == Wrapped? {
              ^
                     : Sendable
/Users/admin/builder/spi-builder-workspace/Sources/ScreenNavigatorKit/Internal/Helpers/Binding+when.swift:18:21: warning: capture of 'self' with non-sendable type 'Binding<Optional<Wrapped>>' in a '@Sendable' closure
                    self.transaction(transaction).wrappedValue = newValue
                    ^
/Users/admin/builder/spi-builder-workspace/Sources/ScreenNavigatorKit/Internal/Helpers/Binding+when.swift:11:15: note: consider making generic parameter 'Wrapped' conform to the 'Sendable' protocol
    func when<Wrapped>(_ isTrue: Bool) -> Binding<Value> where Value == Wrapped? {
              ^
                     : Sendable
SwiftCompile normal arm64 Compiling\ Binding+removeDublicates.swift,\ Binding+when.swift /Users/admin/builder/spi-builder-workspace/Sources/ScreenNavigatorKit/Internal/Helpers/Binding+removeDublicates.swift /Users/admin/builder/spi-builder-workspace/Sources/ScreenNavigatorKit/Internal/Helpers/Binding+when.swift (in target 'ScreenNavigatorKit' from project 'ScreenNavigatorKit')
SwiftCompile normal arm64 /Users/admin/builder/spi-builder-workspace/Sources/ScreenNavigatorKit/Internal/Helpers/Binding+removeDublicates.swift (in target 'ScreenNavigatorKit' from project 'ScreenNavigatorKit')
    cd /Users/admin/builder/spi-builder-workspace/.swiftpm/xcode

/Users/admin/builder/spi-builder-workspace/Sources/ScreenNavigatorKit/Internal/Helpers/Binding+removeDublicates.swift:13:13: warning: capture of 'self' with non-sendable type 'Binding<Value>' in a '@Sendable' closure
            self.wrappedValue
            ^
/Users/admin/builder/spi-builder-workspace/Sources/ScreenNavigatorKit/Internal/Helpers/Binding+removeDublicates.swift:15:31: warning: capture of 'self' with non-sendable type 'Binding<Value>' in a '@Sendable' closure
            guard newValue != self.wrappedValue else {
                              ^
SwiftCompile normal arm64 /Users/admin/builder/spi-builder-workspace/Sources/ScreenNavigatorKit/Internal/Helpers/Binding+when.swift (in target 'ScreenNavigatorKit' from project 'ScreenNavigatorKit')
    cd /Users/admin/builder/spi-builder-workspace/.swiftpm/xcode

/Users/admin/builder/spi-builder-workspace/Sources/ScreenNavigatorKit/Internal/Helpers/Binding+when.swift:14:26: warning: capture of 'self' with non-sendable type 'Binding<Optional<Wrapped>>' in a '@Sendable' closure
                isTrue ? self.wrappedValue : nil
                         ^
/Users/admin/builder/spi-builder-workspace/Sources/ScreenNavigatorKit/Internal/Helpers/Binding+when.swift:11:15: note: consider making generic parameter 'Wrapped' conform to the 'Sendable' protocol
    func when<Wrapped>(_ isTrue: Bool) -> Binding<Value> where Value == Wrapped? {
              ^
                     : Sendable
/Users/admin/builder/spi-builder-workspace/Sources/ScreenNavigatorKit/Internal/Helpers/Binding+when.swift:18:21: warning: capture of 'self' with non-sendable type 'Binding<Optional<Wrapped>>' in a '@Sendable' closure
                    self.transaction(transaction).wrappedValue = newValue
                    ^
/Users/admin/builder/spi-builder-workspace/Sources/ScreenNavigatorKit/Internal/Helpers/Binding+when.swift:11:15: note: consider making generic parameter 'Wrapped' conform to the 'Sendable' protocol
    func when<Wrapped>(_ isTrue: Bool) -> Binding<Value> where Value == Wrapped? {
              ^
                     : Sendable
SwiftCompile normal arm64 Compiling\ ModalStackController.swift,\ ModalStackView.swift /Users/admin/builder/spi-builder-workspace/Sources/ScreenNavigatorKit/ModalStack/ModalStackController.swift /Users/admin/builder/spi-builder-workspace/Sources/ScreenNavigatorKit/ModalStack/ModalStackView.swift (in target 'ScreenNavigatorKit' from project 'ScreenNavigatorKit')
SwiftCompile normal arm64 /Users/admin/builder/spi-builder-workspace/Sources/ScreenNavigatorKit/ModalStack/ModalStackController.swift (in target 'ScreenNavigatorKit' from project 'ScreenNavigatorKit')
    cd /Users/admin/builder/spi-builder-workspace/.swiftpm/xcode

SwiftCompile normal arm64 /Users/admin/builder/spi-builder-workspace/Sources/ScreenNavigatorKit/ModalStack/ModalStackView.swift (in target 'ScreenNavigatorKit' from project 'ScreenNavigatorKit')
    cd /Users/admin/builder/spi-builder-workspace/.swiftpm/xcode

SwiftCompile normal arm64 Compiling\ AnySequence+first.swift,\ Binding+isNotNil.swift /Users/admin/builder/spi-builder-workspace/Sources/ScreenNavigatorKit/Internal/Helpers/AnySequence+first.swift /Users/admin/builder/spi-builder-workspace/Sources/ScreenNavigatorKit/Internal/Helpers/Binding+isNotNil.swift (in target 'ScreenNavigatorKit' from project 'ScreenNavigatorKit')
SwiftCompile normal arm64 /Users/admin/builder/spi-builder-workspace/Sources/ScreenNavigatorKit/Internal/Helpers/AnySequence+first.swift (in target 'ScreenNavigatorKit' from project 'ScreenNavigatorKit')
    cd /Users/admin/builder/spi-builder-workspace/.swiftpm/xcode

SwiftCompile normal arm64 /Users/admin/builder/spi-builder-workspace/Sources/ScreenNavigatorKit/Internal/Helpers/Binding+isNotNil.swift (in target 'ScreenNavigatorKit' from project 'ScreenNavigatorKit')
    cd /Users/admin/builder/spi-builder-workspace/.swiftpm/xcode

/Users/admin/builder/spi-builder-workspace/Sources/ScreenNavigatorKit/Internal/Helpers/Binding+isNotNil.swift:13:20: warning: capture of 'self' with non-sendable type 'Binding<Optional<Wrapped>>' in a '@Sendable' closure
            get: { self.wrappedValue != nil },
                   ^
/Users/admin/builder/spi-builder-workspace/Sources/ScreenNavigatorKit/Internal/Helpers/Binding+isNotNil.swift:11:19: note: consider making generic parameter 'Wrapped' conform to the 'Sendable' protocol
    func isNotNil<Wrapped>() -> Binding<Bool> where Value == Wrapped? {
                  ^
                         : Sendable
/Users/admin/builder/spi-builder-workspace/Sources/ScreenNavigatorKit/Internal/Helpers/Binding+isNotNil.swift:16:21: warning: capture of 'self' with non-sendable type 'Binding<Optional<Wrapped>>' in a '@Sendable' closure
                    self.transaction(transaction).wrappedValue = nil
                    ^
/Users/admin/builder/spi-builder-workspace/Sources/ScreenNavigatorKit/Internal/Helpers/Binding+isNotNil.swift:11:19: note: consider making generic parameter 'Wrapped' conform to the 'Sendable' protocol
    func isNotNil<Wrapped>() -> Binding<Bool> where Value == Wrapped? {
                  ^
                         : Sendable
SwiftCompile normal armv7k Compiling\ ModalToggle.swift,\ PresentationStyle.swift /Users/admin/builder/spi-builder-workspace/Sources/ScreenNavigatorKit/ModalStack/ModalToggle.swift /Users/admin/builder/spi-builder-workspace/Sources/ScreenNavigatorKit/ModalStack/PresentationStyle.swift (in target 'ScreenNavigatorKit' from project 'ScreenNavigatorKit')
SwiftCompile normal armv7k /Users/admin/builder/spi-builder-workspace/Sources/ScreenNavigatorKit/ModalStack/ModalToggle.swift (in target 'ScreenNavigatorKit' from project 'ScreenNavigatorKit')
    cd /Users/admin/builder/spi-builder-workspace/.swiftpm/xcode

/Users/admin/builder/spi-builder-workspace/Sources/ScreenNavigatorKit/ModalStack/ModalToggle.swift:48:11: warning: call to main actor-isolated instance method 'asAny()' in a synchronous nonisolated context; this is an error in the Swift 6 language mode
        ).asAny()
          ^
/Users/admin/builder/spi-builder-workspace/Sources/ScreenNavigatorKit/Internal/Helpers/View+asAny.swift:11:10: note: calls to instance method 'asAny()' from outside of its actor context are implicitly asynchronous
    func asAny() -> AnyView {
         ^
/Users/admin/builder/spi-builder-workspace/Sources/ScreenNavigatorKit/ModalStack/ModalToggle.swift:35:10: note: add '@MainActor' to make instance method 'present(in:_:with:onDismiss:)' part of global actor 'MainActor'
    func present(
         ^
    @MainActor
/Users/admin/builder/spi-builder-workspace/Sources/ScreenNavigatorKit/ModalStack/ModalToggle.swift:48:11: warning: sending value of non-Sendable type 'ModifiedContent<some View, ModalToggleViewModifier>' risks causing data races; this is an error in the Swift 6 language mode
        ).asAny()
~~~~~~~~~~^~~~~~~
/Users/admin/builder/spi-builder-workspace/Sources/ScreenNavigatorKit/ModalStack/ModalToggle.swift:48:11: note: sending task-isolated value of non-Sendable type 'ModifiedContent<some View, ModalToggleViewModifier>' to main actor-isolated callee risks causing races in between task-isolated and main actor-isolated uses
        ).asAny()
          ^
SwiftCompile normal armv7k /Users/admin/builder/spi-builder-workspace/Sources/ScreenNavigatorKit/ModalStack/PresentationStyle.swift (in target 'ScreenNavigatorKit' from project 'ScreenNavigatorKit')
    cd /Users/admin/builder/spi-builder-workspace/.swiftpm/xcode

SwiftCompile normal armv7k Compiling\ View+push.swift /Users/admin/builder/spi-builder-workspace/Sources/ScreenNavigatorKit/NavigationStack/View+push.swift (in target 'ScreenNavigatorKit' from project 'ScreenNavigatorKit')
Failed frontend command:
/Applications/Xcode-16.3.0.app/Contents/Developer/Toolchains/XcodeDefault.xctoolchain/usr/bin/swift-frontend -frontend -c /Users/admin/builder/spi-builder-workspace/Sources/ScreenNavigatorKit/Internal/Helpers/AnySequence+first.swift /Users/admin/builder/spi-builder-workspace/Sources/ScreenNavigatorKit/Internal/Helpers/Binding+isNotNil.swift /Users/admin/builder/spi-builder-workspace/Sources/ScreenNavigatorKit/Internal/Helpers/Binding+removeDublicates.swift /Users/admin/builder/spi-builder-workspace/Sources/ScreenNavigatorKit/Internal/Helpers/Binding+when.swift /Users/admin/builder/spi-builder-workspace/Sources/ScreenNavigatorKit/Internal/Helpers/View+appear.swift /Users/admin/builder/spi-builder-workspace/Sources/ScreenNavigatorKit/Internal/Helpers/View+asAny.swift /Users/admin/builder/spi-builder-workspace/Sources/ScreenNavigatorKit/ModalStack/ModalStackController.swift /Users/admin/builder/spi-builder-workspace/Sources/ScreenNavigatorKit/ModalStack/ModalStackView.swift /Users/admin/builder/spi-builder-workspace/Sources/ScreenNavigatorKit/ModalStack/ModalToggle.swift /Users/admin/builder/spi-builder-workspace/Sources/ScreenNavigatorKit/ModalStack/PresentationStyle.swift /Users/admin/builder/spi-builder-workspace/Sources/ScreenNavigatorKit/ModalStack/View+fullScreenCover.swift /Users/admin/builder/spi-builder-workspace/Sources/ScreenNavigatorKit/ModalStack/View+sheet.swift /Users/admin/builder/spi-builder-workspace/Sources/ScreenNavigatorKit/NavigationStack/NavigationStackController.swift /Users/admin/builder/spi-builder-workspace/Sources/ScreenNavigatorKit/NavigationStack/NavigationStackView.swift /Users/admin/builder/spi-builder-workspace/Sources/ScreenNavigatorKit/NavigationStack/PushToggle.swift -primary-file /Users/admin/builder/spi-builder-workspace/Sources/ScreenNavigatorKit/NavigationStack/View+push.swift -emit-dependencies-path /Users/admin/builder/spi-builder-workspace/.derivedData/Build/Intermediates.noindex/ScreenNavigatorKit.build/Debug-watchos/ScreenNavigatorKit.build/Objects-normal/armv7k/View+push.d -emit-const-values-path /Users/admin/builder/spi-builder-workspace/.derivedData/Build/Intermediates.noindex/ScreenNavigatorKit.build/Debug-watchos/ScreenNavigatorKit.build/Objects-normal/armv7k/View+push.swiftconstvalues -emit-reference-dependencies-path /Users/admin/builder/spi-builder-workspace/.derivedData/Build/Intermediates.noindex/ScreenNavigatorKit.build/Debug-watchos/ScreenNavigatorKit.build/Objects-normal/armv7k/View+push.swiftdeps -serialize-diagnostics-path /Users/admin/builder/spi-builder-workspace/.derivedData/Build/Intermediates.noindex/ScreenNavigatorKit.build/Debug-watchos/ScreenNavigatorKit.build/Objects-normal/armv7k/View+push.dia -target armv7k-apple-watchos7.0 -enable-objc-interop -stack-check -sdk /Applications/Xcode-16.3.0.app/Contents/Developer/Platforms/WatchOS.platform/Developer/SDKs/WatchOS11.4.sdk -I /Users/admin/builder/spi-builder-workspace/.derivedData/Build/Products/Debug-watchos -I /Applications/Xcode-16.3.0.app/Contents/Developer/Platforms/WatchOS.platform/Developer/usr/lib -F /Users/admin/builder/spi-builder-workspace/.derivedData/Build/Products/Debug-watchos -F /Applications/Xcode-16.3.0.app/Contents/Developer/Platforms/WatchOS.platform/Developer/Library/Frameworks -F /Applications/Xcode-16.3.0.app/Contents/Developer/Platforms/WatchOS.platform/Developer/SDKs/WatchOS11.4.sdk/Developer/Library/Frameworks -no-color-diagnostics -enable-testing -g -debug-info-format\=dwarf -dwarf-version\=4 -module-cache-path /Users/admin/builder/spi-builder-workspace/.derivedData/ModuleCache.noindex -profile-generate -profile-coverage-mapping -swift-version 5 -enforce-exclusivity\=checked -stats-output-dir /Users/admin/builder/spi-builder-workspace/.swiftpm/xcode/.stats -Onone -D SWIFT_PACKAGE -D DEBUG -serialize-debugging-options -const-gather-protocols-file /Users/admin/builder/spi-builder-workspace/.derivedData/Build/Intermediates.noindex/ScreenNavigatorKit.build/Debug-watchos/ScreenNavigatorKit.build/Objects-normal/armv7k/ScreenNavigatorKit_const_extract_protocols.json -enable-upcoming-feature StrictConcurrency -enable-upcoming-feature DisableOutwardActorInference -enable-upcoming-feature GlobalActorIsolatedTypesUsability -enable-upcoming-feature InferSendableFromCaptures -enable-experimental-feature DebugDescriptionMacro -strict-concurrency\=complete -empty-abi-descriptor -plugin-path /Applications/Xcode-16.3.0.app/Contents/Developer/Toolchains/XcodeDefault.xctoolchain/usr/lib/swift/host/plugins/testing -validate-clang-modules-once -clang-build-session-file /Users/admin/builder/spi-builder-workspace/.derivedData/ModuleCache.noindex/Session.modulevalidation -Xcc -working-directory -Xcc /Users/admin/builder/spi-builder-workspace/.swiftpm/xcode -resource-dir /Applications/Xcode-16.3.0.app/Contents/Developer/Toolchains/XcodeDefault.xctoolchain/usr/lib/swift -enable-anonymous-context-mangled-names -file-compilation-dir /Users/admin/builder/spi-builder-workspace/.swiftpm/xcode -Xcc -ivfsstatcache -Xcc /Users/admin/builder/spi-builder-workspace/.derivedData/SDKStatCaches.noindex/watchos11.4-22T246-43efb940ff07ba2497b70ec94253f576.sdkstatcache -Xcc -I/Users/admin/builder/spi-builder-workspace/.derivedData/Build/Intermediates.noindex/ScreenNavigatorKit.build/Debug-watchos/ScreenNavigatorKit.build/swift-overrides.hmap -Xcc -I/Users/admin/builder/spi-builder-workspace/.derivedData/Build/Products/Debug-watchos/include -Xcc -I/Users/admin/builder/spi-builder-workspace/.derivedData/Build/Intermediates.noindex/ScreenNavigatorKit.build/Debug-watchos/ScreenNavigatorKit.build/DerivedSources-normal/armv7k -Xcc -I/Users/admin/builder/spi-builder-workspace/.derivedData/Build/Intermediates.noindex/ScreenNavigatorKit.build/Debug-watchos/ScreenNavigatorKit.build/DerivedSources/armv7k -Xcc -I/Users/admin/builder/spi-builder-workspace/.derivedData/Build/Intermediates.noindex/ScreenNavigatorKit.build/Debug-watchos/ScreenNavigatorKit.build/DerivedSources -Xcc -DSWIFT_PACKAGE -Xcc -DDEBUG\=1 -module-name ScreenNavigatorKit -frontend-parseable-output -disable-clang-spi -target-sdk-version 11.4 -target-sdk-name watchos11.4 -external-plugin-path /Applications/Xcode-16.3.0.app/Contents/Developer/Platforms/WatchOS.platform/Developer/usr/lib/swift/host/plugins\#/Applications/Xcode-16.3.0.app/Contents/Developer/Platforms/WatchOS.platform/Developer/usr/bin/swift-plugin-server -external-plugin-path /Applications/Xcode-16.3.0.app/Contents/Developer/Platforms/WatchOS.platform/Developer/usr/local/lib/swift/host/plugins\#/Applications/Xcode-16.3.0.app/Contents/Developer/Platforms/WatchOS.platform/Developer/usr/bin/swift-plugin-server -in-process-plugin-server-path /Applications/Xcode-16.3.0.app/Contents/Developer/Toolchains/XcodeDefault.xctoolchain/usr/lib/swift/host/libSwiftInProcPluginServer.dylib -plugin-path /Applications/Xcode-16.3.0.app/Contents/Developer/Toolchains/XcodeDefault.xctoolchain/usr/lib/swift/host/plugins -plugin-path /Applications/Xcode-16.3.0.app/Contents/Developer/Toolchains/XcodeDefault.xctoolchain/usr/local/lib/swift/host/plugins -o /Users/admin/builder/spi-builder-workspace/.derivedData/Build/Intermediates.noindex/ScreenNavigatorKit.build/Debug-watchos/ScreenNavigatorKit.build/Objects-normal/armv7k/View+push.o -index-unit-output-path /ScreenNavigatorKit.build/Debug-watchos/ScreenNavigatorKit.build/Objects-normal/armv7k/View+push.o -index-store-path /Users/admin/builder/spi-builder-workspace/.derivedData/Index.noindex/DataStore -index-system-modules
SwiftCompile normal armv7k /Users/admin/builder/spi-builder-workspace/Sources/ScreenNavigatorKit/NavigationStack/View+push.swift (in target 'ScreenNavigatorKit' from project 'ScreenNavigatorKit')
    cd /Users/admin/builder/spi-builder-workspace/.swiftpm/xcode

/Users/admin/builder/spi-builder-workspace/Sources/ScreenNavigatorKit/NavigationStack/View+push.swift:20:14: error: 'isDetailLink' is unavailable in watchOS
            .isDetailLink(false)
             ^~~~~~~~~~~~
SwiftUI.NavigationLink.isDetailLink:5:15: note: 'isDetailLink' has been explicitly marked unavailable here
  public func isDetailLink(_ isDetailLink: Bool) -> some View
              ^
SwiftCompile normal armv7k Compiling\ NavigationStackController.swift /Users/admin/builder/spi-builder-workspace/Sources/ScreenNavigatorKit/NavigationStack/NavigationStackController.swift (in target 'ScreenNavigatorKit' from project 'ScreenNavigatorKit')
SwiftCompile normal armv7k /Users/admin/builder/spi-builder-workspace/Sources/ScreenNavigatorKit/NavigationStack/NavigationStackController.swift (in target 'ScreenNavigatorKit' from project 'ScreenNavigatorKit')
    cd /Users/admin/builder/spi-builder-workspace/.swiftpm/xcode

SwiftCompile normal arm64 Compiling\ PushToggle.swift /Users/admin/builder/spi-builder-workspace/Sources/ScreenNavigatorKit/NavigationStack/PushToggle.swift (in target 'ScreenNavigatorKit' from project 'ScreenNavigatorKit')
SwiftCompile normal arm64 /Users/admin/builder/spi-builder-workspace/Sources/ScreenNavigatorKit/NavigationStack/PushToggle.swift (in target 'ScreenNavigatorKit' from project 'ScreenNavigatorKit')
    cd /Users/admin/builder/spi-builder-workspace/.swiftpm/xcode

/Users/admin/builder/spi-builder-workspace/Sources/ScreenNavigatorKit/NavigationStack/PushToggle.swift:42:19: warning: call to main actor-isolated instance method 'asAny()' in a synchronous nonisolated context; this is an error in the Swift 6 language mode
                ).asAny()
                  ^
/Users/admin/builder/spi-builder-workspace/Sources/ScreenNavigatorKit/Internal/Helpers/View+asAny.swift:11:10: note: calls to instance method 'asAny()' from outside of its actor context are implicitly asynchronous
    func asAny() -> AnyView {
         ^
/Users/admin/builder/spi-builder-workspace/Sources/ScreenNavigatorKit/NavigationStack/PushToggle.swift:42:19: warning: sending value of non-Sendable type 'ModifiedContent<some View, PushToggleViewModifier>' risks causing data races; this is an error in the Swift 6 language mode
                ).asAny()
~~~~~~~~~~~~~~~~~~^~~~~~~
/Users/admin/builder/spi-builder-workspace/Sources/ScreenNavigatorKit/NavigationStack/PushToggle.swift:42:19: note: sending task-isolated value of non-Sendable type 'ModifiedContent<some View, PushToggleViewModifier>' to main actor-isolated callee risks causing races in between task-isolated and main actor-isolated uses
                ).asAny()
                  ^
SwiftEmitModule normal arm64_32 Emitting\ module\ for\ ScreenNavigatorKit (in target 'ScreenNavigatorKit' from project 'ScreenNavigatorKit')
EmitSwiftModule normal arm64_32 (in target 'ScreenNavigatorKit' from project 'ScreenNavigatorKit')
    cd /Users/admin/builder/spi-builder-workspace/.swiftpm/xcode

SwiftDriverJobDiscovery normal arm64 Emitting module for ScreenNavigatorKit (in target 'ScreenNavigatorKit' from project 'ScreenNavigatorKit')
SwiftDriver\ Compilation\ Requirements ScreenNavigatorKit normal arm64 com.apple.xcode.tools.swift.compiler (in target 'ScreenNavigatorKit' from project 'ScreenNavigatorKit')
    cd /Users/admin/builder/spi-builder-workspace/.swiftpm/xcode
    builtin-Swift-Compilation-Requirements -- /Applications/Xcode-16.3.0.app/Contents/Developer/Toolchains/XcodeDefault.xctoolchain/usr/bin/swiftc -module-name ScreenNavigatorKit -Onone -enforce-exclusivity\=checked @/Users/admin/builder/spi-builder-workspace/.derivedData/Build/Intermediates.noindex/ScreenNavigatorKit.build/Debug-watchos/ScreenNavigatorKit.build/Objects-normal/arm64/ScreenNavigatorKit.SwiftFileList -DSWIFT_PACKAGE -DDEBUG -stats-output-dir .stats -strict-concurrency\=complete -enable-upcoming-feature StrictConcurrency -enable-upcoming-feature DisableOutwardActorInference -enable-upcoming-feature GlobalActorIsolatedTypesUsability -enable-upcoming-feature InferSendableFromCaptures -plugin-path /Applications/Xcode-16.3.0.app/Contents/Developer/Toolchains/XcodeDefault.xctoolchain/usr/lib/swift/host/plugins/testing -enable-experimental-feature DebugDescriptionMacro -sdk /Applications/Xcode-16.3.0.app/Contents/Developer/Platforms/WatchOS.platform/Developer/SDKs/WatchOS11.4.sdk -target arm64-apple-watchos7.0 -g -module-cache-path /Users/admin/builder/spi-builder-workspace/.derivedData/ModuleCache.noindex -Xfrontend -serialize-debugging-options -profile-coverage-mapping -profile-generate -enable-testing -index-store-path /Users/admin/builder/spi-builder-workspace/.derivedData/Index.noindex/DataStore -swift-version 5 -I /Users/admin/builder/spi-builder-workspace/.derivedData/Build/Products/Debug-watchos -I /Applications/Xcode-16.3.0.app/Contents/Developer/Platforms/WatchOS.platform/Developer/usr/lib -F /Users/admin/builder/spi-builder-workspace/.derivedData/Build/Products/Debug-watchos -F /Applications/Xcode-16.3.0.app/Contents/Developer/Platforms/WatchOS.platform/Developer/Library/Frameworks -F /Applications/Xcode-16.3.0.app/Contents/Developer/Platforms/WatchOS.platform/Developer/SDKs/WatchOS11.4.sdk/Developer/Library/Frameworks -c -j10 -enable-batch-mode -incremental -Xcc -ivfsstatcache -Xcc /Users/admin/builder/spi-builder-workspace/.derivedData/SDKStatCaches.noindex/watchos11.4-22T246-43efb940ff07ba2497b70ec94253f576.sdkstatcache -output-file-map /Users/admin/builder/spi-builder-workspace/.derivedData/Build/Intermediates.noindex/ScreenNavigatorKit.build/Debug-watchos/ScreenNavigatorKit.build/Objects-normal/arm64/ScreenNavigatorKit-OutputFileMap.json -use-frontend-parseable-output -save-temps -no-color-diagnostics -serialize-diagnostics -emit-dependencies -emit-module -emit-module-path /Users/admin/builder/spi-builder-workspace/.derivedData/Build/Intermediates.noindex/ScreenNavigatorKit.build/Debug-watchos/ScreenNavigatorKit.build/Objects-normal/arm64/ScreenNavigatorKit.swiftmodule -validate-clang-modules-once -clang-build-session-file /Users/admin/builder/spi-builder-workspace/.derivedData/ModuleCache.noindex/Session.modulevalidation -Xcc -I/Users/admin/builder/spi-builder-workspace/.derivedData/Build/Intermediates.noindex/ScreenNavigatorKit.build/Debug-watchos/ScreenNavigatorKit.build/swift-overrides.hmap -emit-const-values -Xfrontend -const-gather-protocols-file -Xfrontend /Users/admin/builder/spi-builder-workspace/.derivedData/Build/Intermediates.noindex/ScreenNavigatorKit.build/Debug-watchos/ScreenNavigatorKit.build/Objects-normal/arm64/ScreenNavigatorKit_const_extract_protocols.json -Xcc -I/Users/admin/builder/spi-builder-workspace/.derivedData/Build/Products/Debug-watchos/include -Xcc -I/Users/admin/builder/spi-builder-workspace/.derivedData/Build/Intermediates.noindex/ScreenNavigatorKit.build/Debug-watchos/ScreenNavigatorKit.build/DerivedSources-normal/arm64 -Xcc -I/Users/admin/builder/spi-builder-workspace/.derivedData/Build/Intermediates.noindex/ScreenNavigatorKit.build/Debug-watchos/ScreenNavigatorKit.build/DerivedSources/arm64 -Xcc -I/Users/admin/builder/spi-builder-workspace/.derivedData/Build/Intermediates.noindex/ScreenNavigatorKit.build/Debug-watchos/ScreenNavigatorKit.build/DerivedSources -Xcc -DSWIFT_PACKAGE -Xcc -DDEBUG\=1 -emit-objc-header -emit-objc-header-path /Users/admin/builder/spi-builder-workspace/.derivedData/Build/Intermediates.noindex/ScreenNavigatorKit.build/Debug-watchos/ScreenNavigatorKit.build/Objects-normal/arm64/ScreenNavigatorKit-Swift.h -working-directory /Users/admin/builder/spi-builder-workspace/.swiftpm/xcode -experimental-emit-module-separately -disable-cmo
SwiftDriverJobDiscovery normal armv7k Emitting module for ScreenNavigatorKit (in target 'ScreenNavigatorKit' from project 'ScreenNavigatorKit')
SwiftDriver\ Compilation\ Requirements ScreenNavigatorKit normal armv7k com.apple.xcode.tools.swift.compiler (in target 'ScreenNavigatorKit' from project 'ScreenNavigatorKit')
    cd /Users/admin/builder/spi-builder-workspace/.swiftpm/xcode
    builtin-Swift-Compilation-Requirements -- /Applications/Xcode-16.3.0.app/Contents/Developer/Toolchains/XcodeDefault.xctoolchain/usr/bin/swiftc -module-name ScreenNavigatorKit -Onone -enforce-exclusivity\=checked @/Users/admin/builder/spi-builder-workspace/.derivedData/Build/Intermediates.noindex/ScreenNavigatorKit.build/Debug-watchos/ScreenNavigatorKit.build/Objects-normal/armv7k/ScreenNavigatorKit.SwiftFileList -DSWIFT_PACKAGE -DDEBUG -stats-output-dir .stats -strict-concurrency\=complete -enable-upcoming-feature StrictConcurrency -enable-upcoming-feature DisableOutwardActorInference -enable-upcoming-feature GlobalActorIsolatedTypesUsability -enable-upcoming-feature InferSendableFromCaptures -plugin-path /Applications/Xcode-16.3.0.app/Contents/Developer/Toolchains/XcodeDefault.xctoolchain/usr/lib/swift/host/plugins/testing -enable-experimental-feature DebugDescriptionMacro -sdk /Applications/Xcode-16.3.0.app/Contents/Developer/Platforms/WatchOS.platform/Developer/SDKs/WatchOS11.4.sdk -target armv7k-apple-watchos7.0 -g -module-cache-path /Users/admin/builder/spi-builder-workspace/.derivedData/ModuleCache.noindex -Xfrontend -serialize-debugging-options -profile-coverage-mapping -profile-generate -enable-testing -index-store-path /Users/admin/builder/spi-builder-workspace/.derivedData/Index.noindex/DataStore -swift-version 5 -I /Users/admin/builder/spi-builder-workspace/.derivedData/Build/Products/Debug-watchos -I /Applications/Xcode-16.3.0.app/Contents/Developer/Platforms/WatchOS.platform/Developer/usr/lib -F /Users/admin/builder/spi-builder-workspace/.derivedData/Build/Products/Debug-watchos -F /Applications/Xcode-16.3.0.app/Contents/Developer/Platforms/WatchOS.platform/Developer/Library/Frameworks -F /Applications/Xcode-16.3.0.app/Contents/Developer/Platforms/WatchOS.platform/Developer/SDKs/WatchOS11.4.sdk/Developer/Library/Frameworks -c -j10 -enable-batch-mode -incremental -Xcc -ivfsstatcache -Xcc /Users/admin/builder/spi-builder-workspace/.derivedData/SDKStatCaches.noindex/watchos11.4-22T246-43efb940ff07ba2497b70ec94253f576.sdkstatcache -output-file-map /Users/admin/builder/spi-builder-workspace/.derivedData/Build/Intermediates.noindex/ScreenNavigatorKit.build/Debug-watchos/ScreenNavigatorKit.build/Objects-normal/armv7k/ScreenNavigatorKit-OutputFileMap.json -use-frontend-parseable-output -save-temps -no-color-diagnostics -serialize-diagnostics -emit-dependencies -emit-module -emit-module-path /Users/admin/builder/spi-builder-workspace/.derivedData/Build/Intermediates.noindex/ScreenNavigatorKit.build/Debug-watchos/ScreenNavigatorKit.build/Objects-normal/armv7k/ScreenNavigatorKit.swiftmodule -validate-clang-modules-once -clang-build-session-file /Users/admin/builder/spi-builder-workspace/.derivedData/ModuleCache.noindex/Session.modulevalidation -Xcc -I/Users/admin/builder/spi-builder-workspace/.derivedData/Build/Intermediates.noindex/ScreenNavigatorKit.build/Debug-watchos/ScreenNavigatorKit.build/swift-overrides.hmap -emit-const-values -Xfrontend -const-gather-protocols-file -Xfrontend /Users/admin/builder/spi-builder-workspace/.derivedData/Build/Intermediates.noindex/ScreenNavigatorKit.build/Debug-watchos/ScreenNavigatorKit.build/Objects-normal/armv7k/ScreenNavigatorKit_const_extract_protocols.json -Xcc -I/Users/admin/builder/spi-builder-workspace/.derivedData/Build/Products/Debug-watchos/include -Xcc -I/Users/admin/builder/spi-builder-workspace/.derivedData/Build/Intermediates.noindex/ScreenNavigatorKit.build/Debug-watchos/ScreenNavigatorKit.build/DerivedSources-normal/armv7k -Xcc -I/Users/admin/builder/spi-builder-workspace/.derivedData/Build/Intermediates.noindex/ScreenNavigatorKit.build/Debug-watchos/ScreenNavigatorKit.build/DerivedSources/armv7k -Xcc -I/Users/admin/builder/spi-builder-workspace/.derivedData/Build/Intermediates.noindex/ScreenNavigatorKit.build/Debug-watchos/ScreenNavigatorKit.build/DerivedSources -Xcc -DSWIFT_PACKAGE -Xcc -DDEBUG\=1 -emit-objc-header -emit-objc-header-path /Users/admin/builder/spi-builder-workspace/.derivedData/Build/Intermediates.noindex/ScreenNavigatorKit.build/Debug-watchos/ScreenNavigatorKit.build/Objects-normal/armv7k/ScreenNavigatorKit-Swift.h -working-directory /Users/admin/builder/spi-builder-workspace/.swiftpm/xcode -experimental-emit-module-separately -disable-cmo
Copy /Users/admin/builder/spi-builder-workspace/.derivedData/Build/Products/Debug-watchos/ScreenNavigatorKit.swiftmodule/arm64-apple-watchos.swiftmodule /Users/admin/builder/spi-builder-workspace/.derivedData/Build/Intermediates.noindex/ScreenNavigatorKit.build/Debug-watchos/ScreenNavigatorKit.build/Objects-normal/arm64/ScreenNavigatorKit.swiftmodule (in target 'ScreenNavigatorKit' from project 'ScreenNavigatorKit')
    cd /Users/admin/builder/spi-builder-workspace
    builtin-copy -exclude .DS_Store -exclude CVS -exclude .svn -exclude .git -exclude .hg -resolve-src-symlinks -rename /Users/admin/builder/spi-builder-workspace/.derivedData/Build/Intermediates.noindex/ScreenNavigatorKit.build/Debug-watchos/ScreenNavigatorKit.build/Objects-normal/arm64/ScreenNavigatorKit.swiftmodule /Users/admin/builder/spi-builder-workspace/.derivedData/Build/Products/Debug-watchos/ScreenNavigatorKit.swiftmodule/arm64-apple-watchos.swiftmodule
Copy /Users/admin/builder/spi-builder-workspace/.derivedData/Build/Products/Debug-watchos/ScreenNavigatorKit.swiftmodule/armv7k-apple-watchos.swiftmodule /Users/admin/builder/spi-builder-workspace/.derivedData/Build/Intermediates.noindex/ScreenNavigatorKit.build/Debug-watchos/ScreenNavigatorKit.build/Objects-normal/armv7k/ScreenNavigatorKit.swiftmodule (in target 'ScreenNavigatorKit' from project 'ScreenNavigatorKit')
    cd /Users/admin/builder/spi-builder-workspace
    builtin-copy -exclude .DS_Store -exclude CVS -exclude .svn -exclude .git -exclude .hg -resolve-src-symlinks -rename /Users/admin/builder/spi-builder-workspace/.derivedData/Build/Intermediates.noindex/ScreenNavigatorKit.build/Debug-watchos/ScreenNavigatorKit.build/Objects-normal/armv7k/ScreenNavigatorKit.swiftmodule /Users/admin/builder/spi-builder-workspace/.derivedData/Build/Products/Debug-watchos/ScreenNavigatorKit.swiftmodule/armv7k-apple-watchos.swiftmodule
Copy /Users/admin/builder/spi-builder-workspace/.derivedData/Build/Products/Debug-watchos/ScreenNavigatorKit.swiftmodule/armv7k-apple-watchos.swiftdoc /Users/admin/builder/spi-builder-workspace/.derivedData/Build/Intermediates.noindex/ScreenNavigatorKit.build/Debug-watchos/ScreenNavigatorKit.build/Objects-normal/armv7k/ScreenNavigatorKit.swiftdoc (in target 'ScreenNavigatorKit' from project 'ScreenNavigatorKit')
    cd /Users/admin/builder/spi-builder-workspace
    builtin-copy -exclude .DS_Store -exclude CVS -exclude .svn -exclude .git -exclude .hg -resolve-src-symlinks -rename /Users/admin/builder/spi-builder-workspace/.derivedData/Build/Intermediates.noindex/ScreenNavigatorKit.build/Debug-watchos/ScreenNavigatorKit.build/Objects-normal/armv7k/ScreenNavigatorKit.swiftdoc /Users/admin/builder/spi-builder-workspace/.derivedData/Build/Products/Debug-watchos/ScreenNavigatorKit.swiftmodule/armv7k-apple-watchos.swiftdoc
Copy /Users/admin/builder/spi-builder-workspace/.derivedData/Build/Products/Debug-watchos/ScreenNavigatorKit.swiftmodule/armv7k-apple-watchos.abi.json /Users/admin/builder/spi-builder-workspace/.derivedData/Build/Intermediates.noindex/ScreenNavigatorKit.build/Debug-watchos/ScreenNavigatorKit.build/Objects-normal/armv7k/ScreenNavigatorKit.abi.json (in target 'ScreenNavigatorKit' from project 'ScreenNavigatorKit')
    cd /Users/admin/builder/spi-builder-workspace
    builtin-copy -exclude .DS_Store -exclude CVS -exclude .svn -exclude .git -exclude .hg -resolve-src-symlinks -rename /Users/admin/builder/spi-builder-workspace/.derivedData/Build/Intermediates.noindex/ScreenNavigatorKit.build/Debug-watchos/ScreenNavigatorKit.build/Objects-normal/armv7k/ScreenNavigatorKit.abi.json /Users/admin/builder/spi-builder-workspace/.derivedData/Build/Products/Debug-watchos/ScreenNavigatorKit.swiftmodule/armv7k-apple-watchos.abi.json
Copy /Users/admin/builder/spi-builder-workspace/.derivedData/Build/Products/Debug-watchos/ScreenNavigatorKit.swiftmodule/arm64-apple-watchos.swiftdoc /Users/admin/builder/spi-builder-workspace/.derivedData/Build/Intermediates.noindex/ScreenNavigatorKit.build/Debug-watchos/ScreenNavigatorKit.build/Objects-normal/arm64/ScreenNavigatorKit.swiftdoc (in target 'ScreenNavigatorKit' from project 'ScreenNavigatorKit')
    cd /Users/admin/builder/spi-builder-workspace
    builtin-copy -exclude .DS_Store -exclude CVS -exclude .svn -exclude .git -exclude .hg -resolve-src-symlinks -rename /Users/admin/builder/spi-builder-workspace/.derivedData/Build/Intermediates.noindex/ScreenNavigatorKit.build/Debug-watchos/ScreenNavigatorKit.build/Objects-normal/arm64/ScreenNavigatorKit.swiftdoc /Users/admin/builder/spi-builder-workspace/.derivedData/Build/Products/Debug-watchos/ScreenNavigatorKit.swiftmodule/arm64-apple-watchos.swiftdoc
Copy /Users/admin/builder/spi-builder-workspace/.derivedData/Build/Products/Debug-watchos/ScreenNavigatorKit.swiftmodule/arm64-apple-watchos.abi.json /Users/admin/builder/spi-builder-workspace/.derivedData/Build/Intermediates.noindex/ScreenNavigatorKit.build/Debug-watchos/ScreenNavigatorKit.build/Objects-normal/arm64/ScreenNavigatorKit.abi.json (in target 'ScreenNavigatorKit' from project 'ScreenNavigatorKit')
    cd /Users/admin/builder/spi-builder-workspace
    builtin-copy -exclude .DS_Store -exclude CVS -exclude .svn -exclude .git -exclude .hg -resolve-src-symlinks -rename /Users/admin/builder/spi-builder-workspace/.derivedData/Build/Intermediates.noindex/ScreenNavigatorKit.build/Debug-watchos/ScreenNavigatorKit.build/Objects-normal/arm64/ScreenNavigatorKit.abi.json /Users/admin/builder/spi-builder-workspace/.derivedData/Build/Products/Debug-watchos/ScreenNavigatorKit.swiftmodule/arm64-apple-watchos.abi.json
Copy /Users/admin/builder/spi-builder-workspace/.derivedData/Build/Products/Debug-watchos/ScreenNavigatorKit.swiftmodule/Project/armv7k-apple-watchos.swiftsourceinfo /Users/admin/builder/spi-builder-workspace/.derivedData/Build/Intermediates.noindex/ScreenNavigatorKit.build/Debug-watchos/ScreenNavigatorKit.build/Objects-normal/armv7k/ScreenNavigatorKit.swiftsourceinfo (in target 'ScreenNavigatorKit' from project 'ScreenNavigatorKit')
    cd /Users/admin/builder/spi-builder-workspace
    builtin-copy -exclude .DS_Store -exclude CVS -exclude .svn -exclude .git -exclude .hg -resolve-src-symlinks -rename /Users/admin/builder/spi-builder-workspace/.derivedData/Build/Intermediates.noindex/ScreenNavigatorKit.build/Debug-watchos/ScreenNavigatorKit.build/Objects-normal/armv7k/ScreenNavigatorKit.swiftsourceinfo /Users/admin/builder/spi-builder-workspace/.derivedData/Build/Products/Debug-watchos/ScreenNavigatorKit.swiftmodule/Project/armv7k-apple-watchos.swiftsourceinfo
Copy /Users/admin/builder/spi-builder-workspace/.derivedData/Build/Products/Debug-watchos/ScreenNavigatorKit.swiftmodule/Project/arm64-apple-watchos.swiftsourceinfo /Users/admin/builder/spi-builder-workspace/.derivedData/Build/Intermediates.noindex/ScreenNavigatorKit.build/Debug-watchos/ScreenNavigatorKit.build/Objects-normal/arm64/ScreenNavigatorKit.swiftsourceinfo (in target 'ScreenNavigatorKit' from project 'ScreenNavigatorKit')
    cd /Users/admin/builder/spi-builder-workspace
    builtin-copy -exclude .DS_Store -exclude CVS -exclude .svn -exclude .git -exclude .hg -resolve-src-symlinks -rename /Users/admin/builder/spi-builder-workspace/.derivedData/Build/Intermediates.noindex/ScreenNavigatorKit.build/Debug-watchos/ScreenNavigatorKit.build/Objects-normal/arm64/ScreenNavigatorKit.swiftsourceinfo /Users/admin/builder/spi-builder-workspace/.derivedData/Build/Products/Debug-watchos/ScreenNavigatorKit.swiftmodule/Project/arm64-apple-watchos.swiftsourceinfo
SwiftCompile normal arm64_32 Compiling\ AnySequence+first.swift,\ Binding+isNotNil.swift /Users/admin/builder/spi-builder-workspace/Sources/ScreenNavigatorKit/Internal/Helpers/AnySequence+first.swift /Users/admin/builder/spi-builder-workspace/Sources/ScreenNavigatorKit/Internal/Helpers/Binding+isNotNil.swift (in target 'ScreenNavigatorKit' from project 'ScreenNavigatorKit')
SwiftCompile normal arm64_32 /Users/admin/builder/spi-builder-workspace/Sources/ScreenNavigatorKit/Internal/Helpers/AnySequence+first.swift (in target 'ScreenNavigatorKit' from project 'ScreenNavigatorKit')
    cd /Users/admin/builder/spi-builder-workspace/.swiftpm/xcode

SwiftCompile normal arm64_32 /Users/admin/builder/spi-builder-workspace/Sources/ScreenNavigatorKit/Internal/Helpers/Binding+isNotNil.swift (in target 'ScreenNavigatorKit' from project 'ScreenNavigatorKit')
    cd /Users/admin/builder/spi-builder-workspace/.swiftpm/xcode

SwiftCompile normal arm64_32 Compiling\ NavigationStackController.swift /Users/admin/builder/spi-builder-workspace/Sources/ScreenNavigatorKit/NavigationStack/NavigationStackController.swift (in target 'ScreenNavigatorKit' from project 'ScreenNavigatorKit')
SwiftCompile normal arm64_32 /Users/admin/builder/spi-builder-workspace/Sources/ScreenNavigatorKit/NavigationStack/NavigationStackController.swift (in target 'ScreenNavigatorKit' from project 'ScreenNavigatorKit')
    cd /Users/admin/builder/spi-builder-workspace/.swiftpm/xcode

SwiftDriverJobDiscovery normal arm64 Compiling AnySequence+first.swift, Binding+isNotNil.swift (in target 'ScreenNavigatorKit' from project 'ScreenNavigatorKit')
SwiftCompile normal arm64_32 Compiling\ NavigationStackView.swift /Users/admin/builder/spi-builder-workspace/Sources/ScreenNavigatorKit/NavigationStack/NavigationStackView.swift (in target 'ScreenNavigatorKit' from project 'ScreenNavigatorKit')
SwiftCompile normal arm64_32 /Users/admin/builder/spi-builder-workspace/Sources/ScreenNavigatorKit/NavigationStack/NavigationStackView.swift (in target 'ScreenNavigatorKit' from project 'ScreenNavigatorKit')
    cd /Users/admin/builder/spi-builder-workspace/.swiftpm/xcode

SwiftDriverJobDiscovery normal arm64 Compiling PushToggle.swift (in target 'ScreenNavigatorKit' from project 'ScreenNavigatorKit')
SwiftCompile normal arm64_32 Compiling\ View+fullScreenCover.swift,\ View+sheet.swift /Users/admin/builder/spi-builder-workspace/Sources/ScreenNavigatorKit/ModalStack/View+fullScreenCover.swift /Users/admin/builder/spi-builder-workspace/Sources/ScreenNavigatorKit/ModalStack/View+sheet.swift (in target 'ScreenNavigatorKit' from project 'ScreenNavigatorKit')
SwiftCompile normal arm64_32 /Users/admin/builder/spi-builder-workspace/Sources/ScreenNavigatorKit/ModalStack/View+fullScreenCover.swift (in target 'ScreenNavigatorKit' from project 'ScreenNavigatorKit')
    cd /Users/admin/builder/spi-builder-workspace/.swiftpm/xcode

SwiftCompile normal arm64_32 /Users/admin/builder/spi-builder-workspace/Sources/ScreenNavigatorKit/ModalStack/View+sheet.swift (in target 'ScreenNavigatorKit' from project 'ScreenNavigatorKit')
    cd /Users/admin/builder/spi-builder-workspace/.swiftpm/xcode

SwiftDriverJobDiscovery normal arm64 Compiling Binding+removeDublicates.swift, Binding+when.swift (in target 'ScreenNavigatorKit' from project 'ScreenNavigatorKit')
SwiftCompile normal arm64 Compiling\ View+appear.swift,\ View+asAny.swift /Users/admin/builder/spi-builder-workspace/Sources/ScreenNavigatorKit/Internal/Helpers/View+appear.swift /Users/admin/builder/spi-builder-workspace/Sources/ScreenNavigatorKit/Internal/Helpers/View+asAny.swift (in target 'ScreenNavigatorKit' from project 'ScreenNavigatorKit')
SwiftCompile normal arm64 /Users/admin/builder/spi-builder-workspace/Sources/ScreenNavigatorKit/Internal/Helpers/View+appear.swift (in target 'ScreenNavigatorKit' from project 'ScreenNavigatorKit')
    cd /Users/admin/builder/spi-builder-workspace/.swiftpm/xcode

SwiftCompile normal arm64 /Users/admin/builder/spi-builder-workspace/Sources/ScreenNavigatorKit/Internal/Helpers/View+asAny.swift (in target 'ScreenNavigatorKit' from project 'ScreenNavigatorKit')
    cd /Users/admin/builder/spi-builder-workspace/.swiftpm/xcode

SwiftDriverJobDiscovery normal arm64 Compiling ModalStackController.swift, ModalStackView.swift (in target 'ScreenNavigatorKit' from project 'ScreenNavigatorKit')
SwiftCompile normal arm64_32 Compiling\ View+push.swift /Users/admin/builder/spi-builder-workspace/Sources/ScreenNavigatorKit/NavigationStack/View+push.swift (in target 'ScreenNavigatorKit' from project 'ScreenNavigatorKit')
Command SwiftCompile failed with a nonzero exit code
** BUILD FAILED **
The following build commands failed:
	SwiftCompile normal armv7k Compiling\ View+push.swift /Users/admin/builder/spi-builder-workspace/Sources/ScreenNavigatorKit/NavigationStack/View+push.swift (in target 'ScreenNavigatorKit' from project 'ScreenNavigatorKit')
	SwiftCompile normal armv7k /Users/admin/builder/spi-builder-workspace/Sources/ScreenNavigatorKit/NavigationStack/View+push.swift (in target 'ScreenNavigatorKit' from project 'ScreenNavigatorKit')
	SwiftCompile normal arm64_32 Compiling\ View+push.swift /Users/admin/builder/spi-builder-workspace/Sources/ScreenNavigatorKit/NavigationStack/View+push.swift (in target 'ScreenNavigatorKit' from project 'ScreenNavigatorKit')
	Building workspace spi-builder-workspace with scheme ScreenNavigatorKit
(4 failures)
Command line invocation:
    /Applications/Xcode-16.3.0.app/Contents/Developer/usr/bin/xcodebuild -IDEClonedSourcePackagesDirPathOverride=/Users/admin/builder/spi-builder-workspace/.dependencies -resolvePackageDependencies
Resolve Package Graph
Resolved source packages:
  ScreenNavigatorKit: /Users/admin/builder/spi-builder-workspace
resolved source packages: ScreenNavigatorKit
{
  "dependencies" : [
  ],
  "manifest_display_name" : "ScreenNavigatorKit",
  "name" : "ScreenNavigatorKit",
  "path" : "/Users/admin/builder/spi-builder-workspace",
  "platforms" : [
    {
      "name" : "ios",
      "version" : "14.0"
    }
  ],
  "products" : [
    {
      "name" : "ScreenNavigatorKit",
      "targets" : [
        "ScreenNavigatorKit"
      ],
      "type" : {
        "library" : [
          "automatic"
        ]
      }
    }
  ],
  "targets" : [
    {
      "c99name" : "ScreenNavigatorKitTests",
      "module_type" : "SwiftTarget",
      "name" : "ScreenNavigatorKitTests",
      "path" : "Tests/ScreenNavigatorKitTests",
      "sources" : [
        "ScreenNavigatorKitTests.swift"
      ],
      "target_dependencies" : [
        "ScreenNavigatorKit"
      ],
      "type" : "test"
    },
    {
      "c99name" : "ScreenNavigatorKit",
      "module_type" : "SwiftTarget",
      "name" : "ScreenNavigatorKit",
      "path" : "Sources/ScreenNavigatorKit",
      "product_memberships" : [
        "ScreenNavigatorKit"
      ],
      "sources" : [
        "Internal/Helpers/AnySequence+first.swift",
        "Internal/Helpers/Binding+isNotNil.swift",
        "Internal/Helpers/Binding+removeDublicates.swift",
        "Internal/Helpers/Binding+when.swift",
        "Internal/Helpers/View+appear.swift",
        "Internal/Helpers/View+asAny.swift",
        "ModalStack/ModalStackController.swift",
        "ModalStack/ModalStackView.swift",
        "ModalStack/ModalToggle.swift",
        "ModalStack/PresentationStyle.swift",
        "ModalStack/View+fullScreenCover.swift",
        "ModalStack/View+sheet.swift",
        "NavigationStack/NavigationStackController.swift",
        "NavigationStack/NavigationStackView.swift",
        "NavigationStack/PushToggle.swift",
        "NavigationStack/View+push.swift"
      ],
      "type" : "library"
    }
  ],
  "tools_version" : "5.7.1"
}
{
  "workspace" : {
    "name" : "spi-builder-workspace",
    "schemes" : [
      "ScreenNavigatorKit"
    ]
  }
}
Running build ...
env DEVELOPER_DIR=/Applications/Xcode-16.3.0.app xcrun xcodebuild -IDEClonedSourcePackagesDirPathOverride=$PWD/.dependencies -skipMacroValidation -skipPackagePluginValidation -derivedDataPath $PWD/.derivedData build -scheme ScreenNavigatorKit -destination generic/platform=watchOS
Command line invocation:
    /Applications/Xcode-16.3.0.app/Contents/Developer/usr/bin/xcodebuild -IDEClonedSourcePackagesDirPathOverride=/Users/admin/builder/spi-builder-workspace/.dependencies -skipMacroValidation -skipPackagePluginValidation -derivedDataPath /Users/admin/builder/spi-builder-workspace/.derivedData build -scheme ScreenNavigatorKit -destination generic/platform=watchOS
Resolve Package Graph
Resolved source packages:
  ScreenNavigatorKit: /Users/admin/builder/spi-builder-workspace
ComputePackagePrebuildTargetDependencyGraph
Prepare packages
CreateBuildRequest
SendProjectDescription
CreateBuildOperation
ComputeTargetDependencyGraph
note: Building targets in dependency order
note: Target dependency graph (2 targets)
    Target 'ScreenNavigatorKit' in project 'ScreenNavigatorKit'
        ➜ Explicit dependency on target 'ScreenNavigatorKit' in project 'ScreenNavigatorKit'
    Target 'ScreenNavigatorKit' in project 'ScreenNavigatorKit' (no dependencies)
GatherProvisioningInputs
CreateBuildDescription
ExecuteExternalTool /Applications/Xcode-16.3.0.app/Contents/Developer/Toolchains/XcodeDefault.xctoolchain/usr/bin/clang -v -E -dM -isysroot /Applications/Xcode-16.3.0.app/Contents/Developer/Platforms/WatchOS.platform/Developer/SDKs/WatchOS11.4.sdk -x c -c /dev/null
ExecuteExternalTool /Applications/Xcode-16.3.0.app/Contents/Developer/Toolchains/XcodeDefault.xctoolchain/usr/bin/swiftc --version
ExecuteExternalTool /Applications/Xcode-16.3.0.app/Contents/Developer/Toolchains/XcodeDefault.xctoolchain/usr/bin/ld -version_details
Build description signature: 278bf35d6df92b1f51fd36ae1cec5c0b
Build description path: /Users/admin/builder/spi-builder-workspace/.derivedData/Build/Intermediates.noindex/XCBuildData/278bf35d6df92b1f51fd36ae1cec5c0b.xcbuilddata
ClangStatCache /Applications/Xcode-16.3.0.app/Contents/Developer/Toolchains/XcodeDefault.xctoolchain/usr/bin/clang-stat-cache /Applications/Xcode-16.3.0.app/Contents/Developer/Platforms/WatchOS.platform/Developer/SDKs/WatchOS11.4.sdk /Users/admin/builder/spi-builder-workspace/.derivedData/SDKStatCaches.noindex/watchos11.4-22T246-43efb940ff07ba2497b70ec94253f576.sdkstatcache
    cd /Users/admin/builder/spi-builder-workspace/.swiftpm/xcode
    /Applications/Xcode-16.3.0.app/Contents/Developer/Toolchains/XcodeDefault.xctoolchain/usr/bin/clang-stat-cache /Applications/Xcode-16.3.0.app/Contents/Developer/Platforms/WatchOS.platform/Developer/SDKs/WatchOS11.4.sdk -o /Users/admin/builder/spi-builder-workspace/.derivedData/SDKStatCaches.noindex/watchos11.4-22T246-43efb940ff07ba2497b70ec94253f576.sdkstatcache
SwiftDriver ScreenNavigatorKit normal armv7k com.apple.xcode.tools.swift.compiler (in target 'ScreenNavigatorKit' from project 'ScreenNavigatorKit')
    cd /Users/admin/builder/spi-builder-workspace/.swiftpm/xcode
    builtin-SwiftDriver -- /Applications/Xcode-16.3.0.app/Contents/Developer/Toolchains/XcodeDefault.xctoolchain/usr/bin/swiftc -module-name ScreenNavigatorKit -Onone -enforce-exclusivity\=checked @/Users/admin/builder/spi-builder-workspace/.derivedData/Build/Intermediates.noindex/ScreenNavigatorKit.build/Debug-watchos/ScreenNavigatorKit.build/Objects-normal/armv7k/ScreenNavigatorKit.SwiftFileList -DSWIFT_PACKAGE -DDEBUG -DXcode -plugin-path /Applications/Xcode-16.3.0.app/Contents/Developer/Toolchains/XcodeDefault.xctoolchain/usr/lib/swift/host/plugins/testing -enable-experimental-feature DebugDescriptionMacro -sdk /Applications/Xcode-16.3.0.app/Contents/Developer/Platforms/WatchOS.platform/Developer/SDKs/WatchOS11.4.sdk -target armv7k-apple-watchos7.0 -g -module-cache-path /Users/admin/builder/spi-builder-workspace/.derivedData/ModuleCache.noindex -Xfrontend -serialize-debugging-options -profile-coverage-mapping -profile-generate -enable-testing -index-store-path /Users/admin/builder/spi-builder-workspace/.derivedData/Index.noindex/DataStore -swift-version 5 -I /Users/admin/builder/spi-builder-workspace/.derivedData/Build/Products/Debug-watchos -I /Applications/Xcode-16.3.0.app/Contents/Developer/Platforms/WatchOS.platform/Developer/usr/lib -F /Users/admin/builder/spi-builder-workspace/.derivedData/Build/Products/Debug-watchos -F /Applications/Xcode-16.3.0.app/Contents/Developer/Platforms/WatchOS.platform/Developer/Library/Frameworks -F /Applications/Xcode-16.3.0.app/Contents/Developer/Platforms/WatchOS.platform/Developer/SDKs/WatchOS11.4.sdk/Developer/Library/Frameworks -c -j10 -enable-batch-mode -incremental -Xcc -ivfsstatcache -Xcc /Users/admin/builder/spi-builder-workspace/.derivedData/SDKStatCaches.noindex/watchos11.4-22T246-43efb940ff07ba2497b70ec94253f576.sdkstatcache -output-file-map /Users/admin/builder/spi-builder-workspace/.derivedData/Build/Intermediates.noindex/ScreenNavigatorKit.build/Debug-watchos/ScreenNavigatorKit.build/Objects-normal/armv7k/ScreenNavigatorKit-OutputFileMap.json -use-frontend-parseable-output -save-temps -no-color-diagnostics -serialize-diagnostics -emit-dependencies -emit-module -emit-module-path /Users/admin/builder/spi-builder-workspace/.derivedData/Build/Intermediates.noindex/ScreenNavigatorKit.build/Debug-watchos/ScreenNavigatorKit.build/Objects-normal/armv7k/ScreenNavigatorKit.swiftmodule -validate-clang-modules-once -clang-build-session-file /Users/admin/builder/spi-builder-workspace/.derivedData/ModuleCache.noindex/Session.modulevalidation -Xcc -I/Users/admin/builder/spi-builder-workspace/.derivedData/Build/Intermediates.noindex/ScreenNavigatorKit.build/Debug-watchos/ScreenNavigatorKit.build/swift-overrides.hmap -emit-const-values -Xfrontend -const-gather-protocols-file -Xfrontend /Users/admin/builder/spi-builder-workspace/.derivedData/Build/Intermediates.noindex/ScreenNavigatorKit.build/Debug-watchos/ScreenNavigatorKit.build/Objects-normal/armv7k/ScreenNavigatorKit_const_extract_protocols.json -Xcc -I/Users/admin/builder/spi-builder-workspace/.derivedData/Build/Products/Debug-watchos/include -Xcc -I/Users/admin/builder/spi-builder-workspace/.derivedData/Build/Intermediates.noindex/ScreenNavigatorKit.build/Debug-watchos/ScreenNavigatorKit.build/DerivedSources-normal/armv7k -Xcc -I/Users/admin/builder/spi-builder-workspace/.derivedData/Build/Intermediates.noindex/ScreenNavigatorKit.build/Debug-watchos/ScreenNavigatorKit.build/DerivedSources/armv7k -Xcc -I/Users/admin/builder/spi-builder-workspace/.derivedData/Build/Intermediates.noindex/ScreenNavigatorKit.build/Debug-watchos/ScreenNavigatorKit.build/DerivedSources -Xcc -DSWIFT_PACKAGE -Xcc -DDEBUG\=1 -emit-objc-header -emit-objc-header-path /Users/admin/builder/spi-builder-workspace/.derivedData/Build/Intermediates.noindex/ScreenNavigatorKit.build/Debug-watchos/ScreenNavigatorKit.build/Objects-normal/armv7k/ScreenNavigatorKit-Swift.h -working-directory /Users/admin/builder/spi-builder-workspace/.swiftpm/xcode -experimental-emit-module-separately -disable-cmo
SwiftDriver ScreenNavigatorKit normal arm64 com.apple.xcode.tools.swift.compiler (in target 'ScreenNavigatorKit' from project 'ScreenNavigatorKit')
    cd /Users/admin/builder/spi-builder-workspace/.swiftpm/xcode
    builtin-SwiftDriver -- /Applications/Xcode-16.3.0.app/Contents/Developer/Toolchains/XcodeDefault.xctoolchain/usr/bin/swiftc -module-name ScreenNavigatorKit -Onone -enforce-exclusivity\=checked @/Users/admin/builder/spi-builder-workspace/.derivedData/Build/Intermediates.noindex/ScreenNavigatorKit.build/Debug-watchos/ScreenNavigatorKit.build/Objects-normal/arm64/ScreenNavigatorKit.SwiftFileList -DSWIFT_PACKAGE -DDEBUG -DXcode -plugin-path /Applications/Xcode-16.3.0.app/Contents/Developer/Toolchains/XcodeDefault.xctoolchain/usr/lib/swift/host/plugins/testing -enable-experimental-feature DebugDescriptionMacro -sdk /Applications/Xcode-16.3.0.app/Contents/Developer/Platforms/WatchOS.platform/Developer/SDKs/WatchOS11.4.sdk -target arm64-apple-watchos7.0 -g -module-cache-path /Users/admin/builder/spi-builder-workspace/.derivedData/ModuleCache.noindex -Xfrontend -serialize-debugging-options -profile-coverage-mapping -profile-generate -enable-testing -index-store-path /Users/admin/builder/spi-builder-workspace/.derivedData/Index.noindex/DataStore -swift-version 5 -I /Users/admin/builder/spi-builder-workspace/.derivedData/Build/Products/Debug-watchos -I /Applications/Xcode-16.3.0.app/Contents/Developer/Platforms/WatchOS.platform/Developer/usr/lib -F /Users/admin/builder/spi-builder-workspace/.derivedData/Build/Products/Debug-watchos -F /Applications/Xcode-16.3.0.app/Contents/Developer/Platforms/WatchOS.platform/Developer/Library/Frameworks -F /Applications/Xcode-16.3.0.app/Contents/Developer/Platforms/WatchOS.platform/Developer/SDKs/WatchOS11.4.sdk/Developer/Library/Frameworks -c -j10 -enable-batch-mode -incremental -Xcc -ivfsstatcache -Xcc /Users/admin/builder/spi-builder-workspace/.derivedData/SDKStatCaches.noindex/watchos11.4-22T246-43efb940ff07ba2497b70ec94253f576.sdkstatcache -output-file-map /Users/admin/builder/spi-builder-workspace/.derivedData/Build/Intermediates.noindex/ScreenNavigatorKit.build/Debug-watchos/ScreenNavigatorKit.build/Objects-normal/arm64/ScreenNavigatorKit-OutputFileMap.json -use-frontend-parseable-output -save-temps -no-color-diagnostics -serialize-diagnostics -emit-dependencies -emit-module -emit-module-path /Users/admin/builder/spi-builder-workspace/.derivedData/Build/Intermediates.noindex/ScreenNavigatorKit.build/Debug-watchos/ScreenNavigatorKit.build/Objects-normal/arm64/ScreenNavigatorKit.swiftmodule -validate-clang-modules-once -clang-build-session-file /Users/admin/builder/spi-builder-workspace/.derivedData/ModuleCache.noindex/Session.modulevalidation -Xcc -I/Users/admin/builder/spi-builder-workspace/.derivedData/Build/Intermediates.noindex/ScreenNavigatorKit.build/Debug-watchos/ScreenNavigatorKit.build/swift-overrides.hmap -emit-const-values -Xfrontend -const-gather-protocols-file -Xfrontend /Users/admin/builder/spi-builder-workspace/.derivedData/Build/Intermediates.noindex/ScreenNavigatorKit.build/Debug-watchos/ScreenNavigatorKit.build/Objects-normal/arm64/ScreenNavigatorKit_const_extract_protocols.json -Xcc -I/Users/admin/builder/spi-builder-workspace/.derivedData/Build/Products/Debug-watchos/include -Xcc -I/Users/admin/builder/spi-builder-workspace/.derivedData/Build/Intermediates.noindex/ScreenNavigatorKit.build/Debug-watchos/ScreenNavigatorKit.build/DerivedSources-normal/arm64 -Xcc -I/Users/admin/builder/spi-builder-workspace/.derivedData/Build/Intermediates.noindex/ScreenNavigatorKit.build/Debug-watchos/ScreenNavigatorKit.build/DerivedSources/arm64 -Xcc -I/Users/admin/builder/spi-builder-workspace/.derivedData/Build/Intermediates.noindex/ScreenNavigatorKit.build/Debug-watchos/ScreenNavigatorKit.build/DerivedSources -Xcc -DSWIFT_PACKAGE -Xcc -DDEBUG\=1 -emit-objc-header -emit-objc-header-path /Users/admin/builder/spi-builder-workspace/.derivedData/Build/Intermediates.noindex/ScreenNavigatorKit.build/Debug-watchos/ScreenNavigatorKit.build/Objects-normal/arm64/ScreenNavigatorKit-Swift.h -working-directory /Users/admin/builder/spi-builder-workspace/.swiftpm/xcode -experimental-emit-module-separately -disable-cmo
SwiftDriver ScreenNavigatorKit normal arm64_32 com.apple.xcode.tools.swift.compiler (in target 'ScreenNavigatorKit' from project 'ScreenNavigatorKit')
    cd /Users/admin/builder/spi-builder-workspace/.swiftpm/xcode
    builtin-SwiftDriver -- /Applications/Xcode-16.3.0.app/Contents/Developer/Toolchains/XcodeDefault.xctoolchain/usr/bin/swiftc -module-name ScreenNavigatorKit -Onone -enforce-exclusivity\=checked @/Users/admin/builder/spi-builder-workspace/.derivedData/Build/Intermediates.noindex/ScreenNavigatorKit.build/Debug-watchos/ScreenNavigatorKit.build/Objects-normal/arm64_32/ScreenNavigatorKit.SwiftFileList -DSWIFT_PACKAGE -DDEBUG -DXcode -plugin-path /Applications/Xcode-16.3.0.app/Contents/Developer/Toolchains/XcodeDefault.xctoolchain/usr/lib/swift/host/plugins/testing -enable-experimental-feature DebugDescriptionMacro -sdk /Applications/Xcode-16.3.0.app/Contents/Developer/Platforms/WatchOS.platform/Developer/SDKs/WatchOS11.4.sdk -target arm64_32-apple-watchos7.0 -g -module-cache-path /Users/admin/builder/spi-builder-workspace/.derivedData/ModuleCache.noindex -Xfrontend -serialize-debugging-options -profile-coverage-mapping -profile-generate -enable-testing -index-store-path /Users/admin/builder/spi-builder-workspace/.derivedData/Index.noindex/DataStore -swift-version 5 -I /Users/admin/builder/spi-builder-workspace/.derivedData/Build/Products/Debug-watchos -I /Applications/Xcode-16.3.0.app/Contents/Developer/Platforms/WatchOS.platform/Developer/usr/lib -F /Users/admin/builder/spi-builder-workspace/.derivedData/Build/Products/Debug-watchos -F /Applications/Xcode-16.3.0.app/Contents/Developer/Platforms/WatchOS.platform/Developer/Library/Frameworks -F /Applications/Xcode-16.3.0.app/Contents/Developer/Platforms/WatchOS.platform/Developer/SDKs/WatchOS11.4.sdk/Developer/Library/Frameworks -c -j10 -enable-batch-mode -incremental -Xcc -ivfsstatcache -Xcc /Users/admin/builder/spi-builder-workspace/.derivedData/SDKStatCaches.noindex/watchos11.4-22T246-43efb940ff07ba2497b70ec94253f576.sdkstatcache -output-file-map /Users/admin/builder/spi-builder-workspace/.derivedData/Build/Intermediates.noindex/ScreenNavigatorKit.build/Debug-watchos/ScreenNavigatorKit.build/Objects-normal/arm64_32/ScreenNavigatorKit-OutputFileMap.json -use-frontend-parseable-output -save-temps -no-color-diagnostics -serialize-diagnostics -emit-dependencies -emit-module -emit-module-path /Users/admin/builder/spi-builder-workspace/.derivedData/Build/Intermediates.noindex/ScreenNavigatorKit.build/Debug-watchos/ScreenNavigatorKit.build/Objects-normal/arm64_32/ScreenNavigatorKit.swiftmodule -validate-clang-modules-once -clang-build-session-file /Users/admin/builder/spi-builder-workspace/.derivedData/ModuleCache.noindex/Session.modulevalidation -Xcc -I/Users/admin/builder/spi-builder-workspace/.derivedData/Build/Intermediates.noindex/ScreenNavigatorKit.build/Debug-watchos/ScreenNavigatorKit.build/swift-overrides.hmap -emit-const-values -Xfrontend -const-gather-protocols-file -Xfrontend /Users/admin/builder/spi-builder-workspace/.derivedData/Build/Intermediates.noindex/ScreenNavigatorKit.build/Debug-watchos/ScreenNavigatorKit.build/Objects-normal/arm64_32/ScreenNavigatorKit_const_extract_protocols.json -Xcc -I/Users/admin/builder/spi-builder-workspace/.derivedData/Build/Products/Debug-watchos/include -Xcc -I/Users/admin/builder/spi-builder-workspace/.derivedData/Build/Intermediates.noindex/ScreenNavigatorKit.build/Debug-watchos/ScreenNavigatorKit.build/DerivedSources-normal/arm64_32 -Xcc -I/Users/admin/builder/spi-builder-workspace/.derivedData/Build/Intermediates.noindex/ScreenNavigatorKit.build/Debug-watchos/ScreenNavigatorKit.build/DerivedSources/arm64_32 -Xcc -I/Users/admin/builder/spi-builder-workspace/.derivedData/Build/Intermediates.noindex/ScreenNavigatorKit.build/Debug-watchos/ScreenNavigatorKit.build/DerivedSources -Xcc -DSWIFT_PACKAGE -Xcc -DDEBUG\=1 -emit-objc-header -emit-objc-header-path /Users/admin/builder/spi-builder-workspace/.derivedData/Build/Intermediates.noindex/ScreenNavigatorKit.build/Debug-watchos/ScreenNavigatorKit.build/Objects-normal/arm64_32/ScreenNavigatorKit-Swift.h -working-directory /Users/admin/builder/spi-builder-workspace/.swiftpm/xcode -experimental-emit-module-separately -disable-cmo
SwiftEmitModule normal arm64_32 Emitting\ module\ for\ ScreenNavigatorKit (in target 'ScreenNavigatorKit' from project 'ScreenNavigatorKit')
EmitSwiftModule normal arm64_32 (in target 'ScreenNavigatorKit' from project 'ScreenNavigatorKit')
    cd /Users/admin/builder/spi-builder-workspace/.swiftpm/xcode

SwiftCompile normal arm64_32 Compiling\ ModalToggle.swift,\ PresentationStyle.swift /Users/admin/builder/spi-builder-workspace/Sources/ScreenNavigatorKit/ModalStack/ModalToggle.swift /Users/admin/builder/spi-builder-workspace/Sources/ScreenNavigatorKit/ModalStack/PresentationStyle.swift (in target 'ScreenNavigatorKit' from project 'ScreenNavigatorKit')
SwiftCompile normal arm64_32 /Users/admin/builder/spi-builder-workspace/Sources/ScreenNavigatorKit/ModalStack/ModalToggle.swift (in target 'ScreenNavigatorKit' from project 'ScreenNavigatorKit')
    cd /Users/admin/builder/spi-builder-workspace/.swiftpm/xcode

SwiftCompile normal arm64_32 /Users/admin/builder/spi-builder-workspace/Sources/ScreenNavigatorKit/ModalStack/PresentationStyle.swift (in target 'ScreenNavigatorKit' from project 'ScreenNavigatorKit')
    cd /Users/admin/builder/spi-builder-workspace/.swiftpm/xcode

SwiftEmitModule normal armv7k Emitting\ module\ for\ ScreenNavigatorKit (in target 'ScreenNavigatorKit' from project 'ScreenNavigatorKit')
EmitSwiftModule normal armv7k (in target 'ScreenNavigatorKit' from project 'ScreenNavigatorKit')
    cd /Users/admin/builder/spi-builder-workspace/.swiftpm/xcode

SwiftCompile normal armv7k Compiling\ ModalToggle.swift,\ PresentationStyle.swift /Users/admin/builder/spi-builder-workspace/Sources/ScreenNavigatorKit/ModalStack/ModalToggle.swift /Users/admin/builder/spi-builder-workspace/Sources/ScreenNavigatorKit/ModalStack/PresentationStyle.swift (in target 'ScreenNavigatorKit' from project 'ScreenNavigatorKit')
SwiftCompile normal armv7k /Users/admin/builder/spi-builder-workspace/Sources/ScreenNavigatorKit/ModalStack/ModalToggle.swift (in target 'ScreenNavigatorKit' from project 'ScreenNavigatorKit')
    cd /Users/admin/builder/spi-builder-workspace/.swiftpm/xcode

SwiftCompile normal armv7k /Users/admin/builder/spi-builder-workspace/Sources/ScreenNavigatorKit/ModalStack/PresentationStyle.swift (in target 'ScreenNavigatorKit' from project 'ScreenNavigatorKit')
    cd /Users/admin/builder/spi-builder-workspace/.swiftpm/xcode

SwiftCompile normal armv7k Compiling\ View+push.swift /Users/admin/builder/spi-builder-workspace/Sources/ScreenNavigatorKit/NavigationStack/View+push.swift (in target 'ScreenNavigatorKit' from project 'ScreenNavigatorKit')
Failed frontend command:
/Applications/Xcode-16.3.0.app/Contents/Developer/Toolchains/XcodeDefault.xctoolchain/usr/bin/swift-frontend -frontend -c /Users/admin/builder/spi-builder-workspace/Sources/ScreenNavigatorKit/Internal/Helpers/AnySequence+first.swift /Users/admin/builder/spi-builder-workspace/Sources/ScreenNavigatorKit/Internal/Helpers/Binding+isNotNil.swift /Users/admin/builder/spi-builder-workspace/Sources/ScreenNavigatorKit/Internal/Helpers/Binding+removeDublicates.swift /Users/admin/builder/spi-builder-workspace/Sources/ScreenNavigatorKit/Internal/Helpers/Binding+when.swift /Users/admin/builder/spi-builder-workspace/Sources/ScreenNavigatorKit/Internal/Helpers/View+appear.swift /Users/admin/builder/spi-builder-workspace/Sources/ScreenNavigatorKit/Internal/Helpers/View+asAny.swift /Users/admin/builder/spi-builder-workspace/Sources/ScreenNavigatorKit/ModalStack/ModalStackController.swift /Users/admin/builder/spi-builder-workspace/Sources/ScreenNavigatorKit/ModalStack/ModalStackView.swift /Users/admin/builder/spi-builder-workspace/Sources/ScreenNavigatorKit/ModalStack/ModalToggle.swift /Users/admin/builder/spi-builder-workspace/Sources/ScreenNavigatorKit/ModalStack/PresentationStyle.swift /Users/admin/builder/spi-builder-workspace/Sources/ScreenNavigatorKit/ModalStack/View+fullScreenCover.swift /Users/admin/builder/spi-builder-workspace/Sources/ScreenNavigatorKit/ModalStack/View+sheet.swift /Users/admin/builder/spi-builder-workspace/Sources/ScreenNavigatorKit/NavigationStack/NavigationStackController.swift /Users/admin/builder/spi-builder-workspace/Sources/ScreenNavigatorKit/NavigationStack/NavigationStackView.swift /Users/admin/builder/spi-builder-workspace/Sources/ScreenNavigatorKit/NavigationStack/PushToggle.swift -primary-file /Users/admin/builder/spi-builder-workspace/Sources/ScreenNavigatorKit/NavigationStack/View+push.swift -emit-dependencies-path /Users/admin/builder/spi-builder-workspace/.derivedData/Build/Intermediates.noindex/ScreenNavigatorKit.build/Debug-watchos/ScreenNavigatorKit.build/Objects-normal/armv7k/View+push.d -emit-const-values-path /Users/admin/builder/spi-builder-workspace/.derivedData/Build/Intermediates.noindex/ScreenNavigatorKit.build/Debug-watchos/ScreenNavigatorKit.build/Objects-normal/armv7k/View+push.swiftconstvalues -emit-reference-dependencies-path /Users/admin/builder/spi-builder-workspace/.derivedData/Build/Intermediates.noindex/ScreenNavigatorKit.build/Debug-watchos/ScreenNavigatorKit.build/Objects-normal/armv7k/View+push.swiftdeps -serialize-diagnostics-path /Users/admin/builder/spi-builder-workspace/.derivedData/Build/Intermediates.noindex/ScreenNavigatorKit.build/Debug-watchos/ScreenNavigatorKit.build/Objects-normal/armv7k/View+push.dia -target armv7k-apple-watchos7.0 -enable-objc-interop -stack-check -sdk /Applications/Xcode-16.3.0.app/Contents/Developer/Platforms/WatchOS.platform/Developer/SDKs/WatchOS11.4.sdk -I /Users/admin/builder/spi-builder-workspace/.derivedData/Build/Products/Debug-watchos -I /Applications/Xcode-16.3.0.app/Contents/Developer/Platforms/WatchOS.platform/Developer/usr/lib -F /Users/admin/builder/spi-builder-workspace/.derivedData/Build/Products/Debug-watchos -F /Applications/Xcode-16.3.0.app/Contents/Developer/Platforms/WatchOS.platform/Developer/Library/Frameworks -F /Applications/Xcode-16.3.0.app/Contents/Developer/Platforms/WatchOS.platform/Developer/SDKs/WatchOS11.4.sdk/Developer/Library/Frameworks -no-color-diagnostics -enable-testing -g -debug-info-format\=dwarf -dwarf-version\=4 -module-cache-path /Users/admin/builder/spi-builder-workspace/.derivedData/ModuleCache.noindex -profile-generate -profile-coverage-mapping -swift-version 5 -enforce-exclusivity\=checked -Onone -D SWIFT_PACKAGE -D DEBUG -D Xcode -serialize-debugging-options -const-gather-protocols-file /Users/admin/builder/spi-builder-workspace/.derivedData/Build/Intermediates.noindex/ScreenNavigatorKit.build/Debug-watchos/ScreenNavigatorKit.build/Objects-normal/armv7k/ScreenNavigatorKit_const_extract_protocols.json -enable-experimental-feature DebugDescriptionMacro -empty-abi-descriptor -plugin-path /Applications/Xcode-16.3.0.app/Contents/Developer/Toolchains/XcodeDefault.xctoolchain/usr/lib/swift/host/plugins/testing -validate-clang-modules-once -clang-build-session-file /Users/admin/builder/spi-builder-workspace/.derivedData/ModuleCache.noindex/Session.modulevalidation -Xcc -working-directory -Xcc /Users/admin/builder/spi-builder-workspace/.swiftpm/xcode -resource-dir /Applications/Xcode-16.3.0.app/Contents/Developer/Toolchains/XcodeDefault.xctoolchain/usr/lib/swift -enable-anonymous-context-mangled-names -file-compilation-dir /Users/admin/builder/spi-builder-workspace/.swiftpm/xcode -Xcc -ivfsstatcache -Xcc /Users/admin/builder/spi-builder-workspace/.derivedData/SDKStatCaches.noindex/watchos11.4-22T246-43efb940ff07ba2497b70ec94253f576.sdkstatcache -Xcc -I/Users/admin/builder/spi-builder-workspace/.derivedData/Build/Intermediates.noindex/ScreenNavigatorKit.build/Debug-watchos/ScreenNavigatorKit.build/swift-overrides.hmap -Xcc -I/Users/admin/builder/spi-builder-workspace/.derivedData/Build/Products/Debug-watchos/include -Xcc -I/Users/admin/builder/spi-builder-workspace/.derivedData/Build/Intermediates.noindex/ScreenNavigatorKit.build/Debug-watchos/ScreenNavigatorKit.build/DerivedSources-normal/armv7k -Xcc -I/Users/admin/builder/spi-builder-workspace/.derivedData/Build/Intermediates.noindex/ScreenNavigatorKit.build/Debug-watchos/ScreenNavigatorKit.build/DerivedSources/armv7k -Xcc -I/Users/admin/builder/spi-builder-workspace/.derivedData/Build/Intermediates.noindex/ScreenNavigatorKit.build/Debug-watchos/ScreenNavigatorKit.build/DerivedSources -Xcc -DSWIFT_PACKAGE -Xcc -DDEBUG\=1 -module-name ScreenNavigatorKit -frontend-parseable-output -disable-clang-spi -target-sdk-version 11.4 -target-sdk-name watchos11.4 -external-plugin-path /Applications/Xcode-16.3.0.app/Contents/Developer/Platforms/WatchOS.platform/Developer/usr/lib/swift/host/plugins\#/Applications/Xcode-16.3.0.app/Contents/Developer/Platforms/WatchOS.platform/Developer/usr/bin/swift-plugin-server -external-plugin-path /Applications/Xcode-16.3.0.app/Contents/Developer/Platforms/WatchOS.platform/Developer/usr/local/lib/swift/host/plugins\#/Applications/Xcode-16.3.0.app/Contents/Developer/Platforms/WatchOS.platform/Developer/usr/bin/swift-plugin-server -in-process-plugin-server-path /Applications/Xcode-16.3.0.app/Contents/Developer/Toolchains/XcodeDefault.xctoolchain/usr/lib/swift/host/libSwiftInProcPluginServer.dylib -plugin-path /Applications/Xcode-16.3.0.app/Contents/Developer/Toolchains/XcodeDefault.xctoolchain/usr/lib/swift/host/plugins -plugin-path /Applications/Xcode-16.3.0.app/Contents/Developer/Toolchains/XcodeDefault.xctoolchain/usr/local/lib/swift/host/plugins -o /Users/admin/builder/spi-builder-workspace/.derivedData/Build/Intermediates.noindex/ScreenNavigatorKit.build/Debug-watchos/ScreenNavigatorKit.build/Objects-normal/armv7k/View+push.o -index-unit-output-path /ScreenNavigatorKit.build/Debug-watchos/ScreenNavigatorKit.build/Objects-normal/armv7k/View+push.o -index-store-path /Users/admin/builder/spi-builder-workspace/.derivedData/Index.noindex/DataStore -index-system-modules
SwiftCompile normal armv7k /Users/admin/builder/spi-builder-workspace/Sources/ScreenNavigatorKit/NavigationStack/View+push.swift (in target 'ScreenNavigatorKit' from project 'ScreenNavigatorKit')
    cd /Users/admin/builder/spi-builder-workspace/.swiftpm/xcode

/Users/admin/builder/spi-builder-workspace/Sources/ScreenNavigatorKit/NavigationStack/View+push.swift:20:14: error: 'isDetailLink' is unavailable in watchOS
            .isDetailLink(false)
             ^~~~~~~~~~~~
SwiftUI.NavigationLink.isDetailLink:5:15: note: 'isDetailLink' has been explicitly marked unavailable here
  public func isDetailLink(_ isDetailLink: Bool) -> some View
              ^
SwiftCompile normal arm64_32 Compiling\ ModalStackController.swift,\ ModalStackView.swift /Users/admin/builder/spi-builder-workspace/Sources/ScreenNavigatorKit/ModalStack/ModalStackController.swift /Users/admin/builder/spi-builder-workspace/Sources/ScreenNavigatorKit/ModalStack/ModalStackView.swift (in target 'ScreenNavigatorKit' from project 'ScreenNavigatorKit')
SwiftCompile normal arm64_32 /Users/admin/builder/spi-builder-workspace/Sources/ScreenNavigatorKit/ModalStack/ModalStackController.swift (in target 'ScreenNavigatorKit' from project 'ScreenNavigatorKit')
    cd /Users/admin/builder/spi-builder-workspace/.swiftpm/xcode

SwiftCompile normal arm64_32 /Users/admin/builder/spi-builder-workspace/Sources/ScreenNavigatorKit/ModalStack/ModalStackView.swift (in target 'ScreenNavigatorKit' from project 'ScreenNavigatorKit')
    cd /Users/admin/builder/spi-builder-workspace/.swiftpm/xcode

SwiftCompile normal armv7k Compiling\ NavigationStackView.swift /Users/admin/builder/spi-builder-workspace/Sources/ScreenNavigatorKit/NavigationStack/NavigationStackView.swift (in target 'ScreenNavigatorKit' from project 'ScreenNavigatorKit')
SwiftCompile normal armv7k /Users/admin/builder/spi-builder-workspace/Sources/ScreenNavigatorKit/NavigationStack/NavigationStackView.swift (in target 'ScreenNavigatorKit' from project 'ScreenNavigatorKit')
    cd /Users/admin/builder/spi-builder-workspace/.swiftpm/xcode

SwiftCompile normal armv7k Compiling\ View+appear.swift,\ View+asAny.swift /Users/admin/builder/spi-builder-workspace/Sources/ScreenNavigatorKit/Internal/Helpers/View+appear.swift /Users/admin/builder/spi-builder-workspace/Sources/ScreenNavigatorKit/Internal/Helpers/View+asAny.swift (in target 'ScreenNavigatorKit' from project 'ScreenNavigatorKit')
SwiftCompile normal armv7k /Users/admin/builder/spi-builder-workspace/Sources/ScreenNavigatorKit/Internal/Helpers/View+appear.swift (in target 'ScreenNavigatorKit' from project 'ScreenNavigatorKit')
    cd /Users/admin/builder/spi-builder-workspace/.swiftpm/xcode

SwiftCompile normal armv7k /Users/admin/builder/spi-builder-workspace/Sources/ScreenNavigatorKit/Internal/Helpers/View+asAny.swift (in target 'ScreenNavigatorKit' from project 'ScreenNavigatorKit')
    cd /Users/admin/builder/spi-builder-workspace/.swiftpm/xcode

SwiftEmitModule normal arm64 Emitting\ module\ for\ ScreenNavigatorKit (in target 'ScreenNavigatorKit' from project 'ScreenNavigatorKit')
EmitSwiftModule normal arm64 (in target 'ScreenNavigatorKit' from project 'ScreenNavigatorKit')
    cd /Users/admin/builder/spi-builder-workspace/.swiftpm/xcode

SwiftCompile normal armv7k Compiling\ AnySequence+first.swift,\ Binding+isNotNil.swift /Users/admin/builder/spi-builder-workspace/Sources/ScreenNavigatorKit/Internal/Helpers/AnySequence+first.swift /Users/admin/builder/spi-builder-workspace/Sources/ScreenNavigatorKit/Internal/Helpers/Binding+isNotNil.swift (in target 'ScreenNavigatorKit' from project 'ScreenNavigatorKit')
SwiftCompile normal armv7k /Users/admin/builder/spi-builder-workspace/Sources/ScreenNavigatorKit/Internal/Helpers/AnySequence+first.swift (in target 'ScreenNavigatorKit' from project 'ScreenNavigatorKit')
    cd /Users/admin/builder/spi-builder-workspace/.swiftpm/xcode

SwiftCompile normal armv7k /Users/admin/builder/spi-builder-workspace/Sources/ScreenNavigatorKit/Internal/Helpers/Binding+isNotNil.swift (in target 'ScreenNavigatorKit' from project 'ScreenNavigatorKit')
    cd /Users/admin/builder/spi-builder-workspace/.swiftpm/xcode

SwiftCompile normal arm64 Compiling\ PushToggle.swift /Users/admin/builder/spi-builder-workspace/Sources/ScreenNavigatorKit/NavigationStack/PushToggle.swift (in target 'ScreenNavigatorKit' from project 'ScreenNavigatorKit')
Command SwiftCompile failed with a nonzero exit code
** BUILD FAILED **
The following build commands failed:
	SwiftCompile normal armv7k Compiling\ View+push.swift /Users/admin/builder/spi-builder-workspace/Sources/ScreenNavigatorKit/NavigationStack/View+push.swift (in target 'ScreenNavigatorKit' from project 'ScreenNavigatorKit')
	SwiftCompile normal armv7k /Users/admin/builder/spi-builder-workspace/Sources/ScreenNavigatorKit/NavigationStack/View+push.swift (in target 'ScreenNavigatorKit' from project 'ScreenNavigatorKit')
	SwiftCompile normal arm64 Compiling\ PushToggle.swift /Users/admin/builder/spi-builder-workspace/Sources/ScreenNavigatorKit/NavigationStack/PushToggle.swift (in target 'ScreenNavigatorKit' from project 'ScreenNavigatorKit')
	Building workspace spi-builder-workspace with scheme ScreenNavigatorKit
(4 failures)
BUILD FAILURE 6.1 watchOS