The Swift Package Index logo.Swift Package Index

Track the adoption of Swift 6 strict concurrency checks for data race safety. How many packages are Ready for Swift 6?

Build Information

Failed to build YandexMapsMobileNaviKit, reference 4.14.0 (10fdfb), with Swift 6.1 for watchOS using Xcode 16.3 on 1 May 2025 10:49:37 UTC.

Build Command

env DEVELOPER_DIR=/Applications/Xcode-16.3.0.app xcrun xcodebuild -IDEClonedSourcePackagesDirPathOverride=$PWD/.dependencies -skipMacroValidation -skipPackagePluginValidation -derivedDataPath $PWD/.derivedData build -scheme YandexMapsMobileNaviKit -destination generic/platform=watchOS

Build Log

========================================
RunAll
========================================
Builder version: 4.61.3
Interrupt handler set up.
========================================
Checkout
========================================
Clone URL: https://github.com/c-villain/YandexMapsMobileNaviKit.git
Reference: 4.14.0
Initialized empty Git repository in /Users/admin/builder/spi-builder-workspace/.git/
From https://github.com/c-villain/YandexMapsMobileNaviKit
 * tag               4.14.0     -> FETCH_HEAD
HEAD is now at 10fdfb0 Update to 4.14
Cloned https://github.com/c-villain/YandexMapsMobileNaviKit.git
Revision (git rev-parse @):
10fdfb06592e65d2eebe8aaab3a5bd4cbd680d73
SUCCESS checkout https://github.com/c-villain/YandexMapsMobileNaviKit.git at 4.14.0
========================================
Build
========================================
Selected platform:         watchOS
Swift version:             6.1
Building package at path:  $PWD
https://github.com/c-villain/YandexMapsMobileNaviKit.git
https://github.com/c-villain/YandexMapsMobileNaviKit.git
{
  "dependencies" : [
  ],
  "manifest_display_name" : "YandexMapsMobileNaviKit",
  "name" : "YandexMapsMobileNaviKit",
  "path" : "/Users/admin/builder/spi-builder-workspace",
  "platforms" : [
    {
      "name" : "ios",
      "version" : "13.0"
    }
  ],
  "products" : [
    {
      "name" : "YandexMapsMobile",
      "targets" : [
        "YandexMapsMobile"
      ],
      "type" : {
        "library" : [
          "automatic"
        ]
      }
    }
  ],
  "targets" : [
    {
      "c99name" : "YandexMapsMobile",
      "module_type" : "BinaryTarget",
      "name" : "YandexMapsMobile",
      "path" : "remote/archive/YandexMapsMobile.xcframework.zip",
      "product_memberships" : [
        "YandexMapsMobile"
      ],
      "sources" : [
      ],
      "type" : "binary"
    }
  ],
  "tools_version" : "5.3"
}
Command line invocation:
    /Applications/Xcode-16.3.0.app/Contents/Developer/usr/bin/xcodebuild -IDEClonedSourcePackagesDirPathOverride=/Users/admin/builder/spi-builder-workspace/.dependencies -resolvePackageDependencies
Resolve Package Graph
Resolve Package Graph
Resolved source packages:
  YandexMapsMobileNaviKit: /Users/admin/builder/spi-builder-workspace
resolved source packages: YandexMapsMobileNaviKit
{
  "dependencies" : [
  ],
  "manifest_display_name" : "YandexMapsMobileNaviKit",
  "name" : "YandexMapsMobileNaviKit",
  "path" : "/Users/admin/builder/spi-builder-workspace",
  "platforms" : [
    {
      "name" : "ios",
      "version" : "13.0"
    }
  ],
  "products" : [
    {
      "name" : "YandexMapsMobile",
      "targets" : [
        "YandexMapsMobile"
      ],
      "type" : {
        "library" : [
          "automatic"
        ]
      }
    }
  ],
  "targets" : [
    {
      "c99name" : "YandexMapsMobile",
      "module_type" : "BinaryTarget",
      "name" : "YandexMapsMobile",
      "path" : "remote/archive/YandexMapsMobile.xcframework.zip",
      "product_memberships" : [
        "YandexMapsMobile"
      ],
      "sources" : [
      ],
      "type" : "binary"
    }
  ],
  "tools_version" : "5.3"
}
{
  "workspace" : {
    "name" : "spi-builder-workspace",
    "schemes" : [
      "YandexMapsMobileNaviKit"
    ]
  }
}
Running build ...
env DEVELOPER_DIR=/Applications/Xcode-16.3.0.app xcrun xcodebuild -IDEClonedSourcePackagesDirPathOverride=$PWD/.dependencies -skipMacroValidation -skipPackagePluginValidation -derivedDataPath $PWD/.derivedData build -scheme YandexMapsMobileNaviKit -destination generic/platform=watchOS OTHER_SWIFT_FLAGS=-stats-output-dir .stats -strict-concurrency=complete -enable-upcoming-feature StrictConcurrency -enable-upcoming-feature DisableOutwardActorInference -enable-upcoming-feature GlobalActorIsolatedTypesUsability -enable-upcoming-feature InferSendableFromCaptures
Command line invocation:
    /Applications/Xcode-16.3.0.app/Contents/Developer/usr/bin/xcodebuild -IDEClonedSourcePackagesDirPathOverride=/Users/admin/builder/spi-builder-workspace/.dependencies -skipMacroValidation -skipPackagePluginValidation -derivedDataPath /Users/admin/builder/spi-builder-workspace/.derivedData build -scheme YandexMapsMobileNaviKit -destination generic/platform=watchOS "OTHER_SWIFT_FLAGS=-stats-output-dir .stats -strict-concurrency=complete -enable-upcoming-feature StrictConcurrency -enable-upcoming-feature DisableOutwardActorInference -enable-upcoming-feature GlobalActorIsolatedTypesUsability -enable-upcoming-feature InferSendableFromCaptures"
Build settings from command line:
    OTHER_SWIFT_FLAGS = -stats-output-dir .stats -strict-concurrency=complete -enable-upcoming-feature StrictConcurrency -enable-upcoming-feature DisableOutwardActorInference -enable-upcoming-feature GlobalActorIsolatedTypesUsability -enable-upcoming-feature InferSendableFromCaptures
Resolve Package Graph
Resolved source packages:
  YandexMapsMobileNaviKit: /Users/admin/builder/spi-builder-workspace
ComputePackagePrebuildTargetDependencyGraph
Prepare packages
CreateBuildRequest
SendProjectDescription
CreateBuildOperation
ComputeTargetDependencyGraph
note: Building targets in dependency order
note: Target dependency graph (1 target)
    Target 'YandexMapsMobile' in project 'YandexMapsMobileNaviKit' (no dependencies)
GatherProvisioningInputs
CreateBuildDescription
ExecuteExternalTool /Applications/Xcode-16.3.0.app/Contents/Developer/Toolchains/XcodeDefault.xctoolchain/usr/bin/clang -v -E -dM -isysroot /Applications/Xcode-16.3.0.app/Contents/Developer/Platforms/WatchOS.platform/Developer/SDKs/WatchOS11.4.sdk -x c -c /dev/null
Build description signature: e4ab8bee1bf4f0cc0cd8ac5a2bc1d4a5
Build description path: /Users/admin/builder/spi-builder-workspace/.derivedData/Build/Intermediates.noindex/XCBuildData/e4ab8bee1bf4f0cc0cd8ac5a2bc1d4a5.xcbuilddata
/Users/admin/builder/spi-builder-workspace/.dependencies/artifacts/spi-builder-workspace/YandexMapsMobile/YandexMapsMobile.xcframework:1:1: error: While building for watchOS, no library for this platform was found in '/Users/admin/builder/spi-builder-workspace/.dependencies/artifacts/spi-builder-workspace/YandexMapsMobile/YandexMapsMobile.xcframework'. (in target 'YandexMapsMobile' from project 'YandexMapsMobileNaviKit')
** BUILD FAILED **
The following build commands failed:
	Building workspace spi-builder-workspace with scheme YandexMapsMobileNaviKit
(1 failure)
Command line invocation:
    /Applications/Xcode-16.3.0.app/Contents/Developer/usr/bin/xcodebuild -IDEClonedSourcePackagesDirPathOverride=/Users/admin/builder/spi-builder-workspace/.dependencies -resolvePackageDependencies
Resolve Package Graph
Resolved source packages:
  YandexMapsMobileNaviKit: /Users/admin/builder/spi-builder-workspace
resolved source packages: YandexMapsMobileNaviKit
{
  "dependencies" : [
  ],
  "manifest_display_name" : "YandexMapsMobileNaviKit",
  "name" : "YandexMapsMobileNaviKit",
  "path" : "/Users/admin/builder/spi-builder-workspace",
  "platforms" : [
    {
      "name" : "ios",
      "version" : "13.0"
    }
  ],
  "products" : [
    {
      "name" : "YandexMapsMobile",
      "targets" : [
        "YandexMapsMobile"
      ],
      "type" : {
        "library" : [
          "automatic"
        ]
      }
    }
  ],
  "targets" : [
    {
      "c99name" : "YandexMapsMobile",
      "module_type" : "BinaryTarget",
      "name" : "YandexMapsMobile",
      "path" : "remote/archive/YandexMapsMobile.xcframework.zip",
      "product_memberships" : [
        "YandexMapsMobile"
      ],
      "sources" : [
      ],
      "type" : "binary"
    }
  ],
  "tools_version" : "5.3"
}
{
  "workspace" : {
    "name" : "spi-builder-workspace",
    "schemes" : [
      "YandexMapsMobileNaviKit"
    ]
  }
}
Running build ...
env DEVELOPER_DIR=/Applications/Xcode-16.3.0.app xcrun xcodebuild -IDEClonedSourcePackagesDirPathOverride=$PWD/.dependencies -skipMacroValidation -skipPackagePluginValidation -derivedDataPath $PWD/.derivedData build -scheme YandexMapsMobileNaviKit -destination generic/platform=watchOS
Command line invocation:
    /Applications/Xcode-16.3.0.app/Contents/Developer/usr/bin/xcodebuild -IDEClonedSourcePackagesDirPathOverride=/Users/admin/builder/spi-builder-workspace/.dependencies -skipMacroValidation -skipPackagePluginValidation -derivedDataPath /Users/admin/builder/spi-builder-workspace/.derivedData build -scheme YandexMapsMobileNaviKit -destination generic/platform=watchOS
Resolve Package Graph
Resolved source packages:
  YandexMapsMobileNaviKit: /Users/admin/builder/spi-builder-workspace
ComputePackagePrebuildTargetDependencyGraph
Prepare packages
CreateBuildRequest
SendProjectDescription
CreateBuildOperation
ComputeTargetDependencyGraph
note: Building targets in dependency order
note: Target dependency graph (1 target)
    Target 'YandexMapsMobile' in project 'YandexMapsMobileNaviKit' (no dependencies)
GatherProvisioningInputs
CreateBuildDescription
ExecuteExternalTool /Applications/Xcode-16.3.0.app/Contents/Developer/Toolchains/XcodeDefault.xctoolchain/usr/bin/clang -v -E -dM -isysroot /Applications/Xcode-16.3.0.app/Contents/Developer/Platforms/WatchOS.platform/Developer/SDKs/WatchOS11.4.sdk -x c -c /dev/null
Build description signature: 6112e9e12e7be0642b67449949ed5ab4
Build description path: /Users/admin/builder/spi-builder-workspace/.derivedData/Build/Intermediates.noindex/XCBuildData/6112e9e12e7be0642b67449949ed5ab4.xcbuilddata
/Users/admin/builder/spi-builder-workspace/.dependencies/artifacts/spi-builder-workspace/YandexMapsMobile/YandexMapsMobile.xcframework:1:1: error: While building for watchOS, no library for this platform was found in '/Users/admin/builder/spi-builder-workspace/.dependencies/artifacts/spi-builder-workspace/YandexMapsMobile/YandexMapsMobile.xcframework'. (in target 'YandexMapsMobile' from project 'YandexMapsMobileNaviKit')
** BUILD FAILED **
The following build commands failed:
	Building workspace spi-builder-workspace with scheme YandexMapsMobileNaviKit
(1 failure)
BUILD FAILURE 6.1 watchOS