The Swift Package Index logo.Swift Package Index

Track the adoption of Swift 6 strict concurrency checks for data race safety. How many packages are Ready for Swift 6?

Build Information

Failed to build GraduatedSlider, reference main (96bb17), with Swift 6.1 for watchOS using Xcode 16.3 on 26 Apr 2025 14:58:32 UTC.

Build Command

env DEVELOPER_DIR=/Applications/Xcode-16.3.0.app xcrun xcodebuild -IDEClonedSourcePackagesDirPathOverride=$PWD/.dependencies -skipMacroValidation -skipPackagePluginValidation -derivedDataPath $PWD/.derivedData build -scheme GraduatedSlider -destination generic/platform=watchOS

Build Log

========================================
RunAll
========================================
Builder version: 4.61.0
Interrupt handler set up.
========================================
Checkout
========================================
Clone URL: https://github.com/sardon/GraduatedSlider.git
Reference: main
Initialized empty Git repository in /Users/admin/builder/spi-builder-workspace/.git/
From https://github.com/sardon/GraduatedSlider
 * branch            main       -> FETCH_HEAD
 * [new branch]      main       -> origin/main
HEAD is now at 96bb177 .gitignore
Cloned https://github.com/sardon/GraduatedSlider.git
Revision (git rev-parse @):
96bb1779910bba078e6099de8b6b7e1e13cb7793
SUCCESS checkout https://github.com/sardon/GraduatedSlider.git at main
========================================
Build
========================================
Selected platform:         watchOS
Swift version:             6.1
Building package at path:  $PWD
https://github.com/sardon/GraduatedSlider.git
https://github.com/sardon/GraduatedSlider.git
{
  "dependencies" : [
  ],
  "manifest_display_name" : "GraduatedSlider",
  "name" : "GraduatedSlider",
  "path" : "/Users/admin/builder/spi-builder-workspace",
  "platforms" : [
    {
      "name" : "ios",
      "version" : "10.0"
    }
  ],
  "products" : [
    {
      "name" : "GraduatedSlider",
      "targets" : [
        "GraduatedSlider"
      ],
      "type" : {
        "library" : [
          "automatic"
        ]
      }
    }
  ],
  "swift_languages_versions" : [
    "5"
  ],
  "targets" : [
    {
      "c99name" : "GraduatedSlider",
      "module_type" : "SwiftTarget",
      "name" : "GraduatedSlider",
      "path" : "Sources/GraduatedSlider",
      "product_memberships" : [
        "GraduatedSlider"
      ],
      "sources" : [
        "BackgroundLayer.swift",
        "CGContext+Utils.swift",
        "CursorLayer.swift",
        "GraduatedSlider.swift"
      ],
      "type" : "library"
    }
  ],
  "tools_version" : "5.0"
}
Command line invocation:
    /Applications/Xcode-16.3.0.app/Contents/Developer/usr/bin/xcodebuild -IDEClonedSourcePackagesDirPathOverride=/Users/admin/builder/spi-builder-workspace/.dependencies -resolvePackageDependencies
Resolve Package Graph
Resolved source packages:
  GraduatedSlider: /Users/admin/builder/spi-builder-workspace
resolved source packages: GraduatedSlider
{
  "dependencies" : [
  ],
  "manifest_display_name" : "GraduatedSlider",
  "name" : "GraduatedSlider",
  "path" : "/Users/admin/builder/spi-builder-workspace",
  "platforms" : [
    {
      "name" : "ios",
      "version" : "10.0"
    }
  ],
  "products" : [
    {
      "name" : "GraduatedSlider",
      "targets" : [
        "GraduatedSlider"
      ],
      "type" : {
        "library" : [
          "automatic"
        ]
      }
    }
  ],
  "swift_languages_versions" : [
    "5"
  ],
  "targets" : [
    {
      "c99name" : "GraduatedSlider",
      "module_type" : "SwiftTarget",
      "name" : "GraduatedSlider",
      "path" : "Sources/GraduatedSlider",
      "product_memberships" : [
        "GraduatedSlider"
      ],
      "sources" : [
        "BackgroundLayer.swift",
        "CGContext+Utils.swift",
        "CursorLayer.swift",
        "GraduatedSlider.swift"
      ],
      "type" : "library"
    }
  ],
  "tools_version" : "5.0"
}
{
  "workspace" : {
    "name" : "spi-builder-workspace",
    "schemes" : [
      "GraduatedSlider"
    ]
  }
}
Running build ...
env DEVELOPER_DIR=/Applications/Xcode-16.3.0.app xcrun xcodebuild -IDEClonedSourcePackagesDirPathOverride=$PWD/.dependencies -skipMacroValidation -skipPackagePluginValidation -derivedDataPath $PWD/.derivedData build -scheme GraduatedSlider -destination generic/platform=watchOS OTHER_SWIFT_FLAGS=-stats-output-dir .stats -strict-concurrency=complete -enable-upcoming-feature StrictConcurrency -enable-upcoming-feature DisableOutwardActorInference -enable-upcoming-feature GlobalActorIsolatedTypesUsability -enable-upcoming-feature InferSendableFromCaptures
Command line invocation:
    /Applications/Xcode-16.3.0.app/Contents/Developer/usr/bin/xcodebuild -IDEClonedSourcePackagesDirPathOverride=/Users/admin/builder/spi-builder-workspace/.dependencies -skipMacroValidation -skipPackagePluginValidation -derivedDataPath /Users/admin/builder/spi-builder-workspace/.derivedData build -scheme GraduatedSlider -destination generic/platform=watchOS "OTHER_SWIFT_FLAGS=-stats-output-dir .stats -strict-concurrency=complete -enable-upcoming-feature StrictConcurrency -enable-upcoming-feature DisableOutwardActorInference -enable-upcoming-feature GlobalActorIsolatedTypesUsability -enable-upcoming-feature InferSendableFromCaptures"
Build settings from command line:
    OTHER_SWIFT_FLAGS = -stats-output-dir .stats -strict-concurrency=complete -enable-upcoming-feature StrictConcurrency -enable-upcoming-feature DisableOutwardActorInference -enable-upcoming-feature GlobalActorIsolatedTypesUsability -enable-upcoming-feature InferSendableFromCaptures
Resolve Package Graph
Resolved source packages:
  GraduatedSlider: /Users/admin/builder/spi-builder-workspace
ComputePackagePrebuildTargetDependencyGraph
Prepare packages
CreateBuildRequest
SendProjectDescription
CreateBuildOperation
ComputeTargetDependencyGraph
note: Building targets in dependency order
note: Target dependency graph (2 targets)
    Target 'GraduatedSlider' in project 'GraduatedSlider'
        ➜ Explicit dependency on target 'GraduatedSlider' in project 'GraduatedSlider'
    Target 'GraduatedSlider' in project 'GraduatedSlider' (no dependencies)
GatherProvisioningInputs
CreateBuildDescription
ExecuteExternalTool /Applications/Xcode-16.3.0.app/Contents/Developer/Toolchains/XcodeDefault.xctoolchain/usr/bin/clang -v -E -dM -isysroot /Applications/Xcode-16.3.0.app/Contents/Developer/Platforms/WatchOS.platform/Developer/SDKs/WatchOS11.4.sdk -x c -c /dev/null
ExecuteExternalTool /Applications/Xcode-16.3.0.app/Contents/Developer/Toolchains/XcodeDefault.xctoolchain/usr/bin/swiftc --version
ExecuteExternalTool /Applications/Xcode-16.3.0.app/Contents/Developer/Toolchains/XcodeDefault.xctoolchain/usr/bin/ld -version_details
Build description signature: 7e926767aa781b59fcbce3017285ab07
Build description path: /Users/admin/builder/spi-builder-workspace/.derivedData/Build/Intermediates.noindex/XCBuildData/7e926767aa781b59fcbce3017285ab07.xcbuilddata
CreateBuildDirectory /Users/admin/builder/spi-builder-workspace/.derivedData/Build/Products
    cd /Users/admin/builder/spi-builder-workspace/.swiftpm/xcode
    builtin-create-build-directory /Users/admin/builder/spi-builder-workspace/.derivedData/Build/Products
CreateBuildDirectory /Users/admin/builder/spi-builder-workspace/.derivedData/Build/Intermediates.noindex
    cd /Users/admin/builder/spi-builder-workspace/.swiftpm/xcode
    builtin-create-build-directory /Users/admin/builder/spi-builder-workspace/.derivedData/Build/Intermediates.noindex
ClangStatCache /Applications/Xcode-16.3.0.app/Contents/Developer/Toolchains/XcodeDefault.xctoolchain/usr/bin/clang-stat-cache /Applications/Xcode-16.3.0.app/Contents/Developer/Platforms/WatchOS.platform/Developer/SDKs/WatchOS11.4.sdk /Users/admin/builder/spi-builder-workspace/.derivedData/SDKStatCaches.noindex/watchos11.4-22T246-43efb940ff07ba2497b70ec94253f576.sdkstatcache
    cd /Users/admin/builder/spi-builder-workspace/.swiftpm/xcode
    /Applications/Xcode-16.3.0.app/Contents/Developer/Toolchains/XcodeDefault.xctoolchain/usr/bin/clang-stat-cache /Applications/Xcode-16.3.0.app/Contents/Developer/Platforms/WatchOS.platform/Developer/SDKs/WatchOS11.4.sdk -o /Users/admin/builder/spi-builder-workspace/.derivedData/SDKStatCaches.noindex/watchos11.4-22T246-43efb940ff07ba2497b70ec94253f576.sdkstatcache
CreateBuildDirectory /Users/admin/builder/spi-builder-workspace/.derivedData/Build/Intermediates.noindex/EagerLinkingTBDs/Debug-watchos
    cd /Users/admin/builder/spi-builder-workspace/.swiftpm/xcode
    builtin-create-build-directory /Users/admin/builder/spi-builder-workspace/.derivedData/Build/Intermediates.noindex/EagerLinkingTBDs/Debug-watchos
CreateBuildDirectory /Users/admin/builder/spi-builder-workspace/.derivedData/Build/Products/Debug-watchos
    cd /Users/admin/builder/spi-builder-workspace/.swiftpm/xcode
    builtin-create-build-directory /Users/admin/builder/spi-builder-workspace/.derivedData/Build/Products/Debug-watchos
CreateBuildDirectory /Users/admin/builder/spi-builder-workspace/.derivedData/Build/Products/Debug-watchos/PackageFrameworks
    cd /Users/admin/builder/spi-builder-workspace/.swiftpm/xcode
    builtin-create-build-directory /Users/admin/builder/spi-builder-workspace/.derivedData/Build/Products/Debug-watchos/PackageFrameworks
WriteAuxiliaryFile /Users/admin/builder/spi-builder-workspace/.derivedData/Build/Intermediates.noindex/GraduatedSlider.build/Debug-watchos/GraduatedSlider.build/Objects-normal/armv7k/GraduatedSlider_const_extract_protocols.json (in target 'GraduatedSlider' from project 'GraduatedSlider')
    cd /Users/admin/builder/spi-builder-workspace
    write-file /Users/admin/builder/spi-builder-workspace/.derivedData/Build/Intermediates.noindex/GraduatedSlider.build/Debug-watchos/GraduatedSlider.build/Objects-normal/armv7k/GraduatedSlider_const_extract_protocols.json
WriteAuxiliaryFile /Users/admin/builder/spi-builder-workspace/.derivedData/Build/Intermediates.noindex/GraduatedSlider.build/Debug-watchos/GraduatedSlider.build/Objects-normal/armv7k/GraduatedSlider.SwiftFileList (in target 'GraduatedSlider' from project 'GraduatedSlider')
    cd /Users/admin/builder/spi-builder-workspace
    write-file /Users/admin/builder/spi-builder-workspace/.derivedData/Build/Intermediates.noindex/GraduatedSlider.build/Debug-watchos/GraduatedSlider.build/Objects-normal/armv7k/GraduatedSlider.SwiftFileList
WriteAuxiliaryFile /Users/admin/builder/spi-builder-workspace/.derivedData/Build/Intermediates.noindex/GraduatedSlider.build/Debug-watchos/GraduatedSlider.build/Objects-normal/arm64_32/GraduatedSlider.LinkFileList (in target 'GraduatedSlider' from project 'GraduatedSlider')
    cd /Users/admin/builder/spi-builder-workspace
    write-file /Users/admin/builder/spi-builder-workspace/.derivedData/Build/Intermediates.noindex/GraduatedSlider.build/Debug-watchos/GraduatedSlider.build/Objects-normal/arm64_32/GraduatedSlider.LinkFileList
WriteAuxiliaryFile /Users/admin/builder/spi-builder-workspace/.derivedData/Build/Intermediates.noindex/GraduatedSlider.build/Debug-watchos/GraduatedSlider.build/Objects-normal/armv7k/GraduatedSlider-OutputFileMap.json (in target 'GraduatedSlider' from project 'GraduatedSlider')
    cd /Users/admin/builder/spi-builder-workspace
    write-file /Users/admin/builder/spi-builder-workspace/.derivedData/Build/Intermediates.noindex/GraduatedSlider.build/Debug-watchos/GraduatedSlider.build/Objects-normal/armv7k/GraduatedSlider-OutputFileMap.json
WriteAuxiliaryFile /Users/admin/builder/spi-builder-workspace/.derivedData/Build/Intermediates.noindex/GraduatedSlider.build/Debug-watchos/GraduatedSlider.build/Objects-normal/arm64_32/GraduatedSlider.SwiftConstValuesFileList (in target 'GraduatedSlider' from project 'GraduatedSlider')
    cd /Users/admin/builder/spi-builder-workspace
    write-file /Users/admin/builder/spi-builder-workspace/.derivedData/Build/Intermediates.noindex/GraduatedSlider.build/Debug-watchos/GraduatedSlider.build/Objects-normal/arm64_32/GraduatedSlider.SwiftConstValuesFileList
WriteAuxiliaryFile /Users/admin/builder/spi-builder-workspace/.derivedData/Build/Intermediates.noindex/GraduatedSlider.build/Debug-watchos/GraduatedSlider.build/Objects-normal/armv7k/GraduatedSlider.SwiftConstValuesFileList (in target 'GraduatedSlider' from project 'GraduatedSlider')
    cd /Users/admin/builder/spi-builder-workspace
    write-file /Users/admin/builder/spi-builder-workspace/.derivedData/Build/Intermediates.noindex/GraduatedSlider.build/Debug-watchos/GraduatedSlider.build/Objects-normal/armv7k/GraduatedSlider.SwiftConstValuesFileList
WriteAuxiliaryFile /Users/admin/builder/spi-builder-workspace/.derivedData/Build/Intermediates.noindex/GraduatedSlider.build/Debug-watchos/GraduatedSlider.build/Objects-normal/arm64_32/GraduatedSlider_const_extract_protocols.json (in target 'GraduatedSlider' from project 'GraduatedSlider')
    cd /Users/admin/builder/spi-builder-workspace
    write-file /Users/admin/builder/spi-builder-workspace/.derivedData/Build/Intermediates.noindex/GraduatedSlider.build/Debug-watchos/GraduatedSlider.build/Objects-normal/arm64_32/GraduatedSlider_const_extract_protocols.json
WriteAuxiliaryFile /Users/admin/builder/spi-builder-workspace/.derivedData/Build/Intermediates.noindex/GraduatedSlider.build/Debug-watchos/GraduatedSlider.build/Objects-normal/armv7k/GraduatedSlider.LinkFileList (in target 'GraduatedSlider' from project 'GraduatedSlider')
    cd /Users/admin/builder/spi-builder-workspace
    write-file /Users/admin/builder/spi-builder-workspace/.derivedData/Build/Intermediates.noindex/GraduatedSlider.build/Debug-watchos/GraduatedSlider.build/Objects-normal/armv7k/GraduatedSlider.LinkFileList
WriteAuxiliaryFile /Users/admin/builder/spi-builder-workspace/.derivedData/Build/Intermediates.noindex/GraduatedSlider.build/Debug-watchos/GraduatedSlider.build/Objects-normal/arm64_32/GraduatedSlider.SwiftFileList (in target 'GraduatedSlider' from project 'GraduatedSlider')
    cd /Users/admin/builder/spi-builder-workspace
    write-file /Users/admin/builder/spi-builder-workspace/.derivedData/Build/Intermediates.noindex/GraduatedSlider.build/Debug-watchos/GraduatedSlider.build/Objects-normal/arm64_32/GraduatedSlider.SwiftFileList
WriteAuxiliaryFile /Users/admin/builder/spi-builder-workspace/.derivedData/Build/Intermediates.noindex/GraduatedSlider.build/Debug-watchos/GraduatedSlider.build/Objects-normal/arm64_32/GraduatedSlider-OutputFileMap.json (in target 'GraduatedSlider' from project 'GraduatedSlider')
    cd /Users/admin/builder/spi-builder-workspace
    write-file /Users/admin/builder/spi-builder-workspace/.derivedData/Build/Intermediates.noindex/GraduatedSlider.build/Debug-watchos/GraduatedSlider.build/Objects-normal/arm64_32/GraduatedSlider-OutputFileMap.json
WriteAuxiliaryFile /Users/admin/builder/spi-builder-workspace/.derivedData/Build/Intermediates.noindex/GraduatedSlider.build/Debug-watchos/GraduatedSlider.build/Objects-normal/arm64/GraduatedSlider.SwiftFileList (in target 'GraduatedSlider' from project 'GraduatedSlider')
    cd /Users/admin/builder/spi-builder-workspace
    write-file /Users/admin/builder/spi-builder-workspace/.derivedData/Build/Intermediates.noindex/GraduatedSlider.build/Debug-watchos/GraduatedSlider.build/Objects-normal/arm64/GraduatedSlider.SwiftFileList
WriteAuxiliaryFile /Users/admin/builder/spi-builder-workspace/.derivedData/Build/Intermediates.noindex/GraduatedSlider.build/Debug-watchos/GraduatedSlider.build/Objects-normal/arm64/GraduatedSlider_const_extract_protocols.json (in target 'GraduatedSlider' from project 'GraduatedSlider')
    cd /Users/admin/builder/spi-builder-workspace
    write-file /Users/admin/builder/spi-builder-workspace/.derivedData/Build/Intermediates.noindex/GraduatedSlider.build/Debug-watchos/GraduatedSlider.build/Objects-normal/arm64/GraduatedSlider_const_extract_protocols.json
WriteAuxiliaryFile /Users/admin/builder/spi-builder-workspace/.derivedData/Build/Intermediates.noindex/GraduatedSlider.build/Debug-watchos/GraduatedSlider.build/Objects-normal/arm64/GraduatedSlider.SwiftConstValuesFileList (in target 'GraduatedSlider' from project 'GraduatedSlider')
    cd /Users/admin/builder/spi-builder-workspace
    write-file /Users/admin/builder/spi-builder-workspace/.derivedData/Build/Intermediates.noindex/GraduatedSlider.build/Debug-watchos/GraduatedSlider.build/Objects-normal/arm64/GraduatedSlider.SwiftConstValuesFileList
WriteAuxiliaryFile /Users/admin/builder/spi-builder-workspace/.derivedData/Build/Intermediates.noindex/GraduatedSlider.build/Debug-watchos/GraduatedSlider.build/Objects-normal/arm64/GraduatedSlider.LinkFileList (in target 'GraduatedSlider' from project 'GraduatedSlider')
    cd /Users/admin/builder/spi-builder-workspace
    write-file /Users/admin/builder/spi-builder-workspace/.derivedData/Build/Intermediates.noindex/GraduatedSlider.build/Debug-watchos/GraduatedSlider.build/Objects-normal/arm64/GraduatedSlider.LinkFileList
WriteAuxiliaryFile /Users/admin/builder/spi-builder-workspace/.derivedData/Build/Intermediates.noindex/GraduatedSlider.build/Debug-watchos/GraduatedSlider.build/Objects-normal/arm64/GraduatedSlider-OutputFileMap.json (in target 'GraduatedSlider' from project 'GraduatedSlider')
    cd /Users/admin/builder/spi-builder-workspace
    write-file /Users/admin/builder/spi-builder-workspace/.derivedData/Build/Intermediates.noindex/GraduatedSlider.build/Debug-watchos/GraduatedSlider.build/Objects-normal/arm64/GraduatedSlider-OutputFileMap.json
WriteAuxiliaryFile /Users/admin/builder/spi-builder-workspace/.derivedData/Build/Intermediates.noindex/GraduatedSlider.build/Debug-watchos/GraduatedSlider.build/GraduatedSlider.modulemap (in target 'GraduatedSlider' from project 'GraduatedSlider')
    cd /Users/admin/builder/spi-builder-workspace
    write-file /Users/admin/builder/spi-builder-workspace/.derivedData/Build/Intermediates.noindex/GraduatedSlider.build/Debug-watchos/GraduatedSlider.build/GraduatedSlider.modulemap
WriteAuxiliaryFile /Users/admin/builder/spi-builder-workspace/.derivedData/Build/Intermediates.noindex/GraduatedSlider.build/Debug-watchos/GraduatedSlider.build/GraduatedSlider.DependencyStaticMetadataFileList (in target 'GraduatedSlider' from project 'GraduatedSlider')
    cd /Users/admin/builder/spi-builder-workspace
    write-file /Users/admin/builder/spi-builder-workspace/.derivedData/Build/Intermediates.noindex/GraduatedSlider.build/Debug-watchos/GraduatedSlider.build/GraduatedSlider.DependencyStaticMetadataFileList
WriteAuxiliaryFile /Users/admin/builder/spi-builder-workspace/.derivedData/Build/Intermediates.noindex/GraduatedSlider.build/Debug-watchos/GraduatedSlider.build/GraduatedSlider.DependencyMetadataFileList (in target 'GraduatedSlider' from project 'GraduatedSlider')
    cd /Users/admin/builder/spi-builder-workspace
    write-file /Users/admin/builder/spi-builder-workspace/.derivedData/Build/Intermediates.noindex/GraduatedSlider.build/Debug-watchos/GraduatedSlider.build/GraduatedSlider.DependencyMetadataFileList
Copy /Users/admin/builder/spi-builder-workspace/.derivedData/Build/Intermediates.noindex/GeneratedModuleMaps-watchos/GraduatedSlider.modulemap /Users/admin/builder/spi-builder-workspace/.derivedData/Build/Intermediates.noindex/GraduatedSlider.build/Debug-watchos/GraduatedSlider.build/GraduatedSlider.modulemap (in target 'GraduatedSlider' from project 'GraduatedSlider')
    cd /Users/admin/builder/spi-builder-workspace
    builtin-copy -exclude .DS_Store -exclude CVS -exclude .svn -exclude .git -exclude .hg -resolve-src-symlinks /Users/admin/builder/spi-builder-workspace/.derivedData/Build/Intermediates.noindex/GraduatedSlider.build/Debug-watchos/GraduatedSlider.build/GraduatedSlider.modulemap /Users/admin/builder/spi-builder-workspace/.derivedData/Build/Intermediates.noindex/GeneratedModuleMaps-watchos
SwiftDriver GraduatedSlider normal arm64_32 com.apple.xcode.tools.swift.compiler (in target 'GraduatedSlider' from project 'GraduatedSlider')
    cd /Users/admin/builder/spi-builder-workspace/.swiftpm/xcode
    builtin-SwiftDriver -- /Applications/Xcode-16.3.0.app/Contents/Developer/Toolchains/XcodeDefault.xctoolchain/usr/bin/swiftc -module-name GraduatedSlider -Onone -enforce-exclusivity\=checked @/Users/admin/builder/spi-builder-workspace/.derivedData/Build/Intermediates.noindex/GraduatedSlider.build/Debug-watchos/GraduatedSlider.build/Objects-normal/arm64_32/GraduatedSlider.SwiftFileList -DSWIFT_PACKAGE -DDEBUG -stats-output-dir .stats -strict-concurrency\=complete -enable-upcoming-feature StrictConcurrency -enable-upcoming-feature DisableOutwardActorInference -enable-upcoming-feature GlobalActorIsolatedTypesUsability -enable-upcoming-feature InferSendableFromCaptures -plugin-path /Applications/Xcode-16.3.0.app/Contents/Developer/Toolchains/XcodeDefault.xctoolchain/usr/lib/swift/host/plugins/testing -enable-experimental-feature DebugDescriptionMacro -sdk /Applications/Xcode-16.3.0.app/Contents/Developer/Platforms/WatchOS.platform/Developer/SDKs/WatchOS11.4.sdk -target arm64_32-apple-watchos5.0 -g -module-cache-path /Users/admin/builder/spi-builder-workspace/.derivedData/ModuleCache.noindex -Xfrontend -serialize-debugging-options -enable-testing -index-store-path /Users/admin/builder/spi-builder-workspace/.derivedData/Index.noindex/DataStore -swift-version 5 -I /Users/admin/builder/spi-builder-workspace/.derivedData/Build/Products/Debug-watchos -I /Applications/Xcode-16.3.0.app/Contents/Developer/Platforms/WatchOS.platform/Developer/usr/lib -F /Users/admin/builder/spi-builder-workspace/.derivedData/Build/Products/Debug-watchos -F /Applications/Xcode-16.3.0.app/Contents/Developer/Platforms/WatchOS.platform/Developer/Library/Frameworks -F /Applications/Xcode-16.3.0.app/Contents/Developer/Platforms/WatchOS.platform/Developer/SDKs/WatchOS11.4.sdk/Developer/Library/Frameworks -c -j10 -enable-batch-mode -incremental -Xcc -ivfsstatcache -Xcc /Users/admin/builder/spi-builder-workspace/.derivedData/SDKStatCaches.noindex/watchos11.4-22T246-43efb940ff07ba2497b70ec94253f576.sdkstatcache -output-file-map /Users/admin/builder/spi-builder-workspace/.derivedData/Build/Intermediates.noindex/GraduatedSlider.build/Debug-watchos/GraduatedSlider.build/Objects-normal/arm64_32/GraduatedSlider-OutputFileMap.json -use-frontend-parseable-output -save-temps -no-color-diagnostics -serialize-diagnostics -emit-dependencies -emit-module -emit-module-path /Users/admin/builder/spi-builder-workspace/.derivedData/Build/Intermediates.noindex/GraduatedSlider.build/Debug-watchos/GraduatedSlider.build/Objects-normal/arm64_32/GraduatedSlider.swiftmodule -validate-clang-modules-once -clang-build-session-file /Users/admin/builder/spi-builder-workspace/.derivedData/ModuleCache.noindex/Session.modulevalidation -Xcc -I/Users/admin/builder/spi-builder-workspace/.derivedData/Build/Intermediates.noindex/GraduatedSlider.build/Debug-watchos/GraduatedSlider.build/swift-overrides.hmap -emit-const-values -Xfrontend -const-gather-protocols-file -Xfrontend /Users/admin/builder/spi-builder-workspace/.derivedData/Build/Intermediates.noindex/GraduatedSlider.build/Debug-watchos/GraduatedSlider.build/Objects-normal/arm64_32/GraduatedSlider_const_extract_protocols.json -Xcc -I/Users/admin/builder/spi-builder-workspace/.derivedData/Build/Products/Debug-watchos/include -Xcc -I/Users/admin/builder/spi-builder-workspace/.derivedData/Build/Intermediates.noindex/GraduatedSlider.build/Debug-watchos/GraduatedSlider.build/DerivedSources-normal/arm64_32 -Xcc -I/Users/admin/builder/spi-builder-workspace/.derivedData/Build/Intermediates.noindex/GraduatedSlider.build/Debug-watchos/GraduatedSlider.build/DerivedSources/arm64_32 -Xcc -I/Users/admin/builder/spi-builder-workspace/.derivedData/Build/Intermediates.noindex/GraduatedSlider.build/Debug-watchos/GraduatedSlider.build/DerivedSources -Xcc -DSWIFT_PACKAGE -Xcc -DDEBUG\=1 -emit-objc-header -emit-objc-header-path /Users/admin/builder/spi-builder-workspace/.derivedData/Build/Intermediates.noindex/GraduatedSlider.build/Debug-watchos/GraduatedSlider.build/Objects-normal/arm64_32/GraduatedSlider-Swift.h -working-directory /Users/admin/builder/spi-builder-workspace/.swiftpm/xcode -experimental-emit-module-separately -disable-cmo
SwiftDriver GraduatedSlider normal arm64 com.apple.xcode.tools.swift.compiler (in target 'GraduatedSlider' from project 'GraduatedSlider')
    cd /Users/admin/builder/spi-builder-workspace/.swiftpm/xcode
    builtin-SwiftDriver -- /Applications/Xcode-16.3.0.app/Contents/Developer/Toolchains/XcodeDefault.xctoolchain/usr/bin/swiftc -module-name GraduatedSlider -Onone -enforce-exclusivity\=checked @/Users/admin/builder/spi-builder-workspace/.derivedData/Build/Intermediates.noindex/GraduatedSlider.build/Debug-watchos/GraduatedSlider.build/Objects-normal/arm64/GraduatedSlider.SwiftFileList -DSWIFT_PACKAGE -DDEBUG -stats-output-dir .stats -strict-concurrency\=complete -enable-upcoming-feature StrictConcurrency -enable-upcoming-feature DisableOutwardActorInference -enable-upcoming-feature GlobalActorIsolatedTypesUsability -enable-upcoming-feature InferSendableFromCaptures -plugin-path /Applications/Xcode-16.3.0.app/Contents/Developer/Toolchains/XcodeDefault.xctoolchain/usr/lib/swift/host/plugins/testing -enable-experimental-feature DebugDescriptionMacro -sdk /Applications/Xcode-16.3.0.app/Contents/Developer/Platforms/WatchOS.platform/Developer/SDKs/WatchOS11.4.sdk -target arm64-apple-watchos5.0 -g -module-cache-path /Users/admin/builder/spi-builder-workspace/.derivedData/ModuleCache.noindex -Xfrontend -serialize-debugging-options -enable-testing -index-store-path /Users/admin/builder/spi-builder-workspace/.derivedData/Index.noindex/DataStore -swift-version 5 -I /Users/admin/builder/spi-builder-workspace/.derivedData/Build/Products/Debug-watchos -I /Applications/Xcode-16.3.0.app/Contents/Developer/Platforms/WatchOS.platform/Developer/usr/lib -F /Users/admin/builder/spi-builder-workspace/.derivedData/Build/Products/Debug-watchos -F /Applications/Xcode-16.3.0.app/Contents/Developer/Platforms/WatchOS.platform/Developer/Library/Frameworks -F /Applications/Xcode-16.3.0.app/Contents/Developer/Platforms/WatchOS.platform/Developer/SDKs/WatchOS11.4.sdk/Developer/Library/Frameworks -c -j10 -enable-batch-mode -incremental -Xcc -ivfsstatcache -Xcc /Users/admin/builder/spi-builder-workspace/.derivedData/SDKStatCaches.noindex/watchos11.4-22T246-43efb940ff07ba2497b70ec94253f576.sdkstatcache -output-file-map /Users/admin/builder/spi-builder-workspace/.derivedData/Build/Intermediates.noindex/GraduatedSlider.build/Debug-watchos/GraduatedSlider.build/Objects-normal/arm64/GraduatedSlider-OutputFileMap.json -use-frontend-parseable-output -save-temps -no-color-diagnostics -serialize-diagnostics -emit-dependencies -emit-module -emit-module-path /Users/admin/builder/spi-builder-workspace/.derivedData/Build/Intermediates.noindex/GraduatedSlider.build/Debug-watchos/GraduatedSlider.build/Objects-normal/arm64/GraduatedSlider.swiftmodule -validate-clang-modules-once -clang-build-session-file /Users/admin/builder/spi-builder-workspace/.derivedData/ModuleCache.noindex/Session.modulevalidation -Xcc -I/Users/admin/builder/spi-builder-workspace/.derivedData/Build/Intermediates.noindex/GraduatedSlider.build/Debug-watchos/GraduatedSlider.build/swift-overrides.hmap -emit-const-values -Xfrontend -const-gather-protocols-file -Xfrontend /Users/admin/builder/spi-builder-workspace/.derivedData/Build/Intermediates.noindex/GraduatedSlider.build/Debug-watchos/GraduatedSlider.build/Objects-normal/arm64/GraduatedSlider_const_extract_protocols.json -Xcc -I/Users/admin/builder/spi-builder-workspace/.derivedData/Build/Products/Debug-watchos/include -Xcc -I/Users/admin/builder/spi-builder-workspace/.derivedData/Build/Intermediates.noindex/GraduatedSlider.build/Debug-watchos/GraduatedSlider.build/DerivedSources-normal/arm64 -Xcc -I/Users/admin/builder/spi-builder-workspace/.derivedData/Build/Intermediates.noindex/GraduatedSlider.build/Debug-watchos/GraduatedSlider.build/DerivedSources/arm64 -Xcc -I/Users/admin/builder/spi-builder-workspace/.derivedData/Build/Intermediates.noindex/GraduatedSlider.build/Debug-watchos/GraduatedSlider.build/DerivedSources -Xcc -DSWIFT_PACKAGE -Xcc -DDEBUG\=1 -emit-objc-header -emit-objc-header-path /Users/admin/builder/spi-builder-workspace/.derivedData/Build/Intermediates.noindex/GraduatedSlider.build/Debug-watchos/GraduatedSlider.build/Objects-normal/arm64/GraduatedSlider-Swift.h -working-directory /Users/admin/builder/spi-builder-workspace/.swiftpm/xcode -experimental-emit-module-separately -disable-cmo
SwiftDriver GraduatedSlider normal armv7k com.apple.xcode.tools.swift.compiler (in target 'GraduatedSlider' from project 'GraduatedSlider')
    cd /Users/admin/builder/spi-builder-workspace/.swiftpm/xcode
    builtin-SwiftDriver -- /Applications/Xcode-16.3.0.app/Contents/Developer/Toolchains/XcodeDefault.xctoolchain/usr/bin/swiftc -module-name GraduatedSlider -Onone -enforce-exclusivity\=checked @/Users/admin/builder/spi-builder-workspace/.derivedData/Build/Intermediates.noindex/GraduatedSlider.build/Debug-watchos/GraduatedSlider.build/Objects-normal/armv7k/GraduatedSlider.SwiftFileList -DSWIFT_PACKAGE -DDEBUG -stats-output-dir .stats -strict-concurrency\=complete -enable-upcoming-feature StrictConcurrency -enable-upcoming-feature DisableOutwardActorInference -enable-upcoming-feature GlobalActorIsolatedTypesUsability -enable-upcoming-feature InferSendableFromCaptures -plugin-path /Applications/Xcode-16.3.0.app/Contents/Developer/Toolchains/XcodeDefault.xctoolchain/usr/lib/swift/host/plugins/testing -enable-experimental-feature DebugDescriptionMacro -sdk /Applications/Xcode-16.3.0.app/Contents/Developer/Platforms/WatchOS.platform/Developer/SDKs/WatchOS11.4.sdk -target armv7k-apple-watchos5.0 -g -module-cache-path /Users/admin/builder/spi-builder-workspace/.derivedData/ModuleCache.noindex -Xfrontend -serialize-debugging-options -enable-testing -index-store-path /Users/admin/builder/spi-builder-workspace/.derivedData/Index.noindex/DataStore -swift-version 5 -I /Users/admin/builder/spi-builder-workspace/.derivedData/Build/Products/Debug-watchos -I /Applications/Xcode-16.3.0.app/Contents/Developer/Platforms/WatchOS.platform/Developer/usr/lib -F /Users/admin/builder/spi-builder-workspace/.derivedData/Build/Products/Debug-watchos -F /Applications/Xcode-16.3.0.app/Contents/Developer/Platforms/WatchOS.platform/Developer/Library/Frameworks -F /Applications/Xcode-16.3.0.app/Contents/Developer/Platforms/WatchOS.platform/Developer/SDKs/WatchOS11.4.sdk/Developer/Library/Frameworks -c -j10 -enable-batch-mode -incremental -Xcc -ivfsstatcache -Xcc /Users/admin/builder/spi-builder-workspace/.derivedData/SDKStatCaches.noindex/watchos11.4-22T246-43efb940ff07ba2497b70ec94253f576.sdkstatcache -output-file-map /Users/admin/builder/spi-builder-workspace/.derivedData/Build/Intermediates.noindex/GraduatedSlider.build/Debug-watchos/GraduatedSlider.build/Objects-normal/armv7k/GraduatedSlider-OutputFileMap.json -use-frontend-parseable-output -save-temps -no-color-diagnostics -serialize-diagnostics -emit-dependencies -emit-module -emit-module-path /Users/admin/builder/spi-builder-workspace/.derivedData/Build/Intermediates.noindex/GraduatedSlider.build/Debug-watchos/GraduatedSlider.build/Objects-normal/armv7k/GraduatedSlider.swiftmodule -validate-clang-modules-once -clang-build-session-file /Users/admin/builder/spi-builder-workspace/.derivedData/ModuleCache.noindex/Session.modulevalidation -Xcc -I/Users/admin/builder/spi-builder-workspace/.derivedData/Build/Intermediates.noindex/GraduatedSlider.build/Debug-watchos/GraduatedSlider.build/swift-overrides.hmap -emit-const-values -Xfrontend -const-gather-protocols-file -Xfrontend /Users/admin/builder/spi-builder-workspace/.derivedData/Build/Intermediates.noindex/GraduatedSlider.build/Debug-watchos/GraduatedSlider.build/Objects-normal/armv7k/GraduatedSlider_const_extract_protocols.json -Xcc -I/Users/admin/builder/spi-builder-workspace/.derivedData/Build/Products/Debug-watchos/include -Xcc -I/Users/admin/builder/spi-builder-workspace/.derivedData/Build/Intermediates.noindex/GraduatedSlider.build/Debug-watchos/GraduatedSlider.build/DerivedSources-normal/armv7k -Xcc -I/Users/admin/builder/spi-builder-workspace/.derivedData/Build/Intermediates.noindex/GraduatedSlider.build/Debug-watchos/GraduatedSlider.build/DerivedSources/armv7k -Xcc -I/Users/admin/builder/spi-builder-workspace/.derivedData/Build/Intermediates.noindex/GraduatedSlider.build/Debug-watchos/GraduatedSlider.build/DerivedSources -Xcc -DSWIFT_PACKAGE -Xcc -DDEBUG\=1 -emit-objc-header -emit-objc-header-path /Users/admin/builder/spi-builder-workspace/.derivedData/Build/Intermediates.noindex/GraduatedSlider.build/Debug-watchos/GraduatedSlider.build/Objects-normal/armv7k/GraduatedSlider-Swift.h -working-directory /Users/admin/builder/spi-builder-workspace/.swiftpm/xcode -experimental-emit-module-separately -disable-cmo
SwiftCompile normal arm64 Compiling\ BackgroundLayer.swift /Users/admin/builder/spi-builder-workspace/Sources/GraduatedSlider/BackgroundLayer.swift (in target 'GraduatedSlider' from project 'GraduatedSlider')
SwiftCompile normal arm64 /Users/admin/builder/spi-builder-workspace/Sources/GraduatedSlider/BackgroundLayer.swift (in target 'GraduatedSlider' from project 'GraduatedSlider')
    cd /Users/admin/builder/spi-builder-workspace/.swiftpm/xcode

SwiftEmitModule normal arm64 Emitting\ module\ for\ GraduatedSlider (in target 'GraduatedSlider' from project 'GraduatedSlider')
EmitSwiftModule normal arm64 (in target 'GraduatedSlider' from project 'GraduatedSlider')
    cd /Users/admin/builder/spi-builder-workspace/.swiftpm/xcode

SwiftCompile normal arm64 Compiling\ GraduatedSlider.swift /Users/admin/builder/spi-builder-workspace/Sources/GraduatedSlider/GraduatedSlider.swift (in target 'GraduatedSlider' from project 'GraduatedSlider')
SwiftCompile normal arm64 /Users/admin/builder/spi-builder-workspace/Sources/GraduatedSlider/GraduatedSlider.swift (in target 'GraduatedSlider' from project 'GraduatedSlider')
    cd /Users/admin/builder/spi-builder-workspace/.swiftpm/xcode

SwiftEmitModule normal arm64_32 Emitting\ module\ for\ GraduatedSlider (in target 'GraduatedSlider' from project 'GraduatedSlider')
Failed frontend command:
/Applications/Xcode-16.3.0.app/Contents/Developer/Toolchains/XcodeDefault.xctoolchain/usr/bin/swift-frontend -frontend -emit-module -experimental-skip-non-inlinable-function-bodies-without-types /Users/admin/builder/spi-builder-workspace/Sources/GraduatedSlider/BackgroundLayer.swift /Users/admin/builder/spi-builder-workspace/Sources/GraduatedSlider/CGContext+Utils.swift /Users/admin/builder/spi-builder-workspace/Sources/GraduatedSlider/CursorLayer.swift /Users/admin/builder/spi-builder-workspace/Sources/GraduatedSlider/GraduatedSlider.swift -target arm64_32-apple-watchos5.0 -enable-objc-interop -sdk /Applications/Xcode-16.3.0.app/Contents/Developer/Platforms/WatchOS.platform/Developer/SDKs/WatchOS11.4.sdk -I /Users/admin/builder/spi-builder-workspace/.derivedData/Build/Products/Debug-watchos -I /Applications/Xcode-16.3.0.app/Contents/Developer/Platforms/WatchOS.platform/Developer/usr/lib -F /Users/admin/builder/spi-builder-workspace/.derivedData/Build/Products/Debug-watchos -F /Applications/Xcode-16.3.0.app/Contents/Developer/Platforms/WatchOS.platform/Developer/Library/Frameworks -F /Applications/Xcode-16.3.0.app/Contents/Developer/Platforms/WatchOS.platform/Developer/SDKs/WatchOS11.4.sdk/Developer/Library/Frameworks -no-color-diagnostics -enable-testing -g -debug-info-format\=dwarf -dwarf-version\=4 -module-cache-path /Users/admin/builder/spi-builder-workspace/.derivedData/ModuleCache.noindex -swift-version 5 -enforce-exclusivity\=checked -stats-output-dir /Users/admin/builder/spi-builder-workspace/.swiftpm/xcode/.stats -Onone -D SWIFT_PACKAGE -D DEBUG -serialize-debugging-options -const-gather-protocols-file /Users/admin/builder/spi-builder-workspace/.derivedData/Build/Intermediates.noindex/GraduatedSlider.build/Debug-watchos/GraduatedSlider.build/Objects-normal/arm64_32/GraduatedSlider_const_extract_protocols.json -enable-upcoming-feature StrictConcurrency -enable-upcoming-feature DisableOutwardActorInference -enable-upcoming-feature GlobalActorIsolatedTypesUsability -enable-upcoming-feature InferSendableFromCaptures -enable-experimental-feature DebugDescriptionMacro -strict-concurrency\=complete -empty-abi-descriptor -plugin-path /Applications/Xcode-16.3.0.app/Contents/Developer/Toolchains/XcodeDefault.xctoolchain/usr/lib/swift/host/plugins/testing -validate-clang-modules-once -clang-build-session-file /Users/admin/builder/spi-builder-workspace/.derivedData/ModuleCache.noindex/Session.modulevalidation -Xcc -working-directory -Xcc /Users/admin/builder/spi-builder-workspace/.swiftpm/xcode -resource-dir /Applications/Xcode-16.3.0.app/Contents/Developer/Toolchains/XcodeDefault.xctoolchain/usr/lib/swift -enable-anonymous-context-mangled-names -file-compilation-dir /Users/admin/builder/spi-builder-workspace/.swiftpm/xcode -Xcc -ivfsstatcache -Xcc /Users/admin/builder/spi-builder-workspace/.derivedData/SDKStatCaches.noindex/watchos11.4-22T246-43efb940ff07ba2497b70ec94253f576.sdkstatcache -Xcc -I/Users/admin/builder/spi-builder-workspace/.derivedData/Build/Intermediates.noindex/GraduatedSlider.build/Debug-watchos/GraduatedSlider.build/swift-overrides.hmap -Xcc -I/Users/admin/builder/spi-builder-workspace/.derivedData/Build/Products/Debug-watchos/include -Xcc -I/Users/admin/builder/spi-builder-workspace/.derivedData/Build/Intermediates.noindex/GraduatedSlider.build/Debug-watchos/GraduatedSlider.build/DerivedSources-normal/arm64_32 -Xcc -I/Users/admin/builder/spi-builder-workspace/.derivedData/Build/Intermediates.noindex/GraduatedSlider.build/Debug-watchos/GraduatedSlider.build/DerivedSources/arm64_32 -Xcc -I/Users/admin/builder/spi-builder-workspace/.derivedData/Build/Intermediates.noindex/GraduatedSlider.build/Debug-watchos/GraduatedSlider.build/DerivedSources -Xcc -DSWIFT_PACKAGE -Xcc -DDEBUG\=1 -module-name GraduatedSlider -frontend-parseable-output -disable-clang-spi -target-sdk-version 11.4 -target-sdk-name watchos11.4 -external-plugin-path /Applications/Xcode-16.3.0.app/Contents/Developer/Platforms/WatchOS.platform/Developer/usr/lib/swift/host/plugins\#/Applications/Xcode-16.3.0.app/Contents/Developer/Platforms/WatchOS.platform/Developer/usr/bin/swift-plugin-server -external-plugin-path /Applications/Xcode-16.3.0.app/Contents/Developer/Platforms/WatchOS.platform/Developer/usr/local/lib/swift/host/plugins\#/Applications/Xcode-16.3.0.app/Contents/Developer/Platforms/WatchOS.platform/Developer/usr/bin/swift-plugin-server -in-process-plugin-server-path /Applications/Xcode-16.3.0.app/Contents/Developer/Toolchains/XcodeDefault.xctoolchain/usr/lib/swift/host/libSwiftInProcPluginServer.dylib -plugin-path /Applications/Xcode-16.3.0.app/Contents/Developer/Toolchains/XcodeDefault.xctoolchain/usr/lib/swift/host/plugins -plugin-path /Applications/Xcode-16.3.0.app/Contents/Developer/Toolchains/XcodeDefault.xctoolchain/usr/local/lib/swift/host/plugins -emit-module-doc-path /Users/admin/builder/spi-builder-workspace/.derivedData/Build/Intermediates.noindex/GraduatedSlider.build/Debug-watchos/GraduatedSlider.build/Objects-normal/arm64_32/GraduatedSlider.swiftdoc -emit-module-source-info-path /Users/admin/builder/spi-builder-workspace/.derivedData/Build/Intermediates.noindex/GraduatedSlider.build/Debug-watchos/GraduatedSlider.build/Objects-normal/arm64_32/GraduatedSlider.swiftsourceinfo -emit-objc-header-path /Users/admin/builder/spi-builder-workspace/.derivedData/Build/Intermediates.noindex/GraduatedSlider.build/Debug-watchos/GraduatedSlider.build/Objects-normal/arm64_32/GraduatedSlider-Swift.h -serialize-diagnostics-path /Users/admin/builder/spi-builder-workspace/.derivedData/Build/Intermediates.noindex/GraduatedSlider.build/Debug-watchos/GraduatedSlider.build/Objects-normal/arm64_32/GraduatedSlider-master-emit-module.dia -emit-dependencies-path /Users/admin/builder/spi-builder-workspace/.derivedData/Build/Intermediates.noindex/GraduatedSlider.build/Debug-watchos/GraduatedSlider.build/Objects-normal/arm64_32/GraduatedSlider-master-emit-module.d -o /Users/admin/builder/spi-builder-workspace/.derivedData/Build/Intermediates.noindex/GraduatedSlider.build/Debug-watchos/GraduatedSlider.build/Objects-normal/arm64_32/GraduatedSlider.swiftmodule -emit-abi-descriptor-path /Users/admin/builder/spi-builder-workspace/.derivedData/Build/Intermediates.noindex/GraduatedSlider.build/Debug-watchos/GraduatedSlider.build/Objects-normal/arm64_32/GraduatedSlider.abi.json
EmitSwiftModule normal arm64_32 (in target 'GraduatedSlider' from project 'GraduatedSlider')
    cd /Users/admin/builder/spi-builder-workspace/.swiftpm/xcode

/Users/admin/builder/spi-builder-workspace/Sources/GraduatedSlider/BackgroundLayer.swift:12:24: error: cannot find type 'CALayer' in scope
class BackgroundLayer: CALayer {
                       ^~~~~~~
/Users/admin/builder/spi-builder-workspace/Sources/GraduatedSlider/BackgroundLayer.swift:16:13: error: cannot find 'setNeedsDisplay' in scope
            setNeedsDisplay()
            ^~~~~~~~~~~~~~~
/Users/admin/builder/spi-builder-workspace/Sources/GraduatedSlider/BackgroundLayer.swift:22:13: error: cannot find 'setNeedsDisplay' in scope
            setNeedsDisplay()
            ^~~~~~~~~~~~~~~
/Users/admin/builder/spi-builder-workspace/Sources/GraduatedSlider/BackgroundLayer.swift:39:19: error: method does not override any method from its superclass
    override func draw(in ctx: CGContext) {
    ~~~~~~~~      ^
/Users/admin/builder/spi-builder-workspace/Sources/GraduatedSlider/CursorLayer.swift:13:20: error: 'CALayer' is unavailable in watchOS
class CursorLayer: CALayer {
                   ^~~~~~~
/Applications/Xcode-16.3.0.app/Contents/Developer/Platforms/WatchOS.platform/Developer/SDKs/WatchOS11.4.sdk/System/Library/Frameworks/QuartzCore.framework/Headers/CALayer.h:86:12: note: 'CALayer' has been explicitly marked unavailable here
@interface CALayer : NSObject <NSSecureCoding, CAMediaTiming>
           ^
/Users/admin/builder/spi-builder-workspace/Sources/GraduatedSlider/GraduatedSlider.swift:76:23: error: property does not override any property from its superclass
    open override var frame: CGRect {
         ~~~~~~~~     ^
/Users/admin/builder/spi-builder-workspace/Sources/GraduatedSlider/GraduatedSlider.swift:82:23: error: property does not override any property from its superclass
    open override var bounds: CGRect {
         ~~~~~~~~     ^
/Users/admin/builder/spi-builder-workspace/Sources/GraduatedSlider/GraduatedSlider.swift:91:36: error: cannot find type 'UISelectionFeedbackGenerator' in scope
    private var feedbackGenerator: UISelectionFeedbackGenerator?
                                   ^~~~~~~~~~~~~~~~~~~~~~~~~~~~
/Users/admin/builder/spi-builder-workspace/Sources/GraduatedSlider/GraduatedSlider.swift:99:14: error: initializer does not override a designated initializer from its superclass
    override init(frame: CGRect) {
    ~~~~~~~~ ^
/Users/admin/builder/spi-builder-workspace/Sources/GraduatedSlider/GraduatedSlider.swift:163:47: error: cannot find type 'UITouch' in scope
    open override func beginTracking(_ touch: UITouch, with event: UIEvent?) -> Bool {
                                              ^~~~~~~
/Users/admin/builder/spi-builder-workspace/Sources/GraduatedSlider/GraduatedSlider.swift:163:68: error: cannot find type 'UIEvent' in scope
    open override func beginTracking(_ touch: UITouch, with event: UIEvent?) -> Bool {
                                                                   ^~~~~~~
/Users/admin/builder/spi-builder-workspace/Sources/GraduatedSlider/GraduatedSlider.swift:180:50: error: cannot find type 'UITouch' in scope
    open override func continueTracking(_ touch: UITouch, with event: UIEvent?) -> Bool {
                                                 ^~~~~~~
/Users/admin/builder/spi-builder-workspace/Sources/GraduatedSlider/GraduatedSlider.swift:180:71: error: cannot find type 'UIEvent' in scope
    open override func continueTracking(_ touch: UITouch, with event: UIEvent?) -> Bool {
                                                                      ^~~~~~~
/Users/admin/builder/spi-builder-workspace/Sources/GraduatedSlider/GraduatedSlider.swift:210:45: error: cannot find type 'UITouch' in scope
    open override func endTracking(_ touch: UITouch?, with event: UIEvent?) {
                                            ^~~~~~~
/Users/admin/builder/spi-builder-workspace/Sources/GraduatedSlider/GraduatedSlider.swift:210:67: error: cannot find type 'UIEvent' in scope
    open override func endTracking(_ touch: UITouch?, with event: UIEvent?) {
                                                                  ^~~~~~~
/Users/admin/builder/spi-builder-workspace/Sources/GraduatedSlider/GraduatedSlider.swift:214:51: error: cannot find type 'UIEvent' in scope
    open override func cancelTracking(with event: UIEvent?) {
                                                  ^~~~~~~
/Users/admin/builder/spi-builder-workspace/Sources/GraduatedSlider/GraduatedSlider.swift:13:29: error: cannot find type 'UIControl' in scope
open class GraduatedSlider: UIControl {
                            ^~~~~~~~~
SwiftEmitModule normal armv7k Emitting\ module\ for\ GraduatedSlider (in target 'GraduatedSlider' from project 'GraduatedSlider')
Failed frontend command:
/Applications/Xcode-16.3.0.app/Contents/Developer/Toolchains/XcodeDefault.xctoolchain/usr/bin/swift-frontend -frontend -emit-module -experimental-skip-non-inlinable-function-bodies-without-types /Users/admin/builder/spi-builder-workspace/Sources/GraduatedSlider/BackgroundLayer.swift /Users/admin/builder/spi-builder-workspace/Sources/GraduatedSlider/CGContext+Utils.swift /Users/admin/builder/spi-builder-workspace/Sources/GraduatedSlider/CursorLayer.swift /Users/admin/builder/spi-builder-workspace/Sources/GraduatedSlider/GraduatedSlider.swift -target armv7k-apple-watchos5.0 -enable-objc-interop -sdk /Applications/Xcode-16.3.0.app/Contents/Developer/Platforms/WatchOS.platform/Developer/SDKs/WatchOS11.4.sdk -I /Users/admin/builder/spi-builder-workspace/.derivedData/Build/Products/Debug-watchos -I /Applications/Xcode-16.3.0.app/Contents/Developer/Platforms/WatchOS.platform/Developer/usr/lib -F /Users/admin/builder/spi-builder-workspace/.derivedData/Build/Products/Debug-watchos -F /Applications/Xcode-16.3.0.app/Contents/Developer/Platforms/WatchOS.platform/Developer/Library/Frameworks -F /Applications/Xcode-16.3.0.app/Contents/Developer/Platforms/WatchOS.platform/Developer/SDKs/WatchOS11.4.sdk/Developer/Library/Frameworks -no-color-diagnostics -enable-testing -g -debug-info-format\=dwarf -dwarf-version\=4 -module-cache-path /Users/admin/builder/spi-builder-workspace/.derivedData/ModuleCache.noindex -swift-version 5 -enforce-exclusivity\=checked -stats-output-dir /Users/admin/builder/spi-builder-workspace/.swiftpm/xcode/.stats -Onone -D SWIFT_PACKAGE -D DEBUG -serialize-debugging-options -const-gather-protocols-file /Users/admin/builder/spi-builder-workspace/.derivedData/Build/Intermediates.noindex/GraduatedSlider.build/Debug-watchos/GraduatedSlider.build/Objects-normal/armv7k/GraduatedSlider_const_extract_protocols.json -enable-upcoming-feature StrictConcurrency -enable-upcoming-feature DisableOutwardActorInference -enable-upcoming-feature GlobalActorIsolatedTypesUsability -enable-upcoming-feature InferSendableFromCaptures -enable-experimental-feature DebugDescriptionMacro -strict-concurrency\=complete -empty-abi-descriptor -plugin-path /Applications/Xcode-16.3.0.app/Contents/Developer/Toolchains/XcodeDefault.xctoolchain/usr/lib/swift/host/plugins/testing -validate-clang-modules-once -clang-build-session-file /Users/admin/builder/spi-builder-workspace/.derivedData/ModuleCache.noindex/Session.modulevalidation -Xcc -working-directory -Xcc /Users/admin/builder/spi-builder-workspace/.swiftpm/xcode -resource-dir /Applications/Xcode-16.3.0.app/Contents/Developer/Toolchains/XcodeDefault.xctoolchain/usr/lib/swift -enable-anonymous-context-mangled-names -file-compilation-dir /Users/admin/builder/spi-builder-workspace/.swiftpm/xcode -Xcc -ivfsstatcache -Xcc /Users/admin/builder/spi-builder-workspace/.derivedData/SDKStatCaches.noindex/watchos11.4-22T246-43efb940ff07ba2497b70ec94253f576.sdkstatcache -Xcc -I/Users/admin/builder/spi-builder-workspace/.derivedData/Build/Intermediates.noindex/GraduatedSlider.build/Debug-watchos/GraduatedSlider.build/swift-overrides.hmap -Xcc -I/Users/admin/builder/spi-builder-workspace/.derivedData/Build/Products/Debug-watchos/include -Xcc -I/Users/admin/builder/spi-builder-workspace/.derivedData/Build/Intermediates.noindex/GraduatedSlider.build/Debug-watchos/GraduatedSlider.build/DerivedSources-normal/armv7k -Xcc -I/Users/admin/builder/spi-builder-workspace/.derivedData/Build/Intermediates.noindex/GraduatedSlider.build/Debug-watchos/GraduatedSlider.build/DerivedSources/armv7k -Xcc -I/Users/admin/builder/spi-builder-workspace/.derivedData/Build/Intermediates.noindex/GraduatedSlider.build/Debug-watchos/GraduatedSlider.build/DerivedSources -Xcc -DSWIFT_PACKAGE -Xcc -DDEBUG\=1 -module-name GraduatedSlider -frontend-parseable-output -disable-clang-spi -target-sdk-version 11.4 -target-sdk-name watchos11.4 -external-plugin-path /Applications/Xcode-16.3.0.app/Contents/Developer/Platforms/WatchOS.platform/Developer/usr/lib/swift/host/plugins\#/Applications/Xcode-16.3.0.app/Contents/Developer/Platforms/WatchOS.platform/Developer/usr/bin/swift-plugin-server -external-plugin-path /Applications/Xcode-16.3.0.app/Contents/Developer/Platforms/WatchOS.platform/Developer/usr/local/lib/swift/host/plugins\#/Applications/Xcode-16.3.0.app/Contents/Developer/Platforms/WatchOS.platform/Developer/usr/bin/swift-plugin-server -in-process-plugin-server-path /Applications/Xcode-16.3.0.app/Contents/Developer/Toolchains/XcodeDefault.xctoolchain/usr/lib/swift/host/libSwiftInProcPluginServer.dylib -plugin-path /Applications/Xcode-16.3.0.app/Contents/Developer/Toolchains/XcodeDefault.xctoolchain/usr/lib/swift/host/plugins -plugin-path /Applications/Xcode-16.3.0.app/Contents/Developer/Toolchains/XcodeDefault.xctoolchain/usr/local/lib/swift/host/plugins -emit-module-doc-path /Users/admin/builder/spi-builder-workspace/.derivedData/Build/Intermediates.noindex/GraduatedSlider.build/Debug-watchos/GraduatedSlider.build/Objects-normal/armv7k/GraduatedSlider.swiftdoc -emit-module-source-info-path /Users/admin/builder/spi-builder-workspace/.derivedData/Build/Intermediates.noindex/GraduatedSlider.build/Debug-watchos/GraduatedSlider.build/Objects-normal/armv7k/GraduatedSlider.swiftsourceinfo -emit-objc-header-path /Users/admin/builder/spi-builder-workspace/.derivedData/Build/Intermediates.noindex/GraduatedSlider.build/Debug-watchos/GraduatedSlider.build/Objects-normal/armv7k/GraduatedSlider-Swift.h -serialize-diagnostics-path /Users/admin/builder/spi-builder-workspace/.derivedData/Build/Intermediates.noindex/GraduatedSlider.build/Debug-watchos/GraduatedSlider.build/Objects-normal/armv7k/GraduatedSlider-master-emit-module.dia -emit-dependencies-path /Users/admin/builder/spi-builder-workspace/.derivedData/Build/Intermediates.noindex/GraduatedSlider.build/Debug-watchos/GraduatedSlider.build/Objects-normal/armv7k/GraduatedSlider-master-emit-module.d -o /Users/admin/builder/spi-builder-workspace/.derivedData/Build/Intermediates.noindex/GraduatedSlider.build/Debug-watchos/GraduatedSlider.build/Objects-normal/armv7k/GraduatedSlider.swiftmodule -emit-abi-descriptor-path /Users/admin/builder/spi-builder-workspace/.derivedData/Build/Intermediates.noindex/GraduatedSlider.build/Debug-watchos/GraduatedSlider.build/Objects-normal/armv7k/GraduatedSlider.abi.json
EmitSwiftModule normal armv7k (in target 'GraduatedSlider' from project 'GraduatedSlider')
    cd /Users/admin/builder/spi-builder-workspace/.swiftpm/xcode

/Users/admin/builder/spi-builder-workspace/Sources/GraduatedSlider/BackgroundLayer.swift:12:24: error: cannot find type 'CALayer' in scope
class BackgroundLayer: CALayer {
                       ^~~~~~~
/Users/admin/builder/spi-builder-workspace/Sources/GraduatedSlider/BackgroundLayer.swift:16:13: error: cannot find 'setNeedsDisplay' in scope
            setNeedsDisplay()
            ^~~~~~~~~~~~~~~
/Users/admin/builder/spi-builder-workspace/Sources/GraduatedSlider/BackgroundLayer.swift:22:13: error: cannot find 'setNeedsDisplay' in scope
            setNeedsDisplay()
            ^~~~~~~~~~~~~~~
/Users/admin/builder/spi-builder-workspace/Sources/GraduatedSlider/BackgroundLayer.swift:39:19: error: method does not override any method from its superclass
    override func draw(in ctx: CGContext) {
    ~~~~~~~~      ^
/Users/admin/builder/spi-builder-workspace/Sources/GraduatedSlider/CursorLayer.swift:13:20: error: 'CALayer' is unavailable in watchOS
class CursorLayer: CALayer {
                   ^~~~~~~
/Applications/Xcode-16.3.0.app/Contents/Developer/Platforms/WatchOS.platform/Developer/SDKs/WatchOS11.4.sdk/System/Library/Frameworks/QuartzCore.framework/Headers/CALayer.h:86:12: note: 'CALayer' has been explicitly marked unavailable here
@interface CALayer : NSObject <NSSecureCoding, CAMediaTiming>
           ^
/Users/admin/builder/spi-builder-workspace/Sources/GraduatedSlider/GraduatedSlider.swift:76:23: error: property does not override any property from its superclass
    open override var frame: CGRect {
         ~~~~~~~~     ^
/Users/admin/builder/spi-builder-workspace/Sources/GraduatedSlider/GraduatedSlider.swift:82:23: error: property does not override any property from its superclass
    open override var bounds: CGRect {
         ~~~~~~~~     ^
/Users/admin/builder/spi-builder-workspace/Sources/GraduatedSlider/GraduatedSlider.swift:91:36: error: cannot find type 'UISelectionFeedbackGenerator' in scope
    private var feedbackGenerator: UISelectionFeedbackGenerator?
                                   ^~~~~~~~~~~~~~~~~~~~~~~~~~~~
/Users/admin/builder/spi-builder-workspace/Sources/GraduatedSlider/GraduatedSlider.swift:99:14: error: initializer does not override a designated initializer from its superclass
    override init(frame: CGRect) {
    ~~~~~~~~ ^
/Users/admin/builder/spi-builder-workspace/Sources/GraduatedSlider/GraduatedSlider.swift:163:47: error: cannot find type 'UITouch' in scope
    open override func beginTracking(_ touch: UITouch, with event: UIEvent?) -> Bool {
                                              ^~~~~~~
/Users/admin/builder/spi-builder-workspace/Sources/GraduatedSlider/GraduatedSlider.swift:163:68: error: cannot find type 'UIEvent' in scope
    open override func beginTracking(_ touch: UITouch, with event: UIEvent?) -> Bool {
                                                                   ^~~~~~~
/Users/admin/builder/spi-builder-workspace/Sources/GraduatedSlider/GraduatedSlider.swift:180:50: error: cannot find type 'UITouch' in scope
    open override func continueTracking(_ touch: UITouch, with event: UIEvent?) -> Bool {
                                                 ^~~~~~~
/Users/admin/builder/spi-builder-workspace/Sources/GraduatedSlider/GraduatedSlider.swift:180:71: error: cannot find type 'UIEvent' in scope
    open override func continueTracking(_ touch: UITouch, with event: UIEvent?) -> Bool {
                                                                      ^~~~~~~
/Users/admin/builder/spi-builder-workspace/Sources/GraduatedSlider/GraduatedSlider.swift:210:45: error: cannot find type 'UITouch' in scope
    open override func endTracking(_ touch: UITouch?, with event: UIEvent?) {
                                            ^~~~~~~
/Users/admin/builder/spi-builder-workspace/Sources/GraduatedSlider/GraduatedSlider.swift:210:67: error: cannot find type 'UIEvent' in scope
    open override func endTracking(_ touch: UITouch?, with event: UIEvent?) {
                                                                  ^~~~~~~
/Users/admin/builder/spi-builder-workspace/Sources/GraduatedSlider/GraduatedSlider.swift:214:51: error: cannot find type 'UIEvent' in scope
    open override func cancelTracking(with event: UIEvent?) {
                                                  ^~~~~~~
/Users/admin/builder/spi-builder-workspace/Sources/GraduatedSlider/GraduatedSlider.swift:13:29: error: cannot find type 'UIControl' in scope
open class GraduatedSlider: UIControl {
                            ^~~~~~~~~
SwiftCompile normal armv7k Compiling\ GraduatedSlider.swift /Users/admin/builder/spi-builder-workspace/Sources/GraduatedSlider/GraduatedSlider.swift (in target 'GraduatedSlider' from project 'GraduatedSlider')
SwiftCompile normal armv7k /Users/admin/builder/spi-builder-workspace/Sources/GraduatedSlider/GraduatedSlider.swift (in target 'GraduatedSlider' from project 'GraduatedSlider')
    cd /Users/admin/builder/spi-builder-workspace/.swiftpm/xcode

SwiftCompile normal arm64_32 Compiling\ BackgroundLayer.swift /Users/admin/builder/spi-builder-workspace/Sources/GraduatedSlider/BackgroundLayer.swift (in target 'GraduatedSlider' from project 'GraduatedSlider')
SwiftCompile normal arm64_32 /Users/admin/builder/spi-builder-workspace/Sources/GraduatedSlider/BackgroundLayer.swift (in target 'GraduatedSlider' from project 'GraduatedSlider')
    cd /Users/admin/builder/spi-builder-workspace/.swiftpm/xcode

SwiftCompile normal armv7k Compiling\ BackgroundLayer.swift /Users/admin/builder/spi-builder-workspace/Sources/GraduatedSlider/BackgroundLayer.swift (in target 'GraduatedSlider' from project 'GraduatedSlider')
SwiftCompile normal armv7k /Users/admin/builder/spi-builder-workspace/Sources/GraduatedSlider/BackgroundLayer.swift (in target 'GraduatedSlider' from project 'GraduatedSlider')
    cd /Users/admin/builder/spi-builder-workspace/.swiftpm/xcode

SwiftCompile normal arm64_32 Compiling\ CursorLayer.swift /Users/admin/builder/spi-builder-workspace/Sources/GraduatedSlider/CursorLayer.swift (in target 'GraduatedSlider' from project 'GraduatedSlider')
SwiftCompile normal arm64_32 /Users/admin/builder/spi-builder-workspace/Sources/GraduatedSlider/CursorLayer.swift (in target 'GraduatedSlider' from project 'GraduatedSlider')
    cd /Users/admin/builder/spi-builder-workspace/.swiftpm/xcode

SwiftCompile normal armv7k Compiling\ CursorLayer.swift /Users/admin/builder/spi-builder-workspace/Sources/GraduatedSlider/CursorLayer.swift (in target 'GraduatedSlider' from project 'GraduatedSlider')
SwiftCompile normal armv7k /Users/admin/builder/spi-builder-workspace/Sources/GraduatedSlider/CursorLayer.swift (in target 'GraduatedSlider' from project 'GraduatedSlider')
    cd /Users/admin/builder/spi-builder-workspace/.swiftpm/xcode

SwiftCompile normal arm64_32 Compiling\ CGContext+Utils.swift /Users/admin/builder/spi-builder-workspace/Sources/GraduatedSlider/CGContext+Utils.swift (in target 'GraduatedSlider' from project 'GraduatedSlider')
Command SwiftCompile failed with a nonzero exit code
** BUILD FAILED **
The following build commands failed:
	SwiftEmitModule normal arm64_32 Emitting\ module\ for\ GraduatedSlider (in target 'GraduatedSlider' from project 'GraduatedSlider')
	EmitSwiftModule normal arm64_32 (in target 'GraduatedSlider' from project 'GraduatedSlider')
	SwiftEmitModule normal armv7k Emitting\ module\ for\ GraduatedSlider (in target 'GraduatedSlider' from project 'GraduatedSlider')
	EmitSwiftModule normal armv7k (in target 'GraduatedSlider' from project 'GraduatedSlider')
	SwiftCompile normal arm64_32 Compiling\ CGContext+Utils.swift /Users/admin/builder/spi-builder-workspace/Sources/GraduatedSlider/CGContext+Utils.swift (in target 'GraduatedSlider' from project 'GraduatedSlider')
	Building workspace spi-builder-workspace with scheme GraduatedSlider
(6 failures)
Command line invocation:
    /Applications/Xcode-16.3.0.app/Contents/Developer/usr/bin/xcodebuild -IDEClonedSourcePackagesDirPathOverride=/Users/admin/builder/spi-builder-workspace/.dependencies -resolvePackageDependencies
Resolve Package Graph
Resolved source packages:
  GraduatedSlider: /Users/admin/builder/spi-builder-workspace
resolved source packages: GraduatedSlider
{
  "dependencies" : [
  ],
  "manifest_display_name" : "GraduatedSlider",
  "name" : "GraduatedSlider",
  "path" : "/Users/admin/builder/spi-builder-workspace",
  "platforms" : [
    {
      "name" : "ios",
      "version" : "10.0"
    }
  ],
  "products" : [
    {
      "name" : "GraduatedSlider",
      "targets" : [
        "GraduatedSlider"
      ],
      "type" : {
        "library" : [
          "automatic"
        ]
      }
    }
  ],
  "swift_languages_versions" : [
    "5"
  ],
  "targets" : [
    {
      "c99name" : "GraduatedSlider",
      "module_type" : "SwiftTarget",
      "name" : "GraduatedSlider",
      "path" : "Sources/GraduatedSlider",
      "product_memberships" : [
        "GraduatedSlider"
      ],
      "sources" : [
        "BackgroundLayer.swift",
        "CGContext+Utils.swift",
        "CursorLayer.swift",
        "GraduatedSlider.swift"
      ],
      "type" : "library"
    }
  ],
  "tools_version" : "5.0"
}
{
  "workspace" : {
    "name" : "spi-builder-workspace",
    "schemes" : [
      "GraduatedSlider"
    ]
  }
}
Running build ...
env DEVELOPER_DIR=/Applications/Xcode-16.3.0.app xcrun xcodebuild -IDEClonedSourcePackagesDirPathOverride=$PWD/.dependencies -skipMacroValidation -skipPackagePluginValidation -derivedDataPath $PWD/.derivedData build -scheme GraduatedSlider -destination generic/platform=watchOS
Command line invocation:
    /Applications/Xcode-16.3.0.app/Contents/Developer/usr/bin/xcodebuild -IDEClonedSourcePackagesDirPathOverride=/Users/admin/builder/spi-builder-workspace/.dependencies -skipMacroValidation -skipPackagePluginValidation -derivedDataPath /Users/admin/builder/spi-builder-workspace/.derivedData build -scheme GraduatedSlider -destination generic/platform=watchOS
Resolve Package Graph
Resolved source packages:
  GraduatedSlider: /Users/admin/builder/spi-builder-workspace
ComputePackagePrebuildTargetDependencyGraph
Prepare packages
CreateBuildRequest
SendProjectDescription
CreateBuildOperation
ComputeTargetDependencyGraph
note: Building targets in dependency order
note: Target dependency graph (2 targets)
    Target 'GraduatedSlider' in project 'GraduatedSlider'
        ➜ Explicit dependency on target 'GraduatedSlider' in project 'GraduatedSlider'
    Target 'GraduatedSlider' in project 'GraduatedSlider' (no dependencies)
GatherProvisioningInputs
CreateBuildDescription
ExecuteExternalTool /Applications/Xcode-16.3.0.app/Contents/Developer/Toolchains/XcodeDefault.xctoolchain/usr/bin/clang -v -E -dM -isysroot /Applications/Xcode-16.3.0.app/Contents/Developer/Platforms/WatchOS.platform/Developer/SDKs/WatchOS11.4.sdk -x c -c /dev/null
ExecuteExternalTool /Applications/Xcode-16.3.0.app/Contents/Developer/Toolchains/XcodeDefault.xctoolchain/usr/bin/swiftc --version
ExecuteExternalTool /Applications/Xcode-16.3.0.app/Contents/Developer/Toolchains/XcodeDefault.xctoolchain/usr/bin/ld -version_details
Build description signature: c0b070a69757edaa3592d8964d10c85b
Build description path: /Users/admin/builder/spi-builder-workspace/.derivedData/Build/Intermediates.noindex/XCBuildData/c0b070a69757edaa3592d8964d10c85b.xcbuilddata
ClangStatCache /Applications/Xcode-16.3.0.app/Contents/Developer/Toolchains/XcodeDefault.xctoolchain/usr/bin/clang-stat-cache /Applications/Xcode-16.3.0.app/Contents/Developer/Platforms/WatchOS.platform/Developer/SDKs/WatchOS11.4.sdk /Users/admin/builder/spi-builder-workspace/.derivedData/SDKStatCaches.noindex/watchos11.4-22T246-43efb940ff07ba2497b70ec94253f576.sdkstatcache
    cd /Users/admin/builder/spi-builder-workspace/.swiftpm/xcode
    /Applications/Xcode-16.3.0.app/Contents/Developer/Toolchains/XcodeDefault.xctoolchain/usr/bin/clang-stat-cache /Applications/Xcode-16.3.0.app/Contents/Developer/Platforms/WatchOS.platform/Developer/SDKs/WatchOS11.4.sdk -o /Users/admin/builder/spi-builder-workspace/.derivedData/SDKStatCaches.noindex/watchos11.4-22T246-43efb940ff07ba2497b70ec94253f576.sdkstatcache
SwiftDriver GraduatedSlider normal armv7k com.apple.xcode.tools.swift.compiler (in target 'GraduatedSlider' from project 'GraduatedSlider')
    cd /Users/admin/builder/spi-builder-workspace/.swiftpm/xcode
    builtin-SwiftDriver -- /Applications/Xcode-16.3.0.app/Contents/Developer/Toolchains/XcodeDefault.xctoolchain/usr/bin/swiftc -module-name GraduatedSlider -Onone -enforce-exclusivity\=checked @/Users/admin/builder/spi-builder-workspace/.derivedData/Build/Intermediates.noindex/GraduatedSlider.build/Debug-watchos/GraduatedSlider.build/Objects-normal/armv7k/GraduatedSlider.SwiftFileList -DSWIFT_PACKAGE -DDEBUG -DXcode -plugin-path /Applications/Xcode-16.3.0.app/Contents/Developer/Toolchains/XcodeDefault.xctoolchain/usr/lib/swift/host/plugins/testing -enable-experimental-feature DebugDescriptionMacro -sdk /Applications/Xcode-16.3.0.app/Contents/Developer/Platforms/WatchOS.platform/Developer/SDKs/WatchOS11.4.sdk -target armv7k-apple-watchos5.0 -g -module-cache-path /Users/admin/builder/spi-builder-workspace/.derivedData/ModuleCache.noindex -Xfrontend -serialize-debugging-options -enable-testing -index-store-path /Users/admin/builder/spi-builder-workspace/.derivedData/Index.noindex/DataStore -swift-version 5 -I /Users/admin/builder/spi-builder-workspace/.derivedData/Build/Products/Debug-watchos -I /Applications/Xcode-16.3.0.app/Contents/Developer/Platforms/WatchOS.platform/Developer/usr/lib -F /Users/admin/builder/spi-builder-workspace/.derivedData/Build/Products/Debug-watchos -F /Applications/Xcode-16.3.0.app/Contents/Developer/Platforms/WatchOS.platform/Developer/Library/Frameworks -F /Applications/Xcode-16.3.0.app/Contents/Developer/Platforms/WatchOS.platform/Developer/SDKs/WatchOS11.4.sdk/Developer/Library/Frameworks -c -j10 -enable-batch-mode -incremental -Xcc -ivfsstatcache -Xcc /Users/admin/builder/spi-builder-workspace/.derivedData/SDKStatCaches.noindex/watchos11.4-22T246-43efb940ff07ba2497b70ec94253f576.sdkstatcache -output-file-map /Users/admin/builder/spi-builder-workspace/.derivedData/Build/Intermediates.noindex/GraduatedSlider.build/Debug-watchos/GraduatedSlider.build/Objects-normal/armv7k/GraduatedSlider-OutputFileMap.json -use-frontend-parseable-output -save-temps -no-color-diagnostics -serialize-diagnostics -emit-dependencies -emit-module -emit-module-path /Users/admin/builder/spi-builder-workspace/.derivedData/Build/Intermediates.noindex/GraduatedSlider.build/Debug-watchos/GraduatedSlider.build/Objects-normal/armv7k/GraduatedSlider.swiftmodule -validate-clang-modules-once -clang-build-session-file /Users/admin/builder/spi-builder-workspace/.derivedData/ModuleCache.noindex/Session.modulevalidation -Xcc -I/Users/admin/builder/spi-builder-workspace/.derivedData/Build/Intermediates.noindex/GraduatedSlider.build/Debug-watchos/GraduatedSlider.build/swift-overrides.hmap -emit-const-values -Xfrontend -const-gather-protocols-file -Xfrontend /Users/admin/builder/spi-builder-workspace/.derivedData/Build/Intermediates.noindex/GraduatedSlider.build/Debug-watchos/GraduatedSlider.build/Objects-normal/armv7k/GraduatedSlider_const_extract_protocols.json -Xcc -I/Users/admin/builder/spi-builder-workspace/.derivedData/Build/Products/Debug-watchos/include -Xcc -I/Users/admin/builder/spi-builder-workspace/.derivedData/Build/Intermediates.noindex/GraduatedSlider.build/Debug-watchos/GraduatedSlider.build/DerivedSources-normal/armv7k -Xcc -I/Users/admin/builder/spi-builder-workspace/.derivedData/Build/Intermediates.noindex/GraduatedSlider.build/Debug-watchos/GraduatedSlider.build/DerivedSources/armv7k -Xcc -I/Users/admin/builder/spi-builder-workspace/.derivedData/Build/Intermediates.noindex/GraduatedSlider.build/Debug-watchos/GraduatedSlider.build/DerivedSources -Xcc -DSWIFT_PACKAGE -Xcc -DDEBUG\=1 -emit-objc-header -emit-objc-header-path /Users/admin/builder/spi-builder-workspace/.derivedData/Build/Intermediates.noindex/GraduatedSlider.build/Debug-watchos/GraduatedSlider.build/Objects-normal/armv7k/GraduatedSlider-Swift.h -working-directory /Users/admin/builder/spi-builder-workspace/.swiftpm/xcode -experimental-emit-module-separately -disable-cmo
SwiftDriver GraduatedSlider normal arm64 com.apple.xcode.tools.swift.compiler (in target 'GraduatedSlider' from project 'GraduatedSlider')
    cd /Users/admin/builder/spi-builder-workspace/.swiftpm/xcode
    builtin-SwiftDriver -- /Applications/Xcode-16.3.0.app/Contents/Developer/Toolchains/XcodeDefault.xctoolchain/usr/bin/swiftc -module-name GraduatedSlider -Onone -enforce-exclusivity\=checked @/Users/admin/builder/spi-builder-workspace/.derivedData/Build/Intermediates.noindex/GraduatedSlider.build/Debug-watchos/GraduatedSlider.build/Objects-normal/arm64/GraduatedSlider.SwiftFileList -DSWIFT_PACKAGE -DDEBUG -DXcode -plugin-path /Applications/Xcode-16.3.0.app/Contents/Developer/Toolchains/XcodeDefault.xctoolchain/usr/lib/swift/host/plugins/testing -enable-experimental-feature DebugDescriptionMacro -sdk /Applications/Xcode-16.3.0.app/Contents/Developer/Platforms/WatchOS.platform/Developer/SDKs/WatchOS11.4.sdk -target arm64-apple-watchos5.0 -g -module-cache-path /Users/admin/builder/spi-builder-workspace/.derivedData/ModuleCache.noindex -Xfrontend -serialize-debugging-options -enable-testing -index-store-path /Users/admin/builder/spi-builder-workspace/.derivedData/Index.noindex/DataStore -swift-version 5 -I /Users/admin/builder/spi-builder-workspace/.derivedData/Build/Products/Debug-watchos -I /Applications/Xcode-16.3.0.app/Contents/Developer/Platforms/WatchOS.platform/Developer/usr/lib -F /Users/admin/builder/spi-builder-workspace/.derivedData/Build/Products/Debug-watchos -F /Applications/Xcode-16.3.0.app/Contents/Developer/Platforms/WatchOS.platform/Developer/Library/Frameworks -F /Applications/Xcode-16.3.0.app/Contents/Developer/Platforms/WatchOS.platform/Developer/SDKs/WatchOS11.4.sdk/Developer/Library/Frameworks -c -j10 -enable-batch-mode -incremental -Xcc -ivfsstatcache -Xcc /Users/admin/builder/spi-builder-workspace/.derivedData/SDKStatCaches.noindex/watchos11.4-22T246-43efb940ff07ba2497b70ec94253f576.sdkstatcache -output-file-map /Users/admin/builder/spi-builder-workspace/.derivedData/Build/Intermediates.noindex/GraduatedSlider.build/Debug-watchos/GraduatedSlider.build/Objects-normal/arm64/GraduatedSlider-OutputFileMap.json -use-frontend-parseable-output -save-temps -no-color-diagnostics -serialize-diagnostics -emit-dependencies -emit-module -emit-module-path /Users/admin/builder/spi-builder-workspace/.derivedData/Build/Intermediates.noindex/GraduatedSlider.build/Debug-watchos/GraduatedSlider.build/Objects-normal/arm64/GraduatedSlider.swiftmodule -validate-clang-modules-once -clang-build-session-file /Users/admin/builder/spi-builder-workspace/.derivedData/ModuleCache.noindex/Session.modulevalidation -Xcc -I/Users/admin/builder/spi-builder-workspace/.derivedData/Build/Intermediates.noindex/GraduatedSlider.build/Debug-watchos/GraduatedSlider.build/swift-overrides.hmap -emit-const-values -Xfrontend -const-gather-protocols-file -Xfrontend /Users/admin/builder/spi-builder-workspace/.derivedData/Build/Intermediates.noindex/GraduatedSlider.build/Debug-watchos/GraduatedSlider.build/Objects-normal/arm64/GraduatedSlider_const_extract_protocols.json -Xcc -I/Users/admin/builder/spi-builder-workspace/.derivedData/Build/Products/Debug-watchos/include -Xcc -I/Users/admin/builder/spi-builder-workspace/.derivedData/Build/Intermediates.noindex/GraduatedSlider.build/Debug-watchos/GraduatedSlider.build/DerivedSources-normal/arm64 -Xcc -I/Users/admin/builder/spi-builder-workspace/.derivedData/Build/Intermediates.noindex/GraduatedSlider.build/Debug-watchos/GraduatedSlider.build/DerivedSources/arm64 -Xcc -I/Users/admin/builder/spi-builder-workspace/.derivedData/Build/Intermediates.noindex/GraduatedSlider.build/Debug-watchos/GraduatedSlider.build/DerivedSources -Xcc -DSWIFT_PACKAGE -Xcc -DDEBUG\=1 -emit-objc-header -emit-objc-header-path /Users/admin/builder/spi-builder-workspace/.derivedData/Build/Intermediates.noindex/GraduatedSlider.build/Debug-watchos/GraduatedSlider.build/Objects-normal/arm64/GraduatedSlider-Swift.h -working-directory /Users/admin/builder/spi-builder-workspace/.swiftpm/xcode -experimental-emit-module-separately -disable-cmo
SwiftDriver GraduatedSlider normal arm64_32 com.apple.xcode.tools.swift.compiler (in target 'GraduatedSlider' from project 'GraduatedSlider')
    cd /Users/admin/builder/spi-builder-workspace/.swiftpm/xcode
    builtin-SwiftDriver -- /Applications/Xcode-16.3.0.app/Contents/Developer/Toolchains/XcodeDefault.xctoolchain/usr/bin/swiftc -module-name GraduatedSlider -Onone -enforce-exclusivity\=checked @/Users/admin/builder/spi-builder-workspace/.derivedData/Build/Intermediates.noindex/GraduatedSlider.build/Debug-watchos/GraduatedSlider.build/Objects-normal/arm64_32/GraduatedSlider.SwiftFileList -DSWIFT_PACKAGE -DDEBUG -DXcode -plugin-path /Applications/Xcode-16.3.0.app/Contents/Developer/Toolchains/XcodeDefault.xctoolchain/usr/lib/swift/host/plugins/testing -enable-experimental-feature DebugDescriptionMacro -sdk /Applications/Xcode-16.3.0.app/Contents/Developer/Platforms/WatchOS.platform/Developer/SDKs/WatchOS11.4.sdk -target arm64_32-apple-watchos5.0 -g -module-cache-path /Users/admin/builder/spi-builder-workspace/.derivedData/ModuleCache.noindex -Xfrontend -serialize-debugging-options -enable-testing -index-store-path /Users/admin/builder/spi-builder-workspace/.derivedData/Index.noindex/DataStore -swift-version 5 -I /Users/admin/builder/spi-builder-workspace/.derivedData/Build/Products/Debug-watchos -I /Applications/Xcode-16.3.0.app/Contents/Developer/Platforms/WatchOS.platform/Developer/usr/lib -F /Users/admin/builder/spi-builder-workspace/.derivedData/Build/Products/Debug-watchos -F /Applications/Xcode-16.3.0.app/Contents/Developer/Platforms/WatchOS.platform/Developer/Library/Frameworks -F /Applications/Xcode-16.3.0.app/Contents/Developer/Platforms/WatchOS.platform/Developer/SDKs/WatchOS11.4.sdk/Developer/Library/Frameworks -c -j10 -enable-batch-mode -incremental -Xcc -ivfsstatcache -Xcc /Users/admin/builder/spi-builder-workspace/.derivedData/SDKStatCaches.noindex/watchos11.4-22T246-43efb940ff07ba2497b70ec94253f576.sdkstatcache -output-file-map /Users/admin/builder/spi-builder-workspace/.derivedData/Build/Intermediates.noindex/GraduatedSlider.build/Debug-watchos/GraduatedSlider.build/Objects-normal/arm64_32/GraduatedSlider-OutputFileMap.json -use-frontend-parseable-output -save-temps -no-color-diagnostics -serialize-diagnostics -emit-dependencies -emit-module -emit-module-path /Users/admin/builder/spi-builder-workspace/.derivedData/Build/Intermediates.noindex/GraduatedSlider.build/Debug-watchos/GraduatedSlider.build/Objects-normal/arm64_32/GraduatedSlider.swiftmodule -validate-clang-modules-once -clang-build-session-file /Users/admin/builder/spi-builder-workspace/.derivedData/ModuleCache.noindex/Session.modulevalidation -Xcc -I/Users/admin/builder/spi-builder-workspace/.derivedData/Build/Intermediates.noindex/GraduatedSlider.build/Debug-watchos/GraduatedSlider.build/swift-overrides.hmap -emit-const-values -Xfrontend -const-gather-protocols-file -Xfrontend /Users/admin/builder/spi-builder-workspace/.derivedData/Build/Intermediates.noindex/GraduatedSlider.build/Debug-watchos/GraduatedSlider.build/Objects-normal/arm64_32/GraduatedSlider_const_extract_protocols.json -Xcc -I/Users/admin/builder/spi-builder-workspace/.derivedData/Build/Products/Debug-watchos/include -Xcc -I/Users/admin/builder/spi-builder-workspace/.derivedData/Build/Intermediates.noindex/GraduatedSlider.build/Debug-watchos/GraduatedSlider.build/DerivedSources-normal/arm64_32 -Xcc -I/Users/admin/builder/spi-builder-workspace/.derivedData/Build/Intermediates.noindex/GraduatedSlider.build/Debug-watchos/GraduatedSlider.build/DerivedSources/arm64_32 -Xcc -I/Users/admin/builder/spi-builder-workspace/.derivedData/Build/Intermediates.noindex/GraduatedSlider.build/Debug-watchos/GraduatedSlider.build/DerivedSources -Xcc -DSWIFT_PACKAGE -Xcc -DDEBUG\=1 -emit-objc-header -emit-objc-header-path /Users/admin/builder/spi-builder-workspace/.derivedData/Build/Intermediates.noindex/GraduatedSlider.build/Debug-watchos/GraduatedSlider.build/Objects-normal/arm64_32/GraduatedSlider-Swift.h -working-directory /Users/admin/builder/spi-builder-workspace/.swiftpm/xcode -experimental-emit-module-separately -disable-cmo
SwiftCompile normal arm64 Compiling\ BackgroundLayer.swift /Users/admin/builder/spi-builder-workspace/Sources/GraduatedSlider/BackgroundLayer.swift (in target 'GraduatedSlider' from project 'GraduatedSlider')
SwiftCompile normal arm64 /Users/admin/builder/spi-builder-workspace/Sources/GraduatedSlider/BackgroundLayer.swift (in target 'GraduatedSlider' from project 'GraduatedSlider')
    cd /Users/admin/builder/spi-builder-workspace/.swiftpm/xcode

SwiftCompile normal arm64 Compiling\ CursorLayer.swift /Users/admin/builder/spi-builder-workspace/Sources/GraduatedSlider/CursorLayer.swift (in target 'GraduatedSlider' from project 'GraduatedSlider')
SwiftCompile normal arm64 /Users/admin/builder/spi-builder-workspace/Sources/GraduatedSlider/CursorLayer.swift (in target 'GraduatedSlider' from project 'GraduatedSlider')
    cd /Users/admin/builder/spi-builder-workspace/.swiftpm/xcode

SwiftCompile normal arm64 Compiling\ GraduatedSlider.swift /Users/admin/builder/spi-builder-workspace/Sources/GraduatedSlider/GraduatedSlider.swift (in target 'GraduatedSlider' from project 'GraduatedSlider')
SwiftCompile normal arm64 /Users/admin/builder/spi-builder-workspace/Sources/GraduatedSlider/GraduatedSlider.swift (in target 'GraduatedSlider' from project 'GraduatedSlider')
    cd /Users/admin/builder/spi-builder-workspace/.swiftpm/xcode

SwiftEmitModule normal arm64 Emitting\ module\ for\ GraduatedSlider (in target 'GraduatedSlider' from project 'GraduatedSlider')
Failed frontend command:
/Applications/Xcode-16.3.0.app/Contents/Developer/Toolchains/XcodeDefault.xctoolchain/usr/bin/swift-frontend -frontend -emit-module -experimental-skip-non-inlinable-function-bodies-without-types /Users/admin/builder/spi-builder-workspace/Sources/GraduatedSlider/BackgroundLayer.swift /Users/admin/builder/spi-builder-workspace/Sources/GraduatedSlider/CGContext+Utils.swift /Users/admin/builder/spi-builder-workspace/Sources/GraduatedSlider/CursorLayer.swift /Users/admin/builder/spi-builder-workspace/Sources/GraduatedSlider/GraduatedSlider.swift -target arm64-apple-watchos5.0 -Xllvm -aarch64-use-tbi -enable-objc-interop -sdk /Applications/Xcode-16.3.0.app/Contents/Developer/Platforms/WatchOS.platform/Developer/SDKs/WatchOS11.4.sdk -I /Users/admin/builder/spi-builder-workspace/.derivedData/Build/Products/Debug-watchos -I /Applications/Xcode-16.3.0.app/Contents/Developer/Platforms/WatchOS.platform/Developer/usr/lib -F /Users/admin/builder/spi-builder-workspace/.derivedData/Build/Products/Debug-watchos -F /Applications/Xcode-16.3.0.app/Contents/Developer/Platforms/WatchOS.platform/Developer/Library/Frameworks -F /Applications/Xcode-16.3.0.app/Contents/Developer/Platforms/WatchOS.platform/Developer/SDKs/WatchOS11.4.sdk/Developer/Library/Frameworks -no-color-diagnostics -enable-testing -g -debug-info-format\=dwarf -dwarf-version\=4 -module-cache-path /Users/admin/builder/spi-builder-workspace/.derivedData/ModuleCache.noindex -swift-version 5 -enforce-exclusivity\=checked -Onone -D SWIFT_PACKAGE -D DEBUG -D Xcode -serialize-debugging-options -const-gather-protocols-file /Users/admin/builder/spi-builder-workspace/.derivedData/Build/Intermediates.noindex/GraduatedSlider.build/Debug-watchos/GraduatedSlider.build/Objects-normal/arm64/GraduatedSlider_const_extract_protocols.json -enable-experimental-feature DebugDescriptionMacro -empty-abi-descriptor -plugin-path /Applications/Xcode-16.3.0.app/Contents/Developer/Toolchains/XcodeDefault.xctoolchain/usr/lib/swift/host/plugins/testing -validate-clang-modules-once -clang-build-session-file /Users/admin/builder/spi-builder-workspace/.derivedData/ModuleCache.noindex/Session.modulevalidation -Xcc -working-directory -Xcc /Users/admin/builder/spi-builder-workspace/.swiftpm/xcode -resource-dir /Applications/Xcode-16.3.0.app/Contents/Developer/Toolchains/XcodeDefault.xctoolchain/usr/lib/swift -enable-anonymous-context-mangled-names -file-compilation-dir /Users/admin/builder/spi-builder-workspace/.swiftpm/xcode -Xcc -ivfsstatcache -Xcc /Users/admin/builder/spi-builder-workspace/.derivedData/SDKStatCaches.noindex/watchos11.4-22T246-43efb940ff07ba2497b70ec94253f576.sdkstatcache -Xcc -I/Users/admin/builder/spi-builder-workspace/.derivedData/Build/Intermediates.noindex/GraduatedSlider.build/Debug-watchos/GraduatedSlider.build/swift-overrides.hmap -Xcc -I/Users/admin/builder/spi-builder-workspace/.derivedData/Build/Products/Debug-watchos/include -Xcc -I/Users/admin/builder/spi-builder-workspace/.derivedData/Build/Intermediates.noindex/GraduatedSlider.build/Debug-watchos/GraduatedSlider.build/DerivedSources-normal/arm64 -Xcc -I/Users/admin/builder/spi-builder-workspace/.derivedData/Build/Intermediates.noindex/GraduatedSlider.build/Debug-watchos/GraduatedSlider.build/DerivedSources/arm64 -Xcc -I/Users/admin/builder/spi-builder-workspace/.derivedData/Build/Intermediates.noindex/GraduatedSlider.build/Debug-watchos/GraduatedSlider.build/DerivedSources -Xcc -DSWIFT_PACKAGE -Xcc -DDEBUG\=1 -module-name GraduatedSlider -frontend-parseable-output -disable-clang-spi -target-sdk-version 11.4 -target-sdk-name watchos11.4 -external-plugin-path /Applications/Xcode-16.3.0.app/Contents/Developer/Platforms/WatchOS.platform/Developer/usr/lib/swift/host/plugins\#/Applications/Xcode-16.3.0.app/Contents/Developer/Platforms/WatchOS.platform/Developer/usr/bin/swift-plugin-server -external-plugin-path /Applications/Xcode-16.3.0.app/Contents/Developer/Platforms/WatchOS.platform/Developer/usr/local/lib/swift/host/plugins\#/Applications/Xcode-16.3.0.app/Contents/Developer/Platforms/WatchOS.platform/Developer/usr/bin/swift-plugin-server -in-process-plugin-server-path /Applications/Xcode-16.3.0.app/Contents/Developer/Toolchains/XcodeDefault.xctoolchain/usr/lib/swift/host/libSwiftInProcPluginServer.dylib -plugin-path /Applications/Xcode-16.3.0.app/Contents/Developer/Toolchains/XcodeDefault.xctoolchain/usr/lib/swift/host/plugins -plugin-path /Applications/Xcode-16.3.0.app/Contents/Developer/Toolchains/XcodeDefault.xctoolchain/usr/local/lib/swift/host/plugins -emit-module-doc-path /Users/admin/builder/spi-builder-workspace/.derivedData/Build/Intermediates.noindex/GraduatedSlider.build/Debug-watchos/GraduatedSlider.build/Objects-normal/arm64/GraduatedSlider.swiftdoc -emit-module-source-info-path /Users/admin/builder/spi-builder-workspace/.derivedData/Build/Intermediates.noindex/GraduatedSlider.build/Debug-watchos/GraduatedSlider.build/Objects-normal/arm64/GraduatedSlider.swiftsourceinfo -emit-objc-header-path /Users/admin/builder/spi-builder-workspace/.derivedData/Build/Intermediates.noindex/GraduatedSlider.build/Debug-watchos/GraduatedSlider.build/Objects-normal/arm64/GraduatedSlider-Swift.h -serialize-diagnostics-path /Users/admin/builder/spi-builder-workspace/.derivedData/Build/Intermediates.noindex/GraduatedSlider.build/Debug-watchos/GraduatedSlider.build/Objects-normal/arm64/GraduatedSlider-master-emit-module.dia -emit-dependencies-path /Users/admin/builder/spi-builder-workspace/.derivedData/Build/Intermediates.noindex/GraduatedSlider.build/Debug-watchos/GraduatedSlider.build/Objects-normal/arm64/GraduatedSlider-master-emit-module.d -o /Users/admin/builder/spi-builder-workspace/.derivedData/Build/Intermediates.noindex/GraduatedSlider.build/Debug-watchos/GraduatedSlider.build/Objects-normal/arm64/GraduatedSlider.swiftmodule -emit-abi-descriptor-path /Users/admin/builder/spi-builder-workspace/.derivedData/Build/Intermediates.noindex/GraduatedSlider.build/Debug-watchos/GraduatedSlider.build/Objects-normal/arm64/GraduatedSlider.abi.json
EmitSwiftModule normal arm64 (in target 'GraduatedSlider' from project 'GraduatedSlider')
    cd /Users/admin/builder/spi-builder-workspace/.swiftpm/xcode

/Users/admin/builder/spi-builder-workspace/Sources/GraduatedSlider/BackgroundLayer.swift:12:24: error: cannot find type 'CALayer' in scope
class BackgroundLayer: CALayer {
                       ^~~~~~~
/Users/admin/builder/spi-builder-workspace/Sources/GraduatedSlider/BackgroundLayer.swift:16:13: error: cannot find 'setNeedsDisplay' in scope
            setNeedsDisplay()
            ^~~~~~~~~~~~~~~
/Users/admin/builder/spi-builder-workspace/Sources/GraduatedSlider/BackgroundLayer.swift:22:13: error: cannot find 'setNeedsDisplay' in scope
            setNeedsDisplay()
            ^~~~~~~~~~~~~~~
/Users/admin/builder/spi-builder-workspace/Sources/GraduatedSlider/BackgroundLayer.swift:39:19: error: method does not override any method from its superclass
    override func draw(in ctx: CGContext) {
    ~~~~~~~~      ^
/Users/admin/builder/spi-builder-workspace/Sources/GraduatedSlider/CursorLayer.swift:13:20: error: 'CALayer' is unavailable in watchOS
class CursorLayer: CALayer {
                   ^~~~~~~
/Applications/Xcode-16.3.0.app/Contents/Developer/Platforms/WatchOS.platform/Developer/SDKs/WatchOS11.4.sdk/System/Library/Frameworks/QuartzCore.framework/Headers/CALayer.h:86:12: note: 'CALayer' has been explicitly marked unavailable here
@interface CALayer : NSObject <NSSecureCoding, CAMediaTiming>
           ^
/Users/admin/builder/spi-builder-workspace/Sources/GraduatedSlider/GraduatedSlider.swift:76:23: error: property does not override any property from its superclass
    open override var frame: CGRect {
         ~~~~~~~~     ^
/Users/admin/builder/spi-builder-workspace/Sources/GraduatedSlider/GraduatedSlider.swift:82:23: error: property does not override any property from its superclass
    open override var bounds: CGRect {
         ~~~~~~~~     ^
/Users/admin/builder/spi-builder-workspace/Sources/GraduatedSlider/GraduatedSlider.swift:91:36: error: cannot find type 'UISelectionFeedbackGenerator' in scope
    private var feedbackGenerator: UISelectionFeedbackGenerator?
                                   ^~~~~~~~~~~~~~~~~~~~~~~~~~~~
/Users/admin/builder/spi-builder-workspace/Sources/GraduatedSlider/GraduatedSlider.swift:99:14: error: initializer does not override a designated initializer from its superclass
    override init(frame: CGRect) {
    ~~~~~~~~ ^
/Users/admin/builder/spi-builder-workspace/Sources/GraduatedSlider/GraduatedSlider.swift:163:47: error: cannot find type 'UITouch' in scope
    open override func beginTracking(_ touch: UITouch, with event: UIEvent?) -> Bool {
                                              ^~~~~~~
/Users/admin/builder/spi-builder-workspace/Sources/GraduatedSlider/GraduatedSlider.swift:163:68: error: cannot find type 'UIEvent' in scope
    open override func beginTracking(_ touch: UITouch, with event: UIEvent?) -> Bool {
                                                                   ^~~~~~~
/Users/admin/builder/spi-builder-workspace/Sources/GraduatedSlider/GraduatedSlider.swift:180:50: error: cannot find type 'UITouch' in scope
    open override func continueTracking(_ touch: UITouch, with event: UIEvent?) -> Bool {
                                                 ^~~~~~~
/Users/admin/builder/spi-builder-workspace/Sources/GraduatedSlider/GraduatedSlider.swift:180:71: error: cannot find type 'UIEvent' in scope
    open override func continueTracking(_ touch: UITouch, with event: UIEvent?) -> Bool {
                                                                      ^~~~~~~
/Users/admin/builder/spi-builder-workspace/Sources/GraduatedSlider/GraduatedSlider.swift:210:45: error: cannot find type 'UITouch' in scope
    open override func endTracking(_ touch: UITouch?, with event: UIEvent?) {
                                            ^~~~~~~
/Users/admin/builder/spi-builder-workspace/Sources/GraduatedSlider/GraduatedSlider.swift:210:67: error: cannot find type 'UIEvent' in scope
    open override func endTracking(_ touch: UITouch?, with event: UIEvent?) {
                                                                  ^~~~~~~
/Users/admin/builder/spi-builder-workspace/Sources/GraduatedSlider/GraduatedSlider.swift:214:51: error: cannot find type 'UIEvent' in scope
    open override func cancelTracking(with event: UIEvent?) {
                                                  ^~~~~~~
/Users/admin/builder/spi-builder-workspace/Sources/GraduatedSlider/GraduatedSlider.swift:13:29: error: cannot find type 'UIControl' in scope
open class GraduatedSlider: UIControl {
                            ^~~~~~~~~
SwiftEmitModule normal armv7k Emitting\ module\ for\ GraduatedSlider (in target 'GraduatedSlider' from project 'GraduatedSlider')
Failed frontend command:
/Applications/Xcode-16.3.0.app/Contents/Developer/Toolchains/XcodeDefault.xctoolchain/usr/bin/swift-frontend -frontend -emit-module -experimental-skip-non-inlinable-function-bodies-without-types /Users/admin/builder/spi-builder-workspace/Sources/GraduatedSlider/BackgroundLayer.swift /Users/admin/builder/spi-builder-workspace/Sources/GraduatedSlider/CGContext+Utils.swift /Users/admin/builder/spi-builder-workspace/Sources/GraduatedSlider/CursorLayer.swift /Users/admin/builder/spi-builder-workspace/Sources/GraduatedSlider/GraduatedSlider.swift -target armv7k-apple-watchos5.0 -enable-objc-interop -sdk /Applications/Xcode-16.3.0.app/Contents/Developer/Platforms/WatchOS.platform/Developer/SDKs/WatchOS11.4.sdk -I /Users/admin/builder/spi-builder-workspace/.derivedData/Build/Products/Debug-watchos -I /Applications/Xcode-16.3.0.app/Contents/Developer/Platforms/WatchOS.platform/Developer/usr/lib -F /Users/admin/builder/spi-builder-workspace/.derivedData/Build/Products/Debug-watchos -F /Applications/Xcode-16.3.0.app/Contents/Developer/Platforms/WatchOS.platform/Developer/Library/Frameworks -F /Applications/Xcode-16.3.0.app/Contents/Developer/Platforms/WatchOS.platform/Developer/SDKs/WatchOS11.4.sdk/Developer/Library/Frameworks -no-color-diagnostics -enable-testing -g -debug-info-format\=dwarf -dwarf-version\=4 -module-cache-path /Users/admin/builder/spi-builder-workspace/.derivedData/ModuleCache.noindex -swift-version 5 -enforce-exclusivity\=checked -Onone -D SWIFT_PACKAGE -D DEBUG -D Xcode -serialize-debugging-options -const-gather-protocols-file /Users/admin/builder/spi-builder-workspace/.derivedData/Build/Intermediates.noindex/GraduatedSlider.build/Debug-watchos/GraduatedSlider.build/Objects-normal/armv7k/GraduatedSlider_const_extract_protocols.json -enable-experimental-feature DebugDescriptionMacro -empty-abi-descriptor -plugin-path /Applications/Xcode-16.3.0.app/Contents/Developer/Toolchains/XcodeDefault.xctoolchain/usr/lib/swift/host/plugins/testing -validate-clang-modules-once -clang-build-session-file /Users/admin/builder/spi-builder-workspace/.derivedData/ModuleCache.noindex/Session.modulevalidation -Xcc -working-directory -Xcc /Users/admin/builder/spi-builder-workspace/.swiftpm/xcode -resource-dir /Applications/Xcode-16.3.0.app/Contents/Developer/Toolchains/XcodeDefault.xctoolchain/usr/lib/swift -enable-anonymous-context-mangled-names -file-compilation-dir /Users/admin/builder/spi-builder-workspace/.swiftpm/xcode -Xcc -ivfsstatcache -Xcc /Users/admin/builder/spi-builder-workspace/.derivedData/SDKStatCaches.noindex/watchos11.4-22T246-43efb940ff07ba2497b70ec94253f576.sdkstatcache -Xcc -I/Users/admin/builder/spi-builder-workspace/.derivedData/Build/Intermediates.noindex/GraduatedSlider.build/Debug-watchos/GraduatedSlider.build/swift-overrides.hmap -Xcc -I/Users/admin/builder/spi-builder-workspace/.derivedData/Build/Products/Debug-watchos/include -Xcc -I/Users/admin/builder/spi-builder-workspace/.derivedData/Build/Intermediates.noindex/GraduatedSlider.build/Debug-watchos/GraduatedSlider.build/DerivedSources-normal/armv7k -Xcc -I/Users/admin/builder/spi-builder-workspace/.derivedData/Build/Intermediates.noindex/GraduatedSlider.build/Debug-watchos/GraduatedSlider.build/DerivedSources/armv7k -Xcc -I/Users/admin/builder/spi-builder-workspace/.derivedData/Build/Intermediates.noindex/GraduatedSlider.build/Debug-watchos/GraduatedSlider.build/DerivedSources -Xcc -DSWIFT_PACKAGE -Xcc -DDEBUG\=1 -module-name GraduatedSlider -frontend-parseable-output -disable-clang-spi -target-sdk-version 11.4 -target-sdk-name watchos11.4 -external-plugin-path /Applications/Xcode-16.3.0.app/Contents/Developer/Platforms/WatchOS.platform/Developer/usr/lib/swift/host/plugins\#/Applications/Xcode-16.3.0.app/Contents/Developer/Platforms/WatchOS.platform/Developer/usr/bin/swift-plugin-server -external-plugin-path /Applications/Xcode-16.3.0.app/Contents/Developer/Platforms/WatchOS.platform/Developer/usr/local/lib/swift/host/plugins\#/Applications/Xcode-16.3.0.app/Contents/Developer/Platforms/WatchOS.platform/Developer/usr/bin/swift-plugin-server -in-process-plugin-server-path /Applications/Xcode-16.3.0.app/Contents/Developer/Toolchains/XcodeDefault.xctoolchain/usr/lib/swift/host/libSwiftInProcPluginServer.dylib -plugin-path /Applications/Xcode-16.3.0.app/Contents/Developer/Toolchains/XcodeDefault.xctoolchain/usr/lib/swift/host/plugins -plugin-path /Applications/Xcode-16.3.0.app/Contents/Developer/Toolchains/XcodeDefault.xctoolchain/usr/local/lib/swift/host/plugins -emit-module-doc-path /Users/admin/builder/spi-builder-workspace/.derivedData/Build/Intermediates.noindex/GraduatedSlider.build/Debug-watchos/GraduatedSlider.build/Objects-normal/armv7k/GraduatedSlider.swiftdoc -emit-module-source-info-path /Users/admin/builder/spi-builder-workspace/.derivedData/Build/Intermediates.noindex/GraduatedSlider.build/Debug-watchos/GraduatedSlider.build/Objects-normal/armv7k/GraduatedSlider.swiftsourceinfo -emit-objc-header-path /Users/admin/builder/spi-builder-workspace/.derivedData/Build/Intermediates.noindex/GraduatedSlider.build/Debug-watchos/GraduatedSlider.build/Objects-normal/armv7k/GraduatedSlider-Swift.h -serialize-diagnostics-path /Users/admin/builder/spi-builder-workspace/.derivedData/Build/Intermediates.noindex/GraduatedSlider.build/Debug-watchos/GraduatedSlider.build/Objects-normal/armv7k/GraduatedSlider-master-emit-module.dia -emit-dependencies-path /Users/admin/builder/spi-builder-workspace/.derivedData/Build/Intermediates.noindex/GraduatedSlider.build/Debug-watchos/GraduatedSlider.build/Objects-normal/armv7k/GraduatedSlider-master-emit-module.d -o /Users/admin/builder/spi-builder-workspace/.derivedData/Build/Intermediates.noindex/GraduatedSlider.build/Debug-watchos/GraduatedSlider.build/Objects-normal/armv7k/GraduatedSlider.swiftmodule -emit-abi-descriptor-path /Users/admin/builder/spi-builder-workspace/.derivedData/Build/Intermediates.noindex/GraduatedSlider.build/Debug-watchos/GraduatedSlider.build/Objects-normal/armv7k/GraduatedSlider.abi.json
EmitSwiftModule normal armv7k (in target 'GraduatedSlider' from project 'GraduatedSlider')
    cd /Users/admin/builder/spi-builder-workspace/.swiftpm/xcode

/Users/admin/builder/spi-builder-workspace/Sources/GraduatedSlider/BackgroundLayer.swift:12:24: error: cannot find type 'CALayer' in scope
class BackgroundLayer: CALayer {
                       ^~~~~~~
/Users/admin/builder/spi-builder-workspace/Sources/GraduatedSlider/BackgroundLayer.swift:16:13: error: cannot find 'setNeedsDisplay' in scope
            setNeedsDisplay()
            ^~~~~~~~~~~~~~~
/Users/admin/builder/spi-builder-workspace/Sources/GraduatedSlider/BackgroundLayer.swift:22:13: error: cannot find 'setNeedsDisplay' in scope
            setNeedsDisplay()
            ^~~~~~~~~~~~~~~
/Users/admin/builder/spi-builder-workspace/Sources/GraduatedSlider/BackgroundLayer.swift:39:19: error: method does not override any method from its superclass
    override func draw(in ctx: CGContext) {
    ~~~~~~~~      ^
/Users/admin/builder/spi-builder-workspace/Sources/GraduatedSlider/CursorLayer.swift:13:20: error: 'CALayer' is unavailable in watchOS
class CursorLayer: CALayer {
                   ^~~~~~~
/Applications/Xcode-16.3.0.app/Contents/Developer/Platforms/WatchOS.platform/Developer/SDKs/WatchOS11.4.sdk/System/Library/Frameworks/QuartzCore.framework/Headers/CALayer.h:86:12: note: 'CALayer' has been explicitly marked unavailable here
@interface CALayer : NSObject <NSSecureCoding, CAMediaTiming>
           ^
/Users/admin/builder/spi-builder-workspace/Sources/GraduatedSlider/GraduatedSlider.swift:76:23: error: property does not override any property from its superclass
    open override var frame: CGRect {
         ~~~~~~~~     ^
/Users/admin/builder/spi-builder-workspace/Sources/GraduatedSlider/GraduatedSlider.swift:82:23: error: property does not override any property from its superclass
    open override var bounds: CGRect {
         ~~~~~~~~     ^
/Users/admin/builder/spi-builder-workspace/Sources/GraduatedSlider/GraduatedSlider.swift:91:36: error: cannot find type 'UISelectionFeedbackGenerator' in scope
    private var feedbackGenerator: UISelectionFeedbackGenerator?
                                   ^~~~~~~~~~~~~~~~~~~~~~~~~~~~
/Users/admin/builder/spi-builder-workspace/Sources/GraduatedSlider/GraduatedSlider.swift:99:14: error: initializer does not override a designated initializer from its superclass
    override init(frame: CGRect) {
    ~~~~~~~~ ^
/Users/admin/builder/spi-builder-workspace/Sources/GraduatedSlider/GraduatedSlider.swift:163:47: error: cannot find type 'UITouch' in scope
    open override func beginTracking(_ touch: UITouch, with event: UIEvent?) -> Bool {
                                              ^~~~~~~
/Users/admin/builder/spi-builder-workspace/Sources/GraduatedSlider/GraduatedSlider.swift:163:68: error: cannot find type 'UIEvent' in scope
    open override func beginTracking(_ touch: UITouch, with event: UIEvent?) -> Bool {
                                                                   ^~~~~~~
/Users/admin/builder/spi-builder-workspace/Sources/GraduatedSlider/GraduatedSlider.swift:180:50: error: cannot find type 'UITouch' in scope
    open override func continueTracking(_ touch: UITouch, with event: UIEvent?) -> Bool {
                                                 ^~~~~~~
/Users/admin/builder/spi-builder-workspace/Sources/GraduatedSlider/GraduatedSlider.swift:180:71: error: cannot find type 'UIEvent' in scope
    open override func continueTracking(_ touch: UITouch, with event: UIEvent?) -> Bool {
                                                                      ^~~~~~~
/Users/admin/builder/spi-builder-workspace/Sources/GraduatedSlider/GraduatedSlider.swift:210:45: error: cannot find type 'UITouch' in scope
    open override func endTracking(_ touch: UITouch?, with event: UIEvent?) {
                                            ^~~~~~~
/Users/admin/builder/spi-builder-workspace/Sources/GraduatedSlider/GraduatedSlider.swift:210:67: error: cannot find type 'UIEvent' in scope
    open override func endTracking(_ touch: UITouch?, with event: UIEvent?) {
                                                                  ^~~~~~~
/Users/admin/builder/spi-builder-workspace/Sources/GraduatedSlider/GraduatedSlider.swift:214:51: error: cannot find type 'UIEvent' in scope
    open override func cancelTracking(with event: UIEvent?) {
                                                  ^~~~~~~
/Users/admin/builder/spi-builder-workspace/Sources/GraduatedSlider/GraduatedSlider.swift:13:29: error: cannot find type 'UIControl' in scope
open class GraduatedSlider: UIControl {
                            ^~~~~~~~~
SwiftCompile normal armv7k Compiling\ BackgroundLayer.swift /Users/admin/builder/spi-builder-workspace/Sources/GraduatedSlider/BackgroundLayer.swift (in target 'GraduatedSlider' from project 'GraduatedSlider')
SwiftCompile normal armv7k /Users/admin/builder/spi-builder-workspace/Sources/GraduatedSlider/BackgroundLayer.swift (in target 'GraduatedSlider' from project 'GraduatedSlider')
    cd /Users/admin/builder/spi-builder-workspace/.swiftpm/xcode

SwiftCompile normal armv7k Compiling\ GraduatedSlider.swift /Users/admin/builder/spi-builder-workspace/Sources/GraduatedSlider/GraduatedSlider.swift (in target 'GraduatedSlider' from project 'GraduatedSlider')
SwiftCompile normal armv7k /Users/admin/builder/spi-builder-workspace/Sources/GraduatedSlider/GraduatedSlider.swift (in target 'GraduatedSlider' from project 'GraduatedSlider')
    cd /Users/admin/builder/spi-builder-workspace/.swiftpm/xcode

SwiftEmitModule normal arm64_32 Emitting\ module\ for\ GraduatedSlider (in target 'GraduatedSlider' from project 'GraduatedSlider')
EmitSwiftModule normal arm64_32 (in target 'GraduatedSlider' from project 'GraduatedSlider')
    cd /Users/admin/builder/spi-builder-workspace/.swiftpm/xcode

/Users/admin/builder/spi-builder-workspace/Sources/GraduatedSlider/BackgroundLayer.swift:12:24: error: cannot find type 'CALayer' in scope
class BackgroundLayer: CALayer {
                       ^~~~~~~
/Users/admin/builder/spi-builder-workspace/Sources/GraduatedSlider/BackgroundLayer.swift:16:13: error: cannot find 'setNeedsDisplay' in scope
            setNeedsDisplay()
            ^~~~~~~~~~~~~~~
/Users/admin/builder/spi-builder-workspace/Sources/GraduatedSlider/BackgroundLayer.swift:22:13: error: cannot find 'setNeedsDisplay' in scope
            setNeedsDisplay()
            ^~~~~~~~~~~~~~~
/Users/admin/builder/spi-builder-workspace/Sources/GraduatedSlider/BackgroundLayer.swift:39:19: error: method does not override any method from its superclass
    override func draw(in ctx: CGContext) {
    ~~~~~~~~      ^
/Users/admin/builder/spi-builder-workspace/Sources/GraduatedSlider/CursorLayer.swift:13:20: error: 'CALayer' is unavailable in watchOS
class CursorLayer: CALayer {
                   ^~~~~~~
/Applications/Xcode-16.3.0.app/Contents/Developer/Platforms/WatchOS.platform/Developer/SDKs/WatchOS11.4.sdk/System/Library/Frameworks/QuartzCore.framework/Headers/CALayer.h:86:12: note: 'CALayer' has been explicitly marked unavailable here
@interface CALayer : NSObject <NSSecureCoding, CAMediaTiming>
           ^
/Users/admin/builder/spi-builder-workspace/Sources/GraduatedSlider/GraduatedSlider.swift:76:23: error: property does not override any property from its superclass
    open override var frame: CGRect {
         ~~~~~~~~     ^
/Users/admin/builder/spi-builder-workspace/Sources/GraduatedSlider/GraduatedSlider.swift:82:23: error: property does not override any property from its superclass
    open override var bounds: CGRect {
         ~~~~~~~~     ^
/Users/admin/builder/spi-builder-workspace/Sources/GraduatedSlider/GraduatedSlider.swift:91:36: error: cannot find type 'UISelectionFeedbackGenerator' in scope
    private var feedbackGenerator: UISelectionFeedbackGenerator?
                                   ^~~~~~~~~~~~~~~~~~~~~~~~~~~~
/Users/admin/builder/spi-builder-workspace/Sources/GraduatedSlider/GraduatedSlider.swift:99:14: error: initializer does not override a designated initializer from its superclass
    override init(frame: CGRect) {
    ~~~~~~~~ ^
/Users/admin/builder/spi-builder-workspace/Sources/GraduatedSlider/GraduatedSlider.swift:163:47: error: cannot find type 'UITouch' in scope
    open override func beginTracking(_ touch: UITouch, with event: UIEvent?) -> Bool {
                                              ^~~~~~~
/Users/admin/builder/spi-builder-workspace/Sources/GraduatedSlider/GraduatedSlider.swift:163:68: error: cannot find type 'UIEvent' in scope
    open override func beginTracking(_ touch: UITouch, with event: UIEvent?) -> Bool {
                                                                   ^~~~~~~
/Users/admin/builder/spi-builder-workspace/Sources/GraduatedSlider/GraduatedSlider.swift:180:50: error: cannot find type 'UITouch' in scope
    open override func continueTracking(_ touch: UITouch, with event: UIEvent?) -> Bool {
                                                 ^~~~~~~
/Users/admin/builder/spi-builder-workspace/Sources/GraduatedSlider/GraduatedSlider.swift:180:71: error: cannot find type 'UIEvent' in scope
    open override func continueTracking(_ touch: UITouch, with event: UIEvent?) -> Bool {
                                                                      ^~~~~~~
/Users/admin/builder/spi-builder-workspace/Sources/GraduatedSlider/GraduatedSlider.swift:210:45: error: cannot find type 'UITouch' in scope
    open override func endTracking(_ touch: UITouch?, with event: UIEvent?) {
                                            ^~~~~~~
/Users/admin/builder/spi-builder-workspace/Sources/GraduatedSlider/GraduatedSlider.swift:210:67: error: cannot find type 'UIEvent' in scope
    open override func endTracking(_ touch: UITouch?, with event: UIEvent?) {
                                                                  ^~~~~~~
/Users/admin/builder/spi-builder-workspace/Sources/GraduatedSlider/GraduatedSlider.swift:214:51: error: cannot find type 'UIEvent' in scope
    open override func cancelTracking(with event: UIEvent?) {
                                                  ^~~~~~~
/Users/admin/builder/spi-builder-workspace/Sources/GraduatedSlider/GraduatedSlider.swift:13:29: error: cannot find type 'UIControl' in scope
open class GraduatedSlider: UIControl {
                            ^~~~~~~~~
SwiftCompile normal arm64_32 Compiling\ GraduatedSlider.swift /Users/admin/builder/spi-builder-workspace/Sources/GraduatedSlider/GraduatedSlider.swift (in target 'GraduatedSlider' from project 'GraduatedSlider')
SwiftCompile normal arm64_32 /Users/admin/builder/spi-builder-workspace/Sources/GraduatedSlider/GraduatedSlider.swift (in target 'GraduatedSlider' from project 'GraduatedSlider')
    cd /Users/admin/builder/spi-builder-workspace/.swiftpm/xcode

SwiftCompile normal arm64_32 Compiling\ CGContext+Utils.swift /Users/admin/builder/spi-builder-workspace/Sources/GraduatedSlider/CGContext+Utils.swift (in target 'GraduatedSlider' from project 'GraduatedSlider')
SwiftCompile normal arm64_32 /Users/admin/builder/spi-builder-workspace/Sources/GraduatedSlider/CGContext+Utils.swift (in target 'GraduatedSlider' from project 'GraduatedSlider')
    cd /Users/admin/builder/spi-builder-workspace/.swiftpm/xcode

SwiftCompile normal armv7k Compiling\ CGContext+Utils.swift /Users/admin/builder/spi-builder-workspace/Sources/GraduatedSlider/CGContext+Utils.swift (in target 'GraduatedSlider' from project 'GraduatedSlider')
Command SwiftCompile failed with a nonzero exit code
** BUILD FAILED **
The following build commands failed:
	SwiftEmitModule normal arm64 Emitting\ module\ for\ GraduatedSlider (in target 'GraduatedSlider' from project 'GraduatedSlider')
	EmitSwiftModule normal arm64 (in target 'GraduatedSlider' from project 'GraduatedSlider')
	SwiftEmitModule normal armv7k Emitting\ module\ for\ GraduatedSlider (in target 'GraduatedSlider' from project 'GraduatedSlider')
	EmitSwiftModule normal armv7k (in target 'GraduatedSlider' from project 'GraduatedSlider')
	EmitSwiftModule normal arm64_32 (in target 'GraduatedSlider' from project 'GraduatedSlider')
	SwiftCompile normal armv7k Compiling\ CGContext+Utils.swift /Users/admin/builder/spi-builder-workspace/Sources/GraduatedSlider/CGContext+Utils.swift (in target 'GraduatedSlider' from project 'GraduatedSlider')
	Building workspace spi-builder-workspace with scheme GraduatedSlider
(7 failures)
BUILD FAILURE 6.1 watchOS