The Swift Package Index logo.Swift Package Index

Track the adoption of Swift 6 strict concurrency checks for data race safety. How many packages are Ready for Swift 6?

Build Information

Failed to build Helper4Swift, reference master (0b8c30), with Swift 6.1 for macOS (Xcode) using Xcode 16.3 on 25 Apr 2025 20:58:47 UTC.

Build Command

env DEVELOPER_DIR=/Applications/Xcode-16.3.0.app xcrun xcodebuild -IDEClonedSourcePackagesDirPathOverride=$PWD/.dependencies -skipMacroValidation -skipPackagePluginValidation -derivedDataPath $PWD/.derivedData build -scheme Helper4Swift -destination platform=macOS,arch=arm64

Build Log

========================================
RunAll
========================================
Builder version: 4.61.0
Interrupt handler set up.
========================================
Checkout
========================================
Clone URL: https://github.com/cs4alhaider/Helper4Swift.git
Reference: master
Initialized empty Git repository in /Users/admin/builder/spi-builder-workspace/.git/
From https://github.com/cs4alhaider/Helper4Swift
 * branch            master     -> FETCH_HEAD
 * [new branch]      master     -> origin/master
HEAD is now at 0b8c305 Update Binding+Extension.swift
Cloned https://github.com/cs4alhaider/Helper4Swift.git
Revision (git rev-parse @):
0b8c305dddbc7486c5e056416008c1aa18e6cf73
SUCCESS checkout https://github.com/cs4alhaider/Helper4Swift.git at master
========================================
Build
========================================
Selected platform:         macosXcodebuild
Swift version:             6.1
Building package at path:  $PWD
https://github.com/cs4alhaider/Helper4Swift.git
https://github.com/cs4alhaider/Helper4Swift.git
{
  "dependencies" : [
  ],
  "manifest_display_name" : "Helper4Swift",
  "name" : "Helper4Swift",
  "path" : "/Users/admin/builder/spi-builder-workspace",
  "platforms" : [
    {
      "name" : "ios",
      "version" : "13.0"
    },
    {
      "name" : "tvos",
      "version" : "10.0"
    },
    {
      "name" : "watchos",
      "version" : "3.0"
    },
    {
      "name" : "macos",
      "version" : "10.13"
    }
  ],
  "products" : [
    {
      "name" : "Helper4Swift",
      "targets" : [
        "Helper4Swift"
      ],
      "type" : {
        "library" : [
          "automatic"
        ]
      }
    }
  ],
  "targets" : [
    {
      "c99name" : "Helper4SwiftTests",
      "module_type" : "SwiftTarget",
      "name" : "Helper4SwiftTests",
      "path" : "Tests/Helper4SwiftTests",
      "sources" : [
        "Helper4SwiftTests.swift",
        "XCTestManifests.swift"
      ],
      "target_dependencies" : [
        "Helper4Swift"
      ],
      "type" : "test"
    },
    {
      "c99name" : "Helper4Swift",
      "module_type" : "SwiftTarget",
      "name" : "Helper4Swift",
      "path" : "Sources/Helper4Swift",
      "product_memberships" : [
        "Helper4Swift"
      ],
      "sources" : [
        "Extensions/Array+Extension.swift",
        "Extensions/Binding+Extension.swift",
        "Extensions/Bundle+Extension.swift",
        "Extensions/CALayer+Extension.swift",
        "Extensions/CLLocationCoordinate2D+Extension.swift",
        "Extensions/CheckedContinuation+Extension.swift",
        "Extensions/Color+Extension.swift",
        "Extensions/Date+Extension.swift",
        "Extensions/Dictionary+Extension.swift",
        "Extensions/Dispatch+Extension.swift",
        "Extensions/Encodable+Extension.swift",
        "Extensions/Int+Extension.swift",
        "Extensions/JSONDecoder+Extension.swift",
        "Extensions/MKCoordinateSpan+Extension.swift",
        "Extensions/NSMutableAttributedString+Extension.swift",
        "Extensions/Optional+Extension.swift",
        "Extensions/Sequence+Extension.swift",
        "Extensions/String+Extension.swift",
        "Extensions/TimeInterval+Extension.swift",
        "Extensions/UIApplication+Extension.swift",
        "Extensions/UIButton+Extension.swift",
        "Extensions/UICollectionView+Extension.swift",
        "Extensions/UIColor+Extension.swift",
        "Extensions/UIImage+Extension.swift",
        "Extensions/UIImageView+Extension.swift",
        "Extensions/UIKeyboardType+Extension.swift",
        "Extensions/UILabel+Extension.swift",
        "Extensions/UINavigationController+Extension.swift",
        "Extensions/UIStoryboard+Extension.swift",
        "Extensions/UITabBarController+Extension.swift",
        "Extensions/UITableView+Extension.swift",
        "Extensions/UITextField+Extension.swift",
        "Extensions/UITextView+Extension.swift",
        "Extensions/UIView+Extension.swift",
        "Extensions/UIViewAutoLayout+Extension.swift",
        "Extensions/UIViewController+Extension.swift",
        "Extensions/UIViewController+LocalAuthentication+Extension.swift",
        "Extensions/URL+Extension.swift",
        "Helper4Swift.swift",
        "SubClasses/UIViewFromNib.swift"
      ],
      "type" : "library"
    }
  ],
  "tools_version" : "5.2"
}
Command line invocation:
    /Applications/Xcode-16.3.0.app/Contents/Developer/usr/bin/xcodebuild -IDEClonedSourcePackagesDirPathOverride=/Users/admin/builder/spi-builder-workspace/.dependencies -resolvePackageDependencies
Resolve Package Graph
Resolved source packages:
  Helper4Swift: /Users/admin/builder/spi-builder-workspace
resolved source packages: Helper4Swift
{
  "dependencies" : [
  ],
  "manifest_display_name" : "Helper4Swift",
  "name" : "Helper4Swift",
  "path" : "/Users/admin/builder/spi-builder-workspace",
  "platforms" : [
    {
      "name" : "ios",
      "version" : "13.0"
    },
    {
      "name" : "tvos",
      "version" : "10.0"
    },
    {
      "name" : "watchos",
      "version" : "3.0"
    },
    {
      "name" : "macos",
      "version" : "10.13"
    }
  ],
  "products" : [
    {
      "name" : "Helper4Swift",
      "targets" : [
        "Helper4Swift"
      ],
      "type" : {
        "library" : [
          "automatic"
        ]
      }
    }
  ],
  "targets" : [
    {
      "c99name" : "Helper4SwiftTests",
      "module_type" : "SwiftTarget",
      "name" : "Helper4SwiftTests",
      "path" : "Tests/Helper4SwiftTests",
      "sources" : [
        "Helper4SwiftTests.swift",
        "XCTestManifests.swift"
      ],
      "target_dependencies" : [
        "Helper4Swift"
      ],
      "type" : "test"
    },
    {
      "c99name" : "Helper4Swift",
      "module_type" : "SwiftTarget",
      "name" : "Helper4Swift",
      "path" : "Sources/Helper4Swift",
      "product_memberships" : [
        "Helper4Swift"
      ],
      "sources" : [
        "Extensions/Array+Extension.swift",
        "Extensions/Binding+Extension.swift",
        "Extensions/Bundle+Extension.swift",
        "Extensions/CALayer+Extension.swift",
        "Extensions/CLLocationCoordinate2D+Extension.swift",
        "Extensions/CheckedContinuation+Extension.swift",
        "Extensions/Color+Extension.swift",
        "Extensions/Date+Extension.swift",
        "Extensions/Dictionary+Extension.swift",
        "Extensions/Dispatch+Extension.swift",
        "Extensions/Encodable+Extension.swift",
        "Extensions/Int+Extension.swift",
        "Extensions/JSONDecoder+Extension.swift",
        "Extensions/MKCoordinateSpan+Extension.swift",
        "Extensions/NSMutableAttributedString+Extension.swift",
        "Extensions/Optional+Extension.swift",
        "Extensions/Sequence+Extension.swift",
        "Extensions/String+Extension.swift",
        "Extensions/TimeInterval+Extension.swift",
        "Extensions/UIApplication+Extension.swift",
        "Extensions/UIButton+Extension.swift",
        "Extensions/UICollectionView+Extension.swift",
        "Extensions/UIColor+Extension.swift",
        "Extensions/UIImage+Extension.swift",
        "Extensions/UIImageView+Extension.swift",
        "Extensions/UIKeyboardType+Extension.swift",
        "Extensions/UILabel+Extension.swift",
        "Extensions/UINavigationController+Extension.swift",
        "Extensions/UIStoryboard+Extension.swift",
        "Extensions/UITabBarController+Extension.swift",
        "Extensions/UITableView+Extension.swift",
        "Extensions/UITextField+Extension.swift",
        "Extensions/UITextView+Extension.swift",
        "Extensions/UIView+Extension.swift",
        "Extensions/UIViewAutoLayout+Extension.swift",
        "Extensions/UIViewController+Extension.swift",
        "Extensions/UIViewController+LocalAuthentication+Extension.swift",
        "Extensions/URL+Extension.swift",
        "Helper4Swift.swift",
        "SubClasses/UIViewFromNib.swift"
      ],
      "type" : "library"
    }
  ],
  "tools_version" : "5.2"
}
{
  "workspace" : {
    "name" : "spi-builder-workspace",
    "schemes" : [
      "Helper4Swift"
    ]
  }
}
Running build ...
env DEVELOPER_DIR=/Applications/Xcode-16.3.0.app xcrun xcodebuild -IDEClonedSourcePackagesDirPathOverride=$PWD/.dependencies -skipMacroValidation -skipPackagePluginValidation -derivedDataPath $PWD/.derivedData build -scheme Helper4Swift -destination platform=macOS,arch=arm64 OTHER_SWIFT_FLAGS=-stats-output-dir .stats -strict-concurrency=complete -enable-upcoming-feature StrictConcurrency -enable-upcoming-feature DisableOutwardActorInference -enable-upcoming-feature GlobalActorIsolatedTypesUsability -enable-upcoming-feature InferSendableFromCaptures
Command line invocation:
    /Applications/Xcode-16.3.0.app/Contents/Developer/usr/bin/xcodebuild -IDEClonedSourcePackagesDirPathOverride=/Users/admin/builder/spi-builder-workspace/.dependencies -skipMacroValidation -skipPackagePluginValidation -derivedDataPath /Users/admin/builder/spi-builder-workspace/.derivedData build -scheme Helper4Swift -destination platform=macOS,arch=arm64 "OTHER_SWIFT_FLAGS=-stats-output-dir .stats -strict-concurrency=complete -enable-upcoming-feature StrictConcurrency -enable-upcoming-feature DisableOutwardActorInference -enable-upcoming-feature GlobalActorIsolatedTypesUsability -enable-upcoming-feature InferSendableFromCaptures"
Build settings from command line:
    OTHER_SWIFT_FLAGS = -stats-output-dir .stats -strict-concurrency=complete -enable-upcoming-feature StrictConcurrency -enable-upcoming-feature DisableOutwardActorInference -enable-upcoming-feature GlobalActorIsolatedTypesUsability -enable-upcoming-feature InferSendableFromCaptures
Resolve Package Graph
Resolved source packages:
  Helper4Swift: /Users/admin/builder/spi-builder-workspace
ComputePackagePrebuildTargetDependencyGraph
Prepare packages
CreateBuildRequest
SendProjectDescription
CreateBuildOperation
ComputeTargetDependencyGraph
note: Building targets in dependency order
note: Target dependency graph (2 targets)
    Target 'Helper4Swift' in project 'Helper4Swift'
        ➜ Explicit dependency on target 'Helper4Swift' in project 'Helper4Swift'
    Target 'Helper4Swift' in project 'Helper4Swift' (no dependencies)
GatherProvisioningInputs
CreateBuildDescription
ExecuteExternalTool /Applications/Xcode-16.3.0.app/Contents/Developer/Toolchains/XcodeDefault.xctoolchain/usr/bin/clang -v -E -dM -isysroot /Applications/Xcode-16.3.0.app/Contents/Developer/Platforms/MacOSX.platform/Developer/SDKs/MacOSX15.4.sdk -x c -c /dev/null
ExecuteExternalTool /Applications/Xcode-16.3.0.app/Contents/Developer/Toolchains/XcodeDefault.xctoolchain/usr/bin/swiftc --version
ExecuteExternalTool /Applications/Xcode-16.3.0.app/Contents/Developer/Toolchains/XcodeDefault.xctoolchain/usr/bin/ld -version_details
Build description signature: b2c76d61a0ac709da5ee077acc35041f
Build description path: /Users/admin/builder/spi-builder-workspace/.derivedData/Build/Intermediates.noindex/XCBuildData/b2c76d61a0ac709da5ee077acc35041f.xcbuilddata
ClangStatCache /Applications/Xcode-16.3.0.app/Contents/Developer/Toolchains/XcodeDefault.xctoolchain/usr/bin/clang-stat-cache /Applications/Xcode-16.3.0.app/Contents/Developer/Platforms/MacOSX.platform/Developer/SDKs/MacOSX15.4.sdk /Users/admin/builder/spi-builder-workspace/.derivedData/SDKStatCaches.noindex/macosx15.4-24E241-8287b8f5db97e746a1562fbca0c9d29b.sdkstatcache
    cd /Users/admin/builder/spi-builder-workspace/.swiftpm/xcode
    /Applications/Xcode-16.3.0.app/Contents/Developer/Toolchains/XcodeDefault.xctoolchain/usr/bin/clang-stat-cache /Applications/Xcode-16.3.0.app/Contents/Developer/Platforms/MacOSX.platform/Developer/SDKs/MacOSX15.4.sdk -o /Users/admin/builder/spi-builder-workspace/.derivedData/SDKStatCaches.noindex/macosx15.4-24E241-8287b8f5db97e746a1562fbca0c9d29b.sdkstatcache
CreateBuildDirectory /Users/admin/builder/spi-builder-workspace/.derivedData/Build/Products
    cd /Users/admin/builder/spi-builder-workspace/.swiftpm/xcode
    builtin-create-build-directory /Users/admin/builder/spi-builder-workspace/.derivedData/Build/Products
CreateBuildDirectory /Users/admin/builder/spi-builder-workspace/.derivedData/Build/Intermediates.noindex
    cd /Users/admin/builder/spi-builder-workspace/.swiftpm/xcode
    builtin-create-build-directory /Users/admin/builder/spi-builder-workspace/.derivedData/Build/Intermediates.noindex
CreateBuildDirectory /Users/admin/builder/spi-builder-workspace/.derivedData/Build/Products/Debug
    cd /Users/admin/builder/spi-builder-workspace/.swiftpm/xcode
    builtin-create-build-directory /Users/admin/builder/spi-builder-workspace/.derivedData/Build/Products/Debug
CreateBuildDirectory /Users/admin/builder/spi-builder-workspace/.derivedData/Build/Intermediates.noindex/EagerLinkingTBDs/Debug
    cd /Users/admin/builder/spi-builder-workspace/.swiftpm/xcode
    builtin-create-build-directory /Users/admin/builder/spi-builder-workspace/.derivedData/Build/Intermediates.noindex/EagerLinkingTBDs/Debug
CreateBuildDirectory /Users/admin/builder/spi-builder-workspace/.derivedData/Build/Products/Debug/PackageFrameworks
    cd /Users/admin/builder/spi-builder-workspace/.swiftpm/xcode
    builtin-create-build-directory /Users/admin/builder/spi-builder-workspace/.derivedData/Build/Products/Debug/PackageFrameworks
WriteAuxiliaryFile /Users/admin/builder/spi-builder-workspace/.derivedData/Build/Intermediates.noindex/Helper4Swift.build/Debug/Helper4Swift.build/Helper4Swift.modulemap (in target 'Helper4Swift' from project 'Helper4Swift')
    cd /Users/admin/builder/spi-builder-workspace
    write-file /Users/admin/builder/spi-builder-workspace/.derivedData/Build/Intermediates.noindex/Helper4Swift.build/Debug/Helper4Swift.build/Helper4Swift.modulemap
WriteAuxiliaryFile /Users/admin/builder/spi-builder-workspace/.derivedData/Build/Intermediates.noindex/Helper4Swift.build/Debug/Helper4Swift.build/Helper4Swift.DependencyStaticMetadataFileList (in target 'Helper4Swift' from project 'Helper4Swift')
    cd /Users/admin/builder/spi-builder-workspace
    write-file /Users/admin/builder/spi-builder-workspace/.derivedData/Build/Intermediates.noindex/Helper4Swift.build/Debug/Helper4Swift.build/Helper4Swift.DependencyStaticMetadataFileList
WriteAuxiliaryFile /Users/admin/builder/spi-builder-workspace/.derivedData/Build/Intermediates.noindex/Helper4Swift.build/Debug/Helper4Swift.build/Helper4Swift.DependencyMetadataFileList (in target 'Helper4Swift' from project 'Helper4Swift')
    cd /Users/admin/builder/spi-builder-workspace
    write-file /Users/admin/builder/spi-builder-workspace/.derivedData/Build/Intermediates.noindex/Helper4Swift.build/Debug/Helper4Swift.build/Helper4Swift.DependencyMetadataFileList
WriteAuxiliaryFile /Users/admin/builder/spi-builder-workspace/.derivedData/Build/Intermediates.noindex/Helper4Swift.build/Debug/Helper4Swift.build/Objects-normal/arm64/Helper4Swift.SwiftConstValuesFileList (in target 'Helper4Swift' from project 'Helper4Swift')
    cd /Users/admin/builder/spi-builder-workspace
    write-file /Users/admin/builder/spi-builder-workspace/.derivedData/Build/Intermediates.noindex/Helper4Swift.build/Debug/Helper4Swift.build/Objects-normal/arm64/Helper4Swift.SwiftConstValuesFileList
WriteAuxiliaryFile /Users/admin/builder/spi-builder-workspace/.derivedData/Build/Intermediates.noindex/Helper4Swift.build/Debug/Helper4Swift.build/Objects-normal/arm64/Helper4Swift_const_extract_protocols.json (in target 'Helper4Swift' from project 'Helper4Swift')
    cd /Users/admin/builder/spi-builder-workspace
    write-file /Users/admin/builder/spi-builder-workspace/.derivedData/Build/Intermediates.noindex/Helper4Swift.build/Debug/Helper4Swift.build/Objects-normal/arm64/Helper4Swift_const_extract_protocols.json
WriteAuxiliaryFile /Users/admin/builder/spi-builder-workspace/.derivedData/Build/Intermediates.noindex/Helper4Swift.build/Debug/Helper4Swift.build/Objects-normal/arm64/Helper4Swift-OutputFileMap.json (in target 'Helper4Swift' from project 'Helper4Swift')
    cd /Users/admin/builder/spi-builder-workspace
    write-file /Users/admin/builder/spi-builder-workspace/.derivedData/Build/Intermediates.noindex/Helper4Swift.build/Debug/Helper4Swift.build/Objects-normal/arm64/Helper4Swift-OutputFileMap.json
WriteAuxiliaryFile /Users/admin/builder/spi-builder-workspace/.derivedData/Build/Intermediates.noindex/Helper4Swift.build/Debug/Helper4Swift.build/Objects-normal/arm64/Helper4Swift.SwiftFileList (in target 'Helper4Swift' from project 'Helper4Swift')
    cd /Users/admin/builder/spi-builder-workspace
    write-file /Users/admin/builder/spi-builder-workspace/.derivedData/Build/Intermediates.noindex/Helper4Swift.build/Debug/Helper4Swift.build/Objects-normal/arm64/Helper4Swift.SwiftFileList
WriteAuxiliaryFile /Users/admin/builder/spi-builder-workspace/.derivedData/Build/Intermediates.noindex/Helper4Swift.build/Debug/Helper4Swift.build/Objects-normal/arm64/Helper4Swift.LinkFileList (in target 'Helper4Swift' from project 'Helper4Swift')
    cd /Users/admin/builder/spi-builder-workspace
    write-file /Users/admin/builder/spi-builder-workspace/.derivedData/Build/Intermediates.noindex/Helper4Swift.build/Debug/Helper4Swift.build/Objects-normal/arm64/Helper4Swift.LinkFileList
Copy /Users/admin/builder/spi-builder-workspace/.derivedData/Build/Intermediates.noindex/GeneratedModuleMaps/Helper4Swift.modulemap /Users/admin/builder/spi-builder-workspace/.derivedData/Build/Intermediates.noindex/Helper4Swift.build/Debug/Helper4Swift.build/Helper4Swift.modulemap (in target 'Helper4Swift' from project 'Helper4Swift')
    cd /Users/admin/builder/spi-builder-workspace
    builtin-copy -exclude .DS_Store -exclude CVS -exclude .svn -exclude .git -exclude .hg -resolve-src-symlinks /Users/admin/builder/spi-builder-workspace/.derivedData/Build/Intermediates.noindex/Helper4Swift.build/Debug/Helper4Swift.build/Helper4Swift.modulemap /Users/admin/builder/spi-builder-workspace/.derivedData/Build/Intermediates.noindex/GeneratedModuleMaps
SwiftDriver Helper4Swift normal arm64 com.apple.xcode.tools.swift.compiler (in target 'Helper4Swift' from project 'Helper4Swift')
    cd /Users/admin/builder/spi-builder-workspace/.swiftpm/xcode
    builtin-SwiftDriver -- /Applications/Xcode-16.3.0.app/Contents/Developer/Toolchains/XcodeDefault.xctoolchain/usr/bin/swiftc -module-name Helper4Swift -Onone -enforce-exclusivity\=checked @/Users/admin/builder/spi-builder-workspace/.derivedData/Build/Intermediates.noindex/Helper4Swift.build/Debug/Helper4Swift.build/Objects-normal/arm64/Helper4Swift.SwiftFileList -DSWIFT_PACKAGE -DDEBUG -stats-output-dir .stats -strict-concurrency\=complete -enable-upcoming-feature StrictConcurrency -enable-upcoming-feature DisableOutwardActorInference -enable-upcoming-feature GlobalActorIsolatedTypesUsability -enable-upcoming-feature InferSendableFromCaptures -plugin-path /Applications/Xcode-16.3.0.app/Contents/Developer/Toolchains/XcodeDefault.xctoolchain/usr/lib/swift/host/plugins/testing -enable-experimental-feature DebugDescriptionMacro -sdk /Applications/Xcode-16.3.0.app/Contents/Developer/Platforms/MacOSX.platform/Developer/SDKs/MacOSX15.4.sdk -target arm64-apple-macos10.13 -g -module-cache-path /Users/admin/builder/spi-builder-workspace/.derivedData/ModuleCache.noindex -Xfrontend -serialize-debugging-options -profile-coverage-mapping -profile-generate -enable-testing -index-store-path /Users/admin/builder/spi-builder-workspace/.derivedData/Index.noindex/DataStore -swift-version 5 -I /Users/admin/builder/spi-builder-workspace/.derivedData/Build/Products/Debug -I /Applications/Xcode-16.3.0.app/Contents/Developer/Platforms/MacOSX.platform/Developer/usr/lib -F /Users/admin/builder/spi-builder-workspace/.derivedData/Build/Products/Debug -F /Applications/Xcode-16.3.0.app/Contents/Developer/Platforms/MacOSX.platform/Developer/Library/Frameworks -c -j10 -enable-batch-mode -incremental -Xcc -ivfsstatcache -Xcc /Users/admin/builder/spi-builder-workspace/.derivedData/SDKStatCaches.noindex/macosx15.4-24E241-8287b8f5db97e746a1562fbca0c9d29b.sdkstatcache -output-file-map /Users/admin/builder/spi-builder-workspace/.derivedData/Build/Intermediates.noindex/Helper4Swift.build/Debug/Helper4Swift.build/Objects-normal/arm64/Helper4Swift-OutputFileMap.json -use-frontend-parseable-output -save-temps -no-color-diagnostics -serialize-diagnostics -emit-dependencies -emit-module -emit-module-path /Users/admin/builder/spi-builder-workspace/.derivedData/Build/Intermediates.noindex/Helper4Swift.build/Debug/Helper4Swift.build/Objects-normal/arm64/Helper4Swift.swiftmodule -validate-clang-modules-once -clang-build-session-file /Users/admin/builder/spi-builder-workspace/.derivedData/ModuleCache.noindex/Session.modulevalidation -Xcc -I/Users/admin/builder/spi-builder-workspace/.derivedData/Build/Intermediates.noindex/Helper4Swift.build/Debug/Helper4Swift.build/swift-overrides.hmap -emit-const-values -Xfrontend -const-gather-protocols-file -Xfrontend /Users/admin/builder/spi-builder-workspace/.derivedData/Build/Intermediates.noindex/Helper4Swift.build/Debug/Helper4Swift.build/Objects-normal/arm64/Helper4Swift_const_extract_protocols.json -Xcc -I/Users/admin/builder/spi-builder-workspace/.derivedData/Build/Products/Debug/include -Xcc -I/Users/admin/builder/spi-builder-workspace/.derivedData/Build/Intermediates.noindex/Helper4Swift.build/Debug/Helper4Swift.build/DerivedSources-normal/arm64 -Xcc -I/Users/admin/builder/spi-builder-workspace/.derivedData/Build/Intermediates.noindex/Helper4Swift.build/Debug/Helper4Swift.build/DerivedSources/arm64 -Xcc -I/Users/admin/builder/spi-builder-workspace/.derivedData/Build/Intermediates.noindex/Helper4Swift.build/Debug/Helper4Swift.build/DerivedSources -Xcc -DSWIFT_PACKAGE -Xcc -DDEBUG\=1 -emit-objc-header -emit-objc-header-path /Users/admin/builder/spi-builder-workspace/.derivedData/Build/Intermediates.noindex/Helper4Swift.build/Debug/Helper4Swift.build/Objects-normal/arm64/Helper4Swift-Swift.h -working-directory /Users/admin/builder/spi-builder-workspace/.swiftpm/xcode -experimental-emit-module-separately -disable-cmo
SwiftCompile normal arm64 Compiling\ Array+Extension.swift,\ Binding+Extension.swift,\ Bundle+Extension.swift,\ CALayer+Extension.swift /Users/admin/builder/spi-builder-workspace/Sources/Helper4Swift/Extensions/Array+Extension.swift /Users/admin/builder/spi-builder-workspace/Sources/Helper4Swift/Extensions/Binding+Extension.swift /Users/admin/builder/spi-builder-workspace/Sources/Helper4Swift/Extensions/Bundle+Extension.swift /Users/admin/builder/spi-builder-workspace/Sources/Helper4Swift/Extensions/CALayer+Extension.swift (in target 'Helper4Swift' from project 'Helper4Swift')
SwiftCompile normal arm64 /Users/admin/builder/spi-builder-workspace/Sources/Helper4Swift/Extensions/Array+Extension.swift (in target 'Helper4Swift' from project 'Helper4Swift')
    cd /Users/admin/builder/spi-builder-workspace/.swiftpm/xcode

SwiftCompile normal arm64 /Users/admin/builder/spi-builder-workspace/Sources/Helper4Swift/Extensions/Binding+Extension.swift (in target 'Helper4Swift' from project 'Helper4Swift')
    cd /Users/admin/builder/spi-builder-workspace/.swiftpm/xcode

SwiftCompile normal arm64 /Users/admin/builder/spi-builder-workspace/Sources/Helper4Swift/Extensions/Bundle+Extension.swift (in target 'Helper4Swift' from project 'Helper4Swift')
    cd /Users/admin/builder/spi-builder-workspace/.swiftpm/xcode

SwiftCompile normal arm64 /Users/admin/builder/spi-builder-workspace/Sources/Helper4Swift/Extensions/CALayer+Extension.swift (in target 'Helper4Swift' from project 'Helper4Swift')
    cd /Users/admin/builder/spi-builder-workspace/.swiftpm/xcode

SwiftCompile normal arm64 Compiling\ Sequence+Extension.swift,\ String+Extension.swift,\ TimeInterval+Extension.swift,\ UIApplication+Extension.swift /Users/admin/builder/spi-builder-workspace/Sources/Helper4Swift/Extensions/Sequence+Extension.swift /Users/admin/builder/spi-builder-workspace/Sources/Helper4Swift/Extensions/String+Extension.swift /Users/admin/builder/spi-builder-workspace/Sources/Helper4Swift/Extensions/TimeInterval+Extension.swift /Users/admin/builder/spi-builder-workspace/Sources/Helper4Swift/Extensions/UIApplication+Extension.swift (in target 'Helper4Swift' from project 'Helper4Swift')
SwiftCompile normal arm64 /Users/admin/builder/spi-builder-workspace/Sources/Helper4Swift/Extensions/Sequence+Extension.swift (in target 'Helper4Swift' from project 'Helper4Swift')
    cd /Users/admin/builder/spi-builder-workspace/.swiftpm/xcode

SwiftCompile normal arm64 /Users/admin/builder/spi-builder-workspace/Sources/Helper4Swift/Extensions/String+Extension.swift (in target 'Helper4Swift' from project 'Helper4Swift')
    cd /Users/admin/builder/spi-builder-workspace/.swiftpm/xcode

SwiftCompile normal arm64 /Users/admin/builder/spi-builder-workspace/Sources/Helper4Swift/Extensions/TimeInterval+Extension.swift (in target 'Helper4Swift' from project 'Helper4Swift')
    cd /Users/admin/builder/spi-builder-workspace/.swiftpm/xcode

SwiftCompile normal arm64 /Users/admin/builder/spi-builder-workspace/Sources/Helper4Swift/Extensions/UIApplication+Extension.swift (in target 'Helper4Swift' from project 'Helper4Swift')
    cd /Users/admin/builder/spi-builder-workspace/.swiftpm/xcode

SwiftCompile normal arm64 Compiling\ CLLocationCoordinate2D+Extension.swift,\ CheckedContinuation+Extension.swift,\ Color+Extension.swift,\ Date+Extension.swift /Users/admin/builder/spi-builder-workspace/Sources/Helper4Swift/Extensions/CLLocationCoordinate2D+Extension.swift /Users/admin/builder/spi-builder-workspace/Sources/Helper4Swift/Extensions/CheckedContinuation+Extension.swift /Users/admin/builder/spi-builder-workspace/Sources/Helper4Swift/Extensions/Color+Extension.swift /Users/admin/builder/spi-builder-workspace/Sources/Helper4Swift/Extensions/Date+Extension.swift (in target 'Helper4Swift' from project 'Helper4Swift')
SwiftCompile normal arm64 /Users/admin/builder/spi-builder-workspace/Sources/Helper4Swift/Extensions/CLLocationCoordinate2D+Extension.swift (in target 'Helper4Swift' from project 'Helper4Swift')
    cd /Users/admin/builder/spi-builder-workspace/.swiftpm/xcode

SwiftCompile normal arm64 /Users/admin/builder/spi-builder-workspace/Sources/Helper4Swift/Extensions/CheckedContinuation+Extension.swift (in target 'Helper4Swift' from project 'Helper4Swift')
    cd /Users/admin/builder/spi-builder-workspace/.swiftpm/xcode

SwiftCompile normal arm64 /Users/admin/builder/spi-builder-workspace/Sources/Helper4Swift/Extensions/Color+Extension.swift (in target 'Helper4Swift' from project 'Helper4Swift')
    cd /Users/admin/builder/spi-builder-workspace/.swiftpm/xcode

SwiftCompile normal arm64 /Users/admin/builder/spi-builder-workspace/Sources/Helper4Swift/Extensions/Date+Extension.swift (in target 'Helper4Swift' from project 'Helper4Swift')
    cd /Users/admin/builder/spi-builder-workspace/.swiftpm/xcode

SwiftEmitModule normal arm64 Emitting\ module\ for\ Helper4Swift (in target 'Helper4Swift' from project 'Helper4Swift')
Failed frontend command:
/Applications/Xcode-16.3.0.app/Contents/Developer/Toolchains/XcodeDefault.xctoolchain/usr/bin/swift-frontend -frontend -emit-module -experimental-skip-non-inlinable-function-bodies-without-types /Users/admin/builder/spi-builder-workspace/Sources/Helper4Swift/Extensions/Array+Extension.swift /Users/admin/builder/spi-builder-workspace/Sources/Helper4Swift/Extensions/Binding+Extension.swift /Users/admin/builder/spi-builder-workspace/Sources/Helper4Swift/Extensions/Bundle+Extension.swift /Users/admin/builder/spi-builder-workspace/Sources/Helper4Swift/Extensions/CALayer+Extension.swift /Users/admin/builder/spi-builder-workspace/Sources/Helper4Swift/Extensions/CLLocationCoordinate2D+Extension.swift /Users/admin/builder/spi-builder-workspace/Sources/Helper4Swift/Extensions/CheckedContinuation+Extension.swift /Users/admin/builder/spi-builder-workspace/Sources/Helper4Swift/Extensions/Color+Extension.swift /Users/admin/builder/spi-builder-workspace/Sources/Helper4Swift/Extensions/Date+Extension.swift /Users/admin/builder/spi-builder-workspace/Sources/Helper4Swift/Extensions/Dictionary+Extension.swift /Users/admin/builder/spi-builder-workspace/Sources/Helper4Swift/Extensions/Dispatch+Extension.swift /Users/admin/builder/spi-builder-workspace/Sources/Helper4Swift/Extensions/Encodable+Extension.swift /Users/admin/builder/spi-builder-workspace/Sources/Helper4Swift/Extensions/Int+Extension.swift /Users/admin/builder/spi-builder-workspace/Sources/Helper4Swift/Extensions/JSONDecoder+Extension.swift /Users/admin/builder/spi-builder-workspace/Sources/Helper4Swift/Extensions/MKCoordinateSpan+Extension.swift /Users/admin/builder/spi-builder-workspace/Sources/Helper4Swift/Extensions/NSMutableAttributedString+Extension.swift /Users/admin/builder/spi-builder-workspace/Sources/Helper4Swift/Extensions/Optional+Extension.swift /Users/admin/builder/spi-builder-workspace/Sources/Helper4Swift/Extensions/Sequence+Extension.swift /Users/admin/builder/spi-builder-workspace/Sources/Helper4Swift/Extensions/String+Extension.swift /Users/admin/builder/spi-builder-workspace/Sources/Helper4Swift/Extensions/TimeInterval+Extension.swift /Users/admin/builder/spi-builder-workspace/Sources/Helper4Swift/Extensions/UIApplication+Extension.swift /Users/admin/builder/spi-builder-workspace/Sources/Helper4Swift/Extensions/UIButton+Extension.swift /Users/admin/builder/spi-builder-workspace/Sources/Helper4Swift/Extensions/UICollectionView+Extension.swift /Users/admin/builder/spi-builder-workspace/Sources/Helper4Swift/Extensions/UIColor+Extension.swift /Users/admin/builder/spi-builder-workspace/Sources/Helper4Swift/Extensions/UIImage+Extension.swift /Users/admin/builder/spi-builder-workspace/Sources/Helper4Swift/Extensions/UIImageView+Extension.swift /Users/admin/builder/spi-builder-workspace/Sources/Helper4Swift/Extensions/UIKeyboardType+Extension.swift /Users/admin/builder/spi-builder-workspace/Sources/Helper4Swift/Extensions/UILabel+Extension.swift /Users/admin/builder/spi-builder-workspace/Sources/Helper4Swift/Extensions/UINavigationController+Extension.swift /Users/admin/builder/spi-builder-workspace/Sources/Helper4Swift/Extensions/UIStoryboard+Extension.swift /Users/admin/builder/spi-builder-workspace/Sources/Helper4Swift/Extensions/UITabBarController+Extension.swift /Users/admin/builder/spi-builder-workspace/Sources/Helper4Swift/Extensions/UITableView+Extension.swift /Users/admin/builder/spi-builder-workspace/Sources/Helper4Swift/Extensions/UITextField+Extension.swift /Users/admin/builder/spi-builder-workspace/Sources/Helper4Swift/Extensions/UITextView+Extension.swift /Users/admin/builder/spi-builder-workspace/Sources/Helper4Swift/Extensions/UIView+Extension.swift /Users/admin/builder/spi-builder-workspace/Sources/Helper4Swift/Extensions/UIViewAutoLayout+Extension.swift /Users/admin/builder/spi-builder-workspace/Sources/Helper4Swift/Extensions/UIViewController+Extension.swift /Users/admin/builder/spi-builder-workspace/Sources/Helper4Swift/Extensions/UIViewController+LocalAuthentication+Extension.swift /Users/admin/builder/spi-builder-workspace/Sources/Helper4Swift/Extensions/URL+Extension.swift /Users/admin/builder/spi-builder-workspace/Sources/Helper4Swift/Helper4Swift.swift /Users/admin/builder/spi-builder-workspace/Sources/Helper4Swift/SubClasses/UIViewFromNib.swift -target arm64-apple-macos10.13 -Xllvm -aarch64-use-tbi -enable-objc-interop -sdk /Applications/Xcode-16.3.0.app/Contents/Developer/Platforms/MacOSX.platform/Developer/SDKs/MacOSX15.4.sdk -I /Users/admin/builder/spi-builder-workspace/.derivedData/Build/Products/Debug -I /Applications/Xcode-16.3.0.app/Contents/Developer/Platforms/MacOSX.platform/Developer/usr/lib -F /Users/admin/builder/spi-builder-workspace/.derivedData/Build/Products/Debug -F /Applications/Xcode-16.3.0.app/Contents/Developer/Platforms/MacOSX.platform/Developer/Library/Frameworks -no-color-diagnostics -enable-testing -g -debug-info-format\=dwarf -dwarf-version\=4 -module-cache-path /Users/admin/builder/spi-builder-workspace/.derivedData/ModuleCache.noindex -profile-generate -profile-coverage-mapping -swift-version 5 -enforce-exclusivity\=checked -stats-output-dir /Users/admin/builder/spi-builder-workspace/.swiftpm/xcode/.stats -Onone -D SWIFT_PACKAGE -D DEBUG -serialize-debugging-options -const-gather-protocols-file /Users/admin/builder/spi-builder-workspace/.derivedData/Build/Intermediates.noindex/Helper4Swift.build/Debug/Helper4Swift.build/Objects-normal/arm64/Helper4Swift_const_extract_protocols.json -enable-upcoming-feature StrictConcurrency -enable-upcoming-feature DisableOutwardActorInference -enable-upcoming-feature GlobalActorIsolatedTypesUsability -enable-upcoming-feature InferSendableFromCaptures -enable-experimental-feature DebugDescriptionMacro -strict-concurrency\=complete -empty-abi-descriptor -plugin-path /Applications/Xcode-16.3.0.app/Contents/Developer/Toolchains/XcodeDefault.xctoolchain/usr/lib/swift/host/plugins/testing -validate-clang-modules-once -clang-build-session-file /Users/admin/builder/spi-builder-workspace/.derivedData/ModuleCache.noindex/Session.modulevalidation -Xcc -working-directory -Xcc /Users/admin/builder/spi-builder-workspace/.swiftpm/xcode -resource-dir /Applications/Xcode-16.3.0.app/Contents/Developer/Toolchains/XcodeDefault.xctoolchain/usr/lib/swift -enable-anonymous-context-mangled-names -file-compilation-dir /Users/admin/builder/spi-builder-workspace/.swiftpm/xcode -Xcc -ivfsstatcache -Xcc /Users/admin/builder/spi-builder-workspace/.derivedData/SDKStatCaches.noindex/macosx15.4-24E241-8287b8f5db97e746a1562fbca0c9d29b.sdkstatcache -Xcc -I/Users/admin/builder/spi-builder-workspace/.derivedData/Build/Intermediates.noindex/Helper4Swift.build/Debug/Helper4Swift.build/swift-overrides.hmap -Xcc -I/Users/admin/builder/spi-builder-workspace/.derivedData/Build/Products/Debug/include -Xcc -I/Users/admin/builder/spi-builder-workspace/.derivedData/Build/Intermediates.noindex/Helper4Swift.build/Debug/Helper4Swift.build/DerivedSources-normal/arm64 -Xcc -I/Users/admin/builder/spi-builder-workspace/.derivedData/Build/Intermediates.noindex/Helper4Swift.build/Debug/Helper4Swift.build/DerivedSources/arm64 -Xcc -I/Users/admin/builder/spi-builder-workspace/.derivedData/Build/Intermediates.noindex/Helper4Swift.build/Debug/Helper4Swift.build/DerivedSources -Xcc -DSWIFT_PACKAGE -Xcc -DDEBUG\=1 -module-name Helper4Swift -frontend-parseable-output -disable-clang-spi -target-sdk-version 15.4 -target-sdk-name macosx15.4 -external-plugin-path /Applications/Xcode-16.3.0.app/Contents/Developer/Platforms/MacOSX.platform/Developer/usr/lib/swift/host/plugins\#/Applications/Xcode-16.3.0.app/Contents/Developer/Platforms/MacOSX.platform/Developer/usr/bin/swift-plugin-server -external-plugin-path /Applications/Xcode-16.3.0.app/Contents/Developer/Platforms/MacOSX.platform/Developer/usr/local/lib/swift/host/plugins\#/Applications/Xcode-16.3.0.app/Contents/Developer/Platforms/MacOSX.platform/Developer/usr/bin/swift-plugin-server -in-process-plugin-server-path /Applications/Xcode-16.3.0.app/Contents/Developer/Toolchains/XcodeDefault.xctoolchain/usr/lib/swift/host/libSwiftInProcPluginServer.dylib -plugin-path /Applications/Xcode-16.3.0.app/Contents/Developer/Toolchains/XcodeDefault.xctoolchain/usr/lib/swift/host/plugins -plugin-path /Applications/Xcode-16.3.0.app/Contents/Developer/Toolchains/XcodeDefault.xctoolchain/usr/local/lib/swift/host/plugins -emit-module-doc-path /Users/admin/builder/spi-builder-workspace/.derivedData/Build/Intermediates.noindex/Helper4Swift.build/Debug/Helper4Swift.build/Objects-normal/arm64/Helper4Swift.swiftdoc -emit-module-source-info-path /Users/admin/builder/spi-builder-workspace/.derivedData/Build/Intermediates.noindex/Helper4Swift.build/Debug/Helper4Swift.build/Objects-normal/arm64/Helper4Swift.swiftsourceinfo -emit-objc-header-path /Users/admin/builder/spi-builder-workspace/.derivedData/Build/Intermediates.noindex/Helper4Swift.build/Debug/Helper4Swift.build/Objects-normal/arm64/Helper4Swift-Swift.h -serialize-diagnostics-path /Users/admin/builder/spi-builder-workspace/.derivedData/Build/Intermediates.noindex/Helper4Swift.build/Debug/Helper4Swift.build/Objects-normal/arm64/Helper4Swift-master-emit-module.dia -emit-dependencies-path /Users/admin/builder/spi-builder-workspace/.derivedData/Build/Intermediates.noindex/Helper4Swift.build/Debug/Helper4Swift.build/Objects-normal/arm64/Helper4Swift-master-emit-module.d -o /Users/admin/builder/spi-builder-workspace/.derivedData/Build/Intermediates.noindex/Helper4Swift.build/Debug/Helper4Swift.build/Objects-normal/arm64/Helper4Swift.swiftmodule -emit-abi-descriptor-path /Users/admin/builder/spi-builder-workspace/.derivedData/Build/Intermediates.noindex/Helper4Swift.build/Debug/Helper4Swift.build/Objects-normal/arm64/Helper4Swift.abi.json
EmitSwiftModule normal arm64 (in target 'Helper4Swift' from project 'Helper4Swift')
    cd /Users/admin/builder/spi-builder-workspace/.swiftpm/xcode

/Users/admin/builder/spi-builder-workspace/Sources/Helper4Swift/Extensions/Binding+Extension.swift:18:60: error: 'Binding' is only available in macOS 10.15 or newer
    func onChange(_ handler: @escaping (Value) -> Void) -> Binding<Value> {
                                                           ^
/Users/admin/builder/spi-builder-workspace/Sources/Helper4Swift/Extensions/Binding+Extension.swift:18:10: note: add @available attribute to enclosing instance method
    func onChange(_ handler: @escaping (Value) -> Void) -> Binding<Value> {
         ^
/Users/admin/builder/spi-builder-workspace/Sources/Helper4Swift/Extensions/Binding+Extension.swift:11:8: note: add @available attribute to enclosing extension
public extension Binding {
       ^
/Users/admin/builder/spi-builder-workspace/Sources/Helper4Swift/Extensions/Binding+Extension.swift:11:18: error: 'Binding' is only available in macOS 10.15 or newer
public extension Binding {
                 ^
/Users/admin/builder/spi-builder-workspace/Sources/Helper4Swift/Extensions/Binding+Extension.swift:11:8: note: add @available attribute to enclosing extension
public extension Binding {
       ^
/Users/admin/builder/spi-builder-workspace/Sources/Helper4Swift/Extensions/Binding+Extension.swift:30:24: error: 'Binding' is only available in macOS 10.15 or newer
public func ??<T>(lhs: Binding<Optional<T>>, rhs: T) -> Binding<T> {
                       ^
/Users/admin/builder/spi-builder-workspace/Sources/Helper4Swift/Extensions/Binding+Extension.swift:30:13: note: add @available attribute to enclosing operator function
public func ??<T>(lhs: Binding<Optional<T>>, rhs: T) -> Binding<T> {
            ^
/Users/admin/builder/spi-builder-workspace/Sources/Helper4Swift/Extensions/Binding+Extension.swift:30:57: error: 'Binding' is only available in macOS 10.15 or newer
public func ??<T>(lhs: Binding<Optional<T>>, rhs: T) -> Binding<T> {
                                                        ^
/Users/admin/builder/spi-builder-workspace/Sources/Helper4Swift/Extensions/Binding+Extension.swift:30:13: note: add @available attribute to enclosing operator function
public func ??<T>(lhs: Binding<Optional<T>>, rhs: T) -> Binding<T> {
            ^
/Users/admin/builder/spi-builder-workspace/Sources/Helper4Swift/Extensions/CLLocationCoordinate2D+Extension.swift:16:1: warning: extension declares a conformance of imported type 'CLLocationCoordinate2D' to imported protocol 'Equatable'; this will not behave correctly if the owners of 'CoreLocation' introduce this conformance in the future
extension CLLocationCoordinate2D: Equatable {
^
/Users/admin/builder/spi-builder-workspace/Sources/Helper4Swift/Extensions/CLLocationCoordinate2D+Extension.swift:16:1: note: add '@retroactive' to silence this warning
extension CLLocationCoordinate2D: Equatable {
^                                 ~~~~~~~~~
                                  @retroactive Equatable
/Users/admin/builder/spi-builder-workspace/Sources/Helper4Swift/Extensions/CheckedContinuation+Extension.swift:10:18: error: 'CheckedContinuation' is only available in macOS 10.15 or newer
public extension CheckedContinuation where T == Void {
                 ^
/Users/admin/builder/spi-builder-workspace/Sources/Helper4Swift/Extensions/CheckedContinuation+Extension.swift:10:8: note: add @available attribute to enclosing extension
public extension CheckedContinuation where T == Void {
       ^
/Users/admin/builder/spi-builder-workspace/Sources/Helper4Swift/Extensions/Color+Extension.swift:13:23: error: cannot find type 'UIColor' in scope
    func uiColor() -> UIColor {
                      ^~~~~~~
/Users/admin/builder/spi-builder-workspace/Sources/Helper4Swift/Extensions/Color+Extension.swift:11:18: error: 'Color' is only available in macOS 10.15 or newer
public extension Color {
                 ^
/Users/admin/builder/spi-builder-workspace/Sources/Helper4Swift/Extensions/Color+Extension.swift:11:8: note: add @available attribute to enclosing extension
public extension Color {
       ^
/Users/admin/builder/spi-builder-workspace/Sources/Helper4Swift/Extensions/Color+Extension.swift:41:18: error: 'Color' is only available in macOS 10.15 or newer
public extension Color {
                 ^
/Users/admin/builder/spi-builder-workspace/Sources/Helper4Swift/Extensions/Color+Extension.swift:41:8: note: add @available attribute to enclosing extension
public extension Color {
       ^
/Users/admin/builder/spi-builder-workspace/Sources/Helper4Swift/Extensions/Date+Extension.swift:71:21: error: 'RelativeDateTimeFormatter' is only available in macOS 10.15 or newer
        unitsStyle: RelativeDateTimeFormatter.UnitsStyle = .short,
                    ^
/Users/admin/builder/spi-builder-workspace/Sources/Helper4Swift/Extensions/Date+Extension.swift:69:10: note: add @available attribute to enclosing instance method
    func relativeTime(
         ^
/Users/admin/builder/spi-builder-workspace/Sources/Helper4Swift/Extensions/Date+Extension.swift:29:8: note: add @available attribute to enclosing extension
public extension Date {
       ^
/Users/admin/builder/spi-builder-workspace/Sources/Helper4Swift/Extensions/Dispatch+Extension.swift:16:24: warning: static property 'key' is not concurrency-safe because it is nonisolated global shared mutable state; this is an error in the Swift 6 language mode
            static var key: DispatchSpecificKey<Void> = {
                       ^
/Users/admin/builder/spi-builder-workspace/Sources/Helper4Swift/Extensions/Dispatch+Extension.swift:16:24: note: convert 'key' to a 'let' constant to make 'Sendable' shared state immutable
            static var key: DispatchSpecificKey<Void> = {
                   ~~~ ^
                   let
/Users/admin/builder/spi-builder-workspace/Sources/Helper4Swift/Extensions/Dispatch+Extension.swift:16:24: note: add '@MainActor' to make static property 'key' part of global actor 'MainActor'
            static var key: DispatchSpecificKey<Void> = {
                       ^
            @MainActor
/Users/admin/builder/spi-builder-workspace/Sources/Helper4Swift/Extensions/Dispatch+Extension.swift:16:24: note: disable concurrency-safety checks if accesses are protected by an external synchronization mechanism
            static var key: DispatchSpecificKey<Void> = {
                       ^
            nonisolated(unsafe)
/Users/admin/builder/spi-builder-workspace/Sources/Helper4Swift/Extensions/String+Extension.swift:348:23: error: 'Color' is only available in macOS 10.15 or newer
    func toColor() -> Color {
                      ^
/Users/admin/builder/spi-builder-workspace/Sources/Helper4Swift/Extensions/String+Extension.swift:348:10: note: add @available attribute to enclosing instance method
    func toColor() -> Color {
         ^
/Users/admin/builder/spi-builder-workspace/Sources/Helper4Swift/Extensions/String+Extension.swift:346:8: note: add @available attribute to enclosing extension
public extension String {
       ^
SwiftCompile normal arm64 Compiling\ UIImageView+Extension.swift,\ UIKeyboardType+Extension.swift,\ UILabel+Extension.swift,\ UINavigationController+Extension.swift /Users/admin/builder/spi-builder-workspace/Sources/Helper4Swift/Extensions/UIImageView+Extension.swift /Users/admin/builder/spi-builder-workspace/Sources/Helper4Swift/Extensions/UIKeyboardType+Extension.swift /Users/admin/builder/spi-builder-workspace/Sources/Helper4Swift/Extensions/UILabel+Extension.swift /Users/admin/builder/spi-builder-workspace/Sources/Helper4Swift/Extensions/UINavigationController+Extension.swift (in target 'Helper4Swift' from project 'Helper4Swift')
SwiftCompile normal arm64 /Users/admin/builder/spi-builder-workspace/Sources/Helper4Swift/Extensions/UIImageView+Extension.swift (in target 'Helper4Swift' from project 'Helper4Swift')
    cd /Users/admin/builder/spi-builder-workspace/.swiftpm/xcode

SwiftCompile normal arm64 /Users/admin/builder/spi-builder-workspace/Sources/Helper4Swift/Extensions/UIKeyboardType+Extension.swift (in target 'Helper4Swift' from project 'Helper4Swift')
    cd /Users/admin/builder/spi-builder-workspace/.swiftpm/xcode

SwiftCompile normal arm64 /Users/admin/builder/spi-builder-workspace/Sources/Helper4Swift/Extensions/UILabel+Extension.swift (in target 'Helper4Swift' from project 'Helper4Swift')
    cd /Users/admin/builder/spi-builder-workspace/.swiftpm/xcode

SwiftCompile normal arm64 /Users/admin/builder/spi-builder-workspace/Sources/Helper4Swift/Extensions/UINavigationController+Extension.swift (in target 'Helper4Swift' from project 'Helper4Swift')
    cd /Users/admin/builder/spi-builder-workspace/.swiftpm/xcode

SwiftCompile normal arm64 Compiling\ UIViewController+LocalAuthentication+Extension.swift,\ URL+Extension.swift,\ Helper4Swift.swift,\ UIViewFromNib.swift /Users/admin/builder/spi-builder-workspace/Sources/Helper4Swift/Extensions/UIViewController+LocalAuthentication+Extension.swift /Users/admin/builder/spi-builder-workspace/Sources/Helper4Swift/Extensions/URL+Extension.swift /Users/admin/builder/spi-builder-workspace/Sources/Helper4Swift/Helper4Swift.swift /Users/admin/builder/spi-builder-workspace/Sources/Helper4Swift/SubClasses/UIViewFromNib.swift (in target 'Helper4Swift' from project 'Helper4Swift')
SwiftCompile normal arm64 /Users/admin/builder/spi-builder-workspace/Sources/Helper4Swift/Extensions/UIViewController+LocalAuthentication+Extension.swift (in target 'Helper4Swift' from project 'Helper4Swift')
    cd /Users/admin/builder/spi-builder-workspace/.swiftpm/xcode

SwiftCompile normal arm64 /Users/admin/builder/spi-builder-workspace/Sources/Helper4Swift/Extensions/URL+Extension.swift (in target 'Helper4Swift' from project 'Helper4Swift')
    cd /Users/admin/builder/spi-builder-workspace/.swiftpm/xcode

SwiftCompile normal arm64 /Users/admin/builder/spi-builder-workspace/Sources/Helper4Swift/Helper4Swift.swift (in target 'Helper4Swift' from project 'Helper4Swift')
    cd /Users/admin/builder/spi-builder-workspace/.swiftpm/xcode

SwiftCompile normal arm64 /Users/admin/builder/spi-builder-workspace/Sources/Helper4Swift/SubClasses/UIViewFromNib.swift (in target 'Helper4Swift' from project 'Helper4Swift')
    cd /Users/admin/builder/spi-builder-workspace/.swiftpm/xcode

SwiftCompile normal arm64 Compiling\ UIButton+Extension.swift,\ UICollectionView+Extension.swift,\ UIColor+Extension.swift,\ UIImage+Extension.swift /Users/admin/builder/spi-builder-workspace/Sources/Helper4Swift/Extensions/UIButton+Extension.swift /Users/admin/builder/spi-builder-workspace/Sources/Helper4Swift/Extensions/UICollectionView+Extension.swift /Users/admin/builder/spi-builder-workspace/Sources/Helper4Swift/Extensions/UIColor+Extension.swift /Users/admin/builder/spi-builder-workspace/Sources/Helper4Swift/Extensions/UIImage+Extension.swift (in target 'Helper4Swift' from project 'Helper4Swift')
SwiftCompile normal arm64 /Users/admin/builder/spi-builder-workspace/Sources/Helper4Swift/Extensions/UIButton+Extension.swift (in target 'Helper4Swift' from project 'Helper4Swift')
    cd /Users/admin/builder/spi-builder-workspace/.swiftpm/xcode

SwiftCompile normal arm64 /Users/admin/builder/spi-builder-workspace/Sources/Helper4Swift/Extensions/UICollectionView+Extension.swift (in target 'Helper4Swift' from project 'Helper4Swift')
    cd /Users/admin/builder/spi-builder-workspace/.swiftpm/xcode

SwiftCompile normal arm64 /Users/admin/builder/spi-builder-workspace/Sources/Helper4Swift/Extensions/UIColor+Extension.swift (in target 'Helper4Swift' from project 'Helper4Swift')
    cd /Users/admin/builder/spi-builder-workspace/.swiftpm/xcode

SwiftCompile normal arm64 /Users/admin/builder/spi-builder-workspace/Sources/Helper4Swift/Extensions/UIImage+Extension.swift (in target 'Helper4Swift' from project 'Helper4Swift')
    cd /Users/admin/builder/spi-builder-workspace/.swiftpm/xcode

SwiftCompile normal arm64 Compiling\ JSONDecoder+Extension.swift,\ MKCoordinateSpan+Extension.swift,\ NSMutableAttributedString+Extension.swift,\ Optional+Extension.swift /Users/admin/builder/spi-builder-workspace/Sources/Helper4Swift/Extensions/JSONDecoder+Extension.swift /Users/admin/builder/spi-builder-workspace/Sources/Helper4Swift/Extensions/MKCoordinateSpan+Extension.swift /Users/admin/builder/spi-builder-workspace/Sources/Helper4Swift/Extensions/NSMutableAttributedString+Extension.swift /Users/admin/builder/spi-builder-workspace/Sources/Helper4Swift/Extensions/Optional+Extension.swift (in target 'Helper4Swift' from project 'Helper4Swift')
SwiftCompile normal arm64 /Users/admin/builder/spi-builder-workspace/Sources/Helper4Swift/Extensions/JSONDecoder+Extension.swift (in target 'Helper4Swift' from project 'Helper4Swift')
    cd /Users/admin/builder/spi-builder-workspace/.swiftpm/xcode

SwiftCompile normal arm64 /Users/admin/builder/spi-builder-workspace/Sources/Helper4Swift/Extensions/MKCoordinateSpan+Extension.swift (in target 'Helper4Swift' from project 'Helper4Swift')
    cd /Users/admin/builder/spi-builder-workspace/.swiftpm/xcode

SwiftCompile normal arm64 /Users/admin/builder/spi-builder-workspace/Sources/Helper4Swift/Extensions/NSMutableAttributedString+Extension.swift (in target 'Helper4Swift' from project 'Helper4Swift')
    cd /Users/admin/builder/spi-builder-workspace/.swiftpm/xcode

SwiftCompile normal arm64 /Users/admin/builder/spi-builder-workspace/Sources/Helper4Swift/Extensions/Optional+Extension.swift (in target 'Helper4Swift' from project 'Helper4Swift')
    cd /Users/admin/builder/spi-builder-workspace/.swiftpm/xcode

SwiftCompile normal arm64 Compiling\ UIStoryboard+Extension.swift,\ UITabBarController+Extension.swift,\ UITableView+Extension.swift,\ UITextField+Extension.swift /Users/admin/builder/spi-builder-workspace/Sources/Helper4Swift/Extensions/UIStoryboard+Extension.swift /Users/admin/builder/spi-builder-workspace/Sources/Helper4Swift/Extensions/UITabBarController+Extension.swift /Users/admin/builder/spi-builder-workspace/Sources/Helper4Swift/Extensions/UITableView+Extension.swift /Users/admin/builder/spi-builder-workspace/Sources/Helper4Swift/Extensions/UITextField+Extension.swift (in target 'Helper4Swift' from project 'Helper4Swift')
SwiftCompile normal arm64 /Users/admin/builder/spi-builder-workspace/Sources/Helper4Swift/Extensions/UIStoryboard+Extension.swift (in target 'Helper4Swift' from project 'Helper4Swift')
    cd /Users/admin/builder/spi-builder-workspace/.swiftpm/xcode

SwiftCompile normal arm64 /Users/admin/builder/spi-builder-workspace/Sources/Helper4Swift/Extensions/UITabBarController+Extension.swift (in target 'Helper4Swift' from project 'Helper4Swift')
    cd /Users/admin/builder/spi-builder-workspace/.swiftpm/xcode

SwiftCompile normal arm64 /Users/admin/builder/spi-builder-workspace/Sources/Helper4Swift/Extensions/UITableView+Extension.swift (in target 'Helper4Swift' from project 'Helper4Swift')
    cd /Users/admin/builder/spi-builder-workspace/.swiftpm/xcode

SwiftCompile normal arm64 /Users/admin/builder/spi-builder-workspace/Sources/Helper4Swift/Extensions/UITextField+Extension.swift (in target 'Helper4Swift' from project 'Helper4Swift')
    cd /Users/admin/builder/spi-builder-workspace/.swiftpm/xcode

SwiftCompile normal arm64 Compiling\ UITextView+Extension.swift,\ UIView+Extension.swift,\ UIViewAutoLayout+Extension.swift,\ UIViewController+Extension.swift /Users/admin/builder/spi-builder-workspace/Sources/Helper4Swift/Extensions/UITextView+Extension.swift /Users/admin/builder/spi-builder-workspace/Sources/Helper4Swift/Extensions/UIView+Extension.swift /Users/admin/builder/spi-builder-workspace/Sources/Helper4Swift/Extensions/UIViewAutoLayout+Extension.swift /Users/admin/builder/spi-builder-workspace/Sources/Helper4Swift/Extensions/UIViewController+Extension.swift (in target 'Helper4Swift' from project 'Helper4Swift')
SwiftCompile normal arm64 /Users/admin/builder/spi-builder-workspace/Sources/Helper4Swift/Extensions/UITextView+Extension.swift (in target 'Helper4Swift' from project 'Helper4Swift')
    cd /Users/admin/builder/spi-builder-workspace/.swiftpm/xcode

SwiftCompile normal arm64 /Users/admin/builder/spi-builder-workspace/Sources/Helper4Swift/Extensions/UIView+Extension.swift (in target 'Helper4Swift' from project 'Helper4Swift')
    cd /Users/admin/builder/spi-builder-workspace/.swiftpm/xcode

SwiftCompile normal arm64 /Users/admin/builder/spi-builder-workspace/Sources/Helper4Swift/Extensions/UIViewAutoLayout+Extension.swift (in target 'Helper4Swift' from project 'Helper4Swift')
    cd /Users/admin/builder/spi-builder-workspace/.swiftpm/xcode

SwiftCompile normal arm64 /Users/admin/builder/spi-builder-workspace/Sources/Helper4Swift/Extensions/UIViewController+Extension.swift (in target 'Helper4Swift' from project 'Helper4Swift')
    cd /Users/admin/builder/spi-builder-workspace/.swiftpm/xcode

SwiftCompile normal arm64 Compiling\ Dictionary+Extension.swift,\ Dispatch+Extension.swift,\ Encodable+Extension.swift,\ Int+Extension.swift /Users/admin/builder/spi-builder-workspace/Sources/Helper4Swift/Extensions/Dictionary+Extension.swift /Users/admin/builder/spi-builder-workspace/Sources/Helper4Swift/Extensions/Dispatch+Extension.swift /Users/admin/builder/spi-builder-workspace/Sources/Helper4Swift/Extensions/Encodable+Extension.swift /Users/admin/builder/spi-builder-workspace/Sources/Helper4Swift/Extensions/Int+Extension.swift (in target 'Helper4Swift' from project 'Helper4Swift')
Command SwiftCompile failed with a nonzero exit code
--- xcodebuild: WARNING: Using the first of multiple matching destinations:
{ platform:macOS, arch:arm64, id:5f7d3d39af8c60ff28078c34e5f853432a73bc69, name:My Mac }
{ platform:macOS, arch:arm64, variant:Mac Catalyst, id:5f7d3d39af8c60ff28078c34e5f853432a73bc69, name:My Mac }
{ platform:macOS, arch:arm64, variant:DriverKit, id:5f7d3d39af8c60ff28078c34e5f853432a73bc69, name:My Mac }
{ platform:macOS, arch:arm64, variant:Designed for [iPad,iPhone], id:5f7d3d39af8c60ff28078c34e5f853432a73bc69, name:My Mac }
** BUILD FAILED **
The following build commands failed:
	SwiftEmitModule normal arm64 Emitting\ module\ for\ Helper4Swift (in target 'Helper4Swift' from project 'Helper4Swift')
	EmitSwiftModule normal arm64 (in target 'Helper4Swift' from project 'Helper4Swift')
	SwiftCompile normal arm64 Compiling\ Dictionary+Extension.swift,\ Dispatch+Extension.swift,\ Encodable+Extension.swift,\ Int+Extension.swift /Users/admin/builder/spi-builder-workspace/Sources/Helper4Swift/Extensions/Dictionary+Extension.swift /Users/admin/builder/spi-builder-workspace/Sources/Helper4Swift/Extensions/Dispatch+Extension.swift /Users/admin/builder/spi-builder-workspace/Sources/Helper4Swift/Extensions/Encodable+Extension.swift /Users/admin/builder/spi-builder-workspace/Sources/Helper4Swift/Extensions/Int+Extension.swift (in target 'Helper4Swift' from project 'Helper4Swift')
	Building workspace spi-builder-workspace with scheme Helper4Swift
(4 failures)
Command line invocation:
    /Applications/Xcode-16.3.0.app/Contents/Developer/usr/bin/xcodebuild -IDEClonedSourcePackagesDirPathOverride=/Users/admin/builder/spi-builder-workspace/.dependencies -resolvePackageDependencies
Resolve Package Graph
Resolved source packages:
  Helper4Swift: /Users/admin/builder/spi-builder-workspace
resolved source packages: Helper4Swift
{
  "dependencies" : [
  ],
  "manifest_display_name" : "Helper4Swift",
  "name" : "Helper4Swift",
  "path" : "/Users/admin/builder/spi-builder-workspace",
  "platforms" : [
    {
      "name" : "ios",
      "version" : "13.0"
    },
    {
      "name" : "tvos",
      "version" : "10.0"
    },
    {
      "name" : "watchos",
      "version" : "3.0"
    },
    {
      "name" : "macos",
      "version" : "10.13"
    }
  ],
  "products" : [
    {
      "name" : "Helper4Swift",
      "targets" : [
        "Helper4Swift"
      ],
      "type" : {
        "library" : [
          "automatic"
        ]
      }
    }
  ],
  "targets" : [
    {
      "c99name" : "Helper4SwiftTests",
      "module_type" : "SwiftTarget",
      "name" : "Helper4SwiftTests",
      "path" : "Tests/Helper4SwiftTests",
      "sources" : [
        "Helper4SwiftTests.swift",
        "XCTestManifests.swift"
      ],
      "target_dependencies" : [
        "Helper4Swift"
      ],
      "type" : "test"
    },
    {
      "c99name" : "Helper4Swift",
      "module_type" : "SwiftTarget",
      "name" : "Helper4Swift",
      "path" : "Sources/Helper4Swift",
      "product_memberships" : [
        "Helper4Swift"
      ],
      "sources" : [
        "Extensions/Array+Extension.swift",
        "Extensions/Binding+Extension.swift",
        "Extensions/Bundle+Extension.swift",
        "Extensions/CALayer+Extension.swift",
        "Extensions/CLLocationCoordinate2D+Extension.swift",
        "Extensions/CheckedContinuation+Extension.swift",
        "Extensions/Color+Extension.swift",
        "Extensions/Date+Extension.swift",
        "Extensions/Dictionary+Extension.swift",
        "Extensions/Dispatch+Extension.swift",
        "Extensions/Encodable+Extension.swift",
        "Extensions/Int+Extension.swift",
        "Extensions/JSONDecoder+Extension.swift",
        "Extensions/MKCoordinateSpan+Extension.swift",
        "Extensions/NSMutableAttributedString+Extension.swift",
        "Extensions/Optional+Extension.swift",
        "Extensions/Sequence+Extension.swift",
        "Extensions/String+Extension.swift",
        "Extensions/TimeInterval+Extension.swift",
        "Extensions/UIApplication+Extension.swift",
        "Extensions/UIButton+Extension.swift",
        "Extensions/UICollectionView+Extension.swift",
        "Extensions/UIColor+Extension.swift",
        "Extensions/UIImage+Extension.swift",
        "Extensions/UIImageView+Extension.swift",
        "Extensions/UIKeyboardType+Extension.swift",
        "Extensions/UILabel+Extension.swift",
        "Extensions/UINavigationController+Extension.swift",
        "Extensions/UIStoryboard+Extension.swift",
        "Extensions/UITabBarController+Extension.swift",
        "Extensions/UITableView+Extension.swift",
        "Extensions/UITextField+Extension.swift",
        "Extensions/UITextView+Extension.swift",
        "Extensions/UIView+Extension.swift",
        "Extensions/UIViewAutoLayout+Extension.swift",
        "Extensions/UIViewController+Extension.swift",
        "Extensions/UIViewController+LocalAuthentication+Extension.swift",
        "Extensions/URL+Extension.swift",
        "Helper4Swift.swift",
        "SubClasses/UIViewFromNib.swift"
      ],
      "type" : "library"
    }
  ],
  "tools_version" : "5.2"
}
{
  "workspace" : {
    "name" : "spi-builder-workspace",
    "schemes" : [
      "Helper4Swift"
    ]
  }
}
Running build ...
env DEVELOPER_DIR=/Applications/Xcode-16.3.0.app xcrun xcodebuild -IDEClonedSourcePackagesDirPathOverride=$PWD/.dependencies -skipMacroValidation -skipPackagePluginValidation -derivedDataPath $PWD/.derivedData build -scheme Helper4Swift -destination platform=macOS,arch=arm64
Command line invocation:
    /Applications/Xcode-16.3.0.app/Contents/Developer/usr/bin/xcodebuild -IDEClonedSourcePackagesDirPathOverride=/Users/admin/builder/spi-builder-workspace/.dependencies -skipMacroValidation -skipPackagePluginValidation -derivedDataPath /Users/admin/builder/spi-builder-workspace/.derivedData build -scheme Helper4Swift -destination platform=macOS,arch=arm64
Resolve Package Graph
Resolved source packages:
  Helper4Swift: /Users/admin/builder/spi-builder-workspace
ComputePackagePrebuildTargetDependencyGraph
Prepare packages
CreateBuildRequest
SendProjectDescription
CreateBuildOperation
ComputeTargetDependencyGraph
note: Building targets in dependency order
note: Target dependency graph (2 targets)
    Target 'Helper4Swift' in project 'Helper4Swift'
        ➜ Explicit dependency on target 'Helper4Swift' in project 'Helper4Swift'
    Target 'Helper4Swift' in project 'Helper4Swift' (no dependencies)
GatherProvisioningInputs
CreateBuildDescription
ExecuteExternalTool /Applications/Xcode-16.3.0.app/Contents/Developer/Toolchains/XcodeDefault.xctoolchain/usr/bin/clang -v -E -dM -isysroot /Applications/Xcode-16.3.0.app/Contents/Developer/Platforms/MacOSX.platform/Developer/SDKs/MacOSX15.4.sdk -x c -c /dev/null
ExecuteExternalTool /Applications/Xcode-16.3.0.app/Contents/Developer/Toolchains/XcodeDefault.xctoolchain/usr/bin/swiftc --version
ExecuteExternalTool /Applications/Xcode-16.3.0.app/Contents/Developer/Toolchains/XcodeDefault.xctoolchain/usr/bin/ld -version_details
Build description signature: 51863fde071ac03f3f02f9ee6f1d46a6
Build description path: /Users/admin/builder/spi-builder-workspace/.derivedData/Build/Intermediates.noindex/XCBuildData/51863fde071ac03f3f02f9ee6f1d46a6.xcbuilddata
ClangStatCache /Applications/Xcode-16.3.0.app/Contents/Developer/Toolchains/XcodeDefault.xctoolchain/usr/bin/clang-stat-cache /Applications/Xcode-16.3.0.app/Contents/Developer/Platforms/MacOSX.platform/Developer/SDKs/MacOSX15.4.sdk /Users/admin/builder/spi-builder-workspace/.derivedData/SDKStatCaches.noindex/macosx15.4-24E241-8287b8f5db97e746a1562fbca0c9d29b.sdkstatcache
    cd /Users/admin/builder/spi-builder-workspace/.swiftpm/xcode
    /Applications/Xcode-16.3.0.app/Contents/Developer/Toolchains/XcodeDefault.xctoolchain/usr/bin/clang-stat-cache /Applications/Xcode-16.3.0.app/Contents/Developer/Platforms/MacOSX.platform/Developer/SDKs/MacOSX15.4.sdk -o /Users/admin/builder/spi-builder-workspace/.derivedData/SDKStatCaches.noindex/macosx15.4-24E241-8287b8f5db97e746a1562fbca0c9d29b.sdkstatcache
SwiftDriver Helper4Swift normal arm64 com.apple.xcode.tools.swift.compiler (in target 'Helper4Swift' from project 'Helper4Swift')
    cd /Users/admin/builder/spi-builder-workspace/.swiftpm/xcode
    builtin-SwiftDriver -- /Applications/Xcode-16.3.0.app/Contents/Developer/Toolchains/XcodeDefault.xctoolchain/usr/bin/swiftc -module-name Helper4Swift -Onone -enforce-exclusivity\=checked @/Users/admin/builder/spi-builder-workspace/.derivedData/Build/Intermediates.noindex/Helper4Swift.build/Debug/Helper4Swift.build/Objects-normal/arm64/Helper4Swift.SwiftFileList -DSWIFT_PACKAGE -DDEBUG -DXcode -plugin-path /Applications/Xcode-16.3.0.app/Contents/Developer/Toolchains/XcodeDefault.xctoolchain/usr/lib/swift/host/plugins/testing -enable-experimental-feature DebugDescriptionMacro -sdk /Applications/Xcode-16.3.0.app/Contents/Developer/Platforms/MacOSX.platform/Developer/SDKs/MacOSX15.4.sdk -target arm64-apple-macos10.13 -g -module-cache-path /Users/admin/builder/spi-builder-workspace/.derivedData/ModuleCache.noindex -Xfrontend -serialize-debugging-options -profile-coverage-mapping -profile-generate -enable-testing -index-store-path /Users/admin/builder/spi-builder-workspace/.derivedData/Index.noindex/DataStore -swift-version 5 -I /Users/admin/builder/spi-builder-workspace/.derivedData/Build/Products/Debug -I /Applications/Xcode-16.3.0.app/Contents/Developer/Platforms/MacOSX.platform/Developer/usr/lib -F /Users/admin/builder/spi-builder-workspace/.derivedData/Build/Products/Debug -F /Applications/Xcode-16.3.0.app/Contents/Developer/Platforms/MacOSX.platform/Developer/Library/Frameworks -c -j10 -enable-batch-mode -incremental -Xcc -ivfsstatcache -Xcc /Users/admin/builder/spi-builder-workspace/.derivedData/SDKStatCaches.noindex/macosx15.4-24E241-8287b8f5db97e746a1562fbca0c9d29b.sdkstatcache -output-file-map /Users/admin/builder/spi-builder-workspace/.derivedData/Build/Intermediates.noindex/Helper4Swift.build/Debug/Helper4Swift.build/Objects-normal/arm64/Helper4Swift-OutputFileMap.json -use-frontend-parseable-output -save-temps -no-color-diagnostics -serialize-diagnostics -emit-dependencies -emit-module -emit-module-path /Users/admin/builder/spi-builder-workspace/.derivedData/Build/Intermediates.noindex/Helper4Swift.build/Debug/Helper4Swift.build/Objects-normal/arm64/Helper4Swift.swiftmodule -validate-clang-modules-once -clang-build-session-file /Users/admin/builder/spi-builder-workspace/.derivedData/ModuleCache.noindex/Session.modulevalidation -Xcc -I/Users/admin/builder/spi-builder-workspace/.derivedData/Build/Intermediates.noindex/Helper4Swift.build/Debug/Helper4Swift.build/swift-overrides.hmap -emit-const-values -Xfrontend -const-gather-protocols-file -Xfrontend /Users/admin/builder/spi-builder-workspace/.derivedData/Build/Intermediates.noindex/Helper4Swift.build/Debug/Helper4Swift.build/Objects-normal/arm64/Helper4Swift_const_extract_protocols.json -Xcc -I/Users/admin/builder/spi-builder-workspace/.derivedData/Build/Products/Debug/include -Xcc -I/Users/admin/builder/spi-builder-workspace/.derivedData/Build/Intermediates.noindex/Helper4Swift.build/Debug/Helper4Swift.build/DerivedSources-normal/arm64 -Xcc -I/Users/admin/builder/spi-builder-workspace/.derivedData/Build/Intermediates.noindex/Helper4Swift.build/Debug/Helper4Swift.build/DerivedSources/arm64 -Xcc -I/Users/admin/builder/spi-builder-workspace/.derivedData/Build/Intermediates.noindex/Helper4Swift.build/Debug/Helper4Swift.build/DerivedSources -Xcc -DSWIFT_PACKAGE -Xcc -DDEBUG\=1 -emit-objc-header -emit-objc-header-path /Users/admin/builder/spi-builder-workspace/.derivedData/Build/Intermediates.noindex/Helper4Swift.build/Debug/Helper4Swift.build/Objects-normal/arm64/Helper4Swift-Swift.h -working-directory /Users/admin/builder/spi-builder-workspace/.swiftpm/xcode -experimental-emit-module-separately -disable-cmo
SwiftCompile normal arm64 Compiling\ CLLocationCoordinate2D+Extension.swift,\ CheckedContinuation+Extension.swift,\ Color+Extension.swift,\ Date+Extension.swift /Users/admin/builder/spi-builder-workspace/Sources/Helper4Swift/Extensions/CLLocationCoordinate2D+Extension.swift /Users/admin/builder/spi-builder-workspace/Sources/Helper4Swift/Extensions/CheckedContinuation+Extension.swift /Users/admin/builder/spi-builder-workspace/Sources/Helper4Swift/Extensions/Color+Extension.swift /Users/admin/builder/spi-builder-workspace/Sources/Helper4Swift/Extensions/Date+Extension.swift (in target 'Helper4Swift' from project 'Helper4Swift')
SwiftCompile normal arm64 /Users/admin/builder/spi-builder-workspace/Sources/Helper4Swift/Extensions/CLLocationCoordinate2D+Extension.swift (in target 'Helper4Swift' from project 'Helper4Swift')
    cd /Users/admin/builder/spi-builder-workspace/.swiftpm/xcode

SwiftCompile normal arm64 /Users/admin/builder/spi-builder-workspace/Sources/Helper4Swift/Extensions/CheckedContinuation+Extension.swift (in target 'Helper4Swift' from project 'Helper4Swift')
    cd /Users/admin/builder/spi-builder-workspace/.swiftpm/xcode

SwiftCompile normal arm64 /Users/admin/builder/spi-builder-workspace/Sources/Helper4Swift/Extensions/Color+Extension.swift (in target 'Helper4Swift' from project 'Helper4Swift')
    cd /Users/admin/builder/spi-builder-workspace/.swiftpm/xcode

SwiftCompile normal arm64 /Users/admin/builder/spi-builder-workspace/Sources/Helper4Swift/Extensions/Date+Extension.swift (in target 'Helper4Swift' from project 'Helper4Swift')
    cd /Users/admin/builder/spi-builder-workspace/.swiftpm/xcode

SwiftCompile normal arm64 Compiling\ Array+Extension.swift,\ Binding+Extension.swift,\ Bundle+Extension.swift,\ CALayer+Extension.swift /Users/admin/builder/spi-builder-workspace/Sources/Helper4Swift/Extensions/Array+Extension.swift /Users/admin/builder/spi-builder-workspace/Sources/Helper4Swift/Extensions/Binding+Extension.swift /Users/admin/builder/spi-builder-workspace/Sources/Helper4Swift/Extensions/Bundle+Extension.swift /Users/admin/builder/spi-builder-workspace/Sources/Helper4Swift/Extensions/CALayer+Extension.swift (in target 'Helper4Swift' from project 'Helper4Swift')
SwiftCompile normal arm64 /Users/admin/builder/spi-builder-workspace/Sources/Helper4Swift/Extensions/Array+Extension.swift (in target 'Helper4Swift' from project 'Helper4Swift')
    cd /Users/admin/builder/spi-builder-workspace/.swiftpm/xcode

SwiftCompile normal arm64 /Users/admin/builder/spi-builder-workspace/Sources/Helper4Swift/Extensions/Binding+Extension.swift (in target 'Helper4Swift' from project 'Helper4Swift')
    cd /Users/admin/builder/spi-builder-workspace/.swiftpm/xcode

SwiftCompile normal arm64 /Users/admin/builder/spi-builder-workspace/Sources/Helper4Swift/Extensions/Bundle+Extension.swift (in target 'Helper4Swift' from project 'Helper4Swift')
    cd /Users/admin/builder/spi-builder-workspace/.swiftpm/xcode

SwiftCompile normal arm64 /Users/admin/builder/spi-builder-workspace/Sources/Helper4Swift/Extensions/CALayer+Extension.swift (in target 'Helper4Swift' from project 'Helper4Swift')
    cd /Users/admin/builder/spi-builder-workspace/.swiftpm/xcode

SwiftCompile normal arm64 Compiling\ Dictionary+Extension.swift,\ Dispatch+Extension.swift,\ Encodable+Extension.swift,\ Int+Extension.swift /Users/admin/builder/spi-builder-workspace/Sources/Helper4Swift/Extensions/Dictionary+Extension.swift /Users/admin/builder/spi-builder-workspace/Sources/Helper4Swift/Extensions/Dispatch+Extension.swift /Users/admin/builder/spi-builder-workspace/Sources/Helper4Swift/Extensions/Encodable+Extension.swift /Users/admin/builder/spi-builder-workspace/Sources/Helper4Swift/Extensions/Int+Extension.swift (in target 'Helper4Swift' from project 'Helper4Swift')
SwiftCompile normal arm64 /Users/admin/builder/spi-builder-workspace/Sources/Helper4Swift/Extensions/Dictionary+Extension.swift (in target 'Helper4Swift' from project 'Helper4Swift')
    cd /Users/admin/builder/spi-builder-workspace/.swiftpm/xcode

SwiftCompile normal arm64 /Users/admin/builder/spi-builder-workspace/Sources/Helper4Swift/Extensions/Dispatch+Extension.swift (in target 'Helper4Swift' from project 'Helper4Swift')
    cd /Users/admin/builder/spi-builder-workspace/.swiftpm/xcode

SwiftCompile normal arm64 /Users/admin/builder/spi-builder-workspace/Sources/Helper4Swift/Extensions/Encodable+Extension.swift (in target 'Helper4Swift' from project 'Helper4Swift')
    cd /Users/admin/builder/spi-builder-workspace/.swiftpm/xcode

SwiftCompile normal arm64 /Users/admin/builder/spi-builder-workspace/Sources/Helper4Swift/Extensions/Int+Extension.swift (in target 'Helper4Swift' from project 'Helper4Swift')
    cd /Users/admin/builder/spi-builder-workspace/.swiftpm/xcode

SwiftCompile normal arm64 Compiling\ JSONDecoder+Extension.swift,\ MKCoordinateSpan+Extension.swift,\ NSMutableAttributedString+Extension.swift,\ Optional+Extension.swift /Users/admin/builder/spi-builder-workspace/Sources/Helper4Swift/Extensions/JSONDecoder+Extension.swift /Users/admin/builder/spi-builder-workspace/Sources/Helper4Swift/Extensions/MKCoordinateSpan+Extension.swift /Users/admin/builder/spi-builder-workspace/Sources/Helper4Swift/Extensions/NSMutableAttributedString+Extension.swift /Users/admin/builder/spi-builder-workspace/Sources/Helper4Swift/Extensions/Optional+Extension.swift (in target 'Helper4Swift' from project 'Helper4Swift')
SwiftCompile normal arm64 /Users/admin/builder/spi-builder-workspace/Sources/Helper4Swift/Extensions/JSONDecoder+Extension.swift (in target 'Helper4Swift' from project 'Helper4Swift')
    cd /Users/admin/builder/spi-builder-workspace/.swiftpm/xcode

SwiftCompile normal arm64 /Users/admin/builder/spi-builder-workspace/Sources/Helper4Swift/Extensions/MKCoordinateSpan+Extension.swift (in target 'Helper4Swift' from project 'Helper4Swift')
    cd /Users/admin/builder/spi-builder-workspace/.swiftpm/xcode

SwiftCompile normal arm64 /Users/admin/builder/spi-builder-workspace/Sources/Helper4Swift/Extensions/NSMutableAttributedString+Extension.swift (in target 'Helper4Swift' from project 'Helper4Swift')
    cd /Users/admin/builder/spi-builder-workspace/.swiftpm/xcode

SwiftCompile normal arm64 /Users/admin/builder/spi-builder-workspace/Sources/Helper4Swift/Extensions/Optional+Extension.swift (in target 'Helper4Swift' from project 'Helper4Swift')
    cd /Users/admin/builder/spi-builder-workspace/.swiftpm/xcode

SwiftCompile normal arm64 Compiling\ Sequence+Extension.swift,\ String+Extension.swift,\ TimeInterval+Extension.swift,\ UIApplication+Extension.swift /Users/admin/builder/spi-builder-workspace/Sources/Helper4Swift/Extensions/Sequence+Extension.swift /Users/admin/builder/spi-builder-workspace/Sources/Helper4Swift/Extensions/String+Extension.swift /Users/admin/builder/spi-builder-workspace/Sources/Helper4Swift/Extensions/TimeInterval+Extension.swift /Users/admin/builder/spi-builder-workspace/Sources/Helper4Swift/Extensions/UIApplication+Extension.swift (in target 'Helper4Swift' from project 'Helper4Swift')
SwiftCompile normal arm64 /Users/admin/builder/spi-builder-workspace/Sources/Helper4Swift/Extensions/Sequence+Extension.swift (in target 'Helper4Swift' from project 'Helper4Swift')
    cd /Users/admin/builder/spi-builder-workspace/.swiftpm/xcode

SwiftCompile normal arm64 /Users/admin/builder/spi-builder-workspace/Sources/Helper4Swift/Extensions/String+Extension.swift (in target 'Helper4Swift' from project 'Helper4Swift')
    cd /Users/admin/builder/spi-builder-workspace/.swiftpm/xcode

SwiftCompile normal arm64 /Users/admin/builder/spi-builder-workspace/Sources/Helper4Swift/Extensions/TimeInterval+Extension.swift (in target 'Helper4Swift' from project 'Helper4Swift')
    cd /Users/admin/builder/spi-builder-workspace/.swiftpm/xcode

SwiftCompile normal arm64 /Users/admin/builder/spi-builder-workspace/Sources/Helper4Swift/Extensions/UIApplication+Extension.swift (in target 'Helper4Swift' from project 'Helper4Swift')
    cd /Users/admin/builder/spi-builder-workspace/.swiftpm/xcode

SwiftCompile normal arm64 Compiling\ UIImageView+Extension.swift,\ UIKeyboardType+Extension.swift,\ UILabel+Extension.swift,\ UINavigationController+Extension.swift /Users/admin/builder/spi-builder-workspace/Sources/Helper4Swift/Extensions/UIImageView+Extension.swift /Users/admin/builder/spi-builder-workspace/Sources/Helper4Swift/Extensions/UIKeyboardType+Extension.swift /Users/admin/builder/spi-builder-workspace/Sources/Helper4Swift/Extensions/UILabel+Extension.swift /Users/admin/builder/spi-builder-workspace/Sources/Helper4Swift/Extensions/UINavigationController+Extension.swift (in target 'Helper4Swift' from project 'Helper4Swift')
SwiftCompile normal arm64 /Users/admin/builder/spi-builder-workspace/Sources/Helper4Swift/Extensions/UIImageView+Extension.swift (in target 'Helper4Swift' from project 'Helper4Swift')
    cd /Users/admin/builder/spi-builder-workspace/.swiftpm/xcode

SwiftCompile normal arm64 /Users/admin/builder/spi-builder-workspace/Sources/Helper4Swift/Extensions/UIKeyboardType+Extension.swift (in target 'Helper4Swift' from project 'Helper4Swift')
    cd /Users/admin/builder/spi-builder-workspace/.swiftpm/xcode

SwiftCompile normal arm64 /Users/admin/builder/spi-builder-workspace/Sources/Helper4Swift/Extensions/UILabel+Extension.swift (in target 'Helper4Swift' from project 'Helper4Swift')
    cd /Users/admin/builder/spi-builder-workspace/.swiftpm/xcode

SwiftCompile normal arm64 /Users/admin/builder/spi-builder-workspace/Sources/Helper4Swift/Extensions/UINavigationController+Extension.swift (in target 'Helper4Swift' from project 'Helper4Swift')
    cd /Users/admin/builder/spi-builder-workspace/.swiftpm/xcode

SwiftCompile normal arm64 Compiling\ UIButton+Extension.swift,\ UICollectionView+Extension.swift,\ UIColor+Extension.swift,\ UIImage+Extension.swift /Users/admin/builder/spi-builder-workspace/Sources/Helper4Swift/Extensions/UIButton+Extension.swift /Users/admin/builder/spi-builder-workspace/Sources/Helper4Swift/Extensions/UICollectionView+Extension.swift /Users/admin/builder/spi-builder-workspace/Sources/Helper4Swift/Extensions/UIColor+Extension.swift /Users/admin/builder/spi-builder-workspace/Sources/Helper4Swift/Extensions/UIImage+Extension.swift (in target 'Helper4Swift' from project 'Helper4Swift')
SwiftCompile normal arm64 /Users/admin/builder/spi-builder-workspace/Sources/Helper4Swift/Extensions/UIButton+Extension.swift (in target 'Helper4Swift' from project 'Helper4Swift')
    cd /Users/admin/builder/spi-builder-workspace/.swiftpm/xcode

SwiftCompile normal arm64 /Users/admin/builder/spi-builder-workspace/Sources/Helper4Swift/Extensions/UICollectionView+Extension.swift (in target 'Helper4Swift' from project 'Helper4Swift')
    cd /Users/admin/builder/spi-builder-workspace/.swiftpm/xcode

SwiftCompile normal arm64 /Users/admin/builder/spi-builder-workspace/Sources/Helper4Swift/Extensions/UIColor+Extension.swift (in target 'Helper4Swift' from project 'Helper4Swift')
    cd /Users/admin/builder/spi-builder-workspace/.swiftpm/xcode

SwiftCompile normal arm64 /Users/admin/builder/spi-builder-workspace/Sources/Helper4Swift/Extensions/UIImage+Extension.swift (in target 'Helper4Swift' from project 'Helper4Swift')
    cd /Users/admin/builder/spi-builder-workspace/.swiftpm/xcode

SwiftEmitModule normal arm64 Emitting\ module\ for\ Helper4Swift (in target 'Helper4Swift' from project 'Helper4Swift')
Failed frontend command:
/Applications/Xcode-16.3.0.app/Contents/Developer/Toolchains/XcodeDefault.xctoolchain/usr/bin/swift-frontend -frontend -emit-module -experimental-skip-non-inlinable-function-bodies-without-types /Users/admin/builder/spi-builder-workspace/Sources/Helper4Swift/Extensions/Array+Extension.swift /Users/admin/builder/spi-builder-workspace/Sources/Helper4Swift/Extensions/Binding+Extension.swift /Users/admin/builder/spi-builder-workspace/Sources/Helper4Swift/Extensions/Bundle+Extension.swift /Users/admin/builder/spi-builder-workspace/Sources/Helper4Swift/Extensions/CALayer+Extension.swift /Users/admin/builder/spi-builder-workspace/Sources/Helper4Swift/Extensions/CLLocationCoordinate2D+Extension.swift /Users/admin/builder/spi-builder-workspace/Sources/Helper4Swift/Extensions/CheckedContinuation+Extension.swift /Users/admin/builder/spi-builder-workspace/Sources/Helper4Swift/Extensions/Color+Extension.swift /Users/admin/builder/spi-builder-workspace/Sources/Helper4Swift/Extensions/Date+Extension.swift /Users/admin/builder/spi-builder-workspace/Sources/Helper4Swift/Extensions/Dictionary+Extension.swift /Users/admin/builder/spi-builder-workspace/Sources/Helper4Swift/Extensions/Dispatch+Extension.swift /Users/admin/builder/spi-builder-workspace/Sources/Helper4Swift/Extensions/Encodable+Extension.swift /Users/admin/builder/spi-builder-workspace/Sources/Helper4Swift/Extensions/Int+Extension.swift /Users/admin/builder/spi-builder-workspace/Sources/Helper4Swift/Extensions/JSONDecoder+Extension.swift /Users/admin/builder/spi-builder-workspace/Sources/Helper4Swift/Extensions/MKCoordinateSpan+Extension.swift /Users/admin/builder/spi-builder-workspace/Sources/Helper4Swift/Extensions/NSMutableAttributedString+Extension.swift /Users/admin/builder/spi-builder-workspace/Sources/Helper4Swift/Extensions/Optional+Extension.swift /Users/admin/builder/spi-builder-workspace/Sources/Helper4Swift/Extensions/Sequence+Extension.swift /Users/admin/builder/spi-builder-workspace/Sources/Helper4Swift/Extensions/String+Extension.swift /Users/admin/builder/spi-builder-workspace/Sources/Helper4Swift/Extensions/TimeInterval+Extension.swift /Users/admin/builder/spi-builder-workspace/Sources/Helper4Swift/Extensions/UIApplication+Extension.swift /Users/admin/builder/spi-builder-workspace/Sources/Helper4Swift/Extensions/UIButton+Extension.swift /Users/admin/builder/spi-builder-workspace/Sources/Helper4Swift/Extensions/UICollectionView+Extension.swift /Users/admin/builder/spi-builder-workspace/Sources/Helper4Swift/Extensions/UIColor+Extension.swift /Users/admin/builder/spi-builder-workspace/Sources/Helper4Swift/Extensions/UIImage+Extension.swift /Users/admin/builder/spi-builder-workspace/Sources/Helper4Swift/Extensions/UIImageView+Extension.swift /Users/admin/builder/spi-builder-workspace/Sources/Helper4Swift/Extensions/UIKeyboardType+Extension.swift /Users/admin/builder/spi-builder-workspace/Sources/Helper4Swift/Extensions/UILabel+Extension.swift /Users/admin/builder/spi-builder-workspace/Sources/Helper4Swift/Extensions/UINavigationController+Extension.swift /Users/admin/builder/spi-builder-workspace/Sources/Helper4Swift/Extensions/UIStoryboard+Extension.swift /Users/admin/builder/spi-builder-workspace/Sources/Helper4Swift/Extensions/UITabBarController+Extension.swift /Users/admin/builder/spi-builder-workspace/Sources/Helper4Swift/Extensions/UITableView+Extension.swift /Users/admin/builder/spi-builder-workspace/Sources/Helper4Swift/Extensions/UITextField+Extension.swift /Users/admin/builder/spi-builder-workspace/Sources/Helper4Swift/Extensions/UITextView+Extension.swift /Users/admin/builder/spi-builder-workspace/Sources/Helper4Swift/Extensions/UIView+Extension.swift /Users/admin/builder/spi-builder-workspace/Sources/Helper4Swift/Extensions/UIViewAutoLayout+Extension.swift /Users/admin/builder/spi-builder-workspace/Sources/Helper4Swift/Extensions/UIViewController+Extension.swift /Users/admin/builder/spi-builder-workspace/Sources/Helper4Swift/Extensions/UIViewController+LocalAuthentication+Extension.swift /Users/admin/builder/spi-builder-workspace/Sources/Helper4Swift/Extensions/URL+Extension.swift /Users/admin/builder/spi-builder-workspace/Sources/Helper4Swift/Helper4Swift.swift /Users/admin/builder/spi-builder-workspace/Sources/Helper4Swift/SubClasses/UIViewFromNib.swift -target arm64-apple-macos10.13 -Xllvm -aarch64-use-tbi -enable-objc-interop -sdk /Applications/Xcode-16.3.0.app/Contents/Developer/Platforms/MacOSX.platform/Developer/SDKs/MacOSX15.4.sdk -I /Users/admin/builder/spi-builder-workspace/.derivedData/Build/Products/Debug -I /Applications/Xcode-16.3.0.app/Contents/Developer/Platforms/MacOSX.platform/Developer/usr/lib -F /Users/admin/builder/spi-builder-workspace/.derivedData/Build/Products/Debug -F /Applications/Xcode-16.3.0.app/Contents/Developer/Platforms/MacOSX.platform/Developer/Library/Frameworks -no-color-diagnostics -enable-testing -g -debug-info-format\=dwarf -dwarf-version\=4 -module-cache-path /Users/admin/builder/spi-builder-workspace/.derivedData/ModuleCache.noindex -profile-generate -profile-coverage-mapping -swift-version 5 -enforce-exclusivity\=checked -Onone -D SWIFT_PACKAGE -D DEBUG -D Xcode -serialize-debugging-options -const-gather-protocols-file /Users/admin/builder/spi-builder-workspace/.derivedData/Build/Intermediates.noindex/Helper4Swift.build/Debug/Helper4Swift.build/Objects-normal/arm64/Helper4Swift_const_extract_protocols.json -enable-experimental-feature DebugDescriptionMacro -empty-abi-descriptor -plugin-path /Applications/Xcode-16.3.0.app/Contents/Developer/Toolchains/XcodeDefault.xctoolchain/usr/lib/swift/host/plugins/testing -validate-clang-modules-once -clang-build-session-file /Users/admin/builder/spi-builder-workspace/.derivedData/ModuleCache.noindex/Session.modulevalidation -Xcc -working-directory -Xcc /Users/admin/builder/spi-builder-workspace/.swiftpm/xcode -resource-dir /Applications/Xcode-16.3.0.app/Contents/Developer/Toolchains/XcodeDefault.xctoolchain/usr/lib/swift -enable-anonymous-context-mangled-names -file-compilation-dir /Users/admin/builder/spi-builder-workspace/.swiftpm/xcode -Xcc -ivfsstatcache -Xcc /Users/admin/builder/spi-builder-workspace/.derivedData/SDKStatCaches.noindex/macosx15.4-24E241-8287b8f5db97e746a1562fbca0c9d29b.sdkstatcache -Xcc -I/Users/admin/builder/spi-builder-workspace/.derivedData/Build/Intermediates.noindex/Helper4Swift.build/Debug/Helper4Swift.build/swift-overrides.hmap -Xcc -I/Users/admin/builder/spi-builder-workspace/.derivedData/Build/Products/Debug/include -Xcc -I/Users/admin/builder/spi-builder-workspace/.derivedData/Build/Intermediates.noindex/Helper4Swift.build/Debug/Helper4Swift.build/DerivedSources-normal/arm64 -Xcc -I/Users/admin/builder/spi-builder-workspace/.derivedData/Build/Intermediates.noindex/Helper4Swift.build/Debug/Helper4Swift.build/DerivedSources/arm64 -Xcc -I/Users/admin/builder/spi-builder-workspace/.derivedData/Build/Intermediates.noindex/Helper4Swift.build/Debug/Helper4Swift.build/DerivedSources -Xcc -DSWIFT_PACKAGE -Xcc -DDEBUG\=1 -module-name Helper4Swift -frontend-parseable-output -disable-clang-spi -target-sdk-version 15.4 -target-sdk-name macosx15.4 -external-plugin-path /Applications/Xcode-16.3.0.app/Contents/Developer/Platforms/MacOSX.platform/Developer/usr/lib/swift/host/plugins\#/Applications/Xcode-16.3.0.app/Contents/Developer/Platforms/MacOSX.platform/Developer/usr/bin/swift-plugin-server -external-plugin-path /Applications/Xcode-16.3.0.app/Contents/Developer/Platforms/MacOSX.platform/Developer/usr/local/lib/swift/host/plugins\#/Applications/Xcode-16.3.0.app/Contents/Developer/Platforms/MacOSX.platform/Developer/usr/bin/swift-plugin-server -in-process-plugin-server-path /Applications/Xcode-16.3.0.app/Contents/Developer/Toolchains/XcodeDefault.xctoolchain/usr/lib/swift/host/libSwiftInProcPluginServer.dylib -plugin-path /Applications/Xcode-16.3.0.app/Contents/Developer/Toolchains/XcodeDefault.xctoolchain/usr/lib/swift/host/plugins -plugin-path /Applications/Xcode-16.3.0.app/Contents/Developer/Toolchains/XcodeDefault.xctoolchain/usr/local/lib/swift/host/plugins -emit-module-doc-path /Users/admin/builder/spi-builder-workspace/.derivedData/Build/Intermediates.noindex/Helper4Swift.build/Debug/Helper4Swift.build/Objects-normal/arm64/Helper4Swift.swiftdoc -emit-module-source-info-path /Users/admin/builder/spi-builder-workspace/.derivedData/Build/Intermediates.noindex/Helper4Swift.build/Debug/Helper4Swift.build/Objects-normal/arm64/Helper4Swift.swiftsourceinfo -emit-objc-header-path /Users/admin/builder/spi-builder-workspace/.derivedData/Build/Intermediates.noindex/Helper4Swift.build/Debug/Helper4Swift.build/Objects-normal/arm64/Helper4Swift-Swift.h -serialize-diagnostics-path /Users/admin/builder/spi-builder-workspace/.derivedData/Build/Intermediates.noindex/Helper4Swift.build/Debug/Helper4Swift.build/Objects-normal/arm64/Helper4Swift-master-emit-module.dia -emit-dependencies-path /Users/admin/builder/spi-builder-workspace/.derivedData/Build/Intermediates.noindex/Helper4Swift.build/Debug/Helper4Swift.build/Objects-normal/arm64/Helper4Swift-master-emit-module.d -o /Users/admin/builder/spi-builder-workspace/.derivedData/Build/Intermediates.noindex/Helper4Swift.build/Debug/Helper4Swift.build/Objects-normal/arm64/Helper4Swift.swiftmodule -emit-abi-descriptor-path /Users/admin/builder/spi-builder-workspace/.derivedData/Build/Intermediates.noindex/Helper4Swift.build/Debug/Helper4Swift.build/Objects-normal/arm64/Helper4Swift.abi.json
EmitSwiftModule normal arm64 (in target 'Helper4Swift' from project 'Helper4Swift')
    cd /Users/admin/builder/spi-builder-workspace/.swiftpm/xcode

/Users/admin/builder/spi-builder-workspace/Sources/Helper4Swift/Extensions/Binding+Extension.swift:18:60: error: 'Binding' is only available in macOS 10.15 or newer
    func onChange(_ handler: @escaping (Value) -> Void) -> Binding<Value> {
                                                           ^
/Users/admin/builder/spi-builder-workspace/Sources/Helper4Swift/Extensions/Binding+Extension.swift:18:10: note: add @available attribute to enclosing instance method
    func onChange(_ handler: @escaping (Value) -> Void) -> Binding<Value> {
         ^
/Users/admin/builder/spi-builder-workspace/Sources/Helper4Swift/Extensions/Binding+Extension.swift:11:8: note: add @available attribute to enclosing extension
public extension Binding {
       ^
/Users/admin/builder/spi-builder-workspace/Sources/Helper4Swift/Extensions/Binding+Extension.swift:11:18: error: 'Binding' is only available in macOS 10.15 or newer
public extension Binding {
                 ^
/Users/admin/builder/spi-builder-workspace/Sources/Helper4Swift/Extensions/Binding+Extension.swift:11:8: note: add @available attribute to enclosing extension
public extension Binding {
       ^
/Users/admin/builder/spi-builder-workspace/Sources/Helper4Swift/Extensions/Binding+Extension.swift:30:24: error: 'Binding' is only available in macOS 10.15 or newer
public func ??<T>(lhs: Binding<Optional<T>>, rhs: T) -> Binding<T> {
                       ^
/Users/admin/builder/spi-builder-workspace/Sources/Helper4Swift/Extensions/Binding+Extension.swift:30:13: note: add @available attribute to enclosing operator function
public func ??<T>(lhs: Binding<Optional<T>>, rhs: T) -> Binding<T> {
            ^
/Users/admin/builder/spi-builder-workspace/Sources/Helper4Swift/Extensions/Binding+Extension.swift:30:57: error: 'Binding' is only available in macOS 10.15 or newer
public func ??<T>(lhs: Binding<Optional<T>>, rhs: T) -> Binding<T> {
                                                        ^
/Users/admin/builder/spi-builder-workspace/Sources/Helper4Swift/Extensions/Binding+Extension.swift:30:13: note: add @available attribute to enclosing operator function
public func ??<T>(lhs: Binding<Optional<T>>, rhs: T) -> Binding<T> {
            ^
/Users/admin/builder/spi-builder-workspace/Sources/Helper4Swift/Extensions/CLLocationCoordinate2D+Extension.swift:16:1: warning: extension declares a conformance of imported type 'CLLocationCoordinate2D' to imported protocol 'Equatable'; this will not behave correctly if the owners of 'CoreLocation' introduce this conformance in the future
extension CLLocationCoordinate2D: Equatable {
^
/Users/admin/builder/spi-builder-workspace/Sources/Helper4Swift/Extensions/CLLocationCoordinate2D+Extension.swift:16:1: note: add '@retroactive' to silence this warning
extension CLLocationCoordinate2D: Equatable {
^                                 ~~~~~~~~~
                                  @retroactive Equatable
/Users/admin/builder/spi-builder-workspace/Sources/Helper4Swift/Extensions/CheckedContinuation+Extension.swift:10:18: error: 'CheckedContinuation' is only available in macOS 10.15 or newer
public extension CheckedContinuation where T == Void {
                 ^
/Users/admin/builder/spi-builder-workspace/Sources/Helper4Swift/Extensions/CheckedContinuation+Extension.swift:10:8: note: add @available attribute to enclosing extension
public extension CheckedContinuation where T == Void {
       ^
/Users/admin/builder/spi-builder-workspace/Sources/Helper4Swift/Extensions/Color+Extension.swift:13:23: error: cannot find type 'UIColor' in scope
    func uiColor() -> UIColor {
                      ^~~~~~~
/Users/admin/builder/spi-builder-workspace/Sources/Helper4Swift/Extensions/Color+Extension.swift:11:18: error: 'Color' is only available in macOS 10.15 or newer
public extension Color {
                 ^
/Users/admin/builder/spi-builder-workspace/Sources/Helper4Swift/Extensions/Color+Extension.swift:11:8: note: add @available attribute to enclosing extension
public extension Color {
       ^
/Users/admin/builder/spi-builder-workspace/Sources/Helper4Swift/Extensions/Color+Extension.swift:41:18: error: 'Color' is only available in macOS 10.15 or newer
public extension Color {
                 ^
/Users/admin/builder/spi-builder-workspace/Sources/Helper4Swift/Extensions/Color+Extension.swift:41:8: note: add @available attribute to enclosing extension
public extension Color {
       ^
/Users/admin/builder/spi-builder-workspace/Sources/Helper4Swift/Extensions/Date+Extension.swift:71:21: error: 'RelativeDateTimeFormatter' is only available in macOS 10.15 or newer
        unitsStyle: RelativeDateTimeFormatter.UnitsStyle = .short,
                    ^
/Users/admin/builder/spi-builder-workspace/Sources/Helper4Swift/Extensions/Date+Extension.swift:69:10: note: add @available attribute to enclosing instance method
    func relativeTime(
         ^
/Users/admin/builder/spi-builder-workspace/Sources/Helper4Swift/Extensions/Date+Extension.swift:29:8: note: add @available attribute to enclosing extension
public extension Date {
       ^
/Users/admin/builder/spi-builder-workspace/Sources/Helper4Swift/Extensions/String+Extension.swift:348:23: error: 'Color' is only available in macOS 10.15 or newer
    func toColor() -> Color {
                      ^
/Users/admin/builder/spi-builder-workspace/Sources/Helper4Swift/Extensions/String+Extension.swift:348:10: note: add @available attribute to enclosing instance method
    func toColor() -> Color {
         ^
/Users/admin/builder/spi-builder-workspace/Sources/Helper4Swift/Extensions/String+Extension.swift:346:8: note: add @available attribute to enclosing extension
public extension String {
       ^
SwiftCompile normal arm64 Compiling\ UIViewController+LocalAuthentication+Extension.swift,\ URL+Extension.swift,\ Helper4Swift.swift,\ UIViewFromNib.swift /Users/admin/builder/spi-builder-workspace/Sources/Helper4Swift/Extensions/UIViewController+LocalAuthentication+Extension.swift /Users/admin/builder/spi-builder-workspace/Sources/Helper4Swift/Extensions/URL+Extension.swift /Users/admin/builder/spi-builder-workspace/Sources/Helper4Swift/Helper4Swift.swift /Users/admin/builder/spi-builder-workspace/Sources/Helper4Swift/SubClasses/UIViewFromNib.swift (in target 'Helper4Swift' from project 'Helper4Swift')
SwiftCompile normal arm64 /Users/admin/builder/spi-builder-workspace/Sources/Helper4Swift/Extensions/UIViewController+LocalAuthentication+Extension.swift (in target 'Helper4Swift' from project 'Helper4Swift')
    cd /Users/admin/builder/spi-builder-workspace/.swiftpm/xcode

SwiftCompile normal arm64 /Users/admin/builder/spi-builder-workspace/Sources/Helper4Swift/Extensions/URL+Extension.swift (in target 'Helper4Swift' from project 'Helper4Swift')
    cd /Users/admin/builder/spi-builder-workspace/.swiftpm/xcode

SwiftCompile normal arm64 /Users/admin/builder/spi-builder-workspace/Sources/Helper4Swift/Helper4Swift.swift (in target 'Helper4Swift' from project 'Helper4Swift')
    cd /Users/admin/builder/spi-builder-workspace/.swiftpm/xcode

SwiftCompile normal arm64 /Users/admin/builder/spi-builder-workspace/Sources/Helper4Swift/SubClasses/UIViewFromNib.swift (in target 'Helper4Swift' from project 'Helper4Swift')
    cd /Users/admin/builder/spi-builder-workspace/.swiftpm/xcode

SwiftCompile normal arm64 Compiling\ UITextView+Extension.swift,\ UIView+Extension.swift,\ UIViewAutoLayout+Extension.swift,\ UIViewController+Extension.swift /Users/admin/builder/spi-builder-workspace/Sources/Helper4Swift/Extensions/UITextView+Extension.swift /Users/admin/builder/spi-builder-workspace/Sources/Helper4Swift/Extensions/UIView+Extension.swift /Users/admin/builder/spi-builder-workspace/Sources/Helper4Swift/Extensions/UIViewAutoLayout+Extension.swift /Users/admin/builder/spi-builder-workspace/Sources/Helper4Swift/Extensions/UIViewController+Extension.swift (in target 'Helper4Swift' from project 'Helper4Swift')
SwiftCompile normal arm64 /Users/admin/builder/spi-builder-workspace/Sources/Helper4Swift/Extensions/UITextView+Extension.swift (in target 'Helper4Swift' from project 'Helper4Swift')
    cd /Users/admin/builder/spi-builder-workspace/.swiftpm/xcode

SwiftCompile normal arm64 /Users/admin/builder/spi-builder-workspace/Sources/Helper4Swift/Extensions/UIView+Extension.swift (in target 'Helper4Swift' from project 'Helper4Swift')
    cd /Users/admin/builder/spi-builder-workspace/.swiftpm/xcode

SwiftCompile normal arm64 /Users/admin/builder/spi-builder-workspace/Sources/Helper4Swift/Extensions/UIViewAutoLayout+Extension.swift (in target 'Helper4Swift' from project 'Helper4Swift')
    cd /Users/admin/builder/spi-builder-workspace/.swiftpm/xcode

SwiftCompile normal arm64 /Users/admin/builder/spi-builder-workspace/Sources/Helper4Swift/Extensions/UIViewController+Extension.swift (in target 'Helper4Swift' from project 'Helper4Swift')
    cd /Users/admin/builder/spi-builder-workspace/.swiftpm/xcode

SwiftCompile normal arm64 Compiling\ UIStoryboard+Extension.swift,\ UITabBarController+Extension.swift,\ UITableView+Extension.swift,\ UITextField+Extension.swift /Users/admin/builder/spi-builder-workspace/Sources/Helper4Swift/Extensions/UIStoryboard+Extension.swift /Users/admin/builder/spi-builder-workspace/Sources/Helper4Swift/Extensions/UITabBarController+Extension.swift /Users/admin/builder/spi-builder-workspace/Sources/Helper4Swift/Extensions/UITableView+Extension.swift /Users/admin/builder/spi-builder-workspace/Sources/Helper4Swift/Extensions/UITextField+Extension.swift (in target 'Helper4Swift' from project 'Helper4Swift')
Command SwiftCompile failed with a nonzero exit code
--- xcodebuild: WARNING: Using the first of multiple matching destinations:
{ platform:macOS, arch:arm64, id:5f7d3d39af8c60ff28078c34e5f853432a73bc69, name:My Mac }
{ platform:macOS, arch:arm64, variant:Mac Catalyst, id:5f7d3d39af8c60ff28078c34e5f853432a73bc69, name:My Mac }
{ platform:macOS, arch:arm64, variant:DriverKit, id:5f7d3d39af8c60ff28078c34e5f853432a73bc69, name:My Mac }
{ platform:macOS, arch:arm64, variant:Designed for [iPad,iPhone], id:5f7d3d39af8c60ff28078c34e5f853432a73bc69, name:My Mac }
** BUILD FAILED **
The following build commands failed:
	SwiftEmitModule normal arm64 Emitting\ module\ for\ Helper4Swift (in target 'Helper4Swift' from project 'Helper4Swift')
	EmitSwiftModule normal arm64 (in target 'Helper4Swift' from project 'Helper4Swift')
	SwiftCompile normal arm64 Compiling\ UIStoryboard+Extension.swift,\ UITabBarController+Extension.swift,\ UITableView+Extension.swift,\ UITextField+Extension.swift /Users/admin/builder/spi-builder-workspace/Sources/Helper4Swift/Extensions/UIStoryboard+Extension.swift /Users/admin/builder/spi-builder-workspace/Sources/Helper4Swift/Extensions/UITabBarController+Extension.swift /Users/admin/builder/spi-builder-workspace/Sources/Helper4Swift/Extensions/UITableView+Extension.swift /Users/admin/builder/spi-builder-workspace/Sources/Helper4Swift/Extensions/UITextField+Extension.swift (in target 'Helper4Swift' from project 'Helper4Swift')
	Building workspace spi-builder-workspace with scheme Helper4Swift
(4 failures)
BUILD FAILURE 6.1 macosXcodebuild