Build Information
Failed to build ShrinkItArchive, reference 1.3.1 (e7e4ab
), with Swift 6.0 for tvOS using Xcode 16.2 on 1 Dec 2024 18:56:13 UTC.
Build Command
env DEVELOPER_DIR=/Applications/Xcode-16.1.0.app xcrun xcodebuild -IDEClonedSourcePackagesDirPathOverride=$PWD/.dependencies -skipMacroValidation -skipPackagePluginValidation -derivedDataPath $PWD/.derivedData build -scheme ShrinkItArchive-Package -destination generic/platform=tvOS OTHER_SWIFT_FLAGS=-stats-output-dir .stats -strict-concurrency=complete -enable-upcoming-feature StrictConcurrency -enable-upcoming-feature DisableOutwardActorInference -enable-upcoming-feature GlobalActorIsolatedTypesUsability -enable-upcoming-feature InferSendableFromCaptures
Build Log
cd /Users/admin/builder/spi-builder-workspace/.swiftpm/xcode
builtin-swiftTaskExecution -- /Applications/Xcode-16.1.0.app/Contents/Developer/Toolchains/XcodeDefault.xctoolchain/usr/bin/swift-frontend -frontend -c -filelist /Users/admin/builder/spi-builder-workspace/.derivedData/Build/Intermediates.noindex/JavApi⁴Swift.build/Debug-appletvos/JavApi.build/Objects-normal/arm64/sources-1 -primary-file /Users/admin/builder/spi-builder-workspace/.dependencies/checkouts/JavApi4Swift/Sources/JavApi/lang/Class.swift -primary-file /Users/admin/builder/spi-builder-workspace/.dependencies/checkouts/JavApi4Swift/Sources/JavApi/lang/Cloneable+Swiftify.swift -primary-file /Users/admin/builder/spi-builder-workspace/.dependencies/checkouts/JavApi4Swift/Sources/JavApi/lang/Cloneable.swift -primary-file /Users/admin/builder/spi-builder-workspace/.dependencies/checkouts/JavApi4Swift/Sources/JavApi/lang/Comparable+Swiftify.swift -primary-file /Users/admin/builder/spi-builder-workspace/.dependencies/checkouts/JavApi4Swift/Sources/JavApi/lang/Comparable.swift -primary-file /Users/admin/builder/spi-builder-workspace/.dependencies/checkouts/JavApi4Swift/Sources/JavApi/lang/Double+Java.swift -primary-file /Users/admin/builder/spi-builder-workspace/.dependencies/checkouts/JavApi4Swift/Sources/JavApi/lang/Double+Swiftify.swift -primary-file /Users/admin/builder/spi-builder-workspace/.dependencies/checkouts/JavApi4Swift/Sources/JavApi/lang/FileHandle+TextOutputStream.swift -primary-file /Users/admin/builder/spi-builder-workspace/.dependencies/checkouts/JavApi4Swift/Sources/JavApi/lang/Int+Java.swift -primary-file /Users/admin/builder/spi-builder-workspace/.dependencies/checkouts/JavApi4Swift/Sources/JavApi/lang/Int32+Java.swift -primary-file /Users/admin/builder/spi-builder-workspace/.dependencies/checkouts/JavApi4Swift/Sources/JavApi/lang/Int64+Java.swift -primary-file /Users/admin/builder/spi-builder-workspace/.dependencies/checkouts/JavApi4Swift/Sources/JavApi/lang/Integer.swift -primary-file /Users/admin/builder/spi-builder-workspace/.dependencies/checkouts/JavApi4Swift/Sources/JavApi/lang/Long.swift -primary-file /Users/admin/builder/spi-builder-workspace/.dependencies/checkouts/JavApi4Swift/Sources/JavApi/lang/Math.swift -primary-file /Users/admin/builder/spi-builder-workspace/.dependencies/checkouts/JavApi4Swift/Sources/JavApi/lang/Operator+Java.swift -supplementary-output-file-map /Users/admin/builder/spi-builder-workspace/.derivedData/Build/Intermediates.noindex/JavApi⁴Swift.build/Debug-appletvos/JavApi.build/Objects-normal/arm64/supplementaryOutputs-3 -target arm64-apple-tvos16.0 -Xllvm -aarch64-use-tbi -enable-objc-interop -stack-check -sdk /Applications/Xcode-16.1.0.app/Contents/Developer/Platforms/AppleTVOS.platform/Developer/SDKs/AppleTVOS18.1.sdk -I /Users/admin/builder/spi-builder-workspace/.derivedData/Build/Products/Debug-appletvos -I /Applications/Xcode-16.1.0.app/Contents/Developer/Platforms/AppleTVOS.platform/Developer/usr/lib -F /Users/admin/builder/spi-builder-workspace/.derivedData/Build/Products/Debug-appletvos -F /Applications/Xcode-16.1.0.app/Contents/Developer/Platforms/AppleTVOS.platform/Developer/Library/Frameworks -F /Applications/Xcode-16.1.0.app/Contents/Developer/Platforms/AppleTVOS.platform/Developer/SDKs/AppleTVOS18.1.sdk/Developer/Library/Frameworks -no-color-diagnostics -enable-testing -g -debug-info-format\=dwarf -dwarf-version\=4 -module-cache-path /Users/admin/builder/spi-builder-workspace/.derivedData/ModuleCache.noindex -suppress-warnings -profile-generate -profile-coverage-mapping -swift-version 6 -enforce-exclusivity\=checked -stats-output-dir /Users/admin/builder/spi-builder-workspace/.swiftpm/xcode/.stats -Onone -D SWIFT_PACKAGE -D DEBUG -serialize-debugging-options -const-gather-protocols-file /Users/admin/builder/spi-builder-workspace/.derivedData/Build/Intermediates.noindex/JavApi⁴Swift.build/Debug-appletvos/JavApi.build/Objects-normal/arm64/JavApi_const_extract_protocols.json -enable-experimental-feature DebugDescriptionMacro -enable-experimental-feature OpaqueTypeErasure -enable-upcoming-feature StrictConcurrency -enable-upcoming-feature DisableOutwardActorInference -enable-upcoming-feature GlobalActorIsolatedTypesUsability -enable-upcoming-feature InferSendableFromCaptures -strict-concurrency\=complete -empty-abi-descriptor -plugin-path /Applications/Xcode-16.1.0.app/Contents/Developer/Toolchains/XcodeDefault.xctoolchain/usr/lib/swift/host/plugins/testing -user-module-version 0.19.1 -validate-clang-modules-once -clang-build-session-file /Users/admin/builder/spi-builder-workspace/.derivedData/ModuleCache.noindex/Session.modulevalidation -Xcc -working-directory -Xcc /Users/admin/builder/spi-builder-workspace/.swiftpm/xcode -resource-dir /Applications/Xcode-16.1.0.app/Contents/Developer/Toolchains/XcodeDefault.xctoolchain/usr/lib/swift -enable-anonymous-context-mangled-names -file-compilation-dir /Users/admin/builder/spi-builder-workspace/.swiftpm/xcode -Xcc -D_LIBCPP_HARDENING_MODE\=_LIBCPP_HARDENING_MODE_DEBUG -Xcc -ivfsstatcache -Xcc /Users/admin/builder/spi-builder-workspace/.derivedData/SDKStatCaches.noindex/appletvos18.1-22J572-e7fdd8cf9ffd4d4af20823079b51a726.sdkstatcache -Xcc -I/Users/admin/builder/spi-builder-workspace/.derivedData/Build/Intermediates.noindex/JavApi⁴Swift.build/Debug-appletvos/JavApi.build/swift-overrides.hmap -Xcc -I/Users/admin/builder/spi-builder-workspace/.derivedData/Build/Products/Debug-appletvos/include -Xcc -I/Users/admin/builder/spi-builder-workspace/.derivedData/Build/Intermediates.noindex/JavApi⁴Swift.build/Debug-appletvos/JavApi.build/DerivedSources-normal/arm64 -Xcc -I/Users/admin/builder/spi-builder-workspace/.derivedData/Build/Intermediates.noindex/JavApi⁴Swift.build/Debug-appletvos/JavApi.build/DerivedSources/arm64 -Xcc -I/Users/admin/builder/spi-builder-workspace/.derivedData/Build/Intermediates.noindex/JavApi⁴Swift.build/Debug-appletvos/JavApi.build/DerivedSources -Xcc -DSWIFT_PACKAGE -Xcc -DDEBUG\=1 -module-name JavApi -package-name javapi4swift -frontend-parseable-output -disable-clang-spi -target-sdk-version 18.1 -target-sdk-name appletvos18.1 -external-plugin-path /Applications/Xcode-16.1.0.app/Contents/Developer/Platforms/AppleTVOS.platform/Developer/usr/lib/swift/host/plugins\#/Applications/Xcode-16.1.0.app/Contents/Developer/Platforms/AppleTVOS.platform/Developer/usr/bin/swift-plugin-server -external-plugin-path /Applications/Xcode-16.1.0.app/Contents/Developer/Platforms/AppleTVOS.platform/Developer/usr/local/lib/swift/host/plugins\#/Applications/Xcode-16.1.0.app/Contents/Developer/Platforms/AppleTVOS.platform/Developer/usr/bin/swift-plugin-server -plugin-path /Applications/Xcode-16.1.0.app/Contents/Developer/Toolchains/XcodeDefault.xctoolchain/usr/lib/swift/host/plugins -plugin-path /Applications/Xcode-16.1.0.app/Contents/Developer/Toolchains/XcodeDefault.xctoolchain/usr/local/lib/swift/host/plugins -o /Users/admin/builder/spi-builder-workspace/.derivedData/Build/Intermediates.noindex/JavApi⁴Swift.build/Debug-appletvos/JavApi.build/Objects-normal/arm64/Class.o -o /Users/admin/builder/spi-builder-workspace/.derivedData/Build/Intermediates.noindex/JavApi⁴Swift.build/Debug-appletvos/JavApi.build/Objects-normal/arm64/Cloneable+Swiftify.o -o /Users/admin/builder/spi-builder-workspace/.derivedData/Build/Intermediates.noindex/JavApi⁴Swift.build/Debug-appletvos/JavApi.build/Objects-normal/arm64/Cloneable.o -o /Users/admin/builder/spi-builder-workspace/.derivedData/Build/Intermediates.noindex/JavApi⁴Swift.build/Debug-appletvos/JavApi.build/Objects-normal/arm64/Comparable+Swiftify.o -o /Users/admin/builder/spi-builder-workspace/.derivedData/Build/Intermediates.noindex/JavApi⁴Swift.build/Debug-appletvos/JavApi.build/Objects-normal/arm64/Comparable.o -o /Users/admin/builder/spi-builder-workspace/.derivedData/Build/Intermediates.noindex/JavApi⁴Swift.build/Debug-appletvos/JavApi.build/Objects-normal/arm64/Double+Java.o -o /Users/admin/builder/spi-builder-workspace/.derivedData/Build/Intermediates.noindex/JavApi⁴Swift.build/Debug-appletvos/JavApi.build/Objects-normal/arm64/Double+Swiftify.o -o /Users/admin/builder/spi-builder-workspace/.derivedData/Build/Intermediates.noindex/JavApi⁴Swift.build/Debug-appletvos/JavApi.build/Objects-normal/arm64/FileHandle+TextOutputStream.o -o /Users/admin/builder/spi-builder-workspace/.derivedData/Build/Intermediates.noindex/JavApi⁴Swift.build/Debug-appletvos/JavApi.build/Objects-normal/arm64/Int+Java.o -o /Users/admin/builder/spi-builder-workspace/.derivedData/Build/Intermediates.noindex/JavApi⁴Swift.build/Debug-appletvos/JavApi.build/Objects-normal/arm64/Int32+Java.o -o /Users/admin/builder/spi-builder-workspace/.derivedData/Build/Intermediates.noindex/JavApi⁴Swift.build/Debug-appletvos/JavApi.build/Objects-normal/arm64/Int64+Java.o -o /Users/admin/builder/spi-builder-workspace/.derivedData/Build/Intermediates.noindex/JavApi⁴Swift.build/Debug-appletvos/JavApi.build/Objects-normal/arm64/Integer.o -o /Users/admin/builder/spi-builder-workspace/.derivedData/Build/Intermediates.noindex/JavApi⁴Swift.build/Debug-appletvos/JavApi.build/Objects-normal/arm64/Long.o -o /Users/admin/builder/spi-builder-workspace/.derivedData/Build/Intermediates.noindex/JavApi⁴Swift.build/Debug-appletvos/JavApi.build/Objects-normal/arm64/Math.o -o /Users/admin/builder/spi-builder-workspace/.derivedData/Build/Intermediates.noindex/JavApi⁴Swift.build/Debug-appletvos/JavApi.build/Objects-normal/arm64/Operator+Java.o -index-unit-output-path /JavApi⁴Swift.build/Debug-appletvos/JavApi.build/Objects-normal/arm64/Class.o -index-unit-output-path /JavApi⁴Swift.build/Debug-appletvos/JavApi.build/Objects-normal/arm64/Cloneable+Swiftify.o -index-unit-output-path /JavApi⁴Swift.build/Debug-appletvos/JavApi.build/Objects-normal/arm64/Cloneable.o -index-unit-output-path /JavApi⁴Swift.build/Debug-appletvos/JavApi.build/Objects-normal/arm64/Comparable+Swiftify.o -index-unit-output-path /JavApi⁴Swift.build/Debug-appletvos/JavApi.build/Objects-normal/arm64/Comparable.o -index-unit-output-path /JavApi⁴Swift.build/Debug-appletvos/JavApi.build/Objects-normal/arm64/Double+Java.o -index-unit-output-path /JavApi⁴Swift.build/Debug-appletvos/JavApi.build/Objects-normal/arm64/Double+Swiftify.o -index-unit-output-path /JavApi⁴Swift.build/Debug-appletvos/JavApi.build/Objects-normal/arm64/FileHandle+TextOutputStream.o -index-unit-output-path /JavApi⁴Swift.build/Debug-appletvos/JavApi.build/Objects-normal/arm64/Int+Java.o -index-unit-output-path /JavApi⁴Swift.build/Debug-appletvos/JavApi.build/Objects-normal/arm64/Int32+Java.o -index-unit-output-path /JavApi⁴Swift.build/Debug-appletvos/JavApi.build/Objects-normal/arm64/Int64+Java.o -index-unit-output-path /JavApi⁴Swift.build/Debug-appletvos/JavApi.build/Objects-normal/arm64/Integer.o -index-unit-output-path /JavApi⁴Swift.build/Debug-appletvos/JavApi.build/Objects-normal/arm64/Long.o -index-unit-output-path /JavApi⁴Swift.build/Debug-appletvos/JavApi.build/Objects-normal/arm64/Math.o -index-unit-output-path /JavApi⁴Swift.build/Debug-appletvos/JavApi.build/Objects-normal/arm64/Operator+Java.o -index-store-path /Users/admin/builder/spi-builder-workspace/.derivedData/Index.noindex/DataStore -index-system-modules
<unknown>:0: error: upcoming feature 'StrictConcurrency' is already enabled as of Swift version 6
<unknown>:0: error: upcoming feature 'DisableOutwardActorInference' is already enabled as of Swift version 6
<unknown>:0: error: upcoming feature 'GlobalActorIsolatedTypesUsability' is already enabled as of Swift version 6
<unknown>:0: error: upcoming feature 'InferSendableFromCaptures' is already enabled as of Swift version 6
SwiftCompile normal arm64 /Users/admin/builder/spi-builder-workspace/.dependencies/checkouts/JavApi4Swift/Sources/JavApi/lang/Class.swift (in target 'JavApi' from project 'JavApi⁴Swift')
cd /Users/admin/builder/spi-builder-workspace/.swiftpm/xcode
/Applications/Xcode-16.1.0.app/Contents/Developer/Toolchains/XcodeDefault.xctoolchain/usr/bin/swift-frontend -c -filelist /Users/admin/builder/spi-builder-workspace/.derivedData/Build/Intermediates.noindex/JavApi⁴Swift.build/Debug-appletvos/JavApi.build/Objects-normal/arm64/sources-1 -primary-file /Users/admin/builder/spi-builder-workspace/.dependencies/checkouts/JavApi4Swift/Sources/JavApi/lang/Class.swift -primary-file /Users/admin/builder/spi-builder-workspace/.dependencies/checkouts/JavApi4Swift/Sources/JavApi/lang/Cloneable+Swiftify.swift -primary-file /Users/admin/builder/spi-builder-workspace/.dependencies/checkouts/JavApi4Swift/Sources/JavApi/lang/Cloneable.swift -primary-file /Users/admin/builder/spi-builder-workspace/.dependencies/checkouts/JavApi4Swift/Sources/JavApi/lang/Comparable+Swiftify.swift -primary-file /Users/admin/builder/spi-builder-workspace/.dependencies/checkouts/JavApi4Swift/Sources/JavApi/lang/Comparable.swift -primary-file /Users/admin/builder/spi-builder-workspace/.dependencies/checkouts/JavApi4Swift/Sources/JavApi/lang/Double+Java.swift -primary-file /Users/admin/builder/spi-builder-workspace/.dependencies/checkouts/JavApi4Swift/Sources/JavApi/lang/Double+Swiftify.swift -primary-file /Users/admin/builder/spi-builder-workspace/.dependencies/checkouts/JavApi4Swift/Sources/JavApi/lang/FileHandle+TextOutputStream.swift -primary-file /Users/admin/builder/spi-builder-workspace/.dependencies/checkouts/JavApi4Swift/Sources/JavApi/lang/Int+Java.swift -primary-file /Users/admin/builder/spi-builder-workspace/.dependencies/checkouts/JavApi4Swift/Sources/JavApi/lang/Int32+Java.swift -primary-file /Users/admin/builder/spi-builder-workspace/.dependencies/checkouts/JavApi4Swift/Sources/JavApi/lang/Int64+Java.swift -primary-file /Users/admin/builder/spi-builder-workspace/.dependencies/checkouts/JavApi4Swift/Sources/JavApi/lang/Integer.swift -primary-file /Users/admin/builder/spi-builder-workspace/.dependencies/checkouts/JavApi4Swift/Sources/JavApi/lang/Long.swift -primary-file /Users/admin/builder/spi-builder-workspace/.dependencies/checkouts/JavApi4Swift/Sources/JavApi/lang/Math.swift -primary-file /Users/admin/builder/spi-builder-workspace/.dependencies/checkouts/JavApi4Swift/Sources/JavApi/lang/Operator+Java.swift -supplementary-output-file-map /Users/admin/builder/spi-builder-workspace/.derivedData/Build/Intermediates.noindex/JavApi⁴Swift.build/Debug-appletvos/JavApi.build/Objects-normal/arm64/supplementaryOutputs-3 -target arm64-apple-tvos16.0 -Xllvm -aarch64-use-tbi -enable-objc-interop -stack-check -sdk /Applications/Xcode-16.1.0.app/Contents/Developer/Platforms/AppleTVOS.platform/Developer/SDKs/AppleTVOS18.1.sdk -I /Users/admin/builder/spi-builder-workspace/.derivedData/Build/Products/Debug-appletvos -I /Applications/Xcode-16.1.0.app/Contents/Developer/Platforms/AppleTVOS.platform/Developer/usr/lib -F /Users/admin/builder/spi-builder-workspace/.derivedData/Build/Products/Debug-appletvos -F /Applications/Xcode-16.1.0.app/Contents/Developer/Platforms/AppleTVOS.platform/Developer/Library/Frameworks -F /Applications/Xcode-16.1.0.app/Contents/Developer/Platforms/AppleTVOS.platform/Developer/SDKs/AppleTVOS18.1.sdk/Developer/Library/Frameworks -no-color-diagnostics -enable-testing -g -debug-info-format\=dwarf -dwarf-version\=4 -module-cache-path /Users/admin/builder/spi-builder-workspace/.derivedData/ModuleCache.noindex -suppress-warnings -profile-generate -profile-coverage-mapping -swift-version 6 -enforce-exclusivity\=checked -stats-output-dir /Users/admin/builder/spi-builder-workspace/.swiftpm/xcode/.stats -Onone -D SWIFT_PACKAGE -D DEBUG -serialize-debugging-options -const-gather-protocols-file /Users/admin/builder/spi-builder-workspace/.derivedData/Build/Intermediates.noindex/JavApi⁴Swift.build/Debug-appletvos/JavApi.build/Objects-normal/arm64/JavApi_const_extract_protocols.json -enable-experimental-feature DebugDescriptionMacro -enable-experimental-feature OpaqueTypeErasure -enable-upcoming-feature StrictConcurrency -enable-upcoming-feature DisableOutwardActorInference -enable-upcoming-feature GlobalActorIsolatedTypesUsability -enable-upcoming-feature InferSendableFromCaptures -strict-concurrency\=complete -empty-abi-descriptor -plugin-path /Applications/Xcode-16.1.0.app/Contents/Developer/Toolchains/XcodeDefault.xctoolchain/usr/lib/swift/host/plugins/testing -user-module-version 0.19.1 -validate-clang-modules-once -clang-build-session-file /Users/admin/builder/spi-builder-workspace/.derivedData/ModuleCache.noindex/Session.modulevalidation -Xcc -working-directory -Xcc /Users/admin/builder/spi-builder-workspace/.swiftpm/xcode -resource-dir /Applications/Xcode-16.1.0.app/Contents/Developer/Toolchains/XcodeDefault.xctoolchain/usr/lib/swift -enable-anonymous-context-mangled-names -file-compilation-dir /Users/admin/builder/spi-builder-workspace/.swiftpm/xcode -Xcc -D_LIBCPP_HARDENING_MODE\=_LIBCPP_HARDENING_MODE_DEBUG -Xcc -ivfsstatcache -Xcc /Users/admin/builder/spi-builder-workspace/.derivedData/SDKStatCaches.noindex/appletvos18.1-22J572-e7fdd8cf9ffd4d4af20823079b51a726.sdkstatcache -Xcc -I/Users/admin/builder/spi-builder-workspace/.derivedData/Build/Intermediates.noindex/JavApi⁴Swift.build/Debug-appletvos/JavApi.build/swift-overrides.hmap -Xcc -I/Users/admin/builder/spi-builder-workspace/.derivedData/Build/Products/Debug-appletvos/include -Xcc -I/Users/admin/builder/spi-builder-workspace/.derivedData/Build/Intermediates.noindex/JavApi⁴Swift.build/Debug-appletvos/JavApi.build/DerivedSources-normal/arm64 -Xcc -I/Users/admin/builder/spi-builder-workspace/.derivedData/Build/Intermediates.noindex/JavApi⁴Swift.build/Debug-appletvos/JavApi.build/DerivedSources/arm64 -Xcc -I/Users/admin/builder/spi-builder-workspace/.derivedData/Build/Intermediates.noindex/JavApi⁴Swift.build/Debug-appletvos/JavApi.build/DerivedSources -Xcc -DSWIFT_PACKAGE -Xcc -DDEBUG\=1 -module-name JavApi -package-name javapi4swift -frontend-parseable-output -disable-clang-spi -target-sdk-version 18.1 -target-sdk-name appletvos18.1 -external-plugin-path /Applications/Xcode-16.1.0.app/Contents/Developer/Platforms/AppleTVOS.platform/Developer/usr/lib/swift/host/plugins\#/Applications/Xcode-16.1.0.app/Contents/Developer/Platforms/AppleTVOS.platform/Developer/usr/bin/swift-plugin-server -external-plugin-path /Applications/Xcode-16.1.0.app/Contents/Developer/Platforms/AppleTVOS.platform/Developer/usr/local/lib/swift/host/plugins\#/Applications/Xcode-16.1.0.app/Contents/Developer/Platforms/AppleTVOS.platform/Developer/usr/bin/swift-plugin-server -plugin-path /Applications/Xcode-16.1.0.app/Contents/Developer/Toolchains/XcodeDefault.xctoolchain/usr/lib/swift/host/plugins -plugin-path /Applications/Xcode-16.1.0.app/Contents/Developer/Toolchains/XcodeDefault.xctoolchain/usr/local/lib/swift/host/plugins -o /Users/admin/builder/spi-builder-workspace/.derivedData/Build/Intermediates.noindex/JavApi⁴Swift.build/Debug-appletvos/JavApi.build/Objects-normal/arm64/Class.o -o /Users/admin/builder/spi-builder-workspace/.derivedData/Build/Intermediates.noindex/JavApi⁴Swift.build/Debug-appletvos/JavApi.build/Objects-normal/arm64/Cloneable+Swiftify.o -o /Users/admin/builder/spi-builder-workspace/.derivedData/Build/Intermediates.noindex/JavApi⁴Swift.build/Debug-appletvos/JavApi.build/Objects-normal/arm64/Cloneable.o -o /Users/admin/builder/spi-builder-workspace/.derivedData/Build/Intermediates.noindex/JavApi⁴Swift.build/Debug-appletvos/JavApi.build/Objects-normal/arm64/Comparable+Swiftify.o -o /Users/admin/builder/spi-builder-workspace/.derivedData/Build/Intermediates.noindex/JavApi⁴Swift.build/Debug-appletvos/JavApi.build/Objects-normal/arm64/Comparable.o -o /Users/admin/builder/spi-builder-workspace/.derivedData/Build/Intermediates.noindex/JavApi⁴Swift.build/Debug-appletvos/JavApi.build/Objects-normal/arm64/Double+Java.o -o /Users/admin/builder/spi-builder-workspace/.derivedData/Build/Intermediates.noindex/JavApi⁴Swift.build/Debug-appletvos/JavApi.build/Objects-normal/arm64/Double+Swiftify.o -o /Users/admin/builder/spi-builder-workspace/.derivedData/Build/Intermediates.noindex/JavApi⁴Swift.build/Debug-appletvos/JavApi.build/Objects-normal/arm64/FileHandle+TextOutputStream.o -o /Users/admin/builder/spi-builder-workspace/.derivedData/Build/Intermediates.noindex/JavApi⁴Swift.build/Debug-appletvos/JavApi.build/Objects-normal/arm64/Int+Java.o -o /Users/admin/builder/spi-builder-workspace/.derivedData/Build/Intermediates.noindex/JavApi⁴Swift.build/Debug-appletvos/JavApi.build/Objects-normal/arm64/Int32+Java.o -o /Users/admin/builder/spi-builder-workspace/.derivedData/Build/Intermediates.noindex/JavApi⁴Swift.build/Debug-appletvos/JavApi.build/Objects-normal/arm64/Int64+Java.o -o /Users/admin/builder/spi-builder-workspace/.derivedData/Build/Intermediates.noindex/JavApi⁴Swift.build/Debug-appletvos/JavApi.build/Objects-normal/arm64/Integer.o -o /Users/admin/builder/spi-builder-workspace/.derivedData/Build/Intermediates.noindex/JavApi⁴Swift.build/Debug-appletvos/JavApi.build/Objects-normal/arm64/Long.o -o /Users/admin/builder/spi-builder-workspace/.derivedData/Build/Intermediates.noindex/JavApi⁴Swift.build/Debug-appletvos/JavApi.build/Objects-normal/arm64/Math.o -o /Users/admin/builder/spi-builder-workspace/.derivedData/Build/Intermediates.noindex/JavApi⁴Swift.build/Debug-appletvos/JavApi.build/Objects-normal/arm64/Operator+Java.o -index-unit-output-path /JavApi⁴Swift.build/Debug-appletvos/JavApi.build/Objects-normal/arm64/Class.o -index-unit-output-path /JavApi⁴Swift.build/Debug-appletvos/JavApi.build/Objects-normal/arm64/Cloneable+Swiftify.o -index-unit-output-path /JavApi⁴Swift.build/Debug-appletvos/JavApi.build/Objects-normal/arm64/Cloneable.o -index-unit-output-path /JavApi⁴Swift.build/Debug-appletvos/JavApi.build/Objects-normal/arm64/Comparable+Swiftify.o -index-unit-output-path /JavApi⁴Swift.build/Debug-appletvos/JavApi.build/Objects-normal/arm64/Comparable.o -index-unit-output-path /JavApi⁴Swift.build/Debug-appletvos/JavApi.build/Objects-normal/arm64/Double+Java.o -index-unit-output-path /JavApi⁴Swift.build/Debug-appletvos/JavApi.build/Objects-normal/arm64/Double+Swiftify.o -index-unit-output-path /JavApi⁴Swift.build/Debug-appletvos/JavApi.build/Objects-normal/arm64/FileHandle+TextOutputStream.o -index-unit-output-path /JavApi⁴Swift.build/Debug-appletvos/JavApi.build/Objects-normal/arm64/Int+Java.o -index-unit-output-path /JavApi⁴Swift.build/Debug-appletvos/JavApi.build/Objects-normal/arm64/Int32+Java.o -index-unit-output-path /JavApi⁴Swift.build/Debug-appletvos/JavApi.build/Objects-normal/arm64/Int64+Java.o -index-unit-output-path /JavApi⁴Swift.build/Debug-appletvos/JavApi.build/Objects-normal/arm64/Integer.o -index-unit-output-path /JavApi⁴Swift.build/Debug-appletvos/JavApi.build/Objects-normal/arm64/Long.o -index-unit-output-path /JavApi⁴Swift.build/Debug-appletvos/JavApi.build/Objects-normal/arm64/Math.o -index-unit-output-path /JavApi⁴Swift.build/Debug-appletvos/JavApi.build/Objects-normal/arm64/Operator+Java.o -index-store-path /Users/admin/builder/spi-builder-workspace/.derivedData/Index.noindex/DataStore -index-system-modules
SwiftCompile normal arm64 /Users/admin/builder/spi-builder-workspace/.dependencies/checkouts/JavApi4Swift/Sources/JavApi/lang/Cloneable+Swiftify.swift (in target 'JavApi' from project 'JavApi⁴Swift')
cd /Users/admin/builder/spi-builder-workspace/.swiftpm/xcode
/Applications/Xcode-16.1.0.app/Contents/Developer/Toolchains/XcodeDefault.xctoolchain/usr/bin/swift-frontend -c -filelist /Users/admin/builder/spi-builder-workspace/.derivedData/Build/Intermediates.noindex/JavApi⁴Swift.build/Debug-appletvos/JavApi.build/Objects-normal/arm64/sources-1 -primary-file /Users/admin/builder/spi-builder-workspace/.dependencies/checkouts/JavApi4Swift/Sources/JavApi/lang/Class.swift -primary-file /Users/admin/builder/spi-builder-workspace/.dependencies/checkouts/JavApi4Swift/Sources/JavApi/lang/Cloneable+Swiftify.swift -primary-file /Users/admin/builder/spi-builder-workspace/.dependencies/checkouts/JavApi4Swift/Sources/JavApi/lang/Cloneable.swift -primary-file /Users/admin/builder/spi-builder-workspace/.dependencies/checkouts/JavApi4Swift/Sources/JavApi/lang/Comparable+Swiftify.swift -primary-file /Users/admin/builder/spi-builder-workspace/.dependencies/checkouts/JavApi4Swift/Sources/JavApi/lang/Comparable.swift -primary-file /Users/admin/builder/spi-builder-workspace/.dependencies/checkouts/JavApi4Swift/Sources/JavApi/lang/Double+Java.swift -primary-file /Users/admin/builder/spi-builder-workspace/.dependencies/checkouts/JavApi4Swift/Sources/JavApi/lang/Double+Swiftify.swift -primary-file /Users/admin/builder/spi-builder-workspace/.dependencies/checkouts/JavApi4Swift/Sources/JavApi/lang/FileHandle+TextOutputStream.swift -primary-file /Users/admin/builder/spi-builder-workspace/.dependencies/checkouts/JavApi4Swift/Sources/JavApi/lang/Int+Java.swift -primary-file /Users/admin/builder/spi-builder-workspace/.dependencies/checkouts/JavApi4Swift/Sources/JavApi/lang/Int32+Java.swift -primary-file /Users/admin/builder/spi-builder-workspace/.dependencies/checkouts/JavApi4Swift/Sources/JavApi/lang/Int64+Java.swift -primary-file /Users/admin/builder/spi-builder-workspace/.dependencies/checkouts/JavApi4Swift/Sources/JavApi/lang/Integer.swift -primary-file /Users/admin/builder/spi-builder-workspace/.dependencies/checkouts/JavApi4Swift/Sources/JavApi/lang/Long.swift -primary-file /Users/admin/builder/spi-builder-workspace/.dependencies/checkouts/JavApi4Swift/Sources/JavApi/lang/Math.swift -primary-file /Users/admin/builder/spi-builder-workspace/.dependencies/checkouts/JavApi4Swift/Sources/JavApi/lang/Operator+Java.swift -supplementary-output-file-map /Users/admin/builder/spi-builder-workspace/.derivedData/Build/Intermediates.noindex/JavApi⁴Swift.build/Debug-appletvos/JavApi.build/Objects-normal/arm64/supplementaryOutputs-3 -target arm64-apple-tvos16.0 -Xllvm -aarch64-use-tbi -enable-objc-interop -stack-check -sdk /Applications/Xcode-16.1.0.app/Contents/Developer/Platforms/AppleTVOS.platform/Developer/SDKs/AppleTVOS18.1.sdk -I /Users/admin/builder/spi-builder-workspace/.derivedData/Build/Products/Debug-appletvos -I /Applications/Xcode-16.1.0.app/Contents/Developer/Platforms/AppleTVOS.platform/Developer/usr/lib -F /Users/admin/builder/spi-builder-workspace/.derivedData/Build/Products/Debug-appletvos -F /Applications/Xcode-16.1.0.app/Contents/Developer/Platforms/AppleTVOS.platform/Developer/Library/Frameworks -F /Applications/Xcode-16.1.0.app/Contents/Developer/Platforms/AppleTVOS.platform/Developer/SDKs/AppleTVOS18.1.sdk/Developer/Library/Frameworks -no-color-diagnostics -enable-testing -g -debug-info-format\=dwarf -dwarf-version\=4 -module-cache-path /Users/admin/builder/spi-builder-workspace/.derivedData/ModuleCache.noindex -suppress-warnings -profile-generate -profile-coverage-mapping -swift-version 6 -enforce-exclusivity\=checked -stats-output-dir /Users/admin/builder/spi-builder-workspace/.swiftpm/xcode/.stats -Onone -D SWIFT_PACKAGE -D DEBUG -serialize-debugging-options -const-gather-protocols-file /Users/admin/builder/spi-builder-workspace/.derivedData/Build/Intermediates.noindex/JavApi⁴Swift.build/Debug-appletvos/JavApi.build/Objects-normal/arm64/JavApi_const_extract_protocols.json -enable-experimental-feature DebugDescriptionMacro -enable-experimental-feature OpaqueTypeErasure -enable-upcoming-feature StrictConcurrency -enable-upcoming-feature DisableOutwardActorInference -enable-upcoming-feature GlobalActorIsolatedTypesUsability -enable-upcoming-feature InferSendableFromCaptures -strict-concurrency\=complete -empty-abi-descriptor -plugin-path /Applications/Xcode-16.1.0.app/Contents/Developer/Toolchains/XcodeDefault.xctoolchain/usr/lib/swift/host/plugins/testing -user-module-version 0.19.1 -validate-clang-modules-once -clang-build-session-file /Users/admin/builder/spi-builder-workspace/.derivedData/ModuleCache.noindex/Session.modulevalidation -Xcc -working-directory -Xcc /Users/admin/builder/spi-builder-workspace/.swiftpm/xcode -resource-dir /Applications/Xcode-16.1.0.app/Contents/Developer/Toolchains/XcodeDefault.xctoolchain/usr/lib/swift -enable-anonymous-context-mangled-names -file-compilation-dir /Users/admin/builder/spi-builder-workspace/.swiftpm/xcode -Xcc -D_LIBCPP_HARDENING_MODE\=_LIBCPP_HARDENING_MODE_DEBUG -Xcc -ivfsstatcache -Xcc /Users/admin/builder/spi-builder-workspace/.derivedData/SDKStatCaches.noindex/appletvos18.1-22J572-e7fdd8cf9ffd4d4af20823079b51a726.sdkstatcache -Xcc -I/Users/admin/builder/spi-builder-workspace/.derivedData/Build/Intermediates.noindex/JavApi⁴Swift.build/Debug-appletvos/JavApi.build/swift-overrides.hmap -Xcc -I/Users/admin/builder/spi-builder-workspace/.derivedData/Build/Products/Debug-appletvos/include -Xcc -I/Users/admin/builder/spi-builder-workspace/.derivedData/Build/Intermediates.noindex/JavApi⁴Swift.build/Debug-appletvos/JavApi.build/DerivedSources-normal/arm64 -Xcc -I/Users/admin/builder/spi-builder-workspace/.derivedData/Build/Intermediates.noindex/JavApi⁴Swift.build/Debug-appletvos/JavApi.build/DerivedSources/arm64 -Xcc -I/Users/admin/builder/spi-builder-workspace/.derivedData/Build/Intermediates.noindex/JavApi⁴Swift.build/Debug-appletvos/JavApi.build/DerivedSources -Xcc -DSWIFT_PACKAGE -Xcc -DDEBUG\=1 -module-name JavApi -package-name javapi4swift -frontend-parseable-output -disable-clang-spi -target-sdk-version 18.1 -target-sdk-name appletvos18.1 -external-plugin-path /Applications/Xcode-16.1.0.app/Contents/Developer/Platforms/AppleTVOS.platform/Developer/usr/lib/swift/host/plugins\#/Applications/Xcode-16.1.0.app/Contents/Developer/Platforms/AppleTVOS.platform/Developer/usr/bin/swift-plugin-server -external-plugin-path /Applications/Xcode-16.1.0.app/Contents/Developer/Platforms/AppleTVOS.platform/Developer/usr/local/lib/swift/host/plugins\#/Applications/Xcode-16.1.0.app/Contents/Developer/Platforms/AppleTVOS.platform/Developer/usr/bin/swift-plugin-server -plugin-path /Applications/Xcode-16.1.0.app/Contents/Developer/Toolchains/XcodeDefault.xctoolchain/usr/lib/swift/host/plugins -plugin-path /Applications/Xcode-16.1.0.app/Contents/Developer/Toolchains/XcodeDefault.xctoolchain/usr/local/lib/swift/host/plugins -o /Users/admin/builder/spi-builder-workspace/.derivedData/Build/Intermediates.noindex/JavApi⁴Swift.build/Debug-appletvos/JavApi.build/Objects-normal/arm64/Class.o -o /Users/admin/builder/spi-builder-workspace/.derivedData/Build/Intermediates.noindex/JavApi⁴Swift.build/Debug-appletvos/JavApi.build/Objects-normal/arm64/Cloneable+Swiftify.o -o /Users/admin/builder/spi-builder-workspace/.derivedData/Build/Intermediates.noindex/JavApi⁴Swift.build/Debug-appletvos/JavApi.build/Objects-normal/arm64/Cloneable.o -o /Users/admin/builder/spi-builder-workspace/.derivedData/Build/Intermediates.noindex/JavApi⁴Swift.build/Debug-appletvos/JavApi.build/Objects-normal/arm64/Comparable+Swiftify.o -o /Users/admin/builder/spi-builder-workspace/.derivedData/Build/Intermediates.noindex/JavApi⁴Swift.build/Debug-appletvos/JavApi.build/Objects-normal/arm64/Comparable.o -o /Users/admin/builder/spi-builder-workspace/.derivedData/Build/Intermediates.noindex/JavApi⁴Swift.build/Debug-appletvos/JavApi.build/Objects-normal/arm64/Double+Java.o -o /Users/admin/builder/spi-builder-workspace/.derivedData/Build/Intermediates.noindex/JavApi⁴Swift.build/Debug-appletvos/JavApi.build/Objects-normal/arm64/Double+Swiftify.o -o /Users/admin/builder/spi-builder-workspace/.derivedData/Build/Intermediates.noindex/JavApi⁴Swift.build/Debug-appletvos/JavApi.build/Objects-normal/arm64/FileHandle+TextOutputStream.o -o /Users/admin/builder/spi-builder-workspace/.derivedData/Build/Intermediates.noindex/JavApi⁴Swift.build/Debug-appletvos/JavApi.build/Objects-normal/arm64/Int+Java.o -o /Users/admin/builder/spi-builder-workspace/.derivedData/Build/Intermediates.noindex/JavApi⁴Swift.build/Debug-appletvos/JavApi.build/Objects-normal/arm64/Int32+Java.o -o /Users/admin/builder/spi-builder-workspace/.derivedData/Build/Intermediates.noindex/JavApi⁴Swift.build/Debug-appletvos/JavApi.build/Objects-normal/arm64/Int64+Java.o -o /Users/admin/builder/spi-builder-workspace/.derivedData/Build/Intermediates.noindex/JavApi⁴Swift.build/Debug-appletvos/JavApi.build/Objects-normal/arm64/Integer.o -o /Users/admin/builder/spi-builder-workspace/.derivedData/Build/Intermediates.noindex/JavApi⁴Swift.build/Debug-appletvos/JavApi.build/Objects-normal/arm64/Long.o -o /Users/admin/builder/spi-builder-workspace/.derivedData/Build/Intermediates.noindex/JavApi⁴Swift.build/Debug-appletvos/JavApi.build/Objects-normal/arm64/Math.o -o /Users/admin/builder/spi-builder-workspace/.derivedData/Build/Intermediates.noindex/JavApi⁴Swift.build/Debug-appletvos/JavApi.build/Objects-normal/arm64/Operator+Java.o -index-unit-output-path /JavApi⁴Swift.build/Debug-appletvos/JavApi.build/Objects-normal/arm64/Class.o -index-unit-output-path /JavApi⁴Swift.build/Debug-appletvos/JavApi.build/Objects-normal/arm64/Cloneable+Swiftify.o -index-unit-output-path /JavApi⁴Swift.build/Debug-appletvos/JavApi.build/Objects-normal/arm64/Cloneable.o -index-unit-output-path /JavApi⁴Swift.build/Debug-appletvos/JavApi.build/Objects-normal/arm64/Comparable+Swiftify.o -index-unit-output-path /JavApi⁴Swift.build/Debug-appletvos/JavApi.build/Objects-normal/arm64/Comparable.o -index-unit-output-path /JavApi⁴Swift.build/Debug-appletvos/JavApi.build/Objects-normal/arm64/Double+Java.o -index-unit-output-path /JavApi⁴Swift.build/Debug-appletvos/JavApi.build/Objects-normal/arm64/Double+Swiftify.o -index-unit-output-path /JavApi⁴Swift.build/Debug-appletvos/JavApi.build/Objects-normal/arm64/FileHandle+TextOutputStream.o -index-unit-output-path /JavApi⁴Swift.build/Debug-appletvos/JavApi.build/Objects-normal/arm64/Int+Java.o -index-unit-output-path /JavApi⁴Swift.build/Debug-appletvos/JavApi.build/Objects-normal/arm64/Int32+Java.o -index-unit-output-path /JavApi⁴Swift.build/Debug-appletvos/JavApi.build/Objects-normal/arm64/Int64+Java.o -index-unit-output-path /JavApi⁴Swift.build/Debug-appletvos/JavApi.build/Objects-normal/arm64/Integer.o -index-unit-output-path /JavApi⁴Swift.build/Debug-appletvos/JavApi.build/Objects-normal/arm64/Long.o -index-unit-output-path /JavApi⁴Swift.build/Debug-appletvos/JavApi.build/Objects-normal/arm64/Math.o -index-unit-output-path /JavApi⁴Swift.build/Debug-appletvos/JavApi.build/Objects-normal/arm64/Operator+Java.o -index-store-path /Users/admin/builder/spi-builder-workspace/.derivedData/Index.noindex/DataStore -index-system-modules
SwiftCompile normal arm64 /Users/admin/builder/spi-builder-workspace/.dependencies/checkouts/JavApi4Swift/Sources/JavApi/lang/Cloneable.swift (in target 'JavApi' from project 'JavApi⁴Swift')
cd /Users/admin/builder/spi-builder-workspace/.swiftpm/xcode
/Applications/Xcode-16.1.0.app/Contents/Developer/Toolchains/XcodeDefault.xctoolchain/usr/bin/swift-frontend -c -filelist /Users/admin/builder/spi-builder-workspace/.derivedData/Build/Intermediates.noindex/JavApi⁴Swift.build/Debug-appletvos/JavApi.build/Objects-normal/arm64/sources-1 -primary-file /Users/admin/builder/spi-builder-workspace/.dependencies/checkouts/JavApi4Swift/Sources/JavApi/lang/Class.swift -primary-file /Users/admin/builder/spi-builder-workspace/.dependencies/checkouts/JavApi4Swift/Sources/JavApi/lang/Cloneable+Swiftify.swift -primary-file /Users/admin/builder/spi-builder-workspace/.dependencies/checkouts/JavApi4Swift/Sources/JavApi/lang/Cloneable.swift -primary-file /Users/admin/builder/spi-builder-workspace/.dependencies/checkouts/JavApi4Swift/Sources/JavApi/lang/Comparable+Swiftify.swift -primary-file /Users/admin/builder/spi-builder-workspace/.dependencies/checkouts/JavApi4Swift/Sources/JavApi/lang/Comparable.swift -primary-file /Users/admin/builder/spi-builder-workspace/.dependencies/checkouts/JavApi4Swift/Sources/JavApi/lang/Double+Java.swift -primary-file /Users/admin/builder/spi-builder-workspace/.dependencies/checkouts/JavApi4Swift/Sources/JavApi/lang/Double+Swiftify.swift -primary-file /Users/admin/builder/spi-builder-workspace/.dependencies/checkouts/JavApi4Swift/Sources/JavApi/lang/FileHandle+TextOutputStream.swift -primary-file /Users/admin/builder/spi-builder-workspace/.dependencies/checkouts/JavApi4Swift/Sources/JavApi/lang/Int+Java.swift -primary-file /Users/admin/builder/spi-builder-workspace/.dependencies/checkouts/JavApi4Swift/Sources/JavApi/lang/Int32+Java.swift -primary-file /Users/admin/builder/spi-builder-workspace/.dependencies/checkouts/JavApi4Swift/Sources/JavApi/lang/Int64+Java.swift -primary-file /Users/admin/builder/spi-builder-workspace/.dependencies/checkouts/JavApi4Swift/Sources/JavApi/lang/Integer.swift -primary-file /Users/admin/builder/spi-builder-workspace/.dependencies/checkouts/JavApi4Swift/Sources/JavApi/lang/Long.swift -primary-file /Users/admin/builder/spi-builder-workspace/.dependencies/checkouts/JavApi4Swift/Sources/JavApi/lang/Math.swift -primary-file /Users/admin/builder/spi-builder-workspace/.dependencies/checkouts/JavApi4Swift/Sources/JavApi/lang/Operator+Java.swift -supplementary-output-file-map /Users/admin/builder/spi-builder-workspace/.derivedData/Build/Intermediates.noindex/JavApi⁴Swift.build/Debug-appletvos/JavApi.build/Objects-normal/arm64/supplementaryOutputs-3 -target arm64-apple-tvos16.0 -Xllvm -aarch64-use-tbi -enable-objc-interop -stack-check -sdk /Applications/Xcode-16.1.0.app/Contents/Developer/Platforms/AppleTVOS.platform/Developer/SDKs/AppleTVOS18.1.sdk -I /Users/admin/builder/spi-builder-workspace/.derivedData/Build/Products/Debug-appletvos -I /Applications/Xcode-16.1.0.app/Contents/Developer/Platforms/AppleTVOS.platform/Developer/usr/lib -F /Users/admin/builder/spi-builder-workspace/.derivedData/Build/Products/Debug-appletvos -F /Applications/Xcode-16.1.0.app/Contents/Developer/Platforms/AppleTVOS.platform/Developer/Library/Frameworks -F /Applications/Xcode-16.1.0.app/Contents/Developer/Platforms/AppleTVOS.platform/Developer/SDKs/AppleTVOS18.1.sdk/Developer/Library/Frameworks -no-color-diagnostics -enable-testing -g -debug-info-format\=dwarf -dwarf-version\=4 -module-cache-path /Users/admin/builder/spi-builder-workspace/.derivedData/ModuleCache.noindex -suppress-warnings -profile-generate -profile-coverage-mapping -swift-version 6 -enforce-exclusivity\=checked -stats-output-dir /Users/admin/builder/spi-builder-workspace/.swiftpm/xcode/.stats -Onone -D SWIFT_PACKAGE -D DEBUG -serialize-debugging-options -const-gather-protocols-file /Users/admin/builder/spi-builder-workspace/.derivedData/Build/Intermediates.noindex/JavApi⁴Swift.build/Debug-appletvos/JavApi.build/Objects-normal/arm64/JavApi_const_extract_protocols.json -enable-experimental-feature DebugDescriptionMacro -enable-experimental-feature OpaqueTypeErasure -enable-upcoming-feature StrictConcurrency -enable-upcoming-feature DisableOutwardActorInference -enable-upcoming-feature GlobalActorIsolatedTypesUsability -enable-upcoming-feature InferSendableFromCaptures -strict-concurrency\=complete -empty-abi-descriptor -plugin-path /Applications/Xcode-16.1.0.app/Contents/Developer/Toolchains/XcodeDefault.xctoolchain/usr/lib/swift/host/plugins/testing -user-module-version 0.19.1 -validate-clang-modules-once -clang-build-session-file /Users/admin/builder/spi-builder-workspace/.derivedData/ModuleCache.noindex/Session.modulevalidation -Xcc -working-directory -Xcc /Users/admin/builder/spi-builder-workspace/.swiftpm/xcode -resource-dir /Applications/Xcode-16.1.0.app/Contents/Developer/Toolchains/XcodeDefault.xctoolchain/usr/lib/swift -enable-anonymous-context-mangled-names -file-compilation-dir /Users/admin/builder/spi-builder-workspace/.swiftpm/xcode -Xcc -D_LIBCPP_HARDENING_MODE\=_LIBCPP_HARDENING_MODE_DEBUG -Xcc -ivfsstatcache -Xcc /Users/admin/builder/spi-builder-workspace/.derivedData/SDKStatCaches.noindex/appletvos18.1-22J572-e7fdd8cf9ffd4d4af20823079b51a726.sdkstatcache -Xcc -I/Users/admin/builder/spi-builder-workspace/.derivedData/Build/Intermediates.noindex/JavApi⁴Swift.build/Debug-appletvos/JavApi.build/swift-overrides.hmap -Xcc -I/Users/admin/builder/spi-builder-workspace/.derivedData/Build/Products/Debug-appletvos/include -Xcc -I/Users/admin/builder/spi-builder-workspace/.derivedData/Build/Intermediates.noindex/JavApi⁴Swift.build/Debug-appletvos/JavApi.build/DerivedSources-normal/arm64 -Xcc -I/Users/admin/builder/spi-builder-workspace/.derivedData/Build/Intermediates.noindex/JavApi⁴Swift.build/Debug-appletvos/JavApi.build/DerivedSources/arm64 -Xcc -I/Users/admin/builder/spi-builder-workspace/.derivedData/Build/Intermediates.noindex/JavApi⁴Swift.build/Debug-appletvos/JavApi.build/DerivedSources -Xcc -DSWIFT_PACKAGE -Xcc -DDEBUG\=1 -module-name JavApi -package-name javapi4swift -frontend-parseable-output -disable-clang-spi -target-sdk-version 18.1 -target-sdk-name appletvos18.1 -external-plugin-path /Applications/Xcode-16.1.0.app/Contents/Developer/Platforms/AppleTVOS.platform/Developer/usr/lib/swift/host/plugins\#/Applications/Xcode-16.1.0.app/Contents/Developer/Platforms/AppleTVOS.platform/Developer/usr/bin/swift-plugin-server -external-plugin-path /Applications/Xcode-16.1.0.app/Contents/Developer/Platforms/AppleTVOS.platform/Developer/usr/local/lib/swift/host/plugins\#/Applications/Xcode-16.1.0.app/Contents/Developer/Platforms/AppleTVOS.platform/Developer/usr/bin/swift-plugin-server -plugin-path /Applications/Xcode-16.1.0.app/Contents/Developer/Toolchains/XcodeDefault.xctoolchain/usr/lib/swift/host/plugins -plugin-path /Applications/Xcode-16.1.0.app/Contents/Developer/Toolchains/XcodeDefault.xctoolchain/usr/local/lib/swift/host/plugins -o /Users/admin/builder/spi-builder-workspace/.derivedData/Build/Intermediates.noindex/JavApi⁴Swift.build/Debug-appletvos/JavApi.build/Objects-normal/arm64/Class.o -o /Users/admin/builder/spi-builder-workspace/.derivedData/Build/Intermediates.noindex/JavApi⁴Swift.build/Debug-appletvos/JavApi.build/Objects-normal/arm64/Cloneable+Swiftify.o -o /Users/admin/builder/spi-builder-workspace/.derivedData/Build/Intermediates.noindex/JavApi⁴Swift.build/Debug-appletvos/JavApi.build/Objects-normal/arm64/Cloneable.o -o /Users/admin/builder/spi-builder-workspace/.derivedData/Build/Intermediates.noindex/JavApi⁴Swift.build/Debug-appletvos/JavApi.build/Objects-normal/arm64/Comparable+Swiftify.o -o /Users/admin/builder/spi-builder-workspace/.derivedData/Build/Intermediates.noindex/JavApi⁴Swift.build/Debug-appletvos/JavApi.build/Objects-normal/arm64/Comparable.o -o /Users/admin/builder/spi-builder-workspace/.derivedData/Build/Intermediates.noindex/JavApi⁴Swift.build/Debug-appletvos/JavApi.build/Objects-normal/arm64/Double+Java.o -o /Users/admin/builder/spi-builder-workspace/.derivedData/Build/Intermediates.noindex/JavApi⁴Swift.build/Debug-appletvos/JavApi.build/Objects-normal/arm64/Double+Swiftify.o -o /Users/admin/builder/spi-builder-workspace/.derivedData/Build/Intermediates.noindex/JavApi⁴Swift.build/Debug-appletvos/JavApi.build/Objects-normal/arm64/FileHandle+TextOutputStream.o -o /Users/admin/builder/spi-builder-workspace/.derivedData/Build/Intermediates.noindex/JavApi⁴Swift.build/Debug-appletvos/JavApi.build/Objects-normal/arm64/Int+Java.o -o /Users/admin/builder/spi-builder-workspace/.derivedData/Build/Intermediates.noindex/JavApi⁴Swift.build/Debug-appletvos/JavApi.build/Objects-normal/arm64/Int32+Java.o -o /Users/admin/builder/spi-builder-workspace/.derivedData/Build/Intermediates.noindex/JavApi⁴Swift.build/Debug-appletvos/JavApi.build/Objects-normal/arm64/Int64+Java.o -o /Users/admin/builder/spi-builder-workspace/.derivedData/Build/Intermediates.noindex/JavApi⁴Swift.build/Debug-appletvos/JavApi.build/Objects-normal/arm64/Integer.o -o /Users/admin/builder/spi-builder-workspace/.derivedData/Build/Intermediates.noindex/JavApi⁴Swift.build/Debug-appletvos/JavApi.build/Objects-normal/arm64/Long.o -o /Users/admin/builder/spi-builder-workspace/.derivedData/Build/Intermediates.noindex/JavApi⁴Swift.build/Debug-appletvos/JavApi.build/Objects-normal/arm64/Math.o -o /Users/admin/builder/spi-builder-workspace/.derivedData/Build/Intermediates.noindex/JavApi⁴Swift.build/Debug-appletvos/JavApi.build/Objects-normal/arm64/Operator+Java.o -index-unit-output-path /JavApi⁴Swift.build/Debug-appletvos/JavApi.build/Objects-normal/arm64/Class.o -index-unit-output-path /JavApi⁴Swift.build/Debug-appletvos/JavApi.build/Objects-normal/arm64/Cloneable+Swiftify.o -index-unit-output-path /JavApi⁴Swift.build/Debug-appletvos/JavApi.build/Objects-normal/arm64/Cloneable.o -index-unit-output-path /JavApi⁴Swift.build/Debug-appletvos/JavApi.build/Objects-normal/arm64/Comparable+Swiftify.o -index-unit-output-path /JavApi⁴Swift.build/Debug-appletvos/JavApi.build/Objects-normal/arm64/Comparable.o -index-unit-output-path /JavApi⁴Swift.build/Debug-appletvos/JavApi.build/Objects-normal/arm64/Double+Java.o -index-unit-output-path /JavApi⁴Swift.build/Debug-appletvos/JavApi.build/Objects-normal/arm64/Double+Swiftify.o -index-unit-output-path /JavApi⁴Swift.build/Debug-appletvos/JavApi.build/Objects-normal/arm64/FileHandle+TextOutputStream.o -index-unit-output-path /JavApi⁴Swift.build/Debug-appletvos/JavApi.build/Objects-normal/arm64/Int+Java.o -index-unit-output-path /JavApi⁴Swift.build/Debug-appletvos/JavApi.build/Objects-normal/arm64/Int32+Java.o -index-unit-output-path /JavApi⁴Swift.build/Debug-appletvos/JavApi.build/Objects-normal/arm64/Int64+Java.o -index-unit-output-path /JavApi⁴Swift.build/Debug-appletvos/JavApi.build/Objects-normal/arm64/Integer.o -index-unit-output-path /JavApi⁴Swift.build/Debug-appletvos/JavApi.build/Objects-normal/arm64/Long.o -index-unit-output-path /JavApi⁴Swift.build/Debug-appletvos/JavApi.build/Objects-normal/arm64/Math.o -index-unit-output-path /JavApi⁴Swift.build/Debug-appletvos/JavApi.build/Objects-normal/arm64/Operator+Java.o -index-store-path /Users/admin/builder/spi-builder-workspace/.derivedData/Index.noindex/DataStore -index-system-modules
SwiftCompile normal arm64 /Users/admin/builder/spi-builder-workspace/.dependencies/checkouts/JavApi4Swift/Sources/JavApi/lang/Comparable+Swiftify.swift (in target 'JavApi' from project 'JavApi⁴Swift')
cd /Users/admin/builder/spi-builder-workspace/.swiftpm/xcode
/Applications/Xcode-16.1.0.app/Contents/Developer/Toolchains/XcodeDefault.xctoolchain/usr/bin/swift-frontend -c -filelist /Users/admin/builder/spi-builder-workspace/.derivedData/Build/Intermediates.noindex/JavApi⁴Swift.build/Debug-appletvos/JavApi.build/Objects-normal/arm64/sources-1 -primary-file /Users/admin/builder/spi-builder-workspace/.dependencies/checkouts/JavApi4Swift/Sources/JavApi/lang/Class.swift -primary-file /Users/admin/builder/spi-builder-workspace/.dependencies/checkouts/JavApi4Swift/Sources/JavApi/lang/Cloneable+Swiftify.swift -primary-file /Users/admin/builder/spi-builder-workspace/.dependencies/checkouts/JavApi4Swift/Sources/JavApi/lang/Cloneable.swift -primary-file /Users/admin/builder/spi-builder-workspace/.dependencies/checkouts/JavApi4Swift/Sources/JavApi/lang/Comparable+Swiftify.swift -primary-file /Users/admin/builder/spi-builder-workspace/.dependencies/checkouts/JavApi4Swift/Sources/JavApi/lang/Comparable.swift -primary-file /Users/admin/builder/spi-builder-workspace/.dependencies/checkouts/JavApi4Swift/Sources/JavApi/lang/Double+Java.swift -primary-file /Users/admin/builder/spi-builder-workspace/.dependencies/checkouts/JavApi4Swift/Sources/JavApi/lang/Double+Swiftify.swift -primary-file /Users/admin/builder/spi-builder-workspace/.dependencies/checkouts/JavApi4Swift/Sources/JavApi/lang/FileHandle+TextOutputStream.swift -primary-file /Users/admin/builder/spi-builder-workspace/.dependencies/checkouts/JavApi4Swift/Sources/JavApi/lang/Int+Java.swift -primary-file /Users/admin/builder/spi-builder-workspace/.dependencies/checkouts/JavApi4Swift/Sources/JavApi/lang/Int32+Java.swift -primary-file /Users/admin/builder/spi-builder-workspace/.dependencies/checkouts/JavApi4Swift/Sources/JavApi/lang/Int64+Java.swift -primary-file /Users/admin/builder/spi-builder-workspace/.dependencies/checkouts/JavApi4Swift/Sources/JavApi/lang/Integer.swift -primary-file /Users/admin/builder/spi-builder-workspace/.dependencies/checkouts/JavApi4Swift/Sources/JavApi/lang/Long.swift -primary-file /Users/admin/builder/spi-builder-workspace/.dependencies/checkouts/JavApi4Swift/Sources/JavApi/lang/Math.swift -primary-file /Users/admin/builder/spi-builder-workspace/.dependencies/checkouts/JavApi4Swift/Sources/JavApi/lang/Operator+Java.swift -supplementary-output-file-map /Users/admin/builder/spi-builder-workspace/.derivedData/Build/Intermediates.noindex/JavApi⁴Swift.build/Debug-appletvos/JavApi.build/Objects-normal/arm64/supplementaryOutputs-3 -target arm64-apple-tvos16.0 -Xllvm -aarch64-use-tbi -enable-objc-interop -stack-check -sdk /Applications/Xcode-16.1.0.app/Contents/Developer/Platforms/AppleTVOS.platform/Developer/SDKs/AppleTVOS18.1.sdk -I /Users/admin/builder/spi-builder-workspace/.derivedData/Build/Products/Debug-appletvos -I /Applications/Xcode-16.1.0.app/Contents/Developer/Platforms/AppleTVOS.platform/Developer/usr/lib -F /Users/admin/builder/spi-builder-workspace/.derivedData/Build/Products/Debug-appletvos -F /Applications/Xcode-16.1.0.app/Contents/Developer/Platforms/AppleTVOS.platform/Developer/Library/Frameworks -F /Applications/Xcode-16.1.0.app/Contents/Developer/Platforms/AppleTVOS.platform/Developer/SDKs/AppleTVOS18.1.sdk/Developer/Library/Frameworks -no-color-diagnostics -enable-testing -g -debug-info-format\=dwarf -dwarf-version\=4 -module-cache-path /Users/admin/builder/spi-builder-workspace/.derivedData/ModuleCache.noindex -suppress-warnings -profile-generate -profile-coverage-mapping -swift-version 6 -enforce-exclusivity\=checked -stats-output-dir /Users/admin/builder/spi-builder-workspace/.swiftpm/xcode/.stats -Onone -D SWIFT_PACKAGE -D DEBUG -serialize-debugging-options -const-gather-protocols-file /Users/admin/builder/spi-builder-workspace/.derivedData/Build/Intermediates.noindex/JavApi⁴Swift.build/Debug-appletvos/JavApi.build/Objects-normal/arm64/JavApi_const_extract_protocols.json -enable-experimental-feature DebugDescriptionMacro -enable-experimental-feature OpaqueTypeErasure -enable-upcoming-feature StrictConcurrency -enable-upcoming-feature DisableOutwardActorInference -enable-upcoming-feature GlobalActorIsolatedTypesUsability -enable-upcoming-feature InferSendableFromCaptures -strict-concurrency\=complete -empty-abi-descriptor -plugin-path /Applications/Xcode-16.1.0.app/Contents/Developer/Toolchains/XcodeDefault.xctoolchain/usr/lib/swift/host/plugins/testing -user-module-version 0.19.1 -validate-clang-modules-once -clang-build-session-file /Users/admin/builder/spi-builder-workspace/.derivedData/ModuleCache.noindex/Session.modulevalidation -Xcc -working-directory -Xcc /Users/admin/builder/spi-builder-workspace/.swiftpm/xcode -resource-dir /Applications/Xcode-16.1.0.app/Contents/Developer/Toolchains/XcodeDefault.xctoolchain/usr/lib/swift -enable-anonymous-context-mangled-names -file-compilation-dir /Users/admin/builder/spi-builder-workspace/.swiftpm/xcode -Xcc -D_LIBCPP_HARDENING_MODE\=_LIBCPP_HARDENING_MODE_DEBUG -Xcc -ivfsstatcache -Xcc /Users/admin/builder/spi-builder-workspace/.derivedData/SDKStatCaches.noindex/appletvos18.1-22J572-e7fdd8cf9ffd4d4af20823079b51a726.sdkstatcache -Xcc -I/Users/admin/builder/spi-builder-workspace/.derivedData/Build/Intermediates.noindex/JavApi⁴Swift.build/Debug-appletvos/JavApi.build/swift-overrides.hmap -Xcc -I/Users/admin/builder/spi-builder-workspace/.derivedData/Build/Products/Debug-appletvos/include -Xcc -I/Users/admin/builder/spi-builder-workspace/.derivedData/Build/Intermediates.noindex/JavApi⁴Swift.build/Debug-appletvos/JavApi.build/DerivedSources-normal/arm64 -Xcc -I/Users/admin/builder/spi-builder-workspace/.derivedData/Build/Intermediates.noindex/JavApi⁴Swift.build/Debug-appletvos/JavApi.build/DerivedSources/arm64 -Xcc -I/Users/admin/builder/spi-builder-workspace/.derivedData/Build/Intermediates.noindex/JavApi⁴Swift.build/Debug-appletvos/JavApi.build/DerivedSources -Xcc -DSWIFT_PACKAGE -Xcc -DDEBUG\=1 -module-name JavApi -package-name javapi4swift -frontend-parseable-output -disable-clang-spi -target-sdk-version 18.1 -target-sdk-name appletvos18.1 -external-plugin-path /Applications/Xcode-16.1.0.app/Contents/Developer/Platforms/AppleTVOS.platform/Developer/usr/lib/swift/host/plugins\#/Applications/Xcode-16.1.0.app/Contents/Developer/Platforms/AppleTVOS.platform/Developer/usr/bin/swift-plugin-server -external-plugin-path /Applications/Xcode-16.1.0.app/Contents/Developer/Platforms/AppleTVOS.platform/Developer/usr/local/lib/swift/host/plugins\#/Applications/Xcode-16.1.0.app/Contents/Developer/Platforms/AppleTVOS.platform/Developer/usr/bin/swift-plugin-server -plugin-path /Applications/Xcode-16.1.0.app/Contents/Developer/Toolchains/XcodeDefault.xctoolchain/usr/lib/swift/host/plugins -plugin-path /Applications/Xcode-16.1.0.app/Contents/Developer/Toolchains/XcodeDefault.xctoolchain/usr/local/lib/swift/host/plugins -o /Users/admin/builder/spi-builder-workspace/.derivedData/Build/Intermediates.noindex/JavApi⁴Swift.build/Debug-appletvos/JavApi.build/Objects-normal/arm64/Class.o -o /Users/admin/builder/spi-builder-workspace/.derivedData/Build/Intermediates.noindex/JavApi⁴Swift.build/Debug-appletvos/JavApi.build/Objects-normal/arm64/Cloneable+Swiftify.o -o /Users/admin/builder/spi-builder-workspace/.derivedData/Build/Intermediates.noindex/JavApi⁴Swift.build/Debug-appletvos/JavApi.build/Objects-normal/arm64/Cloneable.o -o /Users/admin/builder/spi-builder-workspace/.derivedData/Build/Intermediates.noindex/JavApi⁴Swift.build/Debug-appletvos/JavApi.build/Objects-normal/arm64/Comparable+Swiftify.o -o /Users/admin/builder/spi-builder-workspace/.derivedData/Build/Intermediates.noindex/JavApi⁴Swift.build/Debug-appletvos/JavApi.build/Objects-normal/arm64/Comparable.o -o /Users/admin/builder/spi-builder-workspace/.derivedData/Build/Intermediates.noindex/JavApi⁴Swift.build/Debug-appletvos/JavApi.build/Objects-normal/arm64/Double+Java.o -o /Users/admin/builder/spi-builder-workspace/.derivedData/Build/Intermediates.noindex/JavApi⁴Swift.build/Debug-appletvos/JavApi.build/Objects-normal/arm64/Double+Swiftify.o -o /Users/admin/builder/spi-builder-workspace/.derivedData/Build/Intermediates.noindex/JavApi⁴Swift.build/Debug-appletvos/JavApi.build/Objects-normal/arm64/FileHandle+TextOutputStream.o -o /Users/admin/builder/spi-builder-workspace/.derivedData/Build/Intermediates.noindex/JavApi⁴Swift.build/Debug-appletvos/JavApi.build/Objects-normal/arm64/Int+Java.o -o /Users/admin/builder/spi-builder-workspace/.derivedData/Build/Intermediates.noindex/JavApi⁴Swift.build/Debug-appletvos/JavApi.build/Objects-normal/arm64/Int32+Java.o -o /Users/admin/builder/spi-builder-workspace/.derivedData/Build/Intermediates.noindex/JavApi⁴Swift.build/Debug-appletvos/JavApi.build/Objects-normal/arm64/Int64+Java.o -o /Users/admin/builder/spi-builder-workspace/.derivedData/Build/Intermediates.noindex/JavApi⁴Swift.build/Debug-appletvos/JavApi.build/Objects-normal/arm64/Integer.o -o /Users/admin/builder/spi-builder-workspace/.derivedData/Build/Intermediates.noindex/JavApi⁴Swift.build/Debug-appletvos/JavApi.build/Objects-normal/arm64/Long.o -o /Users/admin/builder/spi-builder-workspace/.derivedData/Build/Intermediates.noindex/JavApi⁴Swift.build/Debug-appletvos/JavApi.build/Objects-normal/arm64/Math.o -o /Users/admin/builder/spi-builder-workspace/.derivedData/Build/Intermediates.noindex/JavApi⁴Swift.build/Debug-appletvos/JavApi.build/Objects-normal/arm64/Operator+Java.o -index-unit-output-path /JavApi⁴Swift.build/Debug-appletvos/JavApi.build/Objects-normal/arm64/Class.o -index-unit-output-path /JavApi⁴Swift.build/Debug-appletvos/JavApi.build/Objects-normal/arm64/Cloneable+Swiftify.o -index-unit-output-path /JavApi⁴Swift.build/Debug-appletvos/JavApi.build/Objects-normal/arm64/Cloneable.o -index-unit-output-path /JavApi⁴Swift.build/Debug-appletvos/JavApi.build/Objects-normal/arm64/Comparable+Swiftify.o -index-unit-output-path /JavApi⁴Swift.build/Debug-appletvos/JavApi.build/Objects-normal/arm64/Comparable.o -index-unit-output-path /JavApi⁴Swift.build/Debug-appletvos/JavApi.build/Objects-normal/arm64/Double+Java.o -index-unit-output-path /JavApi⁴Swift.build/Debug-appletvos/JavApi.build/Objects-normal/arm64/Double+Swiftify.o -index-unit-output-path /JavApi⁴Swift.build/Debug-appletvos/JavApi.build/Objects-normal/arm64/FileHandle+TextOutputStream.o -index-unit-output-path /JavApi⁴Swift.build/Debug-appletvos/JavApi.build/Objects-normal/arm64/Int+Java.o -index-unit-output-path /JavApi⁴Swift.build/Debug-appletvos/JavApi.build/Objects-normal/arm64/Int32+Java.o -index-unit-output-path /JavApi⁴Swift.build/Debug-appletvos/JavApi.build/Objects-normal/arm64/Int64+Java.o -index-unit-output-path /JavApi⁴Swift.build/Debug-appletvos/JavApi.build/Objects-normal/arm64/Integer.o -index-unit-output-path /JavApi⁴Swift.build/Debug-appletvos/JavApi.build/Objects-normal/arm64/Long.o -index-unit-output-path /JavApi⁴Swift.build/Debug-appletvos/JavApi.build/Objects-normal/arm64/Math.o -index-unit-output-path /JavApi⁴Swift.build/Debug-appletvos/JavApi.build/Objects-normal/arm64/Operator+Java.o -index-store-path /Users/admin/builder/spi-builder-workspace/.derivedData/Index.noindex/DataStore -index-system-modules
SwiftCompile normal arm64 /Users/admin/builder/spi-builder-workspace/.dependencies/checkouts/JavApi4Swift/Sources/JavApi/lang/Comparable.swift (in target 'JavApi' from project 'JavApi⁴Swift')
cd /Users/admin/builder/spi-builder-workspace/.swiftpm/xcode
/Applications/Xcode-16.1.0.app/Contents/Developer/Toolchains/XcodeDefault.xctoolchain/usr/bin/swift-frontend -c -filelist /Users/admin/builder/spi-builder-workspace/.derivedData/Build/Intermediates.noindex/JavApi⁴Swift.build/Debug-appletvos/JavApi.build/Objects-normal/arm64/sources-1 -primary-file /Users/admin/builder/spi-builder-workspace/.dependencies/checkouts/JavApi4Swift/Sources/JavApi/lang/Class.swift -primary-file /Users/admin/builder/spi-builder-workspace/.dependencies/checkouts/JavApi4Swift/Sources/JavApi/lang/Cloneable+Swiftify.swift -primary-file /Users/admin/builder/spi-builder-workspace/.dependencies/checkouts/JavApi4Swift/Sources/JavApi/lang/Cloneable.swift -primary-file /Users/admin/builder/spi-builder-workspace/.dependencies/checkouts/JavApi4Swift/Sources/JavApi/lang/Comparable+Swiftify.swift -primary-file /Users/admin/builder/spi-builder-workspace/.dependencies/checkouts/JavApi4Swift/Sources/JavApi/lang/Comparable.swift -primary-file /Users/admin/builder/spi-builder-workspace/.dependencies/checkouts/JavApi4Swift/Sources/JavApi/lang/Double+Java.swift -primary-file /Users/admin/builder/spi-builder-workspace/.dependencies/checkouts/JavApi4Swift/Sources/JavApi/lang/Double+Swiftify.swift -primary-file /Users/admin/builder/spi-builder-workspace/.dependencies/checkouts/JavApi4Swift/Sources/JavApi/lang/FileHandle+TextOutputStream.swift -primary-file /Users/admin/builder/spi-builder-workspace/.dependencies/checkouts/JavApi4Swift/Sources/JavApi/lang/Int+Java.swift -primary-file /Users/admin/builder/spi-builder-workspace/.dependencies/checkouts/JavApi4Swift/Sources/JavApi/lang/Int32+Java.swift -primary-file /Users/admin/builder/spi-builder-workspace/.dependencies/checkouts/JavApi4Swift/Sources/JavApi/lang/Int64+Java.swift -primary-file /Users/admin/builder/spi-builder-workspace/.dependencies/checkouts/JavApi4Swift/Sources/JavApi/lang/Integer.swift -primary-file /Users/admin/builder/spi-builder-workspace/.dependencies/checkouts/JavApi4Swift/Sources/JavApi/lang/Long.swift -primary-file /Users/admin/builder/spi-builder-workspace/.dependencies/checkouts/JavApi4Swift/Sources/JavApi/lang/Math.swift -primary-file /Users/admin/builder/spi-builder-workspace/.dependencies/checkouts/JavApi4Swift/Sources/JavApi/lang/Operator+Java.swift -supplementary-output-file-map /Users/admin/builder/spi-builder-workspace/.derivedData/Build/Intermediates.noindex/JavApi⁴Swift.build/Debug-appletvos/JavApi.build/Objects-normal/arm64/supplementaryOutputs-3 -target arm64-apple-tvos16.0 -Xllvm -aarch64-use-tbi -enable-objc-interop -stack-check -sdk /Applications/Xcode-16.1.0.app/Contents/Developer/Platforms/AppleTVOS.platform/Developer/SDKs/AppleTVOS18.1.sdk -I /Users/admin/builder/spi-builder-workspace/.derivedData/Build/Products/Debug-appletvos -I /Applications/Xcode-16.1.0.app/Contents/Developer/Platforms/AppleTVOS.platform/Developer/usr/lib -F /Users/admin/builder/spi-builder-workspace/.derivedData/Build/Products/Debug-appletvos -F /Applications/Xcode-16.1.0.app/Contents/Developer/Platforms/AppleTVOS.platform/Developer/Library/Frameworks -F /Applications/Xcode-16.1.0.app/Contents/Developer/Platforms/AppleTVOS.platform/Developer/SDKs/AppleTVOS18.1.sdk/Developer/Library/Frameworks -no-color-diagnostics -enable-testing -g -debug-info-format\=dwarf -dwarf-version\=4 -module-cache-path /Users/admin/builder/spi-builder-workspace/.derivedData/ModuleCache.noindex -suppress-warnings -profile-generate -profile-coverage-mapping -swift-version 6 -enforce-exclusivity\=checked -stats-output-dir /Users/admin/builder/spi-builder-workspace/.swiftpm/xcode/.stats -Onone -D SWIFT_PACKAGE -D DEBUG -serialize-debugging-options -const-gather-protocols-file /Users/admin/builder/spi-builder-workspace/.derivedData/Build/Intermediates.noindex/JavApi⁴Swift.build/Debug-appletvos/JavApi.build/Objects-normal/arm64/JavApi_const_extract_protocols.json -enable-experimental-feature DebugDescriptionMacro -enable-experimental-feature OpaqueTypeErasure -enable-upcoming-feature StrictConcurrency -enable-upcoming-feature DisableOutwardActorInference -enable-upcoming-feature GlobalActorIsolatedTypesUsability -enable-upcoming-feature InferSendableFromCaptures -strict-concurrency\=complete -empty-abi-descriptor -plugin-path /Applications/Xcode-16.1.0.app/Contents/Developer/Toolchains/XcodeDefault.xctoolchain/usr/lib/swift/host/plugins/testing -user-module-version 0.19.1 -validate-clang-modules-once -clang-build-session-file /Users/admin/builder/spi-builder-workspace/.derivedData/ModuleCache.noindex/Session.modulevalidation -Xcc -working-directory -Xcc /Users/admin/builder/spi-builder-workspace/.swiftpm/xcode -resource-dir /Applications/Xcode-16.1.0.app/Contents/Developer/Toolchains/XcodeDefault.xctoolchain/usr/lib/swift -enable-anonymous-context-mangled-names -file-compilation-dir /Users/admin/builder/spi-builder-workspace/.swiftpm/xcode -Xcc -D_LIBCPP_HARDENING_MODE\=_LIBCPP_HARDENING_MODE_DEBUG -Xcc -ivfsstatcache -Xcc /Users/admin/builder/spi-builder-workspace/.derivedData/SDKStatCaches.noindex/appletvos18.1-22J572-e7fdd8cf9ffd4d4af20823079b51a726.sdkstatcache -Xcc -I/Users/admin/builder/spi-builder-workspace/.derivedData/Build/Intermediates.noindex/JavApi⁴Swift.build/Debug-appletvos/JavApi.build/swift-overrides.hmap -Xcc -I/Users/admin/builder/spi-builder-workspace/.derivedData/Build/Products/Debug-appletvos/include -Xcc -I/Users/admin/builder/spi-builder-workspace/.derivedData/Build/Intermediates.noindex/JavApi⁴Swift.build/Debug-appletvos/JavApi.build/DerivedSources-normal/arm64 -Xcc -I/Users/admin/builder/spi-builder-workspace/.derivedData/Build/Intermediates.noindex/JavApi⁴Swift.build/Debug-appletvos/JavApi.build/DerivedSources/arm64 -Xcc -I/Users/admin/builder/spi-builder-workspace/.derivedData/Build/Intermediates.noindex/JavApi⁴Swift.build/Debug-appletvos/JavApi.build/DerivedSources -Xcc -DSWIFT_PACKAGE -Xcc -DDEBUG\=1 -module-name JavApi -package-name javapi4swift -frontend-parseable-output -disable-clang-spi -target-sdk-version 18.1 -target-sdk-name appletvos18.1 -external-plugin-path /Applications/Xcode-16.1.0.app/Contents/Developer/Platforms/AppleTVOS.platform/Developer/usr/lib/swift/host/plugins\#/Applications/Xcode-16.1.0.app/Contents/Developer/Platforms/AppleTVOS.platform/Developer/usr/bin/swift-plugin-server -external-plugin-path /Applications/Xcode-16.1.0.app/Contents/Developer/Platforms/AppleTVOS.platform/Developer/usr/local/lib/swift/host/plugins\#/Applications/Xcode-16.1.0.app/Contents/Developer/Platforms/AppleTVOS.platform/Developer/usr/bin/swift-plugin-server -plugin-path /Applications/Xcode-16.1.0.app/Contents/Developer/Toolchains/XcodeDefault.xctoolchain/usr/lib/swift/host/plugins -plugin-path /Applications/Xcode-16.1.0.app/Contents/Developer/Toolchains/XcodeDefault.xctoolchain/usr/local/lib/swift/host/plugins -o /Users/admin/builder/spi-builder-workspace/.derivedData/Build/Intermediates.noindex/JavApi⁴Swift.build/Debug-appletvos/JavApi.build/Objects-normal/arm64/Class.o -o /Users/admin/builder/spi-builder-workspace/.derivedData/Build/Intermediates.noindex/JavApi⁴Swift.build/Debug-appletvos/JavApi.build/Objects-normal/arm64/Cloneable+Swiftify.o -o /Users/admin/builder/spi-builder-workspace/.derivedData/Build/Intermediates.noindex/JavApi⁴Swift.build/Debug-appletvos/JavApi.build/Objects-normal/arm64/Cloneable.o -o /Users/admin/builder/spi-builder-workspace/.derivedData/Build/Intermediates.noindex/JavApi⁴Swift.build/Debug-appletvos/JavApi.build/Objects-normal/arm64/Comparable+Swiftify.o -o /Users/admin/builder/spi-builder-workspace/.derivedData/Build/Intermediates.noindex/JavApi⁴Swift.build/Debug-appletvos/JavApi.build/Objects-normal/arm64/Comparable.o -o /Users/admin/builder/spi-builder-workspace/.derivedData/Build/Intermediates.noindex/JavApi⁴Swift.build/Debug-appletvos/JavApi.build/Objects-normal/arm64/Double+Java.o -o /Users/admin/builder/spi-builder-workspace/.derivedData/Build/Intermediates.noindex/JavApi⁴Swift.build/Debug-appletvos/JavApi.build/Objects-normal/arm64/Double+Swiftify.o -o /Users/admin/builder/spi-builder-workspace/.derivedData/Build/Intermediates.noindex/JavApi⁴Swift.build/Debug-appletvos/JavApi.build/Objects-normal/arm64/FileHandle+TextOutputStream.o -o /Users/admin/builder/spi-builder-workspace/.derivedData/Build/Intermediates.noindex/JavApi⁴Swift.build/Debug-appletvos/JavApi.build/Objects-normal/arm64/Int+Java.o -o /Users/admin/builder/spi-builder-workspace/.derivedData/Build/Intermediates.noindex/JavApi⁴Swift.build/Debug-appletvos/JavApi.build/Objects-normal/arm64/Int32+Java.o -o /Users/admin/builder/spi-builder-workspace/.derivedData/Build/Intermediates.noindex/JavApi⁴Swift.build/Debug-appletvos/JavApi.build/Objects-normal/arm64/Int64+Java.o -o /Users/admin/builder/spi-builder-workspace/.derivedData/Build/Intermediates.noindex/JavApi⁴Swift.build/Debug-appletvos/JavApi.build/Objects-normal/arm64/Integer.o -o /Users/admin/builder/spi-builder-workspace/.derivedData/Build/Intermediates.noindex/JavApi⁴Swift.build/Debug-appletvos/JavApi.build/Objects-normal/arm64/Long.o -o /Users/admin/builder/spi-builder-workspace/.derivedData/Build/Intermediates.noindex/JavApi⁴Swift.build/Debug-appletvos/JavApi.build/Objects-normal/arm64/Math.o -o /Users/admin/builder/spi-builder-workspace/.derivedData/Build/Intermediates.noindex/JavApi⁴Swift.build/Debug-appletvos/JavApi.build/Objects-normal/arm64/Operator+Java.o -index-unit-output-path /JavApi⁴Swift.build/Debug-appletvos/JavApi.build/Objects-normal/arm64/Class.o -index-unit-output-path /JavApi⁴Swift.build/Debug-appletvos/JavApi.build/Objects-normal/arm64/Cloneable+Swiftify.o -index-unit-output-path /JavApi⁴Swift.build/Debug-appletvos/JavApi.build/Objects-normal/arm64/Cloneable.o -index-unit-output-path /JavApi⁴Swift.build/Debug-appletvos/JavApi.build/Objects-normal/arm64/Comparable+Swiftify.o -index-unit-output-path /JavApi⁴Swift.build/Debug-appletvos/JavApi.build/Objects-normal/arm64/Comparable.o -index-unit-output-path /JavApi⁴Swift.build/Debug-appletvos/JavApi.build/Objects-normal/arm64/Double+Java.o -index-unit-output-path /JavApi⁴Swift.build/Debug-appletvos/JavApi.build/Objects-normal/arm64/Double+Swiftify.o -index-unit-output-path /JavApi⁴Swift.build/Debug-appletvos/JavApi.build/Objects-normal/arm64/FileHandle+TextOutputStream.o -index-unit-output-path /JavApi⁴Swift.build/Debug-appletvos/JavApi.build/Objects-normal/arm64/Int+Java.o -index-unit-output-path /JavApi⁴Swift.build/Debug-appletvos/JavApi.build/Objects-normal/arm64/Int32+Java.o -index-unit-output-path /JavApi⁴Swift.build/Debug-appletvos/JavApi.build/Objects-normal/arm64/Int64+Java.o -index-unit-output-path /JavApi⁴Swift.build/Debug-appletvos/JavApi.build/Objects-normal/arm64/Integer.o -index-unit-output-path /JavApi⁴Swift.build/Debug-appletvos/JavApi.build/Objects-normal/arm64/Long.o -index-unit-output-path /JavApi⁴Swift.build/Debug-appletvos/JavApi.build/Objects-normal/arm64/Math.o -index-unit-output-path /JavApi⁴Swift.build/Debug-appletvos/JavApi.build/Objects-normal/arm64/Operator+Java.o -index-store-path /Users/admin/builder/spi-builder-workspace/.derivedData/Index.noindex/DataStore -index-system-modules
SwiftCompile normal arm64 /Users/admin/builder/spi-builder-workspace/.dependencies/checkouts/JavApi4Swift/Sources/JavApi/lang/Double+Java.swift (in target 'JavApi' from project 'JavApi⁴Swift')
cd /Users/admin/builder/spi-builder-workspace/.swiftpm/xcode
/Applications/Xcode-16.1.0.app/Contents/Developer/Toolchains/XcodeDefault.xctoolchain/usr/bin/swift-frontend -c -filelist /Users/admin/builder/spi-builder-workspace/.derivedData/Build/Intermediates.noindex/JavApi⁴Swift.build/Debug-appletvos/JavApi.build/Objects-normal/arm64/sources-1 -primary-file /Users/admin/builder/spi-builder-workspace/.dependencies/checkouts/JavApi4Swift/Sources/JavApi/lang/Class.swift -primary-file /Users/admin/builder/spi-builder-workspace/.dependencies/checkouts/JavApi4Swift/Sources/JavApi/lang/Cloneable+Swiftify.swift -primary-file /Users/admin/builder/spi-builder-workspace/.dependencies/checkouts/JavApi4Swift/Sources/JavApi/lang/Cloneable.swift -primary-file /Users/admin/builder/spi-builder-workspace/.dependencies/checkouts/JavApi4Swift/Sources/JavApi/lang/Comparable+Swiftify.swift -primary-file /Users/admin/builder/spi-builder-workspace/.dependencies/checkouts/JavApi4Swift/Sources/JavApi/lang/Comparable.swift -primary-file /Users/admin/builder/spi-builder-workspace/.dependencies/checkouts/JavApi4Swift/Sources/JavApi/lang/Double+Java.swift -primary-file /Users/admin/builder/spi-builder-workspace/.dependencies/checkouts/JavApi4Swift/Sources/JavApi/lang/Double+Swiftify.swift -primary-file /Users/admin/builder/spi-builder-workspace/.dependencies/checkouts/JavApi4Swift/Sources/JavApi/lang/FileHandle+TextOutputStream.swift -primary-file /Users/admin/builder/spi-builder-workspace/.dependencies/checkouts/JavApi4Swift/Sources/JavApi/lang/Int+Java.swift -primary-file /Users/admin/builder/spi-builder-workspace/.dependencies/checkouts/JavApi4Swift/Sources/JavApi/lang/Int32+Java.swift -primary-file /Users/admin/builder/spi-builder-workspace/.dependencies/checkouts/JavApi4Swift/Sources/JavApi/lang/Int64+Java.swift -primary-file /Users/admin/builder/spi-builder-workspace/.dependencies/checkouts/JavApi4Swift/Sources/JavApi/lang/Integer.swift -primary-file /Users/admin/builder/spi-builder-workspace/.dependencies/checkouts/JavApi4Swift/Sources/JavApi/lang/Long.swift -primary-file /Users/admin/builder/spi-builder-workspace/.dependencies/checkouts/JavApi4Swift/Sources/JavApi/lang/Math.swift -primary-file /Users/admin/builder/spi-builder-workspace/.dependencies/checkouts/JavApi4Swift/Sources/JavApi/lang/Operator+Java.swift -supplementary-output-file-map /Users/admin/builder/spi-builder-workspace/.derivedData/Build/Intermediates.noindex/JavApi⁴Swift.build/Debug-appletvos/JavApi.build/Objects-normal/arm64/supplementaryOutputs-3 -target arm64-apple-tvos16.0 -Xllvm -aarch64-use-tbi -enable-objc-interop -stack-check -sdk /Applications/Xcode-16.1.0.app/Contents/Developer/Platforms/AppleTVOS.platform/Developer/SDKs/AppleTVOS18.1.sdk -I /Users/admin/builder/spi-builder-workspace/.derivedData/Build/Products/Debug-appletvos -I /Applications/Xcode-16.1.0.app/Contents/Developer/Platforms/AppleTVOS.platform/Developer/usr/lib -F /Users/admin/builder/spi-builder-workspace/.derivedData/Build/Products/Debug-appletvos -F /Applications/Xcode-16.1.0.app/Contents/Developer/Platforms/AppleTVOS.platform/Developer/Library/Frameworks -F /Applications/Xcode-16.1.0.app/Contents/Developer/Platforms/AppleTVOS.platform/Developer/SDKs/AppleTVOS18.1.sdk/Developer/Library/Frameworks -no-color-diagnostics -enable-testing -g -debug-info-format\=dwarf -dwarf-version\=4 -module-cache-path /Users/admin/builder/spi-builder-workspace/.derivedData/ModuleCache.noindex -suppress-warnings -profile-generate -profile-coverage-mapping -swift-version 6 -enforce-exclusivity\=checked -stats-output-dir /Users/admin/builder/spi-builder-workspace/.swiftpm/xcode/.stats -Onone -D SWIFT_PACKAGE -D DEBUG -serialize-debugging-options -const-gather-protocols-file /Users/admin/builder/spi-builder-workspace/.derivedData/Build/Intermediates.noindex/JavApi⁴Swift.build/Debug-appletvos/JavApi.build/Objects-normal/arm64/JavApi_const_extract_protocols.json -enable-experimental-feature DebugDescriptionMacro -enable-experimental-feature OpaqueTypeErasure -enable-upcoming-feature StrictConcurrency -enable-upcoming-feature DisableOutwardActorInference -enable-upcoming-feature GlobalActorIsolatedTypesUsability -enable-upcoming-feature InferSendableFromCaptures -strict-concurrency\=complete -empty-abi-descriptor -plugin-path /Applications/Xcode-16.1.0.app/Contents/Developer/Toolchains/XcodeDefault.xctoolchain/usr/lib/swift/host/plugins/testing -user-module-version 0.19.1 -validate-clang-modules-once -clang-build-session-file /Users/admin/builder/spi-builder-workspace/.derivedData/ModuleCache.noindex/Session.modulevalidation -Xcc -working-directory -Xcc /Users/admin/builder/spi-builder-workspace/.swiftpm/xcode -resource-dir /Applications/Xcode-16.1.0.app/Contents/Developer/Toolchains/XcodeDefault.xctoolchain/usr/lib/swift -enable-anonymous-context-mangled-names -file-compilation-dir /Users/admin/builder/spi-builder-workspace/.swiftpm/xcode -Xcc -D_LIBCPP_HARDENING_MODE\=_LIBCPP_HARDENING_MODE_DEBUG -Xcc -ivfsstatcache -Xcc /Users/admin/builder/spi-builder-workspace/.derivedData/SDKStatCaches.noindex/appletvos18.1-22J572-e7fdd8cf9ffd4d4af20823079b51a726.sdkstatcache -Xcc -I/Users/admin/builder/spi-builder-workspace/.derivedData/Build/Intermediates.noindex/JavApi⁴Swift.build/Debug-appletvos/JavApi.build/swift-overrides.hmap -Xcc -I/Users/admin/builder/spi-builder-workspace/.derivedData/Build/Products/Debug-appletvos/include -Xcc -I/Users/admin/builder/spi-builder-workspace/.derivedData/Build/Intermediates.noindex/JavApi⁴Swift.build/Debug-appletvos/JavApi.build/DerivedSources-normal/arm64 -Xcc -I/Users/admin/builder/spi-builder-workspace/.derivedData/Build/Intermediates.noindex/JavApi⁴Swift.build/Debug-appletvos/JavApi.build/DerivedSources/arm64 -Xcc -I/Users/admin/builder/spi-builder-workspace/.derivedData/Build/Intermediates.noindex/JavApi⁴Swift.build/Debug-appletvos/JavApi.build/DerivedSources -Xcc -DSWIFT_PACKAGE -Xcc -DDEBUG\=1 -module-name JavApi -package-name javapi4swift -frontend-parseable-output -disable-clang-spi -target-sdk-version 18.1 -target-sdk-name appletvos18.1 -external-plugin-path /Applications/Xcode-16.1.0.app/Contents/Developer/Platforms/AppleTVOS.platform/Developer/usr/lib/swift/host/plugins\#/Applications/Xcode-16.1.0.app/Contents/Developer/Platforms/AppleTVOS.platform/Developer/usr/bin/swift-plugin-server -external-plugin-path /Applications/Xcode-16.1.0.app/Contents/Developer/Platforms/AppleTVOS.platform/Developer/usr/local/lib/swift/host/plugins\#/Applications/Xcode-16.1.0.app/Contents/Developer/Platforms/AppleTVOS.platform/Developer/usr/bin/swift-plugin-server -plugin-path /Applications/Xcode-16.1.0.app/Contents/Developer/Toolchains/XcodeDefault.xctoolchain/usr/lib/swift/host/plugins -plugin-path /Applications/Xcode-16.1.0.app/Contents/Developer/Toolchains/XcodeDefault.xctoolchain/usr/local/lib/swift/host/plugins -o /Users/admin/builder/spi-builder-workspace/.derivedData/Build/Intermediates.noindex/JavApi⁴Swift.build/Debug-appletvos/JavApi.build/Objects-normal/arm64/Class.o -o /Users/admin/builder/spi-builder-workspace/.derivedData/Build/Intermediates.noindex/JavApi⁴Swift.build/Debug-appletvos/JavApi.build/Objects-normal/arm64/Cloneable+Swiftify.o -o /Users/admin/builder/spi-builder-workspace/.derivedData/Build/Intermediates.noindex/JavApi⁴Swift.build/Debug-appletvos/JavApi.build/Objects-normal/arm64/Cloneable.o -o /Users/admin/builder/spi-builder-workspace/.derivedData/Build/Intermediates.noindex/JavApi⁴Swift.build/Debug-appletvos/JavApi.build/Objects-normal/arm64/Comparable+Swiftify.o -o /Users/admin/builder/spi-builder-workspace/.derivedData/Build/Intermediates.noindex/JavApi⁴Swift.build/Debug-appletvos/JavApi.build/Objects-normal/arm64/Comparable.o -o /Users/admin/builder/spi-builder-workspace/.derivedData/Build/Intermediates.noindex/JavApi⁴Swift.build/Debug-appletvos/JavApi.build/Objects-normal/arm64/Double+Java.o -o /Users/admin/builder/spi-builder-workspace/.derivedData/Build/Intermediates.noindex/JavApi⁴Swift.build/Debug-appletvos/JavApi.build/Objects-normal/arm64/Double+Swiftify.o -o /Users/admin/builder/spi-builder-workspace/.derivedData/Build/Intermediates.noindex/JavApi⁴Swift.build/Debug-appletvos/JavApi.build/Objects-normal/arm64/FileHandle+TextOutputStream.o -o /Users/admin/builder/spi-builder-workspace/.derivedData/Build/Intermediates.noindex/JavApi⁴Swift.build/Debug-appletvos/JavApi.build/Objects-normal/arm64/Int+Java.o -o /Users/admin/builder/spi-builder-workspace/.derivedData/Build/Intermediates.noindex/JavApi⁴Swift.build/Debug-appletvos/JavApi.build/Objects-normal/arm64/Int32+Java.o -o /Users/admin/builder/spi-builder-workspace/.derivedData/Build/Intermediates.noindex/JavApi⁴Swift.build/Debug-appletvos/JavApi.build/Objects-normal/arm64/Int64+Java.o -o /Users/admin/builder/spi-builder-workspace/.derivedData/Build/Intermediates.noindex/JavApi⁴Swift.build/Debug-appletvos/JavApi.build/Objects-normal/arm64/Integer.o -o /Users/admin/builder/spi-builder-workspace/.derivedData/Build/Intermediates.noindex/JavApi⁴Swift.build/Debug-appletvos/JavApi.build/Objects-normal/arm64/Long.o -o /Users/admin/builder/spi-builder-workspace/.derivedData/Build/Intermediates.noindex/JavApi⁴Swift.build/Debug-appletvos/JavApi.build/Objects-normal/arm64/Math.o -o /Users/admin/builder/spi-builder-workspace/.derivedData/Build/Intermediates.noindex/JavApi⁴Swift.build/Debug-appletvos/JavApi.build/Objects-normal/arm64/Operator+Java.o -index-unit-output-path /JavApi⁴Swift.build/Debug-appletvos/JavApi.build/Objects-normal/arm64/Class.o -index-unit-output-path /JavApi⁴Swift.build/Debug-appletvos/JavApi.build/Objects-normal/arm64/Cloneable+Swiftify.o -index-unit-output-path /JavApi⁴Swift.build/Debug-appletvos/JavApi.build/Objects-normal/arm64/Cloneable.o -index-unit-output-path /JavApi⁴Swift.build/Debug-appletvos/JavApi.build/Objects-normal/arm64/Comparable+Swiftify.o -index-unit-output-path /JavApi⁴Swift.build/Debug-appletvos/JavApi.build/Objects-normal/arm64/Comparable.o -index-unit-output-path /JavApi⁴Swift.build/Debug-appletvos/JavApi.build/Objects-normal/arm64/Double+Java.o -index-unit-output-path /JavApi⁴Swift.build/Debug-appletvos/JavApi.build/Objects-normal/arm64/Double+Swiftify.o -index-unit-output-path /JavApi⁴Swift.build/Debug-appletvos/JavApi.build/Objects-normal/arm64/FileHandle+TextOutputStream.o -index-unit-output-path /JavApi⁴Swift.build/Debug-appletvos/JavApi.build/Objects-normal/arm64/Int+Java.o -index-unit-output-path /JavApi⁴Swift.build/Debug-appletvos/JavApi.build/Objects-normal/arm64/Int32+Java.o -index-unit-output-path /JavApi⁴Swift.build/Debug-appletvos/JavApi.build/Objects-normal/arm64/Int64+Java.o -index-unit-output-path /JavApi⁴Swift.build/Debug-appletvos/JavApi.build/Objects-normal/arm64/Integer.o -index-unit-output-path /JavApi⁴Swift.build/Debug-appletvos/JavApi.build/Objects-normal/arm64/Long.o -index-unit-output-path /JavApi⁴Swift.build/Debug-appletvos/JavApi.build/Objects-normal/arm64/Math.o -index-unit-output-path /JavApi⁴Swift.build/Debug-appletvos/JavApi.build/Objects-normal/arm64/Operator+Java.o -index-store-path /Users/admin/builder/spi-builder-workspace/.derivedData/Index.noindex/DataStore -index-system-modules
SwiftCompile normal arm64 /Users/admin/builder/spi-builder-workspace/.dependencies/checkouts/JavApi4Swift/Sources/JavApi/lang/Double+Swiftify.swift (in target 'JavApi' from project 'JavApi⁴Swift')
cd /Users/admin/builder/spi-builder-workspace/.swiftpm/xcode
/Applications/Xcode-16.1.0.app/Contents/Developer/Toolchains/XcodeDefault.xctoolchain/usr/bin/swift-frontend -c -filelist /Users/admin/builder/spi-builder-workspace/.derivedData/Build/Intermediates.noindex/JavApi⁴Swift.build/Debug-appletvos/JavApi.build/Objects-normal/arm64/sources-1 -primary-file /Users/admin/builder/spi-builder-workspace/.dependencies/checkouts/JavApi4Swift/Sources/JavApi/lang/Class.swift -primary-file /Users/admin/builder/spi-builder-workspace/.dependencies/checkouts/JavApi4Swift/Sources/JavApi/lang/Cloneable+Swiftify.swift -primary-file /Users/admin/builder/spi-builder-workspace/.dependencies/checkouts/JavApi4Swift/Sources/JavApi/lang/Cloneable.swift -primary-file /Users/admin/builder/spi-builder-workspace/.dependencies/checkouts/JavApi4Swift/Sources/JavApi/lang/Comparable+Swiftify.swift -primary-file /Users/admin/builder/spi-builder-workspace/.dependencies/checkouts/JavApi4Swift/Sources/JavApi/lang/Comparable.swift -primary-file /Users/admin/builder/spi-builder-workspace/.dependencies/checkouts/JavApi4Swift/Sources/JavApi/lang/Double+Java.swift -primary-file /Users/admin/builder/spi-builder-workspace/.dependencies/checkouts/JavApi4Swift/Sources/JavApi/lang/Double+Swiftify.swift -primary-file /Users/admin/builder/spi-builder-workspace/.dependencies/checkouts/JavApi4Swift/Sources/JavApi/lang/FileHandle+TextOutputStream.swift -primary-file /Users/admin/builder/spi-builder-workspace/.dependencies/checkouts/JavApi4Swift/Sources/JavApi/lang/Int+Java.swift -primary-file /Users/admin/builder/spi-builder-workspace/.dependencies/checkouts/JavApi4Swift/Sources/JavApi/lang/Int32+Java.swift -primary-file /Users/admin/builder/spi-builder-workspace/.dependencies/checkouts/JavApi4Swift/Sources/JavApi/lang/Int64+Java.swift -primary-file /Users/admin/builder/spi-builder-workspace/.dependencies/checkouts/JavApi4Swift/Sources/JavApi/lang/Integer.swift -primary-file /Users/admin/builder/spi-builder-workspace/.dependencies/checkouts/JavApi4Swift/Sources/JavApi/lang/Long.swift -primary-file /Users/admin/builder/spi-builder-workspace/.dependencies/checkouts/JavApi4Swift/Sources/JavApi/lang/Math.swift -primary-file /Users/admin/builder/spi-builder-workspace/.dependencies/checkouts/JavApi4Swift/Sources/JavApi/lang/Operator+Java.swift -supplementary-output-file-map /Users/admin/builder/spi-builder-workspace/.derivedData/Build/Intermediates.noindex/JavApi⁴Swift.build/Debug-appletvos/JavApi.build/Objects-normal/arm64/supplementaryOutputs-3 -target arm64-apple-tvos16.0 -Xllvm -aarch64-use-tbi -enable-objc-interop -stack-check -sdk /Applications/Xcode-16.1.0.app/Contents/Developer/Platforms/AppleTVOS.platform/Developer/SDKs/AppleTVOS18.1.sdk -I /Users/admin/builder/spi-builder-workspace/.derivedData/Build/Products/Debug-appletvos -I /Applications/Xcode-16.1.0.app/Contents/Developer/Platforms/AppleTVOS.platform/Developer/usr/lib -F /Users/admin/builder/spi-builder-workspace/.derivedData/Build/Products/Debug-appletvos -F /Applications/Xcode-16.1.0.app/Contents/Developer/Platforms/AppleTVOS.platform/Developer/Library/Frameworks -F /Applications/Xcode-16.1.0.app/Contents/Developer/Platforms/AppleTVOS.platform/Developer/SDKs/AppleTVOS18.1.sdk/Developer/Library/Frameworks -no-color-diagnostics -enable-testing -g -debug-info-format\=dwarf -dwarf-version\=4 -module-cache-path /Users/admin/builder/spi-builder-workspace/.derivedData/ModuleCache.noindex -suppress-warnings -profile-generate -profile-coverage-mapping -swift-version 6 -enforce-exclusivity\=checked -stats-output-dir /Users/admin/builder/spi-builder-workspace/.swiftpm/xcode/.stats -Onone -D SWIFT_PACKAGE -D DEBUG -serialize-debugging-options -const-gather-protocols-file /Users/admin/builder/spi-builder-workspace/.derivedData/Build/Intermediates.noindex/JavApi⁴Swift.build/Debug-appletvos/JavApi.build/Objects-normal/arm64/JavApi_const_extract_protocols.json -enable-experimental-feature DebugDescriptionMacro -enable-experimental-feature OpaqueTypeErasure -enable-upcoming-feature StrictConcurrency -enable-upcoming-feature DisableOutwardActorInference -enable-upcoming-feature GlobalActorIsolatedTypesUsability -enable-upcoming-feature InferSendableFromCaptures -strict-concurrency\=complete -empty-abi-descriptor -plugin-path /Applications/Xcode-16.1.0.app/Contents/Developer/Toolchains/XcodeDefault.xctoolchain/usr/lib/swift/host/plugins/testing -user-module-version 0.19.1 -validate-clang-modules-once -clang-build-session-file /Users/admin/builder/spi-builder-workspace/.derivedData/ModuleCache.noindex/Session.modulevalidation -Xcc -working-directory -Xcc /Users/admin/builder/spi-builder-workspace/.swiftpm/xcode -resource-dir /Applications/Xcode-16.1.0.app/Contents/Developer/Toolchains/XcodeDefault.xctoolchain/usr/lib/swift -enable-anonymous-context-mangled-names -file-compilation-dir /Users/admin/builder/spi-builder-workspace/.swiftpm/xcode -Xcc -D_LIBCPP_HARDENING_MODE\=_LIBCPP_HARDENING_MODE_DEBUG -Xcc -ivfsstatcache -Xcc /Users/admin/builder/spi-builder-workspace/.derivedData/SDKStatCaches.noindex/appletvos18.1-22J572-e7fdd8cf9ffd4d4af20823079b51a726.sdkstatcache -Xcc -I/Users/admin/builder/spi-builder-workspace/.derivedData/Build/Intermediates.noindex/JavApi⁴Swift.build/Debug-appletvos/JavApi.build/swift-overrides.hmap -Xcc -I/Users/admin/builder/spi-builder-workspace/.derivedData/Build/Products/Debug-appletvos/include -Xcc -I/Users/admin/builder/spi-builder-workspace/.derivedData/Build/Intermediates.noindex/JavApi⁴Swift.build/Debug-appletvos/JavApi.build/DerivedSources-normal/arm64 -Xcc -I/Users/admin/builder/spi-builder-workspace/.derivedData/Build/Intermediates.noindex/JavApi⁴Swift.build/Debug-appletvos/JavApi.build/DerivedSources/arm64 -Xcc -I/Users/admin/builder/spi-builder-workspace/.derivedData/Build/Intermediates.noindex/JavApi⁴Swift.build/Debug-appletvos/JavApi.build/DerivedSources -Xcc -DSWIFT_PACKAGE -Xcc -DDEBUG\=1 -module-name JavApi -package-name javapi4swift -frontend-parseable-output -disable-clang-spi -target-sdk-version 18.1 -target-sdk-name appletvos18.1 -external-plugin-path /Applications/Xcode-16.1.0.app/Contents/Developer/Platforms/AppleTVOS.platform/Developer/usr/lib/swift/host/plugins\#/Applications/Xcode-16.1.0.app/Contents/Developer/Platforms/AppleTVOS.platform/Developer/usr/bin/swift-plugin-server -external-plugin-path /Applications/Xcode-16.1.0.app/Contents/Developer/Platforms/AppleTVOS.platform/Developer/usr/local/lib/swift/host/plugins\#/Applications/Xcode-16.1.0.app/Contents/Developer/Platforms/AppleTVOS.platform/Developer/usr/bin/swift-plugin-server -plugin-path /Applications/Xcode-16.1.0.app/Contents/Developer/Toolchains/XcodeDefault.xctoolchain/usr/lib/swift/host/plugins -plugin-path /Applications/Xcode-16.1.0.app/Contents/Developer/Toolchains/XcodeDefault.xctoolchain/usr/local/lib/swift/host/plugins -o /Users/admin/builder/spi-builder-workspace/.derivedData/Build/Intermediates.noindex/JavApi⁴Swift.build/Debug-appletvos/JavApi.build/Objects-normal/arm64/Class.o -o /Users/admin/builder/spi-builder-workspace/.derivedData/Build/Intermediates.noindex/JavApi⁴Swift.build/Debug-appletvos/JavApi.build/Objects-normal/arm64/Cloneable+Swiftify.o -o /Users/admin/builder/spi-builder-workspace/.derivedData/Build/Intermediates.noindex/JavApi⁴Swift.build/Debug-appletvos/JavApi.build/Objects-normal/arm64/Cloneable.o -o /Users/admin/builder/spi-builder-workspace/.derivedData/Build/Intermediates.noindex/JavApi⁴Swift.build/Debug-appletvos/JavApi.build/Objects-normal/arm64/Comparable+Swiftify.o -o /Users/admin/builder/spi-builder-workspace/.derivedData/Build/Intermediates.noindex/JavApi⁴Swift.build/Debug-appletvos/JavApi.build/Objects-normal/arm64/Comparable.o -o /Users/admin/builder/spi-builder-workspace/.derivedData/Build/Intermediates.noindex/JavApi⁴Swift.build/Debug-appletvos/JavApi.build/Objects-normal/arm64/Double+Java.o -o /Users/admin/builder/spi-builder-workspace/.derivedData/Build/Intermediates.noindex/JavApi⁴Swift.build/Debug-appletvos/JavApi.build/Objects-normal/arm64/Double+Swiftify.o -o /Users/admin/builder/spi-builder-workspace/.derivedData/Build/Intermediates.noindex/JavApi⁴Swift.build/Debug-appletvos/JavApi.build/Objects-normal/arm64/FileHandle+TextOutputStream.o -o /Users/admin/builder/spi-builder-workspace/.derivedData/Build/Intermediates.noindex/JavApi⁴Swift.build/Debug-appletvos/JavApi.build/Objects-normal/arm64/Int+Java.o -o /Users/admin/builder/spi-builder-workspace/.derivedData/Build/Intermediates.noindex/JavApi⁴Swift.build/Debug-appletvos/JavApi.build/Objects-normal/arm64/Int32+Java.o -o /Users/admin/builder/spi-builder-workspace/.derivedData/Build/Intermediates.noindex/JavApi⁴Swift.build/Debug-appletvos/JavApi.build/Objects-normal/arm64/Int64+Java.o -o /Users/admin/builder/spi-builder-workspace/.derivedData/Build/Intermediates.noindex/JavApi⁴Swift.build/Debug-appletvos/JavApi.build/Objects-normal/arm64/Integer.o -o /Users/admin/builder/spi-builder-workspace/.derivedData/Build/Intermediates.noindex/JavApi⁴Swift.build/Debug-appletvos/JavApi.build/Objects-normal/arm64/Long.o -o /Users/admin/builder/spi-builder-workspace/.derivedData/Build/Intermediates.noindex/JavApi⁴Swift.build/Debug-appletvos/JavApi.build/Objects-normal/arm64/Math.o -o /Users/admin/builder/spi-builder-workspace/.derivedData/Build/Intermediates.noindex/JavApi⁴Swift.build/Debug-appletvos/JavApi.build/Objects-normal/arm64/Operator+Java.o -index-unit-output-path /JavApi⁴Swift.build/Debug-appletvos/JavApi.build/Objects-normal/arm64/Class.o -index-unit-output-path /JavApi⁴Swift.build/Debug-appletvos/JavApi.build/Objects-normal/arm64/Cloneable+Swiftify.o -index-unit-output-path /JavApi⁴Swift.build/Debug-appletvos/JavApi.build/Objects-normal/arm64/Cloneable.o -index-unit-output-path /JavApi⁴Swift.build/Debug-appletvos/JavApi.build/Objects-normal/arm64/Comparable+Swiftify.o -index-unit-output-path /JavApi⁴Swift.build/Debug-appletvos/JavApi.build/Objects-normal/arm64/Comparable.o -index-unit-output-path /JavApi⁴Swift.build/Debug-appletvos/JavApi.build/Objects-normal/arm64/Double+Java.o -index-unit-output-path /JavApi⁴Swift.build/Debug-appletvos/JavApi.build/Objects-normal/arm64/Double+Swiftify.o -index-unit-output-path /JavApi⁴Swift.build/Debug-appletvos/JavApi.build/Objects-normal/arm64/FileHandle+TextOutputStream.o -index-unit-output-path /JavApi⁴Swift.build/Debug-appletvos/JavApi.build/Objects-normal/arm64/Int+Java.o -index-unit-output-path /JavApi⁴Swift.build/Debug-appletvos/JavApi.build/Objects-normal/arm64/Int32+Java.o -index-unit-output-path /JavApi⁴Swift.build/Debug-appletvos/JavApi.build/Objects-normal/arm64/Int64+Java.o -index-unit-output-path /JavApi⁴Swift.build/Debug-appletvos/JavApi.build/Objects-normal/arm64/Integer.o -index-unit-output-path /JavApi⁴Swift.build/Debug-appletvos/JavApi.build/Objects-normal/arm64/Long.o -index-unit-output-path /JavApi⁴Swift.build/Debug-appletvos/JavApi.build/Objects-normal/arm64/Math.o -index-unit-output-path /JavApi⁴Swift.build/Debug-appletvos/JavApi.build/Objects-normal/arm64/Operator+Java.o -index-store-path /Users/admin/builder/spi-builder-workspace/.derivedData/Index.noindex/DataStore -index-system-modules
SwiftCompile normal arm64 /Users/admin/builder/spi-builder-workspace/.dependencies/checkouts/JavApi4Swift/Sources/JavApi/lang/FileHandle+TextOutputStream.swift (in target 'JavApi' from project 'JavApi⁴Swift')
cd /Users/admin/builder/spi-builder-workspace/.swiftpm/xcode
/Applications/Xcode-16.1.0.app/Contents/Developer/Toolchains/XcodeDefault.xctoolchain/usr/bin/swift-frontend -c -filelist /Users/admin/builder/spi-builder-workspace/.derivedData/Build/Intermediates.noindex/JavApi⁴Swift.build/Debug-appletvos/JavApi.build/Objects-normal/arm64/sources-1 -primary-file /Users/admin/builder/spi-builder-workspace/.dependencies/checkouts/JavApi4Swift/Sources/JavApi/lang/Class.swift -primary-file /Users/admin/builder/spi-builder-workspace/.dependencies/checkouts/JavApi4Swift/Sources/JavApi/lang/Cloneable+Swiftify.swift -primary-file /Users/admin/builder/spi-builder-workspace/.dependencies/checkouts/JavApi4Swift/Sources/JavApi/lang/Cloneable.swift -primary-file /Users/admin/builder/spi-builder-workspace/.dependencies/checkouts/JavApi4Swift/Sources/JavApi/lang/Comparable+Swiftify.swift -primary-file /Users/admin/builder/spi-builder-workspace/.dependencies/checkouts/JavApi4Swift/Sources/JavApi/lang/Comparable.swift -primary-file /Users/admin/builder/spi-builder-workspace/.dependencies/checkouts/JavApi4Swift/Sources/JavApi/lang/Double+Java.swift -primary-file /Users/admin/builder/spi-builder-workspace/.dependencies/checkouts/JavApi4Swift/Sources/JavApi/lang/Double+Swiftify.swift -primary-file /Users/admin/builder/spi-builder-workspace/.dependencies/checkouts/JavApi4Swift/Sources/JavApi/lang/FileHandle+TextOutputStream.swift -primary-file /Users/admin/builder/spi-builder-workspace/.dependencies/checkouts/JavApi4Swift/Sources/JavApi/lang/Int+Java.swift -primary-file /Users/admin/builder/spi-builder-workspace/.dependencies/checkouts/JavApi4Swift/Sources/JavApi/lang/Int32+Java.swift -primary-file /Users/admin/builder/spi-builder-workspace/.dependencies/checkouts/JavApi4Swift/Sources/JavApi/lang/Int64+Java.swift -primary-file /Users/admin/builder/spi-builder-workspace/.dependencies/checkouts/JavApi4Swift/Sources/JavApi/lang/Integer.swift -primary-file /Users/admin/builder/spi-builder-workspace/.dependencies/checkouts/JavApi4Swift/Sources/JavApi/lang/Long.swift -primary-file /Users/admin/builder/spi-builder-workspace/.dependencies/checkouts/JavApi4Swift/Sources/JavApi/lang/Math.swift -primary-file /Users/admin/builder/spi-builder-workspace/.dependencies/checkouts/JavApi4Swift/Sources/JavApi/lang/Operator+Java.swift -supplementary-output-file-map /Users/admin/builder/spi-builder-workspace/.derivedData/Build/Intermediates.noindex/JavApi⁴Swift.build/Debug-appletvos/JavApi.build/Objects-normal/arm64/supplementaryOutputs-3 -target arm64-apple-tvos16.0 -Xllvm -aarch64-use-tbi -enable-objc-interop -stack-check -sdk /Applications/Xcode-16.1.0.app/Contents/Developer/Platforms/AppleTVOS.platform/Developer/SDKs/AppleTVOS18.1.sdk -I /Users/admin/builder/spi-builder-workspace/.derivedData/Build/Products/Debug-appletvos -I /Applications/Xcode-16.1.0.app/Contents/Developer/Platforms/AppleTVOS.platform/Developer/usr/lib -F /Users/admin/builder/spi-builder-workspace/.derivedData/Build/Products/Debug-appletvos -F /Applications/Xcode-16.1.0.app/Contents/Developer/Platforms/AppleTVOS.platform/Developer/Library/Frameworks -F /Applications/Xcode-16.1.0.app/Contents/Developer/Platforms/AppleTVOS.platform/Developer/SDKs/AppleTVOS18.1.sdk/Developer/Library/Frameworks -no-color-diagnostics -enable-testing -g -debug-info-format\=dwarf -dwarf-version\=4 -module-cache-path /Users/admin/builder/spi-builder-workspace/.derivedData/ModuleCache.noindex -suppress-warnings -profile-generate -profile-coverage-mapping -swift-version 6 -enforce-exclusivity\=checked -stats-output-dir /Users/admin/builder/spi-builder-workspace/.swiftpm/xcode/.stats -Onone -D SWIFT_PACKAGE -D DEBUG -serialize-debugging-options -const-gather-protocols-file /Users/admin/builder/spi-builder-workspace/.derivedData/Build/Intermediates.noindex/JavApi⁴Swift.build/Debug-appletvos/JavApi.build/Objects-normal/arm64/JavApi_const_extract_protocols.json -enable-experimental-feature DebugDescriptionMacro -enable-experimental-feature OpaqueTypeErasure -enable-upcoming-feature StrictConcurrency -enable-upcoming-feature DisableOutwardActorInference -enable-upcoming-feature GlobalActorIsolatedTypesUsability -enable-upcoming-feature InferSendableFromCaptures -strict-concurrency\=complete -empty-abi-descriptor -plugin-path /Applications/Xcode-16.1.0.app/Contents/Developer/Toolchains/XcodeDefault.xctoolchain/usr/lib/swift/host/plugins/testing -user-module-version 0.19.1 -validate-clang-modules-once -clang-build-session-file /Users/admin/builder/spi-builder-workspace/.derivedData/ModuleCache.noindex/Session.modulevalidation -Xcc -working-directory -Xcc /Users/admin/builder/spi-builder-workspace/.swiftpm/xcode -resource-dir /Applications/Xcode-16.1.0.app/Contents/Developer/Toolchains/XcodeDefault.xctoolchain/usr/lib/swift -enable-anonymous-context-mangled-names -file-compilation-dir /Users/admin/builder/spi-builder-workspace/.swiftpm/xcode -Xcc -D_LIBCPP_HARDENING_MODE\=_LIBCPP_HARDENING_MODE_DEBUG -Xcc -ivfsstatcache -Xcc /Users/admin/builder/spi-builder-workspace/.derivedData/SDKStatCaches.noindex/appletvos18.1-22J572-e7fdd8cf9ffd4d4af20823079b51a726.sdkstatcache -Xcc -I/Users/admin/builder/spi-builder-workspace/.derivedData/Build/Intermediates.noindex/JavApi⁴Swift.build/Debug-appletvos/JavApi.build/swift-overrides.hmap -Xcc -I/Users/admin/builder/spi-builder-workspace/.derivedData/Build/Products/Debug-appletvos/include -Xcc -I/Users/admin/builder/spi-builder-workspace/.derivedData/Build/Intermediates.noindex/JavApi⁴Swift.build/Debug-appletvos/JavApi.build/DerivedSources-normal/arm64 -Xcc -I/Users/admin/builder/spi-builder-workspace/.derivedData/Build/Intermediates.noindex/JavApi⁴Swift.build/Debug-appletvos/JavApi.build/DerivedSources/arm64 -Xcc -I/Users/admin/builder/spi-builder-workspace/.derivedData/Build/Intermediates.noindex/JavApi⁴Swift.build/Debug-appletvos/JavApi.build/DerivedSources -Xcc -DSWIFT_PACKAGE -Xcc -DDEBUG\=1 -module-name JavApi -package-name javapi4swift -frontend-parseable-output -disable-clang-spi -target-sdk-version 18.1 -target-sdk-name appletvos18.1 -external-plugin-path /Applications/Xcode-16.1.0.app/Contents/Developer/Platforms/AppleTVOS.platform/Developer/usr/lib/swift/host/plugins\#/Applications/Xcode-16.1.0.app/Contents/Developer/Platforms/AppleTVOS.platform/Developer/usr/bin/swift-plugin-server -external-plugin-path /Applications/Xcode-16.1.0.app/Contents/Developer/Platforms/AppleTVOS.platform/Developer/usr/local/lib/swift/host/plugins\#/Applications/Xcode-16.1.0.app/Contents/Developer/Platforms/AppleTVOS.platform/Developer/usr/bin/swift-plugin-server -plugin-path /Applications/Xcode-16.1.0.app/Contents/Developer/Toolchains/XcodeDefault.xctoolchain/usr/lib/swift/host/plugins -plugin-path /Applications/Xcode-16.1.0.app/Contents/Developer/Toolchains/XcodeDefault.xctoolchain/usr/local/lib/swift/host/plugins -o /Users/admin/builder/spi-builder-workspace/.derivedData/Build/Intermediates.noindex/JavApi⁴Swift.build/Debug-appletvos/JavApi.build/Objects-normal/arm64/Class.o -o /Users/admin/builder/spi-builder-workspace/.derivedData/Build/Intermediates.noindex/JavApi⁴Swift.build/Debug-appletvos/JavApi.build/Objects-normal/arm64/Cloneable+Swiftify.o -o /Users/admin/builder/spi-builder-workspace/.derivedData/Build/Intermediates.noindex/JavApi⁴Swift.build/Debug-appletvos/JavApi.build/Objects-normal/arm64/Cloneable.o -o /Users/admin/builder/spi-builder-workspace/.derivedData/Build/Intermediates.noindex/JavApi⁴Swift.build/Debug-appletvos/JavApi.build/Objects-normal/arm64/Comparable+Swiftify.o -o /Users/admin/builder/spi-builder-workspace/.derivedData/Build/Intermediates.noindex/JavApi⁴Swift.build/Debug-appletvos/JavApi.build/Objects-normal/arm64/Comparable.o -o /Users/admin/builder/spi-builder-workspace/.derivedData/Build/Intermediates.noindex/JavApi⁴Swift.build/Debug-appletvos/JavApi.build/Objects-normal/arm64/Double+Java.o -o /Users/admin/builder/spi-builder-workspace/.derivedData/Build/Intermediates.noindex/JavApi⁴Swift.build/Debug-appletvos/JavApi.build/Objects-normal/arm64/Double+Swiftify.o -o /Users/admin/builder/spi-builder-workspace/.derivedData/Build/Intermediates.noindex/JavApi⁴Swift.build/Debug-appletvos/JavApi.build/Objects-normal/arm64/FileHandle+TextOutputStream.o -o /Users/admin/builder/spi-builder-workspace/.derivedData/Build/Intermediates.noindex/JavApi⁴Swift.build/Debug-appletvos/JavApi.build/Objects-normal/arm64/Int+Java.o -o /Users/admin/builder/spi-builder-workspace/.derivedData/Build/Intermediates.noindex/JavApi⁴Swift.build/Debug-appletvos/JavApi.build/Objects-normal/arm64/Int32+Java.o -o /Users/admin/builder/spi-builder-workspace/.derivedData/Build/Intermediates.noindex/JavApi⁴Swift.build/Debug-appletvos/JavApi.build/Objects-normal/arm64/Int64+Java.o -o /Users/admin/builder/spi-builder-workspace/.derivedData/Build/Intermediates.noindex/JavApi⁴Swift.build/Debug-appletvos/JavApi.build/Objects-normal/arm64/Integer.o -o /Users/admin/builder/spi-builder-workspace/.derivedData/Build/Intermediates.noindex/JavApi⁴Swift.build/Debug-appletvos/JavApi.build/Objects-normal/arm64/Long.o -o /Users/admin/builder/spi-builder-workspace/.derivedData/Build/Intermediates.noindex/JavApi⁴Swift.build/Debug-appletvos/JavApi.build/Objects-normal/arm64/Math.o -o /Users/admin/builder/spi-builder-workspace/.derivedData/Build/Intermediates.noindex/JavApi⁴Swift.build/Debug-appletvos/JavApi.build/Objects-normal/arm64/Operator+Java.o -index-unit-output-path /JavApi⁴Swift.build/Debug-appletvos/JavApi.build/Objects-normal/arm64/Class.o -index-unit-output-path /JavApi⁴Swift.build/Debug-appletvos/JavApi.build/Objects-normal/arm64/Cloneable+Swiftify.o -index-unit-output-path /JavApi⁴Swift.build/Debug-appletvos/JavApi.build/Objects-normal/arm64/Cloneable.o -index-unit-output-path /JavApi⁴Swift.build/Debug-appletvos/JavApi.build/Objects-normal/arm64/Comparable+Swiftify.o -index-unit-output-path /JavApi⁴Swift.build/Debug-appletvos/JavApi.build/Objects-normal/arm64/Comparable.o -index-unit-output-path /JavApi⁴Swift.build/Debug-appletvos/JavApi.build/Objects-normal/arm64/Double+Java.o -index-unit-output-path /JavApi⁴Swift.build/Debug-appletvos/JavApi.build/Objects-normal/arm64/Double+Swiftify.o -index-unit-output-path /JavApi⁴Swift.build/Debug-appletvos/JavApi.build/Objects-normal/arm64/FileHandle+TextOutputStream.o -index-unit-output-path /JavApi⁴Swift.build/Debug-appletvos/JavApi.build/Objects-normal/arm64/Int+Java.o -index-unit-output-path /JavApi⁴Swift.build/Debug-appletvos/JavApi.build/Objects-normal/arm64/Int32+Java.o -index-unit-output-path /JavApi⁴Swift.build/Debug-appletvos/JavApi.build/Objects-normal/arm64/Int64+Java.o -index-unit-output-path /JavApi⁴Swift.build/Debug-appletvos/JavApi.build/Objects-normal/arm64/Integer.o -index-unit-output-path /JavApi⁴Swift.build/Debug-appletvos/JavApi.build/Objects-normal/arm64/Long.o -index-unit-output-path /JavApi⁴Swift.build/Debug-appletvos/JavApi.build/Objects-normal/arm64/Math.o -index-unit-output-path /JavApi⁴Swift.build/Debug-appletvos/JavApi.build/Objects-normal/arm64/Operator+Java.o -index-store-path /Users/admin/builder/spi-builder-workspace/.derivedData/Index.noindex/DataStore -index-system-modules
SwiftCompile normal arm64 /Users/admin/builder/spi-builder-workspace/.dependencies/checkouts/JavApi4Swift/Sources/JavApi/lang/Int+Java.swift (in target 'JavApi' from project 'JavApi⁴Swift')
cd /Users/admin/builder/spi-builder-workspace/.swiftpm/xcode
/Applications/Xcode-16.1.0.app/Contents/Developer/Toolchains/XcodeDefault.xctoolchain/usr/bin/swift-frontend -c -filelist /Users/admin/builder/spi-builder-workspace/.derivedData/Build/Intermediates.noindex/JavApi⁴Swift.build/Debug-appletvos/JavApi.build/Objects-normal/arm64/sources-1 -primary-file /Users/admin/builder/spi-builder-workspace/.dependencies/checkouts/JavApi4Swift/Sources/JavApi/lang/Class.swift -primary-file /Users/admin/builder/spi-builder-workspace/.dependencies/checkouts/JavApi4Swift/Sources/JavApi/lang/Cloneable+Swiftify.swift -primary-file /Users/admin/builder/spi-builder-workspace/.dependencies/checkouts/JavApi4Swift/Sources/JavApi/lang/Cloneable.swift -primary-file /Users/admin/builder/spi-builder-workspace/.dependencies/checkouts/JavApi4Swift/Sources/JavApi/lang/Comparable+Swiftify.swift -primary-file /Users/admin/builder/spi-builder-workspace/.dependencies/checkouts/JavApi4Swift/Sources/JavApi/lang/Comparable.swift -primary-file /Users/admin/builder/spi-builder-workspace/.dependencies/checkouts/JavApi4Swift/Sources/JavApi/lang/Double+Java.swift -primary-file /Users/admin/builder/spi-builder-workspace/.dependencies/checkouts/JavApi4Swift/Sources/JavApi/lang/Double+Swiftify.swift -primary-file /Users/admin/builder/spi-builder-workspace/.dependencies/checkouts/JavApi4Swift/Sources/JavApi/lang/FileHandle+TextOutputStream.swift -primary-file /Users/admin/builder/spi-builder-workspace/.dependencies/checkouts/JavApi4Swift/Sources/JavApi/lang/Int+Java.swift -primary-file /Users/admin/builder/spi-builder-workspace/.dependencies/checkouts/JavApi4Swift/Sources/JavApi/lang/Int32+Java.swift -primary-file /Users/admin/builder/spi-builder-workspace/.dependencies/checkouts/JavApi4Swift/Sources/JavApi/lang/Int64+Java.swift -primary-file /Users/admin/builder/spi-builder-workspace/.dependencies/checkouts/JavApi4Swift/Sources/JavApi/lang/Integer.swift -primary-file /Users/admin/builder/spi-builder-workspace/.dependencies/checkouts/JavApi4Swift/Sources/JavApi/lang/Long.swift -primary-file /Users/admin/builder/spi-builder-workspace/.dependencies/checkouts/JavApi4Swift/Sources/JavApi/lang/Math.swift -primary-file /Users/admin/builder/spi-builder-workspace/.dependencies/checkouts/JavApi4Swift/Sources/JavApi/lang/Operator+Java.swift -supplementary-output-file-map /Users/admin/builder/spi-builder-workspace/.derivedData/Build/Intermediates.noindex/JavApi⁴Swift.build/Debug-appletvos/JavApi.build/Objects-normal/arm64/supplementaryOutputs-3 -target arm64-apple-tvos16.0 -Xllvm -aarch64-use-tbi -enable-objc-interop -stack-check -sdk /Applications/Xcode-16.1.0.app/Contents/Developer/Platforms/AppleTVOS.platform/Developer/SDKs/AppleTVOS18.1.sdk -I /Users/admin/builder/spi-builder-workspace/.derivedData/Build/Products/Debug-appletvos -I /Applications/Xcode-16.1.0.app/Contents/Developer/Platforms/AppleTVOS.platform/Developer/usr/lib -F /Users/admin/builder/spi-builder-workspace/.derivedData/Build/Products/Debug-appletvos -F /Applications/Xcode-16.1.0.app/Contents/Developer/Platforms/AppleTVOS.platform/Developer/Library/Frameworks -F /Applications/Xcode-16.1.0.app/Contents/Developer/Platforms/AppleTVOS.platform/Developer/SDKs/AppleTVOS18.1.sdk/Developer/Library/Frameworks -no-color-diagnostics -enable-testing -g -debug-info-format\=dwarf -dwarf-version\=4 -module-cache-path /Users/admin/builder/spi-builder-workspace/.derivedData/ModuleCache.noindex -suppress-warnings -profile-generate -profile-coverage-mapping -swift-version 6 -enforce-exclusivity\=checked -stats-output-dir /Users/admin/builder/spi-builder-workspace/.swiftpm/xcode/.stats -Onone -D SWIFT_PACKAGE -D DEBUG -serialize-debugging-options -const-gather-protocols-file /Users/admin/builder/spi-builder-workspace/.derivedData/Build/Intermediates.noindex/JavApi⁴Swift.build/Debug-appletvos/JavApi.build/Objects-normal/arm64/JavApi_const_extract_protocols.json -enable-experimental-feature DebugDescriptionMacro -enable-experimental-feature OpaqueTypeErasure -enable-upcoming-feature StrictConcurrency -enable-upcoming-feature DisableOutwardActorInference -enable-upcoming-feature GlobalActorIsolatedTypesUsability -enable-upcoming-feature InferSendableFromCaptures -strict-concurrency\=complete -empty-abi-descriptor -plugin-path /Applications/Xcode-16.1.0.app/Contents/Developer/Toolchains/XcodeDefault.xctoolchain/usr/lib/swift/host/plugins/testing -user-module-version 0.19.1 -validate-clang-modules-once -clang-build-session-file /Users/admin/builder/spi-builder-workspace/.derivedData/ModuleCache.noindex/Session.modulevalidation -Xcc -working-directory -Xcc /Users/admin/builder/spi-builder-workspace/.swiftpm/xcode -resource-dir /Applications/Xcode-16.1.0.app/Contents/Developer/Toolchains/XcodeDefault.xctoolchain/usr/lib/swift -enable-anonymous-context-mangled-names -file-compilation-dir /Users/admin/builder/spi-builder-workspace/.swiftpm/xcode -Xcc -D_LIBCPP_HARDENING_MODE\=_LIBCPP_HARDENING_MODE_DEBUG -Xcc -ivfsstatcache -Xcc /Users/admin/builder/spi-builder-workspace/.derivedData/SDKStatCaches.noindex/appletvos18.1-22J572-e7fdd8cf9ffd4d4af20823079b51a726.sdkstatcache -Xcc -I/Users/admin/builder/spi-builder-workspace/.derivedData/Build/Intermediates.noindex/JavApi⁴Swift.build/Debug-appletvos/JavApi.build/swift-overrides.hmap -Xcc -I/Users/admin/builder/spi-builder-workspace/.derivedData/Build/Products/Debug-appletvos/include -Xcc -I/Users/admin/builder/spi-builder-workspace/.derivedData/Build/Intermediates.noindex/JavApi⁴Swift.build/Debug-appletvos/JavApi.build/DerivedSources-normal/arm64 -Xcc -I/Users/admin/builder/spi-builder-workspace/.derivedData/Build/Intermediates.noindex/JavApi⁴Swift.build/Debug-appletvos/JavApi.build/DerivedSources/arm64 -Xcc -I/Users/admin/builder/spi-builder-workspace/.derivedData/Build/Intermediates.noindex/JavApi⁴Swift.build/Debug-appletvos/JavApi.build/DerivedSources -Xcc -DSWIFT_PACKAGE -Xcc -DDEBUG\=1 -module-name JavApi -package-name javapi4swift -frontend-parseable-output -disable-clang-spi -target-sdk-version 18.1 -target-sdk-name appletvos18.1 -external-plugin-path /Applications/Xcode-16.1.0.app/Contents/Developer/Platforms/AppleTVOS.platform/Developer/usr/lib/swift/host/plugins\#/Applications/Xcode-16.1.0.app/Contents/Developer/Platforms/AppleTVOS.platform/Developer/usr/bin/swift-plugin-server -external-plugin-path /Applications/Xcode-16.1.0.app/Contents/Developer/Platforms/AppleTVOS.platform/Developer/usr/local/lib/swift/host/plugins\#/Applications/Xcode-16.1.0.app/Contents/Developer/Platforms/AppleTVOS.platform/Developer/usr/bin/swift-plugin-server -plugin-path /Applications/Xcode-16.1.0.app/Contents/Developer/Toolchains/XcodeDefault.xctoolchain/usr/lib/swift/host/plugins -plugin-path /Applications/Xcode-16.1.0.app/Contents/Developer/Toolchains/XcodeDefault.xctoolchain/usr/local/lib/swift/host/plugins -o /Users/admin/builder/spi-builder-workspace/.derivedData/Build/Intermediates.noindex/JavApi⁴Swift.build/Debug-appletvos/JavApi.build/Objects-normal/arm64/Class.o -o /Users/admin/builder/spi-builder-workspace/.derivedData/Build/Intermediates.noindex/JavApi⁴Swift.build/Debug-appletvos/JavApi.build/Objects-normal/arm64/Cloneable+Swiftify.o -o /Users/admin/builder/spi-builder-workspace/.derivedData/Build/Intermediates.noindex/JavApi⁴Swift.build/Debug-appletvos/JavApi.build/Objects-normal/arm64/Cloneable.o -o /Users/admin/builder/spi-builder-workspace/.derivedData/Build/Intermediates.noindex/JavApi⁴Swift.build/Debug-appletvos/JavApi.build/Objects-normal/arm64/Comparable+Swiftify.o -o /Users/admin/builder/spi-builder-workspace/.derivedData/Build/Intermediates.noindex/JavApi⁴Swift.build/Debug-appletvos/JavApi.build/Objects-normal/arm64/Comparable.o -o /Users/admin/builder/spi-builder-workspace/.derivedData/Build/Intermediates.noindex/JavApi⁴Swift.build/Debug-appletvos/JavApi.build/Objects-normal/arm64/Double+Java.o -o /Users/admin/builder/spi-builder-workspace/.derivedData/Build/Intermediates.noindex/JavApi⁴Swift.build/Debug-appletvos/JavApi.build/Objects-normal/arm64/Double+Swiftify.o -o /Users/admin/builder/spi-builder-workspace/.derivedData/Build/Intermediates.noindex/JavApi⁴Swift.build/Debug-appletvos/JavApi.build/Objects-normal/arm64/FileHandle+TextOutputStream.o -o /Users/admin/builder/spi-builder-workspace/.derivedData/Build/Intermediates.noindex/JavApi⁴Swift.build/Debug-appletvos/JavApi.build/Objects-normal/arm64/Int+Java.o -o /Users/admin/builder/spi-builder-workspace/.derivedData/Build/Intermediates.noindex/JavApi⁴Swift.build/Debug-appletvos/JavApi.build/Objects-normal/arm64/Int32+Java.o -o /Users/admin/builder/spi-builder-workspace/.derivedData/Build/Intermediates.noindex/JavApi⁴Swift.build/Debug-appletvos/JavApi.build/Objects-normal/arm64/Int64+Java.o -o /Users/admin/builder/spi-builder-workspace/.derivedData/Build/Intermediates.noindex/JavApi⁴Swift.build/Debug-appletvos/JavApi.build/Objects-normal/arm64/Integer.o -o /Users/admin/builder/spi-builder-workspace/.derivedData/Build/Intermediates.noindex/JavApi⁴Swift.build/Debug-appletvos/JavApi.build/Objects-normal/arm64/Long.o -o /Users/admin/builder/spi-builder-workspace/.derivedData/Build/Intermediates.noindex/JavApi⁴Swift.build/Debug-appletvos/JavApi.build/Objects-normal/arm64/Math.o -o /Users/admin/builder/spi-builder-workspace/.derivedData/Build/Intermediates.noindex/JavApi⁴Swift.build/Debug-appletvos/JavApi.build/Objects-normal/arm64/Operator+Java.o -index-unit-output-path /JavApi⁴Swift.build/Debug-appletvos/JavApi.build/Objects-normal/arm64/Class.o -index-unit-output-path /JavApi⁴Swift.build/Debug-appletvos/JavApi.build/Objects-normal/arm64/Cloneable+Swiftify.o -index-unit-output-path /JavApi⁴Swift.build/Debug-appletvos/JavApi.build/Objects-normal/arm64/Cloneable.o -index-unit-output-path /JavApi⁴Swift.build/Debug-appletvos/JavApi.build/Objects-normal/arm64/Comparable+Swiftify.o -index-unit-output-path /JavApi⁴Swift.build/Debug-appletvos/JavApi.build/Objects-normal/arm64/Comparable.o -index-unit-output-path /JavApi⁴Swift.build/Debug-appletvos/JavApi.build/Objects-normal/arm64/Double+Java.o -index-unit-output-path /JavApi⁴Swift.build/Debug-appletvos/JavApi.build/Objects-normal/arm64/Double+Swiftify.o -index-unit-output-path /JavApi⁴Swift.build/Debug-appletvos/JavApi.build/Objects-normal/arm64/FileHandle+TextOutputStream.o -index-unit-output-path /JavApi⁴Swift.build/Debug-appletvos/JavApi.build/Objects-normal/arm64/Int+Java.o -index-unit-output-path /JavApi⁴Swift.build/Debug-appletvos/JavApi.build/Objects-normal/arm64/Int32+Java.o -index-unit-output-path /JavApi⁴Swift.build/Debug-appletvos/JavApi.build/Objects-normal/arm64/Int64+Java.o -index-unit-output-path /JavApi⁴Swift.build/Debug-appletvos/JavApi.build/Objects-normal/arm64/Integer.o -index-unit-output-path /JavApi⁴Swift.build/Debug-appletvos/JavApi.build/Objects-normal/arm64/Long.o -index-unit-output-path /JavApi⁴Swift.build/Debug-appletvos/JavApi.build/Objects-normal/arm64/Math.o -index-unit-output-path /JavApi⁴Swift.build/Debug-appletvos/JavApi.build/Objects-normal/arm64/Operator+Java.o -index-store-path /Users/admin/builder/spi-builder-workspace/.derivedData/Index.noindex/DataStore -index-system-modules
SwiftCompile normal arm64 /Users/admin/builder/spi-builder-workspace/.dependencies/checkouts/JavApi4Swift/Sources/JavApi/lang/Int32+Java.swift (in target 'JavApi' from project 'JavApi⁴Swift')
cd /Users/admin/builder/spi-builder-workspace/.swiftpm/xcode
/Applications/Xcode-16.1.0.app/Contents/Developer/Toolchains/XcodeDefault.xctoolchain/usr/bin/swift-frontend -c -filelist /Users/admin/builder/spi-builder-workspace/.derivedData/Build/Intermediates.noindex/JavApi⁴Swift.build/Debug-appletvos/JavApi.build/Objects-normal/arm64/sources-1 -primary-file /Users/admin/builder/spi-builder-workspace/.dependencies/checkouts/JavApi4Swift/Sources/JavApi/lang/Class.swift -primary-file /Users/admin/builder/spi-builder-workspace/.dependencies/checkouts/JavApi4Swift/Sources/JavApi/lang/Cloneable+Swiftify.swift -primary-file /Users/admin/builder/spi-builder-workspace/.dependencies/checkouts/JavApi4Swift/Sources/JavApi/lang/Cloneable.swift -primary-file /Users/admin/builder/spi-builder-workspace/.dependencies/checkouts/JavApi4Swift/Sources/JavApi/lang/Comparable+Swiftify.swift -primary-file /Users/admin/builder/spi-builder-workspace/.dependencies/checkouts/JavApi4Swift/Sources/JavApi/lang/Comparable.swift -primary-file /Users/admin/builder/spi-builder-workspace/.dependencies/checkouts/JavApi4Swift/Sources/JavApi/lang/Double+Java.swift -primary-file /Users/admin/builder/spi-builder-workspace/.dependencies/checkouts/JavApi4Swift/Sources/JavApi/lang/Double+Swiftify.swift -primary-file /Users/admin/builder/spi-builder-workspace/.dependencies/checkouts/JavApi4Swift/Sources/JavApi/lang/FileHandle+TextOutputStream.swift -primary-file /Users/admin/builder/spi-builder-workspace/.dependencies/checkouts/JavApi4Swift/Sources/JavApi/lang/Int+Java.swift -primary-file /Users/admin/builder/spi-builder-workspace/.dependencies/checkouts/JavApi4Swift/Sources/JavApi/lang/Int32+Java.swift -primary-file /Users/admin/builder/spi-builder-workspace/.dependencies/checkouts/JavApi4Swift/Sources/JavApi/lang/Int64+Java.swift -primary-file /Users/admin/builder/spi-builder-workspace/.dependencies/checkouts/JavApi4Swift/Sources/JavApi/lang/Integer.swift -primary-file /Users/admin/builder/spi-builder-workspace/.dependencies/checkouts/JavApi4Swift/Sources/JavApi/lang/Long.swift -primary-file /Users/admin/builder/spi-builder-workspace/.dependencies/checkouts/JavApi4Swift/Sources/JavApi/lang/Math.swift -primary-file /Users/admin/builder/spi-builder-workspace/.dependencies/checkouts/JavApi4Swift/Sources/JavApi/lang/Operator+Java.swift -supplementary-output-file-map /Users/admin/builder/spi-builder-workspace/.derivedData/Build/Intermediates.noindex/JavApi⁴Swift.build/Debug-appletvos/JavApi.build/Objects-normal/arm64/supplementaryOutputs-3 -target arm64-apple-tvos16.0 -Xllvm -aarch64-use-tbi -enable-objc-interop -stack-check -sdk /Applications/Xcode-16.1.0.app/Contents/Developer/Platforms/AppleTVOS.platform/Developer/SDKs/AppleTVOS18.1.sdk -I /Users/admin/builder/spi-builder-workspace/.derivedData/Build/Products/Debug-appletvos -I /Applications/Xcode-16.1.0.app/Contents/Developer/Platforms/AppleTVOS.platform/Developer/usr/lib -F /Users/admin/builder/spi-builder-workspace/.derivedData/Build/Products/Debug-appletvos -F /Applications/Xcode-16.1.0.app/Contents/Developer/Platforms/AppleTVOS.platform/Developer/Library/Frameworks -F /Applications/Xcode-16.1.0.app/Contents/Developer/Platforms/AppleTVOS.platform/Developer/SDKs/AppleTVOS18.1.sdk/Developer/Library/Frameworks -no-color-diagnostics -enable-testing -g -debug-info-format\=dwarf -dwarf-version\=4 -module-cache-path /Users/admin/builder/spi-builder-workspace/.derivedData/ModuleCache.noindex -suppress-warnings -profile-generate -profile-coverage-mapping -swift-version 6 -enforce-exclusivity\=checked -stats-output-dir /Users/admin/builder/spi-builder-workspace/.swiftpm/xcode/.stats -Onone -D SWIFT_PACKAGE -D DEBUG -serialize-debugging-options -const-gather-protocols-file /Users/admin/builder/spi-builder-workspace/.derivedData/Build/Intermediates.noindex/JavApi⁴Swift.build/Debug-appletvos/JavApi.build/Objects-normal/arm64/JavApi_const_extract_protocols.json -enable-experimental-feature DebugDescriptionMacro -enable-experimental-feature OpaqueTypeErasure -enable-upcoming-feature StrictConcurrency -enable-upcoming-feature DisableOutwardActorInference -enable-upcoming-feature GlobalActorIsolatedTypesUsability -enable-upcoming-feature InferSendableFromCaptures -strict-concurrency\=complete -empty-abi-descriptor -plugin-path /Applications/Xcode-16.1.0.app/Contents/Developer/Toolchains/XcodeDefault.xctoolchain/usr/lib/swift/host/plugins/testing -user-module-version 0.19.1 -validate-clang-modules-once -clang-build-session-file /Users/admin/builder/spi-builder-workspace/.derivedData/ModuleCache.noindex/Session.modulevalidation -Xcc -working-directory -Xcc /Users/admin/builder/spi-builder-workspace/.swiftpm/xcode -resource-dir /Applications/Xcode-16.1.0.app/Contents/Developer/Toolchains/XcodeDefault.xctoolchain/usr/lib/swift -enable-anonymous-context-mangled-names -file-compilation-dir /Users/admin/builder/spi-builder-workspace/.swiftpm/xcode -Xcc -D_LIBCPP_HARDENING_MODE\=_LIBCPP_HARDENING_MODE_DEBUG -Xcc -ivfsstatcache -Xcc /Users/admin/builder/spi-builder-workspace/.derivedData/SDKStatCaches.noindex/appletvos18.1-22J572-e7fdd8cf9ffd4d4af20823079b51a726.sdkstatcache -Xcc -I/Users/admin/builder/spi-builder-workspace/.derivedData/Build/Intermediates.noindex/JavApi⁴Swift.build/Debug-appletvos/JavApi.build/swift-overrides.hmap -Xcc -I/Users/admin/builder/spi-builder-workspace/.derivedData/Build/Products/Debug-appletvos/include -Xcc -I/Users/admin/builder/spi-builder-workspace/.derivedData/Build/Intermediates.noindex/JavApi⁴Swift.build/Debug-appletvos/JavApi.build/DerivedSources-normal/arm64 -Xcc -I/Users/admin/builder/spi-builder-workspace/.derivedData/Build/Intermediates.noindex/JavApi⁴Swift.build/Debug-appletvos/JavApi.build/DerivedSources/arm64 -Xcc -I/Users/admin/builder/spi-builder-workspace/.derivedData/Build/Intermediates.noindex/JavApi⁴Swift.build/Debug-appletvos/JavApi.build/DerivedSources -Xcc -DSWIFT_PACKAGE -Xcc -DDEBUG\=1 -module-name JavApi -package-name javapi4swift -frontend-parseable-output -disable-clang-spi -target-sdk-version 18.1 -target-sdk-name appletvos18.1 -external-plugin-path /Applications/Xcode-16.1.0.app/Contents/Developer/Platforms/AppleTVOS.platform/Developer/usr/lib/swift/host/plugins\#/Applications/Xcode-16.1.0.app/Contents/Developer/Platforms/AppleTVOS.platform/Developer/usr/bin/swift-plugin-server -external-plugin-path /Applications/Xcode-16.1.0.app/Contents/Developer/Platforms/AppleTVOS.platform/Developer/usr/local/lib/swift/host/plugins\#/Applications/Xcode-16.1.0.app/Contents/Developer/Platforms/AppleTVOS.platform/Developer/usr/bin/swift-plugin-server -plugin-path /Applications/Xcode-16.1.0.app/Contents/Developer/Toolchains/XcodeDefault.xctoolchain/usr/lib/swift/host/plugins -plugin-path /Applications/Xcode-16.1.0.app/Contents/Developer/Toolchains/XcodeDefault.xctoolchain/usr/local/lib/swift/host/plugins -o /Users/admin/builder/spi-builder-workspace/.derivedData/Build/Intermediates.noindex/JavApi⁴Swift.build/Debug-appletvos/JavApi.build/Objects-normal/arm64/Class.o -o /Users/admin/builder/spi-builder-workspace/.derivedData/Build/Intermediates.noindex/JavApi⁴Swift.build/Debug-appletvos/JavApi.build/Objects-normal/arm64/Cloneable+Swiftify.o -o /Users/admin/builder/spi-builder-workspace/.derivedData/Build/Intermediates.noindex/JavApi⁴Swift.build/Debug-appletvos/JavApi.build/Objects-normal/arm64/Cloneable.o -o /Users/admin/builder/spi-builder-workspace/.derivedData/Build/Intermediates.noindex/JavApi⁴Swift.build/Debug-appletvos/JavApi.build/Objects-normal/arm64/Comparable+Swiftify.o -o /Users/admin/builder/spi-builder-workspace/.derivedData/Build/Intermediates.noindex/JavApi⁴Swift.build/Debug-appletvos/JavApi.build/Objects-normal/arm64/Comparable.o -o /Users/admin/builder/spi-builder-workspace/.derivedData/Build/Intermediates.noindex/JavApi⁴Swift.build/Debug-appletvos/JavApi.build/Objects-normal/arm64/Double+Java.o -o /Users/admin/builder/spi-builder-workspace/.derivedData/Build/Intermediates.noindex/JavApi⁴Swift.build/Debug-appletvos/JavApi.build/Objects-normal/arm64/Double+Swiftify.o -o /Users/admin/builder/spi-builder-workspace/.derivedData/Build/Intermediates.noindex/JavApi⁴Swift.build/Debug-appletvos/JavApi.build/Objects-normal/arm64/FileHandle+TextOutputStream.o -o /Users/admin/builder/spi-builder-workspace/.derivedData/Build/Intermediates.noindex/JavApi⁴Swift.build/Debug-appletvos/JavApi.build/Objects-normal/arm64/Int+Java.o -o /Users/admin/builder/spi-builder-workspace/.derivedData/Build/Intermediates.noindex/JavApi⁴Swift.build/Debug-appletvos/JavApi.build/Objects-normal/arm64/Int32+Java.o -o /Users/admin/builder/spi-builder-workspace/.derivedData/Build/Intermediates.noindex/JavApi⁴Swift.build/Debug-appletvos/JavApi.build/Objects-normal/arm64/Int64+Java.o -o /Users/admin/builder/spi-builder-workspace/.derivedData/Build/Intermediates.noindex/JavApi⁴Swift.build/Debug-appletvos/JavApi.build/Objects-normal/arm64/Integer.o -o /Users/admin/builder/spi-builder-workspace/.derivedData/Build/Intermediates.noindex/JavApi⁴Swift.build/Debug-appletvos/JavApi.build/Objects-normal/arm64/Long.o -o /Users/admin/builder/spi-builder-workspace/.derivedData/Build/Intermediates.noindex/JavApi⁴Swift.build/Debug-appletvos/JavApi.build/Objects-normal/arm64/Math.o -o /Users/admin/builder/spi-builder-workspace/.derivedData/Build/Intermediates.noindex/JavApi⁴Swift.build/Debug-appletvos/JavApi.build/Objects-normal/arm64/Operator+Java.o -index-unit-output-path /JavApi⁴Swift.build/Debug-appletvos/JavApi.build/Objects-normal/arm64/Class.o -index-unit-output-path /JavApi⁴Swift.build/Debug-appletvos/JavApi.build/Objects-normal/arm64/Cloneable+Swiftify.o -index-unit-output-path /JavApi⁴Swift.build/Debug-appletvos/JavApi.build/Objects-normal/arm64/Cloneable.o -index-unit-output-path /JavApi⁴Swift.build/Debug-appletvos/JavApi.build/Objects-normal/arm64/Comparable+Swiftify.o -index-unit-output-path /JavApi⁴Swift.build/Debug-appletvos/JavApi.build/Objects-normal/arm64/Comparable.o -index-unit-output-path /JavApi⁴Swift.build/Debug-appletvos/JavApi.build/Objects-normal/arm64/Double+Java.o -index-unit-output-path /JavApi⁴Swift.build/Debug-appletvos/JavApi.build/Objects-normal/arm64/Double+Swiftify.o -index-unit-output-path /JavApi⁴Swift.build/Debug-appletvos/JavApi.build/Objects-normal/arm64/FileHandle+TextOutputStream.o -index-unit-output-path /JavApi⁴Swift.build/Debug-appletvos/JavApi.build/Objects-normal/arm64/Int+Java.o -index-unit-output-path /JavApi⁴Swift.build/Debug-appletvos/JavApi.build/Objects-normal/arm64/Int32+Java.o -index-unit-output-path /JavApi⁴Swift.build/Debug-appletvos/JavApi.build/Objects-normal/arm64/Int64+Java.o -index-unit-output-path /JavApi⁴Swift.build/Debug-appletvos/JavApi.build/Objects-normal/arm64/Integer.o -index-unit-output-path /JavApi⁴Swift.build/Debug-appletvos/JavApi.build/Objects-normal/arm64/Long.o -index-unit-output-path /JavApi⁴Swift.build/Debug-appletvos/JavApi.build/Objects-normal/arm64/Math.o -index-unit-output-path /JavApi⁴Swift.build/Debug-appletvos/JavApi.build/Objects-normal/arm64/Operator+Java.o -index-store-path /Users/admin/builder/spi-builder-workspace/.derivedData/Index.noindex/DataStore -index-system-modules
SwiftCompile normal arm64 /Users/admin/builder/spi-builder-workspace/.dependencies/checkouts/JavApi4Swift/Sources/JavApi/lang/Int64+Java.swift (in target 'JavApi' from project 'JavApi⁴Swift')
cd /Users/admin/builder/spi-builder-workspace/.swiftpm/xcode
/Applications/Xcode-16.1.0.app/Contents/Developer/Toolchains/XcodeDefault.xctoolchain/usr/bin/swift-frontend -c -filelist /Users/admin/builder/spi-builder-workspace/.derivedData/Build/Intermediates.noindex/JavApi⁴Swift.build/Debug-appletvos/JavApi.build/Objects-normal/arm64/sources-1 -primary-file /Users/admin/builder/spi-builder-workspace/.dependencies/checkouts/JavApi4Swift/Sources/JavApi/lang/Class.swift -primary-file /Users/admin/builder/spi-builder-workspace/.dependencies/checkouts/JavApi4Swift/Sources/JavApi/lang/Cloneable+Swiftify.swift -primary-file /Users/admin/builder/spi-builder-workspace/.dependencies/checkouts/JavApi4Swift/Sources/JavApi/lang/Cloneable.swift -primary-file /Users/admin/builder/spi-builder-workspace/.dependencies/checkouts/JavApi4Swift/Sources/JavApi/lang/Comparable+Swiftify.swift -primary-file /Users/admin/builder/spi-builder-workspace/.dependencies/checkouts/JavApi4Swift/Sources/JavApi/lang/Comparable.swift -primary-file /Users/admin/builder/spi-builder-workspace/.dependencies/checkouts/JavApi4Swift/Sources/JavApi/lang/Double+Java.swift -primary-file /Users/admin/builder/spi-builder-workspace/.dependencies/checkouts/JavApi4Swift/Sources/JavApi/lang/Double+Swiftify.swift -primary-file /Users/admin/builder/spi-builder-workspace/.dependencies/checkouts/JavApi4Swift/Sources/JavApi/lang/FileHandle+TextOutputStream.swift -primary-file /Users/admin/builder/spi-builder-workspace/.dependencies/checkouts/JavApi4Swift/Sources/JavApi/lang/Int+Java.swift -primary-file /Users/admin/builder/spi-builder-workspace/.dependencies/checkouts/JavApi4Swift/Sources/JavApi/lang/Int32+Java.swift -primary-file /Users/admin/builder/spi-builder-workspace/.dependencies/checkouts/JavApi4Swift/Sources/JavApi/lang/Int64+Java.swift -primary-file /Users/admin/builder/spi-builder-workspace/.dependencies/checkouts/JavApi4Swift/Sources/JavApi/lang/Integer.swift -primary-file /Users/admin/builder/spi-builder-workspace/.dependencies/checkouts/JavApi4Swift/Sources/JavApi/lang/Long.swift -primary-file /Users/admin/builder/spi-builder-workspace/.dependencies/checkouts/JavApi4Swift/Sources/JavApi/lang/Math.swift -primary-file /Users/admin/builder/spi-builder-workspace/.dependencies/checkouts/JavApi4Swift/Sources/JavApi/lang/Operator+Java.swift -supplementary-output-file-map /Users/admin/builder/spi-builder-workspace/.derivedData/Build/Intermediates.noindex/JavApi⁴Swift.build/Debug-appletvos/JavApi.build/Objects-normal/arm64/supplementaryOutputs-3 -target arm64-apple-tvos16.0 -Xllvm -aarch64-use-tbi -enable-objc-interop -stack-check -sdk /Applications/Xcode-16.1.0.app/Contents/Developer/Platforms/AppleTVOS.platform/Developer/SDKs/AppleTVOS18.1.sdk -I /Users/admin/builder/spi-builder-workspace/.derivedData/Build/Products/Debug-appletvos -I /Applications/Xcode-16.1.0.app/Contents/Developer/Platforms/AppleTVOS.platform/Developer/usr/lib -F /Users/admin/builder/spi-builder-workspace/.derivedData/Build/Products/Debug-appletvos -F /Applications/Xcode-16.1.0.app/Contents/Developer/Platforms/AppleTVOS.platform/Developer/Library/Frameworks -F /Applications/Xcode-16.1.0.app/Contents/Developer/Platforms/AppleTVOS.platform/Developer/SDKs/AppleTVOS18.1.sdk/Developer/Library/Frameworks -no-color-diagnostics -enable-testing -g -debug-info-format\=dwarf -dwarf-version\=4 -module-cache-path /Users/admin/builder/spi-builder-workspace/.derivedData/ModuleCache.noindex -suppress-warnings -profile-generate -profile-coverage-mapping -swift-version 6 -enforce-exclusivity\=checked -stats-output-dir /Users/admin/builder/spi-builder-workspace/.swiftpm/xcode/.stats -Onone -D SWIFT_PACKAGE -D DEBUG -serialize-debugging-options -const-gather-protocols-file /Users/admin/builder/spi-builder-workspace/.derivedData/Build/Intermediates.noindex/JavApi⁴Swift.build/Debug-appletvos/JavApi.build/Objects-normal/arm64/JavApi_const_extract_protocols.json -enable-experimental-feature DebugDescriptionMacro -enable-experimental-feature OpaqueTypeErasure -enable-upcoming-feature StrictConcurrency -enable-upcoming-feature DisableOutwardActorInference -enable-upcoming-feature GlobalActorIsolatedTypesUsability -enable-upcoming-feature InferSendableFromCaptures -strict-concurrency\=complete -empty-abi-descriptor -plugin-path /Applications/Xcode-16.1.0.app/Contents/Developer/Toolchains/XcodeDefault.xctoolchain/usr/lib/swift/host/plugins/testing -user-module-version 0.19.1 -validate-clang-modules-once -clang-build-session-file /Users/admin/builder/spi-builder-workspace/.derivedData/ModuleCache.noindex/Session.modulevalidation -Xcc -working-directory -Xcc /Users/admin/builder/spi-builder-workspace/.swiftpm/xcode -resource-dir /Applications/Xcode-16.1.0.app/Contents/Developer/Toolchains/XcodeDefault.xctoolchain/usr/lib/swift -enable-anonymous-context-mangled-names -file-compilation-dir /Users/admin/builder/spi-builder-workspace/.swiftpm/xcode -Xcc -D_LIBCPP_HARDENING_MODE\=_LIBCPP_HARDENING_MODE_DEBUG -Xcc -ivfsstatcache -Xcc /Users/admin/builder/spi-builder-workspace/.derivedData/SDKStatCaches.noindex/appletvos18.1-22J572-e7fdd8cf9ffd4d4af20823079b51a726.sdkstatcache -Xcc -I/Users/admin/builder/spi-builder-workspace/.derivedData/Build/Intermediates.noindex/JavApi⁴Swift.build/Debug-appletvos/JavApi.build/swift-overrides.hmap -Xcc -I/Users/admin/builder/spi-builder-workspace/.derivedData/Build/Products/Debug-appletvos/include -Xcc -I/Users/admin/builder/spi-builder-workspace/.derivedData/Build/Intermediates.noindex/JavApi⁴Swift.build/Debug-appletvos/JavApi.build/DerivedSources-normal/arm64 -Xcc -I/Users/admin/builder/spi-builder-workspace/.derivedData/Build/Intermediates.noindex/JavApi⁴Swift.build/Debug-appletvos/JavApi.build/DerivedSources/arm64 -Xcc -I/Users/admin/builder/spi-builder-workspace/.derivedData/Build/Intermediates.noindex/JavApi⁴Swift.build/Debug-appletvos/JavApi.build/DerivedSources -Xcc -DSWIFT_PACKAGE -Xcc -DDEBUG\=1 -module-name JavApi -package-name javapi4swift -frontend-parseable-output -disable-clang-spi -target-sdk-version 18.1 -target-sdk-name appletvos18.1 -external-plugin-path /Applications/Xcode-16.1.0.app/Contents/Developer/Platforms/AppleTVOS.platform/Developer/usr/lib/swift/host/plugins\#/Applications/Xcode-16.1.0.app/Contents/Developer/Platforms/AppleTVOS.platform/Developer/usr/bin/swift-plugin-server -external-plugin-path /Applications/Xcode-16.1.0.app/Contents/Developer/Platforms/AppleTVOS.platform/Developer/usr/local/lib/swift/host/plugins\#/Applications/Xcode-16.1.0.app/Contents/Developer/Platforms/AppleTVOS.platform/Developer/usr/bin/swift-plugin-server -plugin-path /Applications/Xcode-16.1.0.app/Contents/Developer/Toolchains/XcodeDefault.xctoolchain/usr/lib/swift/host/plugins -plugin-path /Applications/Xcode-16.1.0.app/Contents/Developer/Toolchains/XcodeDefault.xctoolchain/usr/local/lib/swift/host/plugins -o /Users/admin/builder/spi-builder-workspace/.derivedData/Build/Intermediates.noindex/JavApi⁴Swift.build/Debug-appletvos/JavApi.build/Objects-normal/arm64/Class.o -o /Users/admin/builder/spi-builder-workspace/.derivedData/Build/Intermediates.noindex/JavApi⁴Swift.build/Debug-appletvos/JavApi.build/Objects-normal/arm64/Cloneable+Swiftify.o -o /Users/admin/builder/spi-builder-workspace/.derivedData/Build/Intermediates.noindex/JavApi⁴Swift.build/Debug-appletvos/JavApi.build/Objects-normal/arm64/Cloneable.o -o /Users/admin/builder/spi-builder-workspace/.derivedData/Build/Intermediates.noindex/JavApi⁴Swift.build/Debug-appletvos/JavApi.build/Objects-normal/arm64/Comparable+Swiftify.o -o /Users/admin/builder/spi-builder-workspace/.derivedData/Build/Intermediates.noindex/JavApi⁴Swift.build/Debug-appletvos/JavApi.build/Objects-normal/arm64/Comparable.o -o /Users/admin/builder/spi-builder-workspace/.derivedData/Build/Intermediates.noindex/JavApi⁴Swift.build/Debug-appletvos/JavApi.build/Objects-normal/arm64/Double+Java.o -o /Users/admin/builder/spi-builder-workspace/.derivedData/Build/Intermediates.noindex/JavApi⁴Swift.build/Debug-appletvos/JavApi.build/Objects-normal/arm64/Double+Swiftify.o -o /Users/admin/builder/spi-builder-workspace/.derivedData/Build/Intermediates.noindex/JavApi⁴Swift.build/Debug-appletvos/JavApi.build/Objects-normal/arm64/FileHandle+TextOutputStream.o -o /Users/admin/builder/spi-builder-workspace/.derivedData/Build/Intermediates.noindex/JavApi⁴Swift.build/Debug-appletvos/JavApi.build/Objects-normal/arm64/Int+Java.o -o /Users/admin/builder/spi-builder-workspace/.derivedData/Build/Intermediates.noindex/JavApi⁴Swift.build/Debug-appletvos/JavApi.build/Objects-normal/arm64/Int32+Java.o -o /Users/admin/builder/spi-builder-workspace/.derivedData/Build/Intermediates.noindex/JavApi⁴Swift.build/Debug-appletvos/JavApi.build/Objects-normal/arm64/Int64+Java.o -o /Users/admin/builder/spi-builder-workspace/.derivedData/Build/Intermediates.noindex/JavApi⁴Swift.build/Debug-appletvos/JavApi.build/Objects-normal/arm64/Integer.o -o /Users/admin/builder/spi-builder-workspace/.derivedData/Build/Intermediates.noindex/JavApi⁴Swift.build/Debug-appletvos/JavApi.build/Objects-normal/arm64/Long.o -o /Users/admin/builder/spi-builder-workspace/.derivedData/Build/Intermediates.noindex/JavApi⁴Swift.build/Debug-appletvos/JavApi.build/Objects-normal/arm64/Math.o -o /Users/admin/builder/spi-builder-workspace/.derivedData/Build/Intermediates.noindex/JavApi⁴Swift.build/Debug-appletvos/JavApi.build/Objects-normal/arm64/Operator+Java.o -index-unit-output-path /JavApi⁴Swift.build/Debug-appletvos/JavApi.build/Objects-normal/arm64/Class.o -index-unit-output-path /JavApi⁴Swift.build/Debug-appletvos/JavApi.build/Objects-normal/arm64/Cloneable+Swiftify.o -index-unit-output-path /JavApi⁴Swift.build/Debug-appletvos/JavApi.build/Objects-normal/arm64/Cloneable.o -index-unit-output-path /JavApi⁴Swift.build/Debug-appletvos/JavApi.build/Objects-normal/arm64/Comparable+Swiftify.o -index-unit-output-path /JavApi⁴Swift.build/Debug-appletvos/JavApi.build/Objects-normal/arm64/Comparable.o -index-unit-output-path /JavApi⁴Swift.build/Debug-appletvos/JavApi.build/Objects-normal/arm64/Double+Java.o -index-unit-output-path /JavApi⁴Swift.build/Debug-appletvos/JavApi.build/Objects-normal/arm64/Double+Swiftify.o -index-unit-output-path /JavApi⁴Swift.build/Debug-appletvos/JavApi.build/Objects-normal/arm64/FileHandle+TextOutputStream.o -index-unit-output-path /JavApi⁴Swift.build/Debug-appletvos/JavApi.build/Objects-normal/arm64/Int+Java.o -index-unit-output-path /JavApi⁴Swift.build/Debug-appletvos/JavApi.build/Objects-normal/arm64/Int32+Java.o -index-unit-output-path /JavApi⁴Swift.build/Debug-appletvos/JavApi.build/Objects-normal/arm64/Int64+Java.o -index-unit-output-path /JavApi⁴Swift.build/Debug-appletvos/JavApi.build/Objects-normal/arm64/Integer.o -index-unit-output-path /JavApi⁴Swift.build/Debug-appletvos/JavApi.build/Objects-normal/arm64/Long.o -index-unit-output-path /JavApi⁴Swift.build/Debug-appletvos/JavApi.build/Objects-normal/arm64/Math.o -index-unit-output-path /JavApi⁴Swift.build/Debug-appletvos/JavApi.build/Objects-normal/arm64/Operator+Java.o -index-store-path /Users/admin/builder/spi-builder-workspace/.derivedData/Index.noindex/DataStore -index-system-modules
SwiftCompile normal arm64 /Users/admin/builder/spi-builder-workspace/.dependencies/checkouts/JavApi4Swift/Sources/JavApi/lang/Integer.swift (in target 'JavApi' from project 'JavApi⁴Swift')
cd /Users/admin/builder/spi-builder-workspace/.swiftpm/xcode
/Applications/Xcode-16.1.0.app/Contents/Developer/Toolchains/XcodeDefault.xctoolchain/usr/bin/swift-frontend -c -filelist /Users/admin/builder/spi-builder-workspace/.derivedData/Build/Intermediates.noindex/JavApi⁴Swift.build/Debug-appletvos/JavApi.build/Objects-normal/arm64/sources-1 -primary-file /Users/admin/builder/spi-builder-workspace/.dependencies/checkouts/JavApi4Swift/Sources/JavApi/lang/Class.swift -primary-file /Users/admin/builder/spi-builder-workspace/.dependencies/checkouts/JavApi4Swift/Sources/JavApi/lang/Cloneable+Swiftify.swift -primary-file /Users/admin/builder/spi-builder-workspace/.dependencies/checkouts/JavApi4Swift/Sources/JavApi/lang/Cloneable.swift -primary-file /Users/admin/builder/spi-builder-workspace/.dependencies/checkouts/JavApi4Swift/Sources/JavApi/lang/Comparable+Swiftify.swift -primary-file /Users/admin/builder/spi-builder-workspace/.dependencies/checkouts/JavApi4Swift/Sources/JavApi/lang/Comparable.swift -primary-file /Users/admin/builder/spi-builder-workspace/.dependencies/checkouts/JavApi4Swift/Sources/JavApi/lang/Double+Java.swift -primary-file /Users/admin/builder/spi-builder-workspace/.dependencies/checkouts/JavApi4Swift/Sources/JavApi/lang/Double+Swiftify.swift -primary-file /Users/admin/builder/spi-builder-workspace/.dependencies/checkouts/JavApi4Swift/Sources/JavApi/lang/FileHandle+TextOutputStream.swift -primary-file /Users/admin/builder/spi-builder-workspace/.dependencies/checkouts/JavApi4Swift/Sources/JavApi/lang/Int+Java.swift -primary-file /Users/admin/builder/spi-builder-workspace/.dependencies/checkouts/JavApi4Swift/Sources/JavApi/lang/Int32+Java.swift -primary-file /Users/admin/builder/spi-builder-workspace/.dependencies/checkouts/JavApi4Swift/Sources/JavApi/lang/Int64+Java.swift -primary-file /Users/admin/builder/spi-builder-workspace/.dependencies/checkouts/JavApi4Swift/Sources/JavApi/lang/Integer.swift -primary-file /Users/admin/builder/spi-builder-workspace/.dependencies/checkouts/JavApi4Swift/Sources/JavApi/lang/Long.swift -primary-file /Users/admin/builder/spi-builder-workspace/.dependencies/checkouts/JavApi4Swift/Sources/JavApi/lang/Math.swift -primary-file /Users/admin/builder/spi-builder-workspace/.dependencies/checkouts/JavApi4Swift/Sources/JavApi/lang/Operator+Java.swift -supplementary-output-file-map /Users/admin/builder/spi-builder-workspace/.derivedData/Build/Intermediates.noindex/JavApi⁴Swift.build/Debug-appletvos/JavApi.build/Objects-normal/arm64/supplementaryOutputs-3 -target arm64-apple-tvos16.0 -Xllvm -aarch64-use-tbi -enable-objc-interop -stack-check -sdk /Applications/Xcode-16.1.0.app/Contents/Developer/Platforms/AppleTVOS.platform/Developer/SDKs/AppleTVOS18.1.sdk -I /Users/admin/builder/spi-builder-workspace/.derivedData/Build/Products/Debug-appletvos -I /Applications/Xcode-16.1.0.app/Contents/Developer/Platforms/AppleTVOS.platform/Developer/usr/lib -F /Users/admin/builder/spi-builder-workspace/.derivedData/Build/Products/Debug-appletvos -F /Applications/Xcode-16.1.0.app/Contents/Developer/Platforms/AppleTVOS.platform/Developer/Library/Frameworks -F /Applications/Xcode-16.1.0.app/Contents/Developer/Platforms/AppleTVOS.platform/Developer/SDKs/AppleTVOS18.1.sdk/Developer/Library/Frameworks -no-color-diagnostics -enable-testing -g -debug-info-format\=dwarf -dwarf-version\=4 -module-cache-path /Users/admin/builder/spi-builder-workspace/.derivedData/ModuleCache.noindex -suppress-warnings -profile-generate -profile-coverage-mapping -swift-version 6 -enforce-exclusivity\=checked -stats-output-dir /Users/admin/builder/spi-builder-workspace/.swiftpm/xcode/.stats -Onone -D SWIFT_PACKAGE -D DEBUG -serialize-debugging-options -const-gather-protocols-file /Users/admin/builder/spi-builder-workspace/.derivedData/Build/Intermediates.noindex/JavApi⁴Swift.build/Debug-appletvos/JavApi.build/Objects-normal/arm64/JavApi_const_extract_protocols.json -enable-experimental-feature DebugDescriptionMacro -enable-experimental-feature OpaqueTypeErasure -enable-upcoming-feature StrictConcurrency -enable-upcoming-feature DisableOutwardActorInference -enable-upcoming-feature GlobalActorIsolatedTypesUsability -enable-upcoming-feature InferSendableFromCaptures -strict-concurrency\=complete -empty-abi-descriptor -plugin-path /Applications/Xcode-16.1.0.app/Contents/Developer/Toolchains/XcodeDefault.xctoolchain/usr/lib/swift/host/plugins/testing -user-module-version 0.19.1 -validate-clang-modules-once -clang-build-session-file /Users/admin/builder/spi-builder-workspace/.derivedData/ModuleCache.noindex/Session.modulevalidation -Xcc -working-directory -Xcc /Users/admin/builder/spi-builder-workspace/.swiftpm/xcode -resource-dir /Applications/Xcode-16.1.0.app/Contents/Developer/Toolchains/XcodeDefault.xctoolchain/usr/lib/swift -enable-anonymous-context-mangled-names -file-compilation-dir /Users/admin/builder/spi-builder-workspace/.swiftpm/xcode -Xcc -D_LIBCPP_HARDENING_MODE\=_LIBCPP_HARDENING_MODE_DEBUG -Xcc -ivfsstatcache -Xcc /Users/admin/builder/spi-builder-workspace/.derivedData/SDKStatCaches.noindex/appletvos18.1-22J572-e7fdd8cf9ffd4d4af20823079b51a726.sdkstatcache -Xcc -I/Users/admin/builder/spi-builder-workspace/.derivedData/Build/Intermediates.noindex/JavApi⁴Swift.build/Debug-appletvos/JavApi.build/swift-overrides.hmap -Xcc -I/Users/admin/builder/spi-builder-workspace/.derivedData/Build/Products/Debug-appletvos/include -Xcc -I/Users/admin/builder/spi-builder-workspace/.derivedData/Build/Intermediates.noindex/JavApi⁴Swift.build/Debug-appletvos/JavApi.build/DerivedSources-normal/arm64 -Xcc -I/Users/admin/builder/spi-builder-workspace/.derivedData/Build/Intermediates.noindex/JavApi⁴Swift.build/Debug-appletvos/JavApi.build/DerivedSources/arm64 -Xcc -I/Users/admin/builder/spi-builder-workspace/.derivedData/Build/Intermediates.noindex/JavApi⁴Swift.build/Debug-appletvos/JavApi.build/DerivedSources -Xcc -DSWIFT_PACKAGE -Xcc -DDEBUG\=1 -module-name JavApi -package-name javapi4swift -frontend-parseable-output -disable-clang-spi -target-sdk-version 18.1 -target-sdk-name appletvos18.1 -external-plugin-path /Applications/Xcode-16.1.0.app/Contents/Developer/Platforms/AppleTVOS.platform/Developer/usr/lib/swift/host/plugins\#/Applications/Xcode-16.1.0.app/Contents/Developer/Platforms/AppleTVOS.platform/Developer/usr/bin/swift-plugin-server -external-plugin-path /Applications/Xcode-16.1.0.app/Contents/Developer/Platforms/AppleTVOS.platform/Developer/usr/local/lib/swift/host/plugins\#/Applications/Xcode-16.1.0.app/Contents/Developer/Platforms/AppleTVOS.platform/Developer/usr/bin/swift-plugin-server -plugin-path /Applications/Xcode-16.1.0.app/Contents/Developer/Toolchains/XcodeDefault.xctoolchain/usr/lib/swift/host/plugins -plugin-path /Applications/Xcode-16.1.0.app/Contents/Developer/Toolchains/XcodeDefault.xctoolchain/usr/local/lib/swift/host/plugins -o /Users/admin/builder/spi-builder-workspace/.derivedData/Build/Intermediates.noindex/JavApi⁴Swift.build/Debug-appletvos/JavApi.build/Objects-normal/arm64/Class.o -o /Users/admin/builder/spi-builder-workspace/.derivedData/Build/Intermediates.noindex/JavApi⁴Swift.build/Debug-appletvos/JavApi.build/Objects-normal/arm64/Cloneable+Swiftify.o -o /Users/admin/builder/spi-builder-workspace/.derivedData/Build/Intermediates.noindex/JavApi⁴Swift.build/Debug-appletvos/JavApi.build/Objects-normal/arm64/Cloneable.o -o /Users/admin/builder/spi-builder-workspace/.derivedData/Build/Intermediates.noindex/JavApi⁴Swift.build/Debug-appletvos/JavApi.build/Objects-normal/arm64/Comparable+Swiftify.o -o /Users/admin/builder/spi-builder-workspace/.derivedData/Build/Intermediates.noindex/JavApi⁴Swift.build/Debug-appletvos/JavApi.build/Objects-normal/arm64/Comparable.o -o /Users/admin/builder/spi-builder-workspace/.derivedData/Build/Intermediates.noindex/JavApi⁴Swift.build/Debug-appletvos/JavApi.build/Objects-normal/arm64/Double+Java.o -o /Users/admin/builder/spi-builder-workspace/.derivedData/Build/Intermediates.noindex/JavApi⁴Swift.build/Debug-appletvos/JavApi.build/Objects-normal/arm64/Double+Swiftify.o -o /Users/admin/builder/spi-builder-workspace/.derivedData/Build/Intermediates.noindex/JavApi⁴Swift.build/Debug-appletvos/JavApi.build/Objects-normal/arm64/FileHandle+TextOutputStream.o -o /Users/admin/builder/spi-builder-workspace/.derivedData/Build/Intermediates.noindex/JavApi⁴Swift.build/Debug-appletvos/JavApi.build/Objects-normal/arm64/Int+Java.o -o /Users/admin/builder/spi-builder-workspace/.derivedData/Build/Intermediates.noindex/JavApi⁴Swift.build/Debug-appletvos/JavApi.build/Objects-normal/arm64/Int32+Java.o -o /Users/admin/builder/spi-builder-workspace/.derivedData/Build/Intermediates.noindex/JavApi⁴Swift.build/Debug-appletvos/JavApi.build/Objects-normal/arm64/Int64+Java.o -o /Users/admin/builder/spi-builder-workspace/.derivedData/Build/Intermediates.noindex/JavApi⁴Swift.build/Debug-appletvos/JavApi.build/Objects-normal/arm64/Integer.o -o /Users/admin/builder/spi-builder-workspace/.derivedData/Build/Intermediates.noindex/JavApi⁴Swift.build/Debug-appletvos/JavApi.build/Objects-normal/arm64/Long.o -o /Users/admin/builder/spi-builder-workspace/.derivedData/Build/Intermediates.noindex/JavApi⁴Swift.build/Debug-appletvos/JavApi.build/Objects-normal/arm64/Math.o -o /Users/admin/builder/spi-builder-workspace/.derivedData/Build/Intermediates.noindex/JavApi⁴Swift.build/Debug-appletvos/JavApi.build/Objects-normal/arm64/Operator+Java.o -index-unit-output-path /JavApi⁴Swift.build/Debug-appletvos/JavApi.build/Objects-normal/arm64/Class.o -index-unit-output-path /JavApi⁴Swift.build/Debug-appletvos/JavApi.build/Objects-normal/arm64/Cloneable+Swiftify.o -index-unit-output-path /JavApi⁴Swift.build/Debug-appletvos/JavApi.build/Objects-normal/arm64/Cloneable.o -index-unit-output-path /JavApi⁴Swift.build/Debug-appletvos/JavApi.build/Objects-normal/arm64/Comparable+Swiftify.o -index-unit-output-path /JavApi⁴Swift.build/Debug-appletvos/JavApi.build/Objects-normal/arm64/Comparable.o -index-unit-output-path /JavApi⁴Swift.build/Debug-appletvos/JavApi.build/Objects-normal/arm64/Double+Java.o -index-unit-output-path /JavApi⁴Swift.build/Debug-appletvos/JavApi.build/Objects-normal/arm64/Double+Swiftify.o -index-unit-output-path /JavApi⁴Swift.build/Debug-appletvos/JavApi.build/Objects-normal/arm64/FileHandle+TextOutputStream.o -index-unit-output-path /JavApi⁴Swift.build/Debug-appletvos/JavApi.build/Objects-normal/arm64/Int+Java.o -index-unit-output-path /JavApi⁴Swift.build/Debug-appletvos/JavApi.build/Objects-normal/arm64/Int32+Java.o -index-unit-output-path /JavApi⁴Swift.build/Debug-appletvos/JavApi.build/Objects-normal/arm64/Int64+Java.o -index-unit-output-path /JavApi⁴Swift.build/Debug-appletvos/JavApi.build/Objects-normal/arm64/Integer.o -index-unit-output-path /JavApi⁴Swift.build/Debug-appletvos/JavApi.build/Objects-normal/arm64/Long.o -index-unit-output-path /JavApi⁴Swift.build/Debug-appletvos/JavApi.build/Objects-normal/arm64/Math.o -index-unit-output-path /JavApi⁴Swift.build/Debug-appletvos/JavApi.build/Objects-normal/arm64/Operator+Java.o -index-store-path /Users/admin/builder/spi-builder-workspace/.derivedData/Index.noindex/DataStore -index-system-modules
SwiftCompile normal arm64 /Users/admin/builder/spi-builder-workspace/.dependencies/checkouts/JavApi4Swift/Sources/JavApi/lang/Long.swift (in target 'JavApi' from project 'JavApi⁴Swift')
cd /Users/admin/builder/spi-builder-workspace/.swiftpm/xcode
/Applications/Xcode-16.1.0.app/Contents/Developer/Toolchains/XcodeDefault.xctoolchain/usr/bin/swift-frontend -c -filelist /Users/admin/builder/spi-builder-workspace/.derivedData/Build/Intermediates.noindex/JavApi⁴Swift.build/Debug-appletvos/JavApi.build/Objects-normal/arm64/sources-1 -primary-file /Users/admin/builder/spi-builder-workspace/.dependencies/checkouts/JavApi4Swift/Sources/JavApi/lang/Class.swift -primary-file /Users/admin/builder/spi-builder-workspace/.dependencies/checkouts/JavApi4Swift/Sources/JavApi/lang/Cloneable+Swiftify.swift -primary-file /Users/admin/builder/spi-builder-workspace/.dependencies/checkouts/JavApi4Swift/Sources/JavApi/lang/Cloneable.swift -primary-file /Users/admin/builder/spi-builder-workspace/.dependencies/checkouts/JavApi4Swift/Sources/JavApi/lang/Comparable+Swiftify.swift -primary-file /Users/admin/builder/spi-builder-workspace/.dependencies/checkouts/JavApi4Swift/Sources/JavApi/lang/Comparable.swift -primary-file /Users/admin/builder/spi-builder-workspace/.dependencies/checkouts/JavApi4Swift/Sources/JavApi/lang/Double+Java.swift -primary-file /Users/admin/builder/spi-builder-workspace/.dependencies/checkouts/JavApi4Swift/Sources/JavApi/lang/Double+Swiftify.swift -primary-file /Users/admin/builder/spi-builder-workspace/.dependencies/checkouts/JavApi4Swift/Sources/JavApi/lang/FileHandle+TextOutputStream.swift -primary-file /Users/admin/builder/spi-builder-workspace/.dependencies/checkouts/JavApi4Swift/Sources/JavApi/lang/Int+Java.swift -primary-file /Users/admin/builder/spi-builder-workspace/.dependencies/checkouts/JavApi4Swift/Sources/JavApi/lang/Int32+Java.swift -primary-file /Users/admin/builder/spi-builder-workspace/.dependencies/checkouts/JavApi4Swift/Sources/JavApi/lang/Int64+Java.swift -primary-file /Users/admin/builder/spi-builder-workspace/.dependencies/checkouts/JavApi4Swift/Sources/JavApi/lang/Integer.swift -primary-file /Users/admin/builder/spi-builder-workspace/.dependencies/checkouts/JavApi4Swift/Sources/JavApi/lang/Long.swift -primary-file /Users/admin/builder/spi-builder-workspace/.dependencies/checkouts/JavApi4Swift/Sources/JavApi/lang/Math.swift -primary-file /Users/admin/builder/spi-builder-workspace/.dependencies/checkouts/JavApi4Swift/Sources/JavApi/lang/Operator+Java.swift -supplementary-output-file-map /Users/admin/builder/spi-builder-workspace/.derivedData/Build/Intermediates.noindex/JavApi⁴Swift.build/Debug-appletvos/JavApi.build/Objects-normal/arm64/supplementaryOutputs-3 -target arm64-apple-tvos16.0 -Xllvm -aarch64-use-tbi -enable-objc-interop -stack-check -sdk /Applications/Xcode-16.1.0.app/Contents/Developer/Platforms/AppleTVOS.platform/Developer/SDKs/AppleTVOS18.1.sdk -I /Users/admin/builder/spi-builder-workspace/.derivedData/Build/Products/Debug-appletvos -I /Applications/Xcode-16.1.0.app/Contents/Developer/Platforms/AppleTVOS.platform/Developer/usr/lib -F /Users/admin/builder/spi-builder-workspace/.derivedData/Build/Products/Debug-appletvos -F /Applications/Xcode-16.1.0.app/Contents/Developer/Platforms/AppleTVOS.platform/Developer/Library/Frameworks -F /Applications/Xcode-16.1.0.app/Contents/Developer/Platforms/AppleTVOS.platform/Developer/SDKs/AppleTVOS18.1.sdk/Developer/Library/Frameworks -no-color-diagnostics -enable-testing -g -debug-info-format\=dwarf -dwarf-version\=4 -module-cache-path /Users/admin/builder/spi-builder-workspace/.derivedData/ModuleCache.noindex -suppress-warnings -profile-generate -profile-coverage-mapping -swift-version 6 -enforce-exclusivity\=checked -stats-output-dir /Users/admin/builder/spi-builder-workspace/.swiftpm/xcode/.stats -Onone -D SWIFT_PACKAGE -D DEBUG -serialize-debugging-options -const-gather-protocols-file /Users/admin/builder/spi-builder-workspace/.derivedData/Build/Intermediates.noindex/JavApi⁴Swift.build/Debug-appletvos/JavApi.build/Objects-normal/arm64/JavApi_const_extract_protocols.json -enable-experimental-feature DebugDescriptionMacro -enable-experimental-feature OpaqueTypeErasure -enable-upcoming-feature StrictConcurrency -enable-upcoming-feature DisableOutwardActorInference -enable-upcoming-feature GlobalActorIsolatedTypesUsability -enable-upcoming-feature InferSendableFromCaptures -strict-concurrency\=complete -empty-abi-descriptor -plugin-path /Applications/Xcode-16.1.0.app/Contents/Developer/Toolchains/XcodeDefault.xctoolchain/usr/lib/swift/host/plugins/testing -user-module-version 0.19.1 -validate-clang-modules-once -clang-build-session-file /Users/admin/builder/spi-builder-workspace/.derivedData/ModuleCache.noindex/Session.modulevalidation -Xcc -working-directory -Xcc /Users/admin/builder/spi-builder-workspace/.swiftpm/xcode -resource-dir /Applications/Xcode-16.1.0.app/Contents/Developer/Toolchains/XcodeDefault.xctoolchain/usr/lib/swift -enable-anonymous-context-mangled-names -file-compilation-dir /Users/admin/builder/spi-builder-workspace/.swiftpm/xcode -Xcc -D_LIBCPP_HARDENING_MODE\=_LIBCPP_HARDENING_MODE_DEBUG -Xcc -ivfsstatcache -Xcc /Users/admin/builder/spi-builder-workspace/.derivedData/SDKStatCaches.noindex/appletvos18.1-22J572-e7fdd8cf9ffd4d4af20823079b51a726.sdkstatcache -Xcc -I/Users/admin/builder/spi-builder-workspace/.derivedData/Build/Intermediates.noindex/JavApi⁴Swift.build/Debug-appletvos/JavApi.build/swift-overrides.hmap -Xcc -I/Users/admin/builder/spi-builder-workspace/.derivedData/Build/Products/Debug-appletvos/include -Xcc -I/Users/admin/builder/spi-builder-workspace/.derivedData/Build/Intermediates.noindex/JavApi⁴Swift.build/Debug-appletvos/JavApi.build/DerivedSources-normal/arm64 -Xcc -I/Users/admin/builder/spi-builder-workspace/.derivedData/Build/Intermediates.noindex/JavApi⁴Swift.build/Debug-appletvos/JavApi.build/DerivedSources/arm64 -Xcc -I/Users/admin/builder/spi-builder-workspace/.derivedData/Build/Intermediates.noindex/JavApi⁴Swift.build/Debug-appletvos/JavApi.build/DerivedSources -Xcc -DSWIFT_PACKAGE -Xcc -DDEBUG\=1 -module-name JavApi -package-name javapi4swift -frontend-parseable-output -disable-clang-spi -target-sdk-version 18.1 -target-sdk-name appletvos18.1 -external-plugin-path /Applications/Xcode-16.1.0.app/Contents/Developer/Platforms/AppleTVOS.platform/Developer/usr/lib/swift/host/plugins\#/Applications/Xcode-16.1.0.app/Contents/Developer/Platforms/AppleTVOS.platform/Developer/usr/bin/swift-plugin-server -external-plugin-path /Applications/Xcode-16.1.0.app/Contents/Developer/Platforms/AppleTVOS.platform/Developer/usr/local/lib/swift/host/plugins\#/Applications/Xcode-16.1.0.app/Contents/Developer/Platforms/AppleTVOS.platform/Developer/usr/bin/swift-plugin-server -plugin-path /Applications/Xcode-16.1.0.app/Contents/Developer/Toolchains/XcodeDefault.xctoolchain/usr/lib/swift/host/plugins -plugin-path /Applications/Xcode-16.1.0.app/Contents/Developer/Toolchains/XcodeDefault.xctoolchain/usr/local/lib/swift/host/plugins -o /Users/admin/builder/spi-builder-workspace/.derivedData/Build/Intermediates.noindex/JavApi⁴Swift.build/Debug-appletvos/JavApi.build/Objects-normal/arm64/Class.o -o /Users/admin/builder/spi-builder-workspace/.derivedData/Build/Intermediates.noindex/JavApi⁴Swift.build/Debug-appletvos/JavApi.build/Objects-normal/arm64/Cloneable+Swiftify.o -o /Users/admin/builder/spi-builder-workspace/.derivedData/Build/Intermediates.noindex/JavApi⁴Swift.build/Debug-appletvos/JavApi.build/Objects-normal/arm64/Cloneable.o -o /Users/admin/builder/spi-builder-workspace/.derivedData/Build/Intermediates.noindex/JavApi⁴Swift.build/Debug-appletvos/JavApi.build/Objects-normal/arm64/Comparable+Swiftify.o -o /Users/admin/builder/spi-builder-workspace/.derivedData/Build/Intermediates.noindex/JavApi⁴Swift.build/Debug-appletvos/JavApi.build/Objects-normal/arm64/Comparable.o -o /Users/admin/builder/spi-builder-workspace/.derivedData/Build/Intermediates.noindex/JavApi⁴Swift.build/Debug-appletvos/JavApi.build/Objects-normal/arm64/Double+Java.o -o /Users/admin/builder/spi-builder-workspace/.derivedData/Build/Intermediates.noindex/JavApi⁴Swift.build/Debug-appletvos/JavApi.build/Objects-normal/arm64/Double+Swiftify.o -o /Users/admin/builder/spi-builder-workspace/.derivedData/Build/Intermediates.noindex/JavApi⁴Swift.build/Debug-appletvos/JavApi.build/Objects-normal/arm64/FileHandle+TextOutputStream.o -o /Users/admin/builder/spi-builder-workspace/.derivedData/Build/Intermediates.noindex/JavApi⁴Swift.build/Debug-appletvos/JavApi.build/Objects-normal/arm64/Int+Java.o -o /Users/admin/builder/spi-builder-workspace/.derivedData/Build/Intermediates.noindex/JavApi⁴Swift.build/Debug-appletvos/JavApi.build/Objects-normal/arm64/Int32+Java.o -o /Users/admin/builder/spi-builder-workspace/.derivedData/Build/Intermediates.noindex/JavApi⁴Swift.build/Debug-appletvos/JavApi.build/Objects-normal/arm64/Int64+Java.o -o /Users/admin/builder/spi-builder-workspace/.derivedData/Build/Intermediates.noindex/JavApi⁴Swift.build/Debug-appletvos/JavApi.build/Objects-normal/arm64/Integer.o -o /Users/admin/builder/spi-builder-workspace/.derivedData/Build/Intermediates.noindex/JavApi⁴Swift.build/Debug-appletvos/JavApi.build/Objects-normal/arm64/Long.o -o /Users/admin/builder/spi-builder-workspace/.derivedData/Build/Intermediates.noindex/JavApi⁴Swift.build/Debug-appletvos/JavApi.build/Objects-normal/arm64/Math.o -o /Users/admin/builder/spi-builder-workspace/.derivedData/Build/Intermediates.noindex/JavApi⁴Swift.build/Debug-appletvos/JavApi.build/Objects-normal/arm64/Operator+Java.o -index-unit-output-path /JavApi⁴Swift.build/Debug-appletvos/JavApi.build/Objects-normal/arm64/Class.o -index-unit-output-path /JavApi⁴Swift.build/Debug-appletvos/JavApi.build/Objects-normal/arm64/Cloneable+Swiftify.o -index-unit-output-path /JavApi⁴Swift.build/Debug-appletvos/JavApi.build/Objects-normal/arm64/Cloneable.o -index-unit-output-path /JavApi⁴Swift.build/Debug-appletvos/JavApi.build/Objects-normal/arm64/Comparable+Swiftify.o -index-unit-output-path /JavApi⁴Swift.build/Debug-appletvos/JavApi.build/Objects-normal/arm64/Comparable.o -index-unit-output-path /JavApi⁴Swift.build/Debug-appletvos/JavApi.build/Objects-normal/arm64/Double+Java.o -index-unit-output-path /JavApi⁴Swift.build/Debug-appletvos/JavApi.build/Objects-normal/arm64/Double+Swiftify.o -index-unit-output-path /JavApi⁴Swift.build/Debug-appletvos/JavApi.build/Objects-normal/arm64/FileHandle+TextOutputStream.o -index-unit-output-path /JavApi⁴Swift.build/Debug-appletvos/JavApi.build/Objects-normal/arm64/Int+Java.o -index-unit-output-path /JavApi⁴Swift.build/Debug-appletvos/JavApi.build/Objects-normal/arm64/Int32+Java.o -index-unit-output-path /JavApi⁴Swift.build/Debug-appletvos/JavApi.build/Objects-normal/arm64/Int64+Java.o -index-unit-output-path /JavApi⁴Swift.build/Debug-appletvos/JavApi.build/Objects-normal/arm64/Integer.o -index-unit-output-path /JavApi⁴Swift.build/Debug-appletvos/JavApi.build/Objects-normal/arm64/Long.o -index-unit-output-path /JavApi⁴Swift.build/Debug-appletvos/JavApi.build/Objects-normal/arm64/Math.o -index-unit-output-path /JavApi⁴Swift.build/Debug-appletvos/JavApi.build/Objects-normal/arm64/Operator+Java.o -index-store-path /Users/admin/builder/spi-builder-workspace/.derivedData/Index.noindex/DataStore -index-system-modules
SwiftCompile normal arm64 /Users/admin/builder/spi-builder-workspace/.dependencies/checkouts/JavApi4Swift/Sources/JavApi/lang/Math.swift (in target 'JavApi' from project 'JavApi⁴Swift')
cd /Users/admin/builder/spi-builder-workspace/.swiftpm/xcode
/Applications/Xcode-16.1.0.app/Contents/Developer/Toolchains/XcodeDefault.xctoolchain/usr/bin/swift-frontend -c -filelist /Users/admin/builder/spi-builder-workspace/.derivedData/Build/Intermediates.noindex/JavApi⁴Swift.build/Debug-appletvos/JavApi.build/Objects-normal/arm64/sources-1 -primary-file /Users/admin/builder/spi-builder-workspace/.dependencies/checkouts/JavApi4Swift/Sources/JavApi/lang/Class.swift -primary-file /Users/admin/builder/spi-builder-workspace/.dependencies/checkouts/JavApi4Swift/Sources/JavApi/lang/Cloneable+Swiftify.swift -primary-file /Users/admin/builder/spi-builder-workspace/.dependencies/checkouts/JavApi4Swift/Sources/JavApi/lang/Cloneable.swift -primary-file /Users/admin/builder/spi-builder-workspace/.dependencies/checkouts/JavApi4Swift/Sources/JavApi/lang/Comparable+Swiftify.swift -primary-file /Users/admin/builder/spi-builder-workspace/.dependencies/checkouts/JavApi4Swift/Sources/JavApi/lang/Comparable.swift -primary-file /Users/admin/builder/spi-builder-workspace/.dependencies/checkouts/JavApi4Swift/Sources/JavApi/lang/Double+Java.swift -primary-file /Users/admin/builder/spi-builder-workspace/.dependencies/checkouts/JavApi4Swift/Sources/JavApi/lang/Double+Swiftify.swift -primary-file /Users/admin/builder/spi-builder-workspace/.dependencies/checkouts/JavApi4Swift/Sources/JavApi/lang/FileHandle+TextOutputStream.swift -primary-file /Users/admin/builder/spi-builder-workspace/.dependencies/checkouts/JavApi4Swift/Sources/JavApi/lang/Int+Java.swift -primary-file /Users/admin/builder/spi-builder-workspace/.dependencies/checkouts/JavApi4Swift/Sources/JavApi/lang/Int32+Java.swift -primary-file /Users/admin/builder/spi-builder-workspace/.dependencies/checkouts/JavApi4Swift/Sources/JavApi/lang/Int64+Java.swift -primary-file /Users/admin/builder/spi-builder-workspace/.dependencies/checkouts/JavApi4Swift/Sources/JavApi/lang/Integer.swift -primary-file /Users/admin/builder/spi-builder-workspace/.dependencies/checkouts/JavApi4Swift/Sources/JavApi/lang/Long.swift -primary-file /Users/admin/builder/spi-builder-workspace/.dependencies/checkouts/JavApi4Swift/Sources/JavApi/lang/Math.swift -primary-file /Users/admin/builder/spi-builder-workspace/.dependencies/checkouts/JavApi4Swift/Sources/JavApi/lang/Operator+Java.swift -supplementary-output-file-map /Users/admin/builder/spi-builder-workspace/.derivedData/Build/Intermediates.noindex/JavApi⁴Swift.build/Debug-appletvos/JavApi.build/Objects-normal/arm64/supplementaryOutputs-3 -target arm64-apple-tvos16.0 -Xllvm -aarch64-use-tbi -enable-objc-interop -stack-check -sdk /Applications/Xcode-16.1.0.app/Contents/Developer/Platforms/AppleTVOS.platform/Developer/SDKs/AppleTVOS18.1.sdk -I /Users/admin/builder/spi-builder-workspace/.derivedData/Build/Products/Debug-appletvos -I /Applications/Xcode-16.1.0.app/Contents/Developer/Platforms/AppleTVOS.platform/Developer/usr/lib -F /Users/admin/builder/spi-builder-workspace/.derivedData/Build/Products/Debug-appletvos -F /Applications/Xcode-16.1.0.app/Contents/Developer/Platforms/AppleTVOS.platform/Developer/Library/Frameworks -F /Applications/Xcode-16.1.0.app/Contents/Developer/Platforms/AppleTVOS.platform/Developer/SDKs/AppleTVOS18.1.sdk/Developer/Library/Frameworks -no-color-diagnostics -enable-testing -g -debug-info-format\=dwarf -dwarf-version\=4 -module-cache-path /Users/admin/builder/spi-builder-workspace/.derivedData/ModuleCache.noindex -suppress-warnings -profile-generate -profile-coverage-mapping -swift-version 6 -enforce-exclusivity\=checked -stats-output-dir /Users/admin/builder/spi-builder-workspace/.swiftpm/xcode/.stats -Onone -D SWIFT_PACKAGE -D DEBUG -serialize-debugging-options -const-gather-protocols-file /Users/admin/builder/spi-builder-workspace/.derivedData/Build/Intermediates.noindex/JavApi⁴Swift.build/Debug-appletvos/JavApi.build/Objects-normal/arm64/JavApi_const_extract_protocols.json -enable-experimental-feature DebugDescriptionMacro -enable-experimental-feature OpaqueTypeErasure -enable-upcoming-feature StrictConcurrency -enable-upcoming-feature DisableOutwardActorInference -enable-upcoming-feature GlobalActorIsolatedTypesUsability -enable-upcoming-feature InferSendableFromCaptures -strict-concurrency\=complete -empty-abi-descriptor -plugin-path /Applications/Xcode-16.1.0.app/Contents/Developer/Toolchains/XcodeDefault.xctoolchain/usr/lib/swift/host/plugins/testing -user-module-version 0.19.1 -validate-clang-modules-once -clang-build-session-file /Users/admin/builder/spi-builder-workspace/.derivedData/ModuleCache.noindex/Session.modulevalidation -Xcc -working-directory -Xcc /Users/admin/builder/spi-builder-workspace/.swiftpm/xcode -resource-dir /Applications/Xcode-16.1.0.app/Contents/Developer/Toolchains/XcodeDefault.xctoolchain/usr/lib/swift -enable-anonymous-context-mangled-names -file-compilation-dir /Users/admin/builder/spi-builder-workspace/.swiftpm/xcode -Xcc -D_LIBCPP_HARDENING_MODE\=_LIBCPP_HARDENING_MODE_DEBUG -Xcc -ivfsstatcache -Xcc /Users/admin/builder/spi-builder-workspace/.derivedData/SDKStatCaches.noindex/appletvos18.1-22J572-e7fdd8cf9ffd4d4af20823079b51a726.sdkstatcache -Xcc -I/Users/admin/builder/spi-builder-workspace/.derivedData/Build/Intermediates.noindex/JavApi⁴Swift.build/Debug-appletvos/JavApi.build/swift-overrides.hmap -Xcc -I/Users/admin/builder/spi-builder-workspace/.derivedData/Build/Products/Debug-appletvos/include -Xcc -I/Users/admin/builder/spi-builder-workspace/.derivedData/Build/Intermediates.noindex/JavApi⁴Swift.build/Debug-appletvos/JavApi.build/DerivedSources-normal/arm64 -Xcc -I/Users/admin/builder/spi-builder-workspace/.derivedData/Build/Intermediates.noindex/JavApi⁴Swift.build/Debug-appletvos/JavApi.build/DerivedSources/arm64 -Xcc -I/Users/admin/builder/spi-builder-workspace/.derivedData/Build/Intermediates.noindex/JavApi⁴Swift.build/Debug-appletvos/JavApi.build/DerivedSources -Xcc -DSWIFT_PACKAGE -Xcc -DDEBUG\=1 -module-name JavApi -package-name javapi4swift -frontend-parseable-output -disable-clang-spi -target-sdk-version 18.1 -target-sdk-name appletvos18.1 -external-plugin-path /Applications/Xcode-16.1.0.app/Contents/Developer/Platforms/AppleTVOS.platform/Developer/usr/lib/swift/host/plugins\#/Applications/Xcode-16.1.0.app/Contents/Developer/Platforms/AppleTVOS.platform/Developer/usr/bin/swift-plugin-server -external-plugin-path /Applications/Xcode-16.1.0.app/Contents/Developer/Platforms/AppleTVOS.platform/Developer/usr/local/lib/swift/host/plugins\#/Applications/Xcode-16.1.0.app/Contents/Developer/Platforms/AppleTVOS.platform/Developer/usr/bin/swift-plugin-server -plugin-path /Applications/Xcode-16.1.0.app/Contents/Developer/Toolchains/XcodeDefault.xctoolchain/usr/lib/swift/host/plugins -plugin-path /Applications/Xcode-16.1.0.app/Contents/Developer/Toolchains/XcodeDefault.xctoolchain/usr/local/lib/swift/host/plugins -o /Users/admin/builder/spi-builder-workspace/.derivedData/Build/Intermediates.noindex/JavApi⁴Swift.build/Debug-appletvos/JavApi.build/Objects-normal/arm64/Class.o -o /Users/admin/builder/spi-builder-workspace/.derivedData/Build/Intermediates.noindex/JavApi⁴Swift.build/Debug-appletvos/JavApi.build/Objects-normal/arm64/Cloneable+Swiftify.o -o /Users/admin/builder/spi-builder-workspace/.derivedData/Build/Intermediates.noindex/JavApi⁴Swift.build/Debug-appletvos/JavApi.build/Objects-normal/arm64/Cloneable.o -o /Users/admin/builder/spi-builder-workspace/.derivedData/Build/Intermediates.noindex/JavApi⁴Swift.build/Debug-appletvos/JavApi.build/Objects-normal/arm64/Comparable+Swiftify.o -o /Users/admin/builder/spi-builder-workspace/.derivedData/Build/Intermediates.noindex/JavApi⁴Swift.build/Debug-appletvos/JavApi.build/Objects-normal/arm64/Comparable.o -o /Users/admin/builder/spi-builder-workspace/.derivedData/Build/Intermediates.noindex/JavApi⁴Swift.build/Debug-appletvos/JavApi.build/Objects-normal/arm64/Double+Java.o -o /Users/admin/builder/spi-builder-workspace/.derivedData/Build/Intermediates.noindex/JavApi⁴Swift.build/Debug-appletvos/JavApi.build/Objects-normal/arm64/Double+Swiftify.o -o /Users/admin/builder/spi-builder-workspace/.derivedData/Build/Intermediates.noindex/JavApi⁴Swift.build/Debug-appletvos/JavApi.build/Objects-normal/arm64/FileHandle+TextOutputStream.o -o /Users/admin/builder/spi-builder-workspace/.derivedData/Build/Intermediates.noindex/JavApi⁴Swift.build/Debug-appletvos/JavApi.build/Objects-normal/arm64/Int+Java.o -o /Users/admin/builder/spi-builder-workspace/.derivedData/Build/Intermediates.noindex/JavApi⁴Swift.build/Debug-appletvos/JavApi.build/Objects-normal/arm64/Int32+Java.o -o /Users/admin/builder/spi-builder-workspace/.derivedData/Build/Intermediates.noindex/JavApi⁴Swift.build/Debug-appletvos/JavApi.build/Objects-normal/arm64/Int64+Java.o -o /Users/admin/builder/spi-builder-workspace/.derivedData/Build/Intermediates.noindex/JavApi⁴Swift.build/Debug-appletvos/JavApi.build/Objects-normal/arm64/Integer.o -o /Users/admin/builder/spi-builder-workspace/.derivedData/Build/Intermediates.noindex/JavApi⁴Swift.build/Debug-appletvos/JavApi.build/Objects-normal/arm64/Long.o -o /Users/admin/builder/spi-builder-workspace/.derivedData/Build/Intermediates.noindex/JavApi⁴Swift.build/Debug-appletvos/JavApi.build/Objects-normal/arm64/Math.o -o /Users/admin/builder/spi-builder-workspace/.derivedData/Build/Intermediates.noindex/JavApi⁴Swift.build/Debug-appletvos/JavApi.build/Objects-normal/arm64/Operator+Java.o -index-unit-output-path /JavApi⁴Swift.build/Debug-appletvos/JavApi.build/Objects-normal/arm64/Class.o -index-unit-output-path /JavApi⁴Swift.build/Debug-appletvos/JavApi.build/Objects-normal/arm64/Cloneable+Swiftify.o -index-unit-output-path /JavApi⁴Swift.build/Debug-appletvos/JavApi.build/Objects-normal/arm64/Cloneable.o -index-unit-output-path /JavApi⁴Swift.build/Debug-appletvos/JavApi.build/Objects-normal/arm64/Comparable+Swiftify.o -index-unit-output-path /JavApi⁴Swift.build/Debug-appletvos/JavApi.build/Objects-normal/arm64/Comparable.o -index-unit-output-path /JavApi⁴Swift.build/Debug-appletvos/JavApi.build/Objects-normal/arm64/Double+Java.o -index-unit-output-path /JavApi⁴Swift.build/Debug-appletvos/JavApi.build/Objects-normal/arm64/Double+Swiftify.o -index-unit-output-path /JavApi⁴Swift.build/Debug-appletvos/JavApi.build/Objects-normal/arm64/FileHandle+TextOutputStream.o -index-unit-output-path /JavApi⁴Swift.build/Debug-appletvos/JavApi.build/Objects-normal/arm64/Int+Java.o -index-unit-output-path /JavApi⁴Swift.build/Debug-appletvos/JavApi.build/Objects-normal/arm64/Int32+Java.o -index-unit-output-path /JavApi⁴Swift.build/Debug-appletvos/JavApi.build/Objects-normal/arm64/Int64+Java.o -index-unit-output-path /JavApi⁴Swift.build/Debug-appletvos/JavApi.build/Objects-normal/arm64/Integer.o -index-unit-output-path /JavApi⁴Swift.build/Debug-appletvos/JavApi.build/Objects-normal/arm64/Long.o -index-unit-output-path /JavApi⁴Swift.build/Debug-appletvos/JavApi.build/Objects-normal/arm64/Math.o -index-unit-output-path /JavApi⁴Swift.build/Debug-appletvos/JavApi.build/Objects-normal/arm64/Operator+Java.o -index-store-path /Users/admin/builder/spi-builder-workspace/.derivedData/Index.noindex/DataStore -index-system-modules
SwiftCompile normal arm64 /Users/admin/builder/spi-builder-workspace/.dependencies/checkouts/JavApi4Swift/Sources/JavApi/lang/Operator+Java.swift (in target 'JavApi' from project 'JavApi⁴Swift')
cd /Users/admin/builder/spi-builder-workspace/.swiftpm/xcode
/Applications/Xcode-16.1.0.app/Contents/Developer/Toolchains/XcodeDefault.xctoolchain/usr/bin/swift-frontend -c -filelist /Users/admin/builder/spi-builder-workspace/.derivedData/Build/Intermediates.noindex/JavApi⁴Swift.build/Debug-appletvos/JavApi.build/Objects-normal/arm64/sources-1 -primary-file /Users/admin/builder/spi-builder-workspace/.dependencies/checkouts/JavApi4Swift/Sources/JavApi/lang/Class.swift -primary-file /Users/admin/builder/spi-builder-workspace/.dependencies/checkouts/JavApi4Swift/Sources/JavApi/lang/Cloneable+Swiftify.swift -primary-file /Users/admin/builder/spi-builder-workspace/.dependencies/checkouts/JavApi4Swift/Sources/JavApi/lang/Cloneable.swift -primary-file /Users/admin/builder/spi-builder-workspace/.dependencies/checkouts/JavApi4Swift/Sources/JavApi/lang/Comparable+Swiftify.swift -primary-file /Users/admin/builder/spi-builder-workspace/.dependencies/checkouts/JavApi4Swift/Sources/JavApi/lang/Comparable.swift -primary-file /Users/admin/builder/spi-builder-workspace/.dependencies/checkouts/JavApi4Swift/Sources/JavApi/lang/Double+Java.swift -primary-file /Users/admin/builder/spi-builder-workspace/.dependencies/checkouts/JavApi4Swift/Sources/JavApi/lang/Double+Swiftify.swift -primary-file /Users/admin/builder/spi-builder-workspace/.dependencies/checkouts/JavApi4Swift/Sources/JavApi/lang/FileHandle+TextOutputStream.swift -primary-file /Users/admin/builder/spi-builder-workspace/.dependencies/checkouts/JavApi4Swift/Sources/JavApi/lang/Int+Java.swift -primary-file /Users/admin/builder/spi-builder-workspace/.dependencies/checkouts/JavApi4Swift/Sources/JavApi/lang/Int32+Java.swift -primary-file /Users/admin/builder/spi-builder-workspace/.dependencies/checkouts/JavApi4Swift/Sources/JavApi/lang/Int64+Java.swift -primary-file /Users/admin/builder/spi-builder-workspace/.dependencies/checkouts/JavApi4Swift/Sources/JavApi/lang/Integer.swift -primary-file /Users/admin/builder/spi-builder-workspace/.dependencies/checkouts/JavApi4Swift/Sources/JavApi/lang/Long.swift -primary-file /Users/admin/builder/spi-builder-workspace/.dependencies/checkouts/JavApi4Swift/Sources/JavApi/lang/Math.swift -primary-file /Users/admin/builder/spi-builder-workspace/.dependencies/checkouts/JavApi4Swift/Sources/JavApi/lang/Operator+Java.swift -supplementary-output-file-map /Users/admin/builder/spi-builder-workspace/.derivedData/Build/Intermediates.noindex/JavApi⁴Swift.build/Debug-appletvos/JavApi.build/Objects-normal/arm64/supplementaryOutputs-3 -target arm64-apple-tvos16.0 -Xllvm -aarch64-use-tbi -enable-objc-interop -stack-check -sdk /Applications/Xcode-16.1.0.app/Contents/Developer/Platforms/AppleTVOS.platform/Developer/SDKs/AppleTVOS18.1.sdk -I /Users/admin/builder/spi-builder-workspace/.derivedData/Build/Products/Debug-appletvos -I /Applications/Xcode-16.1.0.app/Contents/Developer/Platforms/AppleTVOS.platform/Developer/usr/lib -F /Users/admin/builder/spi-builder-workspace/.derivedData/Build/Products/Debug-appletvos -F /Applications/Xcode-16.1.0.app/Contents/Developer/Platforms/AppleTVOS.platform/Developer/Library/Frameworks -F /Applications/Xcode-16.1.0.app/Contents/Developer/Platforms/AppleTVOS.platform/Developer/SDKs/AppleTVOS18.1.sdk/Developer/Library/Frameworks -no-color-diagnostics -enable-testing -g -debug-info-format\=dwarf -dwarf-version\=4 -module-cache-path /Users/admin/builder/spi-builder-workspace/.derivedData/ModuleCache.noindex -suppress-warnings -profile-generate -profile-coverage-mapping -swift-version 6 -enforce-exclusivity\=checked -stats-output-dir /Users/admin/builder/spi-builder-workspace/.swiftpm/xcode/.stats -Onone -D SWIFT_PACKAGE -D DEBUG -serialize-debugging-options -const-gather-protocols-file /Users/admin/builder/spi-builder-workspace/.derivedData/Build/Intermediates.noindex/JavApi⁴Swift.build/Debug-appletvos/JavApi.build/Objects-normal/arm64/JavApi_const_extract_protocols.json -enable-experimental-feature DebugDescriptionMacro -enable-experimental-feature OpaqueTypeErasure -enable-upcoming-feature StrictConcurrency -enable-upcoming-feature DisableOutwardActorInference -enable-upcoming-feature GlobalActorIsolatedTypesUsability -enable-upcoming-feature InferSendableFromCaptures -strict-concurrency\=complete -empty-abi-descriptor -plugin-path /Applications/Xcode-16.1.0.app/Contents/Developer/Toolchains/XcodeDefault.xctoolchain/usr/lib/swift/host/plugins/testing -user-module-version 0.19.1 -validate-clang-modules-once -clang-build-session-file /Users/admin/builder/spi-builder-workspace/.derivedData/ModuleCache.noindex/Session.modulevalidation -Xcc -working-directory -Xcc /Users/admin/builder/spi-builder-workspace/.swiftpm/xcode -resource-dir /Applications/Xcode-16.1.0.app/Contents/Developer/Toolchains/XcodeDefault.xctoolchain/usr/lib/swift -enable-anonymous-context-mangled-names -file-compilation-dir /Users/admin/builder/spi-builder-workspace/.swiftpm/xcode -Xcc -D_LIBCPP_HARDENING_MODE\=_LIBCPP_HARDENING_MODE_DEBUG -Xcc -ivfsstatcache -Xcc /Users/admin/builder/spi-builder-workspace/.derivedData/SDKStatCaches.noindex/appletvos18.1-22J572-e7fdd8cf9ffd4d4af20823079b51a726.sdkstatcache -Xcc -I/Users/admin/builder/spi-builder-workspace/.derivedData/Build/Intermediates.noindex/JavApi⁴Swift.build/Debug-appletvos/JavApi.build/swift-overrides.hmap -Xcc -I/Users/admin/builder/spi-builder-workspace/.derivedData/Build/Products/Debug-appletvos/include -Xcc -I/Users/admin/builder/spi-builder-workspace/.derivedData/Build/Intermediates.noindex/JavApi⁴Swift.build/Debug-appletvos/JavApi.build/DerivedSources-normal/arm64 -Xcc -I/Users/admin/builder/spi-builder-workspace/.derivedData/Build/Intermediates.noindex/JavApi⁴Swift.build/Debug-appletvos/JavApi.build/DerivedSources/arm64 -Xcc -I/Users/admin/builder/spi-builder-workspace/.derivedData/Build/Intermediates.noindex/JavApi⁴Swift.build/Debug-appletvos/JavApi.build/DerivedSources -Xcc -DSWIFT_PACKAGE -Xcc -DDEBUG\=1 -module-name JavApi -package-name javapi4swift -frontend-parseable-output -disable-clang-spi -target-sdk-version 18.1 -target-sdk-name appletvos18.1 -external-plugin-path /Applications/Xcode-16.1.0.app/Contents/Developer/Platforms/AppleTVOS.platform/Developer/usr/lib/swift/host/plugins\#/Applications/Xcode-16.1.0.app/Contents/Developer/Platforms/AppleTVOS.platform/Developer/usr/bin/swift-plugin-server -external-plugin-path /Applications/Xcode-16.1.0.app/Contents/Developer/Platforms/AppleTVOS.platform/Developer/usr/local/lib/swift/host/plugins\#/Applications/Xcode-16.1.0.app/Contents/Developer/Platforms/AppleTVOS.platform/Developer/usr/bin/swift-plugin-server -plugin-path /Applications/Xcode-16.1.0.app/Contents/Developer/Toolchains/XcodeDefault.xctoolchain/usr/lib/swift/host/plugins -plugin-path /Applications/Xcode-16.1.0.app/Contents/Developer/Toolchains/XcodeDefault.xctoolchain/usr/local/lib/swift/host/plugins -o /Users/admin/builder/spi-builder-workspace/.derivedData/Build/Intermediates.noindex/JavApi⁴Swift.build/Debug-appletvos/JavApi.build/Objects-normal/arm64/Class.o -o /Users/admin/builder/spi-builder-workspace/.derivedData/Build/Intermediates.noindex/JavApi⁴Swift.build/Debug-appletvos/JavApi.build/Objects-normal/arm64/Cloneable+Swiftify.o -o /Users/admin/builder/spi-builder-workspace/.derivedData/Build/Intermediates.noindex/JavApi⁴Swift.build/Debug-appletvos/JavApi.build/Objects-normal/arm64/Cloneable.o -o /Users/admin/builder/spi-builder-workspace/.derivedData/Build/Intermediates.noindex/JavApi⁴Swift.build/Debug-appletvos/JavApi.build/Objects-normal/arm64/Comparable+Swiftify.o -o /Users/admin/builder/spi-builder-workspace/.derivedData/Build/Intermediates.noindex/JavApi⁴Swift.build/Debug-appletvos/JavApi.build/Objects-normal/arm64/Comparable.o -o /Users/admin/builder/spi-builder-workspace/.derivedData/Build/Intermediates.noindex/JavApi⁴Swift.build/Debug-appletvos/JavApi.build/Objects-normal/arm64/Double+Java.o -o /Users/admin/builder/spi-builder-workspace/.derivedData/Build/Intermediates.noindex/JavApi⁴Swift.build/Debug-appletvos/JavApi.build/Objects-normal/arm64/Double+Swiftify.o -o /Users/admin/builder/spi-builder-workspace/.derivedData/Build/Intermediates.noindex/JavApi⁴Swift.build/Debug-appletvos/JavApi.build/Objects-normal/arm64/FileHandle+TextOutputStream.o -o /Users/admin/builder/spi-builder-workspace/.derivedData/Build/Intermediates.noindex/JavApi⁴Swift.build/Debug-appletvos/JavApi.build/Objects-normal/arm64/Int+Java.o -o /Users/admin/builder/spi-builder-workspace/.derivedData/Build/Intermediates.noindex/JavApi⁴Swift.build/Debug-appletvos/JavApi.build/Objects-normal/arm64/Int32+Java.o -o /Users/admin/builder/spi-builder-workspace/.derivedData/Build/Intermediates.noindex/JavApi⁴Swift.build/Debug-appletvos/JavApi.build/Objects-normal/arm64/Int64+Java.o -o /Users/admin/builder/spi-builder-workspace/.derivedData/Build/Intermediates.noindex/JavApi⁴Swift.build/Debug-appletvos/JavApi.build/Objects-normal/arm64/Integer.o -o /Users/admin/builder/spi-builder-workspace/.derivedData/Build/Intermediates.noindex/JavApi⁴Swift.build/Debug-appletvos/JavApi.build/Objects-normal/arm64/Long.o -o /Users/admin/builder/spi-builder-workspace/.derivedData/Build/Intermediates.noindex/JavApi⁴Swift.build/Debug-appletvos/JavApi.build/Objects-normal/arm64/Math.o -o /Users/admin/builder/spi-builder-workspace/.derivedData/Build/Intermediates.noindex/JavApi⁴Swift.build/Debug-appletvos/JavApi.build/Objects-normal/arm64/Operator+Java.o -index-unit-output-path /JavApi⁴Swift.build/Debug-appletvos/JavApi.build/Objects-normal/arm64/Class.o -index-unit-output-path /JavApi⁴Swift.build/Debug-appletvos/JavApi.build/Objects-normal/arm64/Cloneable+Swiftify.o -index-unit-output-path /JavApi⁴Swift.build/Debug-appletvos/JavApi.build/Objects-normal/arm64/Cloneable.o -index-unit-output-path /JavApi⁴Swift.build/Debug-appletvos/JavApi.build/Objects-normal/arm64/Comparable+Swiftify.o -index-unit-output-path /JavApi⁴Swift.build/Debug-appletvos/JavApi.build/Objects-normal/arm64/Comparable.o -index-unit-output-path /JavApi⁴Swift.build/Debug-appletvos/JavApi.build/Objects-normal/arm64/Double+Java.o -index-unit-output-path /JavApi⁴Swift.build/Debug-appletvos/JavApi.build/Objects-normal/arm64/Double+Swiftify.o -index-unit-output-path /JavApi⁴Swift.build/Debug-appletvos/JavApi.build/Objects-normal/arm64/FileHandle+TextOutputStream.o -index-unit-output-path /JavApi⁴Swift.build/Debug-appletvos/JavApi.build/Objects-normal/arm64/Int+Java.o -index-unit-output-path /JavApi⁴Swift.build/Debug-appletvos/JavApi.build/Objects-normal/arm64/Int32+Java.o -index-unit-output-path /JavApi⁴Swift.build/Debug-appletvos/JavApi.build/Objects-normal/arm64/Int64+Java.o -index-unit-output-path /JavApi⁴Swift.build/Debug-appletvos/JavApi.build/Objects-normal/arm64/Integer.o -index-unit-output-path /JavApi⁴Swift.build/Debug-appletvos/JavApi.build/Objects-normal/arm64/Long.o -index-unit-output-path /JavApi⁴Swift.build/Debug-appletvos/JavApi.build/Objects-normal/arm64/Math.o -index-unit-output-path /JavApi⁴Swift.build/Debug-appletvos/JavApi.build/Objects-normal/arm64/Operator+Java.o -index-store-path /Users/admin/builder/spi-builder-workspace/.derivedData/Index.noindex/DataStore -index-system-modules
SwiftCompile normal arm64 Compiling\ Thread+Swiftify.swift,\ Thread.swift,\ Throwable.swift,\ java.lang.swift,\ BigDecimal+Java.swift,\ BigDecimal+Swiftify.swift,\ BigDecimal.swift,\ Decimal+Java.swift,\ java.math.swift,\ java.net.swift,\ ByteBuffer+Swiftify.swift,\ ByteBuffer.swift,\ ByteOrder.swift,\ Charset.swift,\ StandardCharsets.swift /Users/admin/builder/spi-builder-workspace/.dependencies/checkouts/JavApi4Swift/Sources/JavApi/lang/Thread+Swiftify.swift /Users/admin/builder/spi-builder-workspace/.dependencies/checkouts/JavApi4Swift/Sources/JavApi/lang/Thread.swift /Users/admin/builder/spi-builder-workspace/.dependencies/checkouts/JavApi4Swift/Sources/JavApi/lang/Throwable.swift /Users/admin/builder/spi-builder-workspace/.dependencies/checkouts/JavApi4Swift/Sources/JavApi/lang/java.lang.swift /Users/admin/builder/spi-builder-workspace/.dependencies/checkouts/JavApi4Swift/Sources/JavApi/math/BigDecimal+Java.swift /Users/admin/builder/spi-builder-workspace/.dependencies/checkouts/JavApi4Swift/Sources/JavApi/math/BigDecimal+Swiftify.swift /Users/admin/builder/spi-builder-workspace/.dependencies/checkouts/JavApi4Swift/Sources/JavApi/math/BigDecimal.swift /Users/admin/builder/spi-builder-workspace/.dependencies/checkouts/JavApi4Swift/Sources/JavApi/math/Decimal+Java.swift /Users/admin/builder/spi-builder-workspace/.dependencies/checkouts/JavApi4Swift/Sources/JavApi/math/java.math.swift /Users/admin/builder/spi-builder-workspace/.dependencies/checkouts/JavApi4Swift/Sources/JavApi/net/java.net.swift /Users/admin/builder/spi-builder-workspace/.dependencies/checkouts/JavApi4Swift/Sources/JavApi/nio/ByteBuffer+Swiftify.swift /Users/admin/builder/spi-builder-workspace/.dependencies/checkouts/JavApi4Swift/Sources/JavApi/nio/ByteBuffer.swift /Users/admin/builder/spi-builder-workspace/.dependencies/checkouts/JavApi4Swift/Sources/JavApi/nio/ByteOrder.swift /Users/admin/builder/spi-builder-workspace/.dependencies/checkouts/JavApi4Swift/Sources/JavApi/nio/charset/Charset.swift /Users/admin/builder/spi-builder-workspace/.dependencies/checkouts/JavApi4Swift/Sources/JavApi/nio/charset/StandardCharsets.swift (in target 'JavApi' from project 'JavApi⁴Swift')
cd /Users/admin/builder/spi-builder-workspace/.swiftpm/xcode
builtin-swiftTaskExecution -- /Applications/Xcode-16.1.0.app/Contents/Developer/Toolchains/XcodeDefault.xctoolchain/usr/bin/swift-frontend -frontend -c -filelist /Users/admin/builder/spi-builder-workspace/.derivedData/Build/Intermediates.noindex/JavApi⁴Swift.build/Debug-appletvos/JavApi.build/Objects-normal/arm64/sources-1 -primary-file /Users/admin/builder/spi-builder-workspace/.dependencies/checkouts/JavApi4Swift/Sources/JavApi/lang/Thread+Swiftify.swift -primary-file /Users/admin/builder/spi-builder-workspace/.dependencies/checkouts/JavApi4Swift/Sources/JavApi/lang/Thread.swift -primary-file /Users/admin/builder/spi-builder-workspace/.dependencies/checkouts/JavApi4Swift/Sources/JavApi/lang/Throwable.swift -primary-file /Users/admin/builder/spi-builder-workspace/.dependencies/checkouts/JavApi4Swift/Sources/JavApi/lang/java.lang.swift -primary-file /Users/admin/builder/spi-builder-workspace/.dependencies/checkouts/JavApi4Swift/Sources/JavApi/math/BigDecimal+Java.swift -primary-file /Users/admin/builder/spi-builder-workspace/.dependencies/checkouts/JavApi4Swift/Sources/JavApi/math/BigDecimal+Swiftify.swift -primary-file /Users/admin/builder/spi-builder-workspace/.dependencies/checkouts/JavApi4Swift/Sources/JavApi/math/BigDecimal.swift -primary-file /Users/admin/builder/spi-builder-workspace/.dependencies/checkouts/JavApi4Swift/Sources/JavApi/math/Decimal+Java.swift -primary-file /Users/admin/builder/spi-builder-workspace/.dependencies/checkouts/JavApi4Swift/Sources/JavApi/math/java.math.swift -primary-file /Users/admin/builder/spi-builder-workspace/.dependencies/checkouts/JavApi4Swift/Sources/JavApi/net/java.net.swift -primary-file /Users/admin/builder/spi-builder-workspace/.dependencies/checkouts/JavApi4Swift/Sources/JavApi/nio/ByteBuffer+Swiftify.swift -primary-file /Users/admin/builder/spi-builder-workspace/.dependencies/checkouts/JavApi4Swift/Sources/JavApi/nio/ByteBuffer.swift -primary-file /Users/admin/builder/spi-builder-workspace/.dependencies/checkouts/JavApi4Swift/Sources/JavApi/nio/ByteOrder.swift -primary-file /Users/admin/builder/spi-builder-workspace/.dependencies/checkouts/JavApi4Swift/Sources/JavApi/nio/charset/Charset.swift -primary-file /Users/admin/builder/spi-builder-workspace/.dependencies/checkouts/JavApi4Swift/Sources/JavApi/nio/charset/StandardCharsets.swift -supplementary-output-file-map /Users/admin/builder/spi-builder-workspace/.derivedData/Build/Intermediates.noindex/JavApi⁴Swift.build/Debug-appletvos/JavApi.build/Objects-normal/arm64/supplementaryOutputs-5 -target arm64-apple-tvos16.0 -Xllvm -aarch64-use-tbi -enable-objc-interop -stack-check -sdk /Applications/Xcode-16.1.0.app/Contents/Developer/Platforms/AppleTVOS.platform/Developer/SDKs/AppleTVOS18.1.sdk -I /Users/admin/builder/spi-builder-workspace/.derivedData/Build/Products/Debug-appletvos -I /Applications/Xcode-16.1.0.app/Contents/Developer/Platforms/AppleTVOS.platform/Developer/usr/lib -F /Users/admin/builder/spi-builder-workspace/.derivedData/Build/Products/Debug-appletvos -F /Applications/Xcode-16.1.0.app/Contents/Developer/Platforms/AppleTVOS.platform/Developer/Library/Frameworks -F /Applications/Xcode-16.1.0.app/Contents/Developer/Platforms/AppleTVOS.platform/Developer/SDKs/AppleTVOS18.1.sdk/Developer/Library/Frameworks -no-color-diagnostics -enable-testing -g -debug-info-format\=dwarf -dwarf-version\=4 -module-cache-path /Users/admin/builder/spi-builder-workspace/.derivedData/ModuleCache.noindex -suppress-warnings -profile-generate -profile-coverage-mapping -swift-version 6 -enforce-exclusivity\=checked -stats-output-dir /Users/admin/builder/spi-builder-workspace/.swiftpm/xcode/.stats -Onone -D SWIFT_PACKAGE -D DEBUG -serialize-debugging-options -const-gather-protocols-file /Users/admin/builder/spi-builder-workspace/.derivedData/Build/Intermediates.noindex/JavApi⁴Swift.build/Debug-appletvos/JavApi.build/Objects-normal/arm64/JavApi_const_extract_protocols.json -enable-experimental-feature DebugDescriptionMacro -enable-experimental-feature OpaqueTypeErasure -enable-upcoming-feature StrictConcurrency -enable-upcoming-feature DisableOutwardActorInference -enable-upcoming-feature GlobalActorIsolatedTypesUsability -enable-upcoming-feature InferSendableFromCaptures -strict-concurrency\=complete -empty-abi-descriptor -plugin-path /Applications/Xcode-16.1.0.app/Contents/Developer/Toolchains/XcodeDefault.xctoolchain/usr/lib/swift/host/plugins/testing -user-module-version 0.19.1 -validate-clang-modules-once -clang-build-session-file /Users/admin/builder/spi-builder-workspace/.derivedData/ModuleCache.noindex/Session.modulevalidation -Xcc -working-directory -Xcc /Users/admin/builder/spi-builder-workspace/.swiftpm/xcode -resource-dir /Applications/Xcode-16.1.0.app/Contents/Developer/Toolchains/XcodeDefault.xctoolchain/usr/lib/swift -enable-anonymous-context-mangled-names -file-compilation-dir /Users/admin/builder/spi-builder-workspace/.swiftpm/xcode -Xcc -D_LIBCPP_HARDENING_MODE\=_LIBCPP_HARDENING_MODE_DEBUG -Xcc -ivfsstatcache -Xcc /Users/admin/builder/spi-builder-workspace/.derivedData/SDKStatCaches.noindex/appletvos18.1-22J572-e7fdd8cf9ffd4d4af20823079b51a726.sdkstatcache -Xcc -I/Users/admin/builder/spi-builder-workspace/.derivedData/Build/Intermediates.noindex/JavApi⁴Swift.build/Debug-appletvos/JavApi.build/swift-overrides.hmap -Xcc -I/Users/admin/builder/spi-builder-workspace/.derivedData/Build/Products/Debug-appletvos/include -Xcc -I/Users/admin/builder/spi-builder-workspace/.derivedData/Build/Intermediates.noindex/JavApi⁴Swift.build/Debug-appletvos/JavApi.build/DerivedSources-normal/arm64 -Xcc -I/Users/admin/builder/spi-builder-workspace/.derivedData/Build/Intermediates.noindex/JavApi⁴Swift.build/Debug-appletvos/JavApi.build/DerivedSources/arm64 -Xcc -I/Users/admin/builder/spi-builder-workspace/.derivedData/Build/Intermediates.noindex/JavApi⁴Swift.build/Debug-appletvos/JavApi.build/DerivedSources -Xcc -DSWIFT_PACKAGE -Xcc -DDEBUG\=1 -module-name JavApi -package-name javapi4swift -frontend-parseable-output -disable-clang-spi -target-sdk-version 18.1 -target-sdk-name appletvos18.1 -external-plugin-path /Applications/Xcode-16.1.0.app/Contents/Developer/Platforms/AppleTVOS.platform/Developer/usr/lib/swift/host/plugins\#/Applications/Xcode-16.1.0.app/Contents/Developer/Platforms/AppleTVOS.platform/Developer/usr/bin/swift-plugin-server -external-plugin-path /Applications/Xcode-16.1.0.app/Contents/Developer/Platforms/AppleTVOS.platform/Developer/usr/local/lib/swift/host/plugins\#/Applications/Xcode-16.1.0.app/Contents/Developer/Platforms/AppleTVOS.platform/Developer/usr/bin/swift-plugin-server -plugin-path /Applications/Xcode-16.1.0.app/Contents/Developer/Toolchains/XcodeDefault.xctoolchain/usr/lib/swift/host/plugins -plugin-path /Applications/Xcode-16.1.0.app/Contents/Developer/Toolchains/XcodeDefault.xctoolchain/usr/local/lib/swift/host/plugins -o /Users/admin/builder/spi-builder-workspace/.derivedData/Build/Intermediates.noindex/JavApi⁴Swift.build/Debug-appletvos/JavApi.build/Objects-normal/arm64/Thread+Swiftify.o -o /Users/admin/builder/spi-builder-workspace/.derivedData/Build/Intermediates.noindex/JavApi⁴Swift.build/Debug-appletvos/JavApi.build/Objects-normal/arm64/Thread.o -o /Users/admin/builder/spi-builder-workspace/.derivedData/Build/Intermediates.noindex/JavApi⁴Swift.build/Debug-appletvos/JavApi.build/Objects-normal/arm64/Throwable.o -o /Users/admin/builder/spi-builder-workspace/.derivedData/Build/Intermediates.noindex/JavApi⁴Swift.build/Debug-appletvos/JavApi.build/Objects-normal/arm64/java.lang.o -o /Users/admin/builder/spi-builder-workspace/.derivedData/Build/Intermediates.noindex/JavApi⁴Swift.build/Debug-appletvos/JavApi.build/Objects-normal/arm64/BigDecimal+Java.o -o /Users/admin/builder/spi-builder-workspace/.derivedData/Build/Intermediates.noindex/JavApi⁴Swift.build/Debug-appletvos/JavApi.build/Objects-normal/arm64/BigDecimal+Swiftify.o -o /Users/admin/builder/spi-builder-workspace/.derivedData/Build/Intermediates.noindex/JavApi⁴Swift.build/Debug-appletvos/JavApi.build/Objects-normal/arm64/BigDecimal.o -o /Users/admin/builder/spi-builder-workspace/.derivedData/Build/Intermediates.noindex/JavApi⁴Swift.build/Debug-appletvos/JavApi.build/Objects-normal/arm64/Decimal+Java.o -o /Users/admin/builder/spi-builder-workspace/.derivedData/Build/Intermediates.noindex/JavApi⁴Swift.build/Debug-appletvos/JavApi.build/Objects-normal/arm64/java.math.o -o /Users/admin/builder/spi-builder-workspace/.derivedData/Build/Intermediates.noindex/JavApi⁴Swift.build/Debug-appletvos/JavApi.build/Objects-normal/arm64/java.net.o -o /Users/admin/builder/spi-builder-workspace/.derivedData/Build/Intermediates.noindex/JavApi⁴Swift.build/Debug-appletvos/JavApi.build/Objects-normal/arm64/ByteBuffer+Swiftify.o -o /Users/admin/builder/spi-builder-workspace/.derivedData/Build/Intermediates.noindex/JavApi⁴Swift.build/Debug-appletvos/JavApi.build/Objects-normal/arm64/ByteBuffer.o -o /Users/admin/builder/spi-builder-workspace/.derivedData/Build/Intermediates.noindex/JavApi⁴Swift.build/Debug-appletvos/JavApi.build/Objects-normal/arm64/ByteOrder.o -o /Users/admin/builder/spi-builder-workspace/.derivedData/Build/Intermediates.noindex/JavApi⁴Swift.build/Debug-appletvos/JavApi.build/Objects-normal/arm64/Charset.o -o /Users/admin/builder/spi-builder-workspace/.derivedData/Build/Intermediates.noindex/JavApi⁴Swift.build/Debug-appletvos/JavApi.build/Objects-normal/arm64/StandardCharsets.o -index-unit-output-path /JavApi⁴Swift.build/Debug-appletvos/JavApi.build/Objects-normal/arm64/Thread+Swiftify.o -index-unit-output-path /JavApi⁴Swift.build/Debug-appletvos/JavApi.build/Objects-normal/arm64/Thread.o -index-unit-output-path /JavApi⁴Swift.build/Debug-appletvos/JavApi.build/Objects-normal/arm64/Throwable.o -index-unit-output-path /JavApi⁴Swift.build/Debug-appletvos/JavApi.build/Objects-normal/arm64/java.lang.o -index-unit-output-path /JavApi⁴Swift.build/Debug-appletvos/JavApi.build/Objects-normal/arm64/BigDecimal+Java.o -index-unit-output-path /JavApi⁴Swift.build/Debug-appletvos/JavApi.build/Objects-normal/arm64/BigDecimal+Swiftify.o -index-unit-output-path /JavApi⁴Swift.build/Debug-appletvos/JavApi.build/Objects-normal/arm64/BigDecimal.o -index-unit-output-path /JavApi⁴Swift.build/Debug-appletvos/JavApi.build/Objects-normal/arm64/Decimal+Java.o -index-unit-output-path /JavApi⁴Swift.build/Debug-appletvos/JavApi.build/Objects-normal/arm64/java.math.o -index-unit-output-path /JavApi⁴Swift.build/Debug-appletvos/JavApi.build/Objects-normal/arm64/java.net.o -index-unit-output-path /JavApi⁴Swift.build/Debug-appletvos/JavApi.build/Objects-normal/arm64/ByteBuffer+Swiftify.o -index-unit-output-path /JavApi⁴Swift.build/Debug-appletvos/JavApi.build/Objects-normal/arm64/ByteBuffer.o -index-unit-output-path /JavApi⁴Swift.build/Debug-appletvos/JavApi.build/Objects-normal/arm64/ByteOrder.o -index-unit-output-path /JavApi⁴Swift.build/Debug-appletvos/JavApi.build/Objects-normal/arm64/Charset.o -index-unit-output-path /JavApi⁴Swift.build/Debug-appletvos/JavApi.build/Objects-normal/arm64/StandardCharsets.o -index-store-path /Users/admin/builder/spi-builder-workspace/.derivedData/Index.noindex/DataStore -index-system-modules
Command SwiftCompile failed with a nonzero exit code
** BUILD FAILED **
The following build commands failed:
SwiftEmitModule normal arm64 Emitting\ module\ for\ JavApi (in target 'JavApi' from project 'JavApi⁴Swift')
EmitSwiftModule normal arm64 (in target 'JavApi' from project 'JavApi⁴Swift')
SwiftCompile normal arm64 Compiling\ Thread+Swiftify.swift,\ Thread.swift,\ Throwable.swift,\ java.lang.swift,\ BigDecimal+Java.swift,\ BigDecimal+Swiftify.swift,\ BigDecimal.swift,\ Decimal+Java.swift,\ java.math.swift,\ java.net.swift,\ ByteBuffer+Swiftify.swift,\ ByteBuffer.swift,\ ByteOrder.swift,\ Charset.swift,\ StandardCharsets.swift /Users/admin/builder/spi-builder-workspace/.dependencies/checkouts/JavApi4Swift/Sources/JavApi/lang/Thread+Swiftify.swift /Users/admin/builder/spi-builder-workspace/.dependencies/checkouts/JavApi4Swift/Sources/JavApi/lang/Thread.swift /Users/admin/builder/spi-builder-workspace/.dependencies/checkouts/JavApi4Swift/Sources/JavApi/lang/Throwable.swift /Users/admin/builder/spi-builder-workspace/.dependencies/checkouts/JavApi4Swift/Sources/JavApi/lang/java.lang.swift /Users/admin/builder/spi-builder-workspace/.dependencies/checkouts/JavApi4Swift/Sources/JavApi/math/BigDecimal+Java.swift /Users/admin/builder/spi-builder-workspace/.dependencies/checkouts/JavApi4Swift/Sources/JavApi/math/BigDecimal+Swiftify.swift /Users/admin/builder/spi-builder-workspace/.dependencies/checkouts/JavApi4Swift/Sources/JavApi/math/BigDecimal.swift /Users/admin/builder/spi-builder-workspace/.dependencies/checkouts/JavApi4Swift/Sources/JavApi/math/Decimal+Java.swift /Users/admin/builder/spi-builder-workspace/.dependencies/checkouts/JavApi4Swift/Sources/JavApi/math/java.math.swift /Users/admin/builder/spi-builder-workspace/.dependencies/checkouts/JavApi4Swift/Sources/JavApi/net/java.net.swift /Users/admin/builder/spi-builder-workspace/.dependencies/checkouts/JavApi4Swift/Sources/JavApi/nio/ByteBuffer+Swiftify.swift /Users/admin/builder/spi-builder-workspace/.dependencies/checkouts/JavApi4Swift/Sources/JavApi/nio/ByteBuffer.swift /Users/admin/builder/spi-builder-workspace/.dependencies/checkouts/JavApi4Swift/Sources/JavApi/nio/ByteOrder.swift /Users/admin/builder/spi-builder-workspace/.dependencies/checkouts/JavApi4Swift/Sources/JavApi/nio/charset/Charset.swift /Users/admin/builder/spi-builder-workspace/.dependencies/checkouts/JavApi4Swift/Sources/JavApi/nio/charset/StandardCharsets.swift (in target 'JavApi' from project 'JavApi⁴Swift')
Building workspace spi-builder-workspace with scheme ShrinkItArchive-Package
(4 failures)
BUILD FAILURE 6.0 tvOS