The Swift Package Index logo.Swift Package Index

Track the adoption of Swift 6 strict concurrency checks for data race safety. How many packages are Ready for Swift 6?

Build Information

Failed to build CameraView, reference 0.0.1 (bb528e), with Swift 6.0 for tvOS using Xcode 16.2 on 26 Nov 2024 08:40:03 UTC.

Build Command

env DEVELOPER_DIR=/Applications/Xcode-16.1.0.app xcrun xcodebuild -IDEClonedSourcePackagesDirPathOverride=$PWD/.dependencies -skipMacroValidation -skipPackagePluginValidation -derivedDataPath $PWD/.derivedData build -scheme CameraView -destination generic/platform=tvOS OTHER_SWIFT_FLAGS=-stats-output-dir .stats -strict-concurrency=complete -enable-upcoming-feature StrictConcurrency -enable-upcoming-feature DisableOutwardActorInference -enable-upcoming-feature GlobalActorIsolatedTypesUsability -enable-upcoming-feature InferSendableFromCaptures

Build Log

========================================
RunAll
========================================
Builder version: 4.58.0
Interrupt handler set up.
========================================
Checkout
========================================
Clone URL: https://github.com/brettfazio/CameraView.git
Reference: 0.0.1
Initialized empty Git repository in /Users/admin/builder/spi-builder-workspace/.git/
From https://github.com/brettfazio/CameraView
 * tag               0.0.1      -> FETCH_HEAD
HEAD is now at bb528e1 Delete swift.yml
Cloned https://github.com/brettfazio/CameraView.git
Revision (git rev-parse @):
bb528e129ac23f2888dee51a309bbd4b10374673
SUCCESS checkout https://github.com/brettfazio/CameraView.git at 0.0.1
========================================
Build
========================================
Selected platform:         tvOS
Swift version:             6.0
Building package at path:  $PWD
https://github.com/brettfazio/CameraView.git
Command line invocation:
    /Applications/Xcode-16.1.0.app/Contents/Developer/usr/bin/xcodebuild -IDEClonedSourcePackagesDirPathOverride=/Users/admin/builder/spi-builder-workspace/.dependencies -resolvePackageDependencies
User defaults from command line:
    IDEClonedSourcePackagesDirPathOverride = /Users/admin/builder/spi-builder-workspace/.dependencies
    IDEPackageSupportUseBuiltinSCM = YES
Resolve Package Graph
Resolve Package Graph
Resolved source packages:
  CameraView: /Users/admin/builder/spi-builder-workspace
resolved source packages: CameraView
{
  "dependencies" : [
  ],
  "manifest_display_name" : "CameraView",
  "name" : "CameraView",
  "path" : "/Users/admin/builder/spi-builder-workspace",
  "platforms" : [
    {
      "name" : "ios",
      "version" : "13.0"
    }
  ],
  "products" : [
    {
      "name" : "CameraView",
      "targets" : [
        "CameraView"
      ],
      "type" : {
        "library" : [
          "automatic"
        ]
      }
    }
  ],
  "targets" : [
    {
      "c99name" : "CameraViewTests",
      "module_type" : "SwiftTarget",
      "name" : "CameraViewTests",
      "path" : "Tests/CameraViewTests",
      "sources" : [
        "CameraViewTests.swift",
        "XCTestManifests.swift"
      ],
      "target_dependencies" : [
        "CameraView"
      ],
      "type" : "test"
    },
    {
      "c99name" : "CameraView",
      "module_type" : "SwiftTarget",
      "name" : "CameraView",
      "path" : "Sources/CameraView",
      "product_memberships" : [
        "CameraView"
      ],
      "sources" : [
        "CameraView.swift",
        "CameraViewDelegate.swift"
      ],
      "type" : "library"
    }
  ],
  "tools_version" : "5.1"
}
{
  "workspace" : {
    "name" : "spi-builder-workspace",
    "schemes" : [
      "CameraView"
    ]
  }
}
Running build ...
env DEVELOPER_DIR=/Applications/Xcode-16.1.0.app xcrun xcodebuild -IDEClonedSourcePackagesDirPathOverride=$PWD/.dependencies -skipMacroValidation -skipPackagePluginValidation -derivedDataPath $PWD/.derivedData build -scheme CameraView -destination generic/platform=tvOS OTHER_SWIFT_FLAGS=-stats-output-dir .stats -strict-concurrency=complete -enable-upcoming-feature StrictConcurrency -enable-upcoming-feature DisableOutwardActorInference -enable-upcoming-feature GlobalActorIsolatedTypesUsability -enable-upcoming-feature InferSendableFromCaptures
Command line invocation:
    /Applications/Xcode-16.1.0.app/Contents/Developer/usr/bin/xcodebuild -IDEClonedSourcePackagesDirPathOverride=/Users/admin/builder/spi-builder-workspace/.dependencies -skipMacroValidation -skipPackagePluginValidation -derivedDataPath /Users/admin/builder/spi-builder-workspace/.derivedData build -scheme CameraView -destination generic/platform=tvOS "OTHER_SWIFT_FLAGS=-stats-output-dir .stats -strict-concurrency=complete -enable-upcoming-feature StrictConcurrency -enable-upcoming-feature DisableOutwardActorInference -enable-upcoming-feature GlobalActorIsolatedTypesUsability -enable-upcoming-feature InferSendableFromCaptures"
User defaults from command line:
    IDEClonedSourcePackagesDirPathOverride = /Users/admin/builder/spi-builder-workspace/.dependencies
    IDEDerivedDataPathOverride = /Users/admin/builder/spi-builder-workspace/.derivedData
    IDEPackageSupportUseBuiltinSCM = YES
Build settings from command line:
    OTHER_SWIFT_FLAGS = -stats-output-dir .stats -strict-concurrency=complete -enable-upcoming-feature StrictConcurrency -enable-upcoming-feature DisableOutwardActorInference -enable-upcoming-feature GlobalActorIsolatedTypesUsability -enable-upcoming-feature InferSendableFromCaptures
Resolve Package Graph
Resolved source packages:
  CameraView: /Users/admin/builder/spi-builder-workspace
Prepare packages
ComputeTargetDependencyGraph
note: Building targets in dependency order
note: Target dependency graph (2 targets)
    Target 'CameraView' in project 'CameraView'
        ➜ Explicit dependency on target 'CameraView' in project 'CameraView'
    Target 'CameraView' in project 'CameraView' (no dependencies)
GatherProvisioningInputs
CreateBuildDescription
ExecuteExternalTool /Applications/Xcode-16.1.0.app/Contents/Developer/Toolchains/XcodeDefault.xctoolchain/usr/bin/clang -v -E -dM -isysroot /Applications/Xcode-16.1.0.app/Contents/Developer/Platforms/AppleTVOS.platform/Developer/SDKs/AppleTVOS18.1.sdk -x c -c /dev/null
ExecuteExternalTool /Applications/Xcode-16.1.0.app/Contents/Developer/Toolchains/XcodeDefault.xctoolchain/usr/bin/swiftc --version
ExecuteExternalTool /Applications/Xcode-16.1.0.app/Contents/Developer/Toolchains/XcodeDefault.xctoolchain/usr/bin/ld -version_details
Build description signature: 71e2131ae14cf6a5fe496b9be0424bd6
Build description path: /Users/admin/builder/spi-builder-workspace/.derivedData/Build/Intermediates.noindex/XCBuildData/71e2131ae14cf6a5fe496b9be0424bd6.xcbuilddata
CreateBuildDirectory /Users/admin/builder/spi-builder-workspace/.derivedData/Build/Products
    cd /Users/admin/builder/spi-builder-workspace/.swiftpm/xcode
    builtin-create-build-directory /Users/admin/builder/spi-builder-workspace/.derivedData/Build/Products
CreateBuildDirectory /Users/admin/builder/spi-builder-workspace/.derivedData/Build/Intermediates.noindex
    cd /Users/admin/builder/spi-builder-workspace/.swiftpm/xcode
    builtin-create-build-directory /Users/admin/builder/spi-builder-workspace/.derivedData/Build/Intermediates.noindex
ClangStatCache /Applications/Xcode-16.1.0.app/Contents/Developer/Toolchains/XcodeDefault.xctoolchain/usr/bin/clang-stat-cache /Applications/Xcode-16.1.0.app/Contents/Developer/Platforms/AppleTVOS.platform/Developer/SDKs/AppleTVOS18.1.sdk /Users/admin/builder/spi-builder-workspace/.derivedData/SDKStatCaches.noindex/appletvos18.1-22J572-e7fdd8cf9ffd4d4af20823079b51a726.sdkstatcache
    cd /Users/admin/builder/spi-builder-workspace/.swiftpm/xcode
    /Applications/Xcode-16.1.0.app/Contents/Developer/Toolchains/XcodeDefault.xctoolchain/usr/bin/clang-stat-cache /Applications/Xcode-16.1.0.app/Contents/Developer/Platforms/AppleTVOS.platform/Developer/SDKs/AppleTVOS18.1.sdk -o /Users/admin/builder/spi-builder-workspace/.derivedData/SDKStatCaches.noindex/appletvos18.1-22J572-e7fdd8cf9ffd4d4af20823079b51a726.sdkstatcache
CreateBuildDirectory /Users/admin/builder/spi-builder-workspace/.derivedData/Build/Products/Debug-appletvos
    cd /Users/admin/builder/spi-builder-workspace/.swiftpm/xcode
    builtin-create-build-directory /Users/admin/builder/spi-builder-workspace/.derivedData/Build/Products/Debug-appletvos
CreateBuildDirectory /Users/admin/builder/spi-builder-workspace/.derivedData/Build/Intermediates.noindex/EagerLinkingTBDs/Debug-appletvos
    cd /Users/admin/builder/spi-builder-workspace/.swiftpm/xcode
    builtin-create-build-directory /Users/admin/builder/spi-builder-workspace/.derivedData/Build/Intermediates.noindex/EagerLinkingTBDs/Debug-appletvos
CreateBuildDirectory /Users/admin/builder/spi-builder-workspace/.derivedData/Build/Products/Debug-appletvos/PackageFrameworks
    cd /Users/admin/builder/spi-builder-workspace/.swiftpm/xcode
    builtin-create-build-directory /Users/admin/builder/spi-builder-workspace/.derivedData/Build/Products/Debug-appletvos/PackageFrameworks
WriteAuxiliaryFile /Users/admin/builder/spi-builder-workspace/.derivedData/Build/Intermediates.noindex/CameraView.build/Debug-appletvos/CameraView.build/CameraView.DependencyMetadataFileList (in target 'CameraView' from project 'CameraView')
    cd /Users/admin/builder/spi-builder-workspace
    write-file /Users/admin/builder/spi-builder-workspace/.derivedData/Build/Intermediates.noindex/CameraView.build/Debug-appletvos/CameraView.build/CameraView.DependencyMetadataFileList
WriteAuxiliaryFile /Users/admin/builder/spi-builder-workspace/.derivedData/Build/Intermediates.noindex/CameraView.build/Debug-appletvos/CameraView.build/CameraView.modulemap (in target 'CameraView' from project 'CameraView')
    cd /Users/admin/builder/spi-builder-workspace
    write-file /Users/admin/builder/spi-builder-workspace/.derivedData/Build/Intermediates.noindex/CameraView.build/Debug-appletvos/CameraView.build/CameraView.modulemap
WriteAuxiliaryFile /Users/admin/builder/spi-builder-workspace/.derivedData/Build/Intermediates.noindex/CameraView.build/Debug-appletvos/CameraView.build/Objects-normal/arm64/CameraView-OutputFileMap.json (in target 'CameraView' from project 'CameraView')
    cd /Users/admin/builder/spi-builder-workspace
    write-file /Users/admin/builder/spi-builder-workspace/.derivedData/Build/Intermediates.noindex/CameraView.build/Debug-appletvos/CameraView.build/Objects-normal/arm64/CameraView-OutputFileMap.json
WriteAuxiliaryFile /Users/admin/builder/spi-builder-workspace/.derivedData/Build/Intermediates.noindex/CameraView.build/Debug-appletvos/CameraView.build/Objects-normal/arm64/CameraView.SwiftFileList (in target 'CameraView' from project 'CameraView')
    cd /Users/admin/builder/spi-builder-workspace
    write-file /Users/admin/builder/spi-builder-workspace/.derivedData/Build/Intermediates.noindex/CameraView.build/Debug-appletvos/CameraView.build/Objects-normal/arm64/CameraView.SwiftFileList
WriteAuxiliaryFile /Users/admin/builder/spi-builder-workspace/.derivedData/Build/Intermediates.noindex/CameraView.build/Debug-appletvos/CameraView.build/Objects-normal/arm64/CameraView_const_extract_protocols.json (in target 'CameraView' from project 'CameraView')
    cd /Users/admin/builder/spi-builder-workspace
    write-file /Users/admin/builder/spi-builder-workspace/.derivedData/Build/Intermediates.noindex/CameraView.build/Debug-appletvos/CameraView.build/Objects-normal/arm64/CameraView_const_extract_protocols.json
WriteAuxiliaryFile /Users/admin/builder/spi-builder-workspace/.derivedData/Build/Intermediates.noindex/CameraView.build/Debug-appletvos/CameraView.build/Objects-normal/arm64/CameraView.LinkFileList (in target 'CameraView' from project 'CameraView')
    cd /Users/admin/builder/spi-builder-workspace
    write-file /Users/admin/builder/spi-builder-workspace/.derivedData/Build/Intermediates.noindex/CameraView.build/Debug-appletvos/CameraView.build/Objects-normal/arm64/CameraView.LinkFileList
Copy /Users/admin/builder/spi-builder-workspace/.derivedData/Build/Intermediates.noindex/GeneratedModuleMaps-appletvos/CameraView.modulemap /Users/admin/builder/spi-builder-workspace/.derivedData/Build/Intermediates.noindex/CameraView.build/Debug-appletvos/CameraView.build/CameraView.modulemap (in target 'CameraView' from project 'CameraView')
    cd /Users/admin/builder/spi-builder-workspace
    builtin-copy -exclude .DS_Store -exclude CVS -exclude .svn -exclude .git -exclude .hg -resolve-src-symlinks /Users/admin/builder/spi-builder-workspace/.derivedData/Build/Intermediates.noindex/CameraView.build/Debug-appletvos/CameraView.build/CameraView.modulemap /Users/admin/builder/spi-builder-workspace/.derivedData/Build/Intermediates.noindex/GeneratedModuleMaps-appletvos
SwiftDriver CameraView normal arm64 com.apple.xcode.tools.swift.compiler (in target 'CameraView' from project 'CameraView')
    cd /Users/admin/builder/spi-builder-workspace/.swiftpm/xcode
    builtin-SwiftDriver -- /Applications/Xcode-16.1.0.app/Contents/Developer/Toolchains/XcodeDefault.xctoolchain/usr/bin/swiftc -module-name CameraView -Onone -enforce-exclusivity\=checked @/Users/admin/builder/spi-builder-workspace/.derivedData/Build/Intermediates.noindex/CameraView.build/Debug-appletvos/CameraView.build/Objects-normal/arm64/CameraView.SwiftFileList -DSWIFT_PACKAGE -DDEBUG -stats-output-dir .stats -strict-concurrency\=complete -enable-upcoming-feature StrictConcurrency -enable-upcoming-feature DisableOutwardActorInference -enable-upcoming-feature GlobalActorIsolatedTypesUsability -enable-upcoming-feature InferSendableFromCaptures -plugin-path /Applications/Xcode-16.1.0.app/Contents/Developer/Toolchains/XcodeDefault.xctoolchain/usr/lib/swift/host/plugins/testing -enable-experimental-feature DebugDescriptionMacro -sdk /Applications/Xcode-16.1.0.app/Contents/Developer/Platforms/AppleTVOS.platform/Developer/SDKs/AppleTVOS18.1.sdk -target arm64-apple-tvos13.0 -g -module-cache-path /Users/admin/builder/spi-builder-workspace/.derivedData/ModuleCache.noindex -Xfrontend -serialize-debugging-options -profile-coverage-mapping -profile-generate -enable-testing -index-store-path /Users/admin/builder/spi-builder-workspace/.derivedData/Index.noindex/DataStore -enable-experimental-feature OpaqueTypeErasure -Xcc -D_LIBCPP_HARDENING_MODE\=_LIBCPP_HARDENING_MODE_DEBUG -swift-version 5 -I /Users/admin/builder/spi-builder-workspace/.derivedData/Build/Products/Debug-appletvos -I /Applications/Xcode-16.1.0.app/Contents/Developer/Platforms/AppleTVOS.platform/Developer/usr/lib -F /Users/admin/builder/spi-builder-workspace/.derivedData/Build/Products/Debug-appletvos -F /Applications/Xcode-16.1.0.app/Contents/Developer/Platforms/AppleTVOS.platform/Developer/Library/Frameworks -F /Applications/Xcode-16.1.0.app/Contents/Developer/Platforms/AppleTVOS.platform/Developer/SDKs/AppleTVOS18.1.sdk/Developer/Library/Frameworks -c -j10 -enable-batch-mode -incremental -Xcc -ivfsstatcache -Xcc /Users/admin/builder/spi-builder-workspace/.derivedData/SDKStatCaches.noindex/appletvos18.1-22J572-e7fdd8cf9ffd4d4af20823079b51a726.sdkstatcache -output-file-map /Users/admin/builder/spi-builder-workspace/.derivedData/Build/Intermediates.noindex/CameraView.build/Debug-appletvos/CameraView.build/Objects-normal/arm64/CameraView-OutputFileMap.json -use-frontend-parseable-output -save-temps -no-color-diagnostics -serialize-diagnostics -emit-dependencies -emit-module -emit-module-path /Users/admin/builder/spi-builder-workspace/.derivedData/Build/Intermediates.noindex/CameraView.build/Debug-appletvos/CameraView.build/Objects-normal/arm64/CameraView.swiftmodule -validate-clang-modules-once -clang-build-session-file /Users/admin/builder/spi-builder-workspace/.derivedData/ModuleCache.noindex/Session.modulevalidation -Xcc -I/Users/admin/builder/spi-builder-workspace/.derivedData/Build/Intermediates.noindex/CameraView.build/Debug-appletvos/CameraView.build/swift-overrides.hmap -emit-const-values -Xfrontend -const-gather-protocols-file -Xfrontend /Users/admin/builder/spi-builder-workspace/.derivedData/Build/Intermediates.noindex/CameraView.build/Debug-appletvos/CameraView.build/Objects-normal/arm64/CameraView_const_extract_protocols.json -Xcc -I/Users/admin/builder/spi-builder-workspace/.derivedData/Build/Products/Debug-appletvos/include -Xcc -I/Users/admin/builder/spi-builder-workspace/.derivedData/Build/Intermediates.noindex/CameraView.build/Debug-appletvos/CameraView.build/DerivedSources-normal/arm64 -Xcc -I/Users/admin/builder/spi-builder-workspace/.derivedData/Build/Intermediates.noindex/CameraView.build/Debug-appletvos/CameraView.build/DerivedSources/arm64 -Xcc -I/Users/admin/builder/spi-builder-workspace/.derivedData/Build/Intermediates.noindex/CameraView.build/Debug-appletvos/CameraView.build/DerivedSources -Xcc -DSWIFT_PACKAGE -Xcc -DDEBUG\=1 -emit-objc-header -emit-objc-header-path /Users/admin/builder/spi-builder-workspace/.derivedData/Build/Intermediates.noindex/CameraView.build/Debug-appletvos/CameraView.build/Objects-normal/arm64/CameraView-Swift.h -working-directory /Users/admin/builder/spi-builder-workspace/.swiftpm/xcode -experimental-emit-module-separately -disable-cmo
SwiftEmitModule normal arm64 Emitting\ module\ for\ CameraView (in target 'CameraView' from project 'CameraView')
    cd /Users/admin/builder/spi-builder-workspace/.swiftpm/xcode
    builtin-swiftTaskExecution -- /Applications/Xcode-16.1.0.app/Contents/Developer/Toolchains/XcodeDefault.xctoolchain/usr/bin/swift-frontend -frontend -emit-module -experimental-skip-non-inlinable-function-bodies-without-types /Users/admin/builder/spi-builder-workspace/Sources/CameraView/CameraView.swift /Users/admin/builder/spi-builder-workspace/Sources/CameraView/CameraViewDelegate.swift -target arm64-apple-tvos13.0 -Xllvm -aarch64-use-tbi -enable-objc-interop -stack-check -sdk /Applications/Xcode-16.1.0.app/Contents/Developer/Platforms/AppleTVOS.platform/Developer/SDKs/AppleTVOS18.1.sdk -I /Users/admin/builder/spi-builder-workspace/.derivedData/Build/Products/Debug-appletvos -I /Applications/Xcode-16.1.0.app/Contents/Developer/Platforms/AppleTVOS.platform/Developer/usr/lib -F /Users/admin/builder/spi-builder-workspace/.derivedData/Build/Products/Debug-appletvos -F /Applications/Xcode-16.1.0.app/Contents/Developer/Platforms/AppleTVOS.platform/Developer/Library/Frameworks -F /Applications/Xcode-16.1.0.app/Contents/Developer/Platforms/AppleTVOS.platform/Developer/SDKs/AppleTVOS18.1.sdk/Developer/Library/Frameworks -no-color-diagnostics -enable-testing -g -debug-info-format\=dwarf -dwarf-version\=4 -module-cache-path /Users/admin/builder/spi-builder-workspace/.derivedData/ModuleCache.noindex -profile-generate -profile-coverage-mapping -swift-version 5 -enforce-exclusivity\=checked -stats-output-dir /Users/admin/builder/spi-builder-workspace/.swiftpm/xcode/.stats -Onone -D SWIFT_PACKAGE -D DEBUG -serialize-debugging-options -const-gather-protocols-file /Users/admin/builder/spi-builder-workspace/.derivedData/Build/Intermediates.noindex/CameraView.build/Debug-appletvos/CameraView.build/Objects-normal/arm64/CameraView_const_extract_protocols.json -enable-experimental-feature DebugDescriptionMacro -enable-experimental-feature OpaqueTypeErasure -enable-upcoming-feature StrictConcurrency -enable-upcoming-feature DisableOutwardActorInference -enable-upcoming-feature GlobalActorIsolatedTypesUsability -enable-upcoming-feature InferSendableFromCaptures -strict-concurrency\=complete -empty-abi-descriptor -plugin-path /Applications/Xcode-16.1.0.app/Contents/Developer/Toolchains/XcodeDefault.xctoolchain/usr/lib/swift/host/plugins/testing -validate-clang-modules-once -clang-build-session-file /Users/admin/builder/spi-builder-workspace/.derivedData/ModuleCache.noindex/Session.modulevalidation -Xcc -working-directory -Xcc /Users/admin/builder/spi-builder-workspace/.swiftpm/xcode -resource-dir /Applications/Xcode-16.1.0.app/Contents/Developer/Toolchains/XcodeDefault.xctoolchain/usr/lib/swift -enable-anonymous-context-mangled-names -file-compilation-dir /Users/admin/builder/spi-builder-workspace/.swiftpm/xcode -Xcc -D_LIBCPP_HARDENING_MODE\=_LIBCPP_HARDENING_MODE_DEBUG -Xcc -ivfsstatcache -Xcc /Users/admin/builder/spi-builder-workspace/.derivedData/SDKStatCaches.noindex/appletvos18.1-22J572-e7fdd8cf9ffd4d4af20823079b51a726.sdkstatcache -Xcc -I/Users/admin/builder/spi-builder-workspace/.derivedData/Build/Intermediates.noindex/CameraView.build/Debug-appletvos/CameraView.build/swift-overrides.hmap -Xcc -I/Users/admin/builder/spi-builder-workspace/.derivedData/Build/Products/Debug-appletvos/include -Xcc -I/Users/admin/builder/spi-builder-workspace/.derivedData/Build/Intermediates.noindex/CameraView.build/Debug-appletvos/CameraView.build/DerivedSources-normal/arm64 -Xcc -I/Users/admin/builder/spi-builder-workspace/.derivedData/Build/Intermediates.noindex/CameraView.build/Debug-appletvos/CameraView.build/DerivedSources/arm64 -Xcc -I/Users/admin/builder/spi-builder-workspace/.derivedData/Build/Intermediates.noindex/CameraView.build/Debug-appletvos/CameraView.build/DerivedSources -Xcc -DSWIFT_PACKAGE -Xcc -DDEBUG\=1 -module-name CameraView -frontend-parseable-output -disable-clang-spi -target-sdk-version 18.1 -target-sdk-name appletvos18.1 -external-plugin-path /Applications/Xcode-16.1.0.app/Contents/Developer/Platforms/AppleTVOS.platform/Developer/usr/lib/swift/host/plugins\#/Applications/Xcode-16.1.0.app/Contents/Developer/Platforms/AppleTVOS.platform/Developer/usr/bin/swift-plugin-server -external-plugin-path /Applications/Xcode-16.1.0.app/Contents/Developer/Platforms/AppleTVOS.platform/Developer/usr/local/lib/swift/host/plugins\#/Applications/Xcode-16.1.0.app/Contents/Developer/Platforms/AppleTVOS.platform/Developer/usr/bin/swift-plugin-server -plugin-path /Applications/Xcode-16.1.0.app/Contents/Developer/Toolchains/XcodeDefault.xctoolchain/usr/lib/swift/host/plugins -plugin-path /Applications/Xcode-16.1.0.app/Contents/Developer/Toolchains/XcodeDefault.xctoolchain/usr/local/lib/swift/host/plugins -emit-module-doc-path /Users/admin/builder/spi-builder-workspace/.derivedData/Build/Intermediates.noindex/CameraView.build/Debug-appletvos/CameraView.build/Objects-normal/arm64/CameraView.swiftdoc -emit-module-source-info-path /Users/admin/builder/spi-builder-workspace/.derivedData/Build/Intermediates.noindex/CameraView.build/Debug-appletvos/CameraView.build/Objects-normal/arm64/CameraView.swiftsourceinfo -emit-objc-header-path /Users/admin/builder/spi-builder-workspace/.derivedData/Build/Intermediates.noindex/CameraView.build/Debug-appletvos/CameraView.build/Objects-normal/arm64/CameraView-Swift.h -serialize-diagnostics-path /Users/admin/builder/spi-builder-workspace/.derivedData/Build/Intermediates.noindex/CameraView.build/Debug-appletvos/CameraView.build/Objects-normal/arm64/CameraView-master-emit-module.dia -emit-dependencies-path /Users/admin/builder/spi-builder-workspace/.derivedData/Build/Intermediates.noindex/CameraView.build/Debug-appletvos/CameraView.build/Objects-normal/arm64/CameraView-master-emit-module.d -o /Users/admin/builder/spi-builder-workspace/.derivedData/Build/Intermediates.noindex/CameraView.build/Debug-appletvos/CameraView.build/Objects-normal/arm64/CameraView.swiftmodule -emit-abi-descriptor-path /Users/admin/builder/spi-builder-workspace/.derivedData/Build/Intermediates.noindex/CameraView.build/Debug-appletvos/CameraView.build/Objects-normal/arm64/CameraView.abi.json
EmitSwiftModule normal arm64 (in target 'CameraView' from project 'CameraView')
    cd /Users/admin/builder/spi-builder-workspace/.swiftpm/xcode
    /Applications/Xcode-16.1.0.app/Contents/Developer/Toolchains/XcodeDefault.xctoolchain/usr/bin/swift-frontend -emit-module -experimental-skip-non-inlinable-function-bodies-without-types /Users/admin/builder/spi-builder-workspace/Sources/CameraView/CameraView.swift /Users/admin/builder/spi-builder-workspace/Sources/CameraView/CameraViewDelegate.swift -target arm64-apple-tvos13.0 -Xllvm -aarch64-use-tbi -enable-objc-interop -stack-check -sdk /Applications/Xcode-16.1.0.app/Contents/Developer/Platforms/AppleTVOS.platform/Developer/SDKs/AppleTVOS18.1.sdk -I /Users/admin/builder/spi-builder-workspace/.derivedData/Build/Products/Debug-appletvos -I /Applications/Xcode-16.1.0.app/Contents/Developer/Platforms/AppleTVOS.platform/Developer/usr/lib -F /Users/admin/builder/spi-builder-workspace/.derivedData/Build/Products/Debug-appletvos -F /Applications/Xcode-16.1.0.app/Contents/Developer/Platforms/AppleTVOS.platform/Developer/Library/Frameworks -F /Applications/Xcode-16.1.0.app/Contents/Developer/Platforms/AppleTVOS.platform/Developer/SDKs/AppleTVOS18.1.sdk/Developer/Library/Frameworks -no-color-diagnostics -enable-testing -g -debug-info-format\=dwarf -dwarf-version\=4 -module-cache-path /Users/admin/builder/spi-builder-workspace/.derivedData/ModuleCache.noindex -profile-generate -profile-coverage-mapping -swift-version 5 -enforce-exclusivity\=checked -stats-output-dir /Users/admin/builder/spi-builder-workspace/.swiftpm/xcode/.stats -Onone -D SWIFT_PACKAGE -D DEBUG -serialize-debugging-options -const-gather-protocols-file /Users/admin/builder/spi-builder-workspace/.derivedData/Build/Intermediates.noindex/CameraView.build/Debug-appletvos/CameraView.build/Objects-normal/arm64/CameraView_const_extract_protocols.json -enable-experimental-feature DebugDescriptionMacro -enable-experimental-feature OpaqueTypeErasure -enable-upcoming-feature StrictConcurrency -enable-upcoming-feature DisableOutwardActorInference -enable-upcoming-feature GlobalActorIsolatedTypesUsability -enable-upcoming-feature InferSendableFromCaptures -strict-concurrency\=complete -empty-abi-descriptor -plugin-path /Applications/Xcode-16.1.0.app/Contents/Developer/Toolchains/XcodeDefault.xctoolchain/usr/lib/swift/host/plugins/testing -validate-clang-modules-once -clang-build-session-file /Users/admin/builder/spi-builder-workspace/.derivedData/ModuleCache.noindex/Session.modulevalidation -Xcc -working-directory -Xcc /Users/admin/builder/spi-builder-workspace/.swiftpm/xcode -resource-dir /Applications/Xcode-16.1.0.app/Contents/Developer/Toolchains/XcodeDefault.xctoolchain/usr/lib/swift -enable-anonymous-context-mangled-names -file-compilation-dir /Users/admin/builder/spi-builder-workspace/.swiftpm/xcode -Xcc -D_LIBCPP_HARDENING_MODE\=_LIBCPP_HARDENING_MODE_DEBUG -Xcc -ivfsstatcache -Xcc /Users/admin/builder/spi-builder-workspace/.derivedData/SDKStatCaches.noindex/appletvos18.1-22J572-e7fdd8cf9ffd4d4af20823079b51a726.sdkstatcache -Xcc -I/Users/admin/builder/spi-builder-workspace/.derivedData/Build/Intermediates.noindex/CameraView.build/Debug-appletvos/CameraView.build/swift-overrides.hmap -Xcc -I/Users/admin/builder/spi-builder-workspace/.derivedData/Build/Products/Debug-appletvos/include -Xcc -I/Users/admin/builder/spi-builder-workspace/.derivedData/Build/Intermediates.noindex/CameraView.build/Debug-appletvos/CameraView.build/DerivedSources-normal/arm64 -Xcc -I/Users/admin/builder/spi-builder-workspace/.derivedData/Build/Intermediates.noindex/CameraView.build/Debug-appletvos/CameraView.build/DerivedSources/arm64 -Xcc -I/Users/admin/builder/spi-builder-workspace/.derivedData/Build/Intermediates.noindex/CameraView.build/Debug-appletvos/CameraView.build/DerivedSources -Xcc -DSWIFT_PACKAGE -Xcc -DDEBUG\=1 -module-name CameraView -frontend-parseable-output -disable-clang-spi -target-sdk-version 18.1 -target-sdk-name appletvos18.1 -external-plugin-path /Applications/Xcode-16.1.0.app/Contents/Developer/Platforms/AppleTVOS.platform/Developer/usr/lib/swift/host/plugins\#/Applications/Xcode-16.1.0.app/Contents/Developer/Platforms/AppleTVOS.platform/Developer/usr/bin/swift-plugin-server -external-plugin-path /Applications/Xcode-16.1.0.app/Contents/Developer/Platforms/AppleTVOS.platform/Developer/usr/local/lib/swift/host/plugins\#/Applications/Xcode-16.1.0.app/Contents/Developer/Platforms/AppleTVOS.platform/Developer/usr/bin/swift-plugin-server -plugin-path /Applications/Xcode-16.1.0.app/Contents/Developer/Toolchains/XcodeDefault.xctoolchain/usr/lib/swift/host/plugins -plugin-path /Applications/Xcode-16.1.0.app/Contents/Developer/Toolchains/XcodeDefault.xctoolchain/usr/local/lib/swift/host/plugins -emit-module-doc-path /Users/admin/builder/spi-builder-workspace/.derivedData/Build/Intermediates.noindex/CameraView.build/Debug-appletvos/CameraView.build/Objects-normal/arm64/CameraView.swiftdoc -emit-module-source-info-path /Users/admin/builder/spi-builder-workspace/.derivedData/Build/Intermediates.noindex/CameraView.build/Debug-appletvos/CameraView.build/Objects-normal/arm64/CameraView.swiftsourceinfo -emit-objc-header-path /Users/admin/builder/spi-builder-workspace/.derivedData/Build/Intermediates.noindex/CameraView.build/Debug-appletvos/CameraView.build/Objects-normal/arm64/CameraView-Swift.h -serialize-diagnostics-path /Users/admin/builder/spi-builder-workspace/.derivedData/Build/Intermediates.noindex/CameraView.build/Debug-appletvos/CameraView.build/Objects-normal/arm64/CameraView-master-emit-module.dia -emit-dependencies-path /Users/admin/builder/spi-builder-workspace/.derivedData/Build/Intermediates.noindex/CameraView.build/Debug-appletvos/CameraView.build/Objects-normal/arm64/CameraView-master-emit-module.d -o /Users/admin/builder/spi-builder-workspace/.derivedData/Build/Intermediates.noindex/CameraView.build/Debug-appletvos/CameraView.build/Objects-normal/arm64/CameraView.swiftmodule -emit-abi-descriptor-path /Users/admin/builder/spi-builder-workspace/.derivedData/Build/Intermediates.noindex/CameraView.build/Debug-appletvos/CameraView.build/Objects-normal/arm64/CameraView.abi.json
/Users/admin/builder/spi-builder-workspace/Sources/CameraView/CameraView.swift:14:29: error: 'AVCaptureDevice' is only available in tvOS 17.0 or newer
    private var cameraType: AVCaptureDevice.DeviceType
                            ^
/Users/admin/builder/spi-builder-workspace/Sources/CameraView/CameraView.swift:12:15: note: add @available attribute to enclosing struct
public struct CameraView: View {
              ^
/Users/admin/builder/spi-builder-workspace/Sources/CameraView/CameraView.swift:15:33: error: 'AVCaptureDevice' is only available in tvOS 17.0 or newer
    private var cameraPosition: AVCaptureDevice.Position
                                ^
/Users/admin/builder/spi-builder-workspace/Sources/CameraView/CameraView.swift:12:15: note: add @available attribute to enclosing struct
public struct CameraView: View {
              ^
/Users/admin/builder/spi-builder-workspace/Sources/CameraView/CameraView.swift:17:66: error: 'AVCaptureDevice' is only available in tvOS 17.0 or newer
    public init(delegate: CameraViewDelegate? = nil, cameraType: AVCaptureDevice.DeviceType = .builtInWideAngleCamera, cameraPosition: AVCaptureDevice.Position = .back) {
                                                                 ^
/Users/admin/builder/spi-builder-workspace/Sources/CameraView/CameraView.swift:17:12: note: add @available attribute to enclosing initializer
    public init(delegate: CameraViewDelegate? = nil, cameraType: AVCaptureDevice.DeviceType = .builtInWideAngleCamera, cameraPosition: AVCaptureDevice.Position = .back) {
           ^
/Users/admin/builder/spi-builder-workspace/Sources/CameraView/CameraView.swift:12:15: note: add @available attribute to enclosing struct
public struct CameraView: View {
              ^
/Users/admin/builder/spi-builder-workspace/Sources/CameraView/CameraView.swift:17:136: error: 'AVCaptureDevice' is only available in tvOS 17.0 or newer
    public init(delegate: CameraViewDelegate? = nil, cameraType: AVCaptureDevice.DeviceType = .builtInWideAngleCamera, cameraPosition: AVCaptureDevice.Position = .back) {
                                                                                                                                       ^
/Users/admin/builder/spi-builder-workspace/Sources/CameraView/CameraView.swift:17:12: note: add @available attribute to enclosing initializer
    public init(delegate: CameraViewDelegate? = nil, cameraType: AVCaptureDevice.DeviceType = .builtInWideAngleCamera, cameraPosition: AVCaptureDevice.Position = .back) {
           ^
/Users/admin/builder/spi-builder-workspace/Sources/CameraView/CameraView.swift:12:15: note: add @available attribute to enclosing struct
public struct CameraView: View {
              ^
/Users/admin/builder/spi-builder-workspace/Sources/CameraView/CameraView.swift:17:96: error: 'builtInWideAngleCamera' is only available in tvOS 17.0 or newer
    public init(delegate: CameraViewDelegate? = nil, cameraType: AVCaptureDevice.DeviceType = .builtInWideAngleCamera, cameraPosition: AVCaptureDevice.Position = .back) {
                                                                                               ^
/Users/admin/builder/spi-builder-workspace/Sources/CameraView/CameraView.swift:17:12: note: add @available attribute to enclosing initializer
    public init(delegate: CameraViewDelegate? = nil, cameraType: AVCaptureDevice.DeviceType = .builtInWideAngleCamera, cameraPosition: AVCaptureDevice.Position = .back) {
           ^
/Users/admin/builder/spi-builder-workspace/Sources/CameraView/CameraView.swift:12:15: note: add @available attribute to enclosing struct
public struct CameraView: View {
              ^
/Users/admin/builder/spi-builder-workspace/Sources/CameraView/CameraView.swift:32:33: error: 'AVCaptureSession' is only available in tvOS 17.0 or newer
    private var captureSession: AVCaptureSession?
                                ^
/Users/admin/builder/spi-builder-workspace/Sources/CameraView/CameraView.swift:28:15: note: add @available attribute to enclosing class
private class PreviewView: UIView {
              ^
/Users/admin/builder/spi-builder-workspace/Sources/CameraView/CameraView.swift:34:28: error: 'AVCaptureVideoPreviewLayer' is only available in tvOS 17.0 or newer
    var videoPreviewLayer: AVCaptureVideoPreviewLayer {
                           ^
/Users/admin/builder/spi-builder-workspace/Sources/CameraView/CameraView.swift:34:9: note: add @available attribute to enclosing property
    var videoPreviewLayer: AVCaptureVideoPreviewLayer {
        ^
/Users/admin/builder/spi-builder-workspace/Sources/CameraView/CameraView.swift:28:15: note: add @available attribute to enclosing class
private class PreviewView: UIView {
              ^
/Users/admin/builder/spi-builder-workspace/Sources/CameraView/CameraView.swift:38:59: error: 'AVCaptureDevice' is only available in tvOS 17.0 or newer
    init(delegate: CameraViewDelegate? = nil, cameraType: AVCaptureDevice.DeviceType = .builtInWideAngleCamera, cameraPosition: AVCaptureDevice.Position = .back) {
                                                          ^
/Users/admin/builder/spi-builder-workspace/Sources/CameraView/CameraView.swift:38:5: note: add @available attribute to enclosing initializer
    init(delegate: CameraViewDelegate? = nil, cameraType: AVCaptureDevice.DeviceType = .builtInWideAngleCamera, cameraPosition: AVCaptureDevice.Position = .back) {
    ^
/Users/admin/builder/spi-builder-workspace/Sources/CameraView/CameraView.swift:28:15: note: add @available attribute to enclosing class
private class PreviewView: UIView {
              ^
/Users/admin/builder/spi-builder-workspace/Sources/CameraView/CameraView.swift:38:129: error: 'AVCaptureDevice' is only available in tvOS 17.0 or newer
    init(delegate: CameraViewDelegate? = nil, cameraType: AVCaptureDevice.DeviceType = .builtInWideAngleCamera, cameraPosition: AVCaptureDevice.Position = .back) {
                                                                                                                                ^
/Users/admin/builder/spi-builder-workspace/Sources/CameraView/CameraView.swift:38:5: note: add @available attribute to enclosing initializer
    init(delegate: CameraViewDelegate? = nil, cameraType: AVCaptureDevice.DeviceType = .builtInWideAngleCamera, cameraPosition: AVCaptureDevice.Position = .back) {
    ^
/Users/admin/builder/spi-builder-workspace/Sources/CameraView/CameraView.swift:28:15: note: add @available attribute to enclosing class
private class PreviewView: UIView {
              ^
/Users/admin/builder/spi-builder-workspace/Sources/CameraView/CameraView.swift:38:89: error: 'builtInWideAngleCamera' is only available in tvOS 17.0 or newer
    init(delegate: CameraViewDelegate? = nil, cameraType: AVCaptureDevice.DeviceType = .builtInWideAngleCamera, cameraPosition: AVCaptureDevice.Position = .back) {
                                                                                        ^
/Users/admin/builder/spi-builder-workspace/Sources/CameraView/CameraView.swift:38:5: note: add @available attribute to enclosing initializer
    init(delegate: CameraViewDelegate? = nil, cameraType: AVCaptureDevice.DeviceType = .builtInWideAngleCamera, cameraPosition: AVCaptureDevice.Position = .back) {
    ^
/Users/admin/builder/spi-builder-workspace/Sources/CameraView/CameraView.swift:28:15: note: add @available attribute to enclosing class
private class PreviewView: UIView {
              ^
/Users/admin/builder/spi-builder-workspace/Sources/CameraView/CameraView.swift:100:29: error: 'AVCaptureDevice' is only available in tvOS 17.0 or newer
    private var cameraType: AVCaptureDevice.DeviceType
                            ^
/Users/admin/builder/spi-builder-workspace/Sources/CameraView/CameraView.swift:98:16: note: add @available attribute to enclosing struct
private struct PreviewHolder: UIViewRepresentable {
               ^
/Users/admin/builder/spi-builder-workspace/Sources/CameraView/CameraView.swift:101:33: error: 'AVCaptureDevice' is only available in tvOS 17.0 or newer
    private var cameraPosition: AVCaptureDevice.Position
                                ^
/Users/admin/builder/spi-builder-workspace/Sources/CameraView/CameraView.swift:98:16: note: add @available attribute to enclosing struct
private struct PreviewHolder: UIViewRepresentable {
               ^
/Users/admin/builder/spi-builder-workspace/Sources/CameraView/CameraView.swift:103:59: error: 'AVCaptureDevice' is only available in tvOS 17.0 or newer
    init(delegate: CameraViewDelegate? = nil, cameraType: AVCaptureDevice.DeviceType = .builtInWideAngleCamera, cameraPosition: AVCaptureDevice.Position = .back) {
                                                          ^
/Users/admin/builder/spi-builder-workspace/Sources/CameraView/CameraView.swift:103:5: note: add @available attribute to enclosing initializer
    init(delegate: CameraViewDelegate? = nil, cameraType: AVCaptureDevice.DeviceType = .builtInWideAngleCamera, cameraPosition: AVCaptureDevice.Position = .back) {
    ^
/Users/admin/builder/spi-builder-workspace/Sources/CameraView/CameraView.swift:98:16: note: add @available attribute to enclosing struct
private struct PreviewHolder: UIViewRepresentable {
               ^
/Users/admin/builder/spi-builder-workspace/Sources/CameraView/CameraView.swift:103:129: error: 'AVCaptureDevice' is only available in tvOS 17.0 or newer
    init(delegate: CameraViewDelegate? = nil, cameraType: AVCaptureDevice.DeviceType = .builtInWideAngleCamera, cameraPosition: AVCaptureDevice.Position = .back) {
                                                                                                                                ^
/Users/admin/builder/spi-builder-workspace/Sources/CameraView/CameraView.swift:103:5: note: add @available attribute to enclosing initializer
    init(delegate: CameraViewDelegate? = nil, cameraType: AVCaptureDevice.DeviceType = .builtInWideAngleCamera, cameraPosition: AVCaptureDevice.Position = .back) {
    ^
/Users/admin/builder/spi-builder-workspace/Sources/CameraView/CameraView.swift:98:16: note: add @available attribute to enclosing struct
private struct PreviewHolder: UIViewRepresentable {
               ^
/Users/admin/builder/spi-builder-workspace/Sources/CameraView/CameraView.swift:103:89: error: 'builtInWideAngleCamera' is only available in tvOS 17.0 or newer
    init(delegate: CameraViewDelegate? = nil, cameraType: AVCaptureDevice.DeviceType = .builtInWideAngleCamera, cameraPosition: AVCaptureDevice.Position = .back) {
                                                                                        ^
/Users/admin/builder/spi-builder-workspace/Sources/CameraView/CameraView.swift:103:5: note: add @available attribute to enclosing initializer
    init(delegate: CameraViewDelegate? = nil, cameraType: AVCaptureDevice.DeviceType = .builtInWideAngleCamera, cameraPosition: AVCaptureDevice.Position = .back) {
    ^
/Users/admin/builder/spi-builder-workspace/Sources/CameraView/CameraView.swift:98:16: note: add @available attribute to enclosing struct
private struct PreviewHolder: UIViewRepresentable {
               ^
SwiftCompile normal arm64 Compiling\ CameraViewDelegate.swift /Users/admin/builder/spi-builder-workspace/Sources/CameraView/CameraViewDelegate.swift (in target 'CameraView' from project 'CameraView')
    cd /Users/admin/builder/spi-builder-workspace/.swiftpm/xcode
    builtin-swiftTaskExecution -- /Applications/Xcode-16.1.0.app/Contents/Developer/Toolchains/XcodeDefault.xctoolchain/usr/bin/swift-frontend -frontend -c /Users/admin/builder/spi-builder-workspace/Sources/CameraView/CameraView.swift -primary-file /Users/admin/builder/spi-builder-workspace/Sources/CameraView/CameraViewDelegate.swift -emit-dependencies-path /Users/admin/builder/spi-builder-workspace/.derivedData/Build/Intermediates.noindex/CameraView.build/Debug-appletvos/CameraView.build/Objects-normal/arm64/CameraViewDelegate.d -emit-const-values-path /Users/admin/builder/spi-builder-workspace/.derivedData/Build/Intermediates.noindex/CameraView.build/Debug-appletvos/CameraView.build/Objects-normal/arm64/CameraViewDelegate.swiftconstvalues -emit-reference-dependencies-path /Users/admin/builder/spi-builder-workspace/.derivedData/Build/Intermediates.noindex/CameraView.build/Debug-appletvos/CameraView.build/Objects-normal/arm64/CameraViewDelegate.swiftdeps -serialize-diagnostics-path /Users/admin/builder/spi-builder-workspace/.derivedData/Build/Intermediates.noindex/CameraView.build/Debug-appletvos/CameraView.build/Objects-normal/arm64/CameraViewDelegate.dia -target arm64-apple-tvos13.0 -Xllvm -aarch64-use-tbi -enable-objc-interop -stack-check -sdk /Applications/Xcode-16.1.0.app/Contents/Developer/Platforms/AppleTVOS.platform/Developer/SDKs/AppleTVOS18.1.sdk -I /Users/admin/builder/spi-builder-workspace/.derivedData/Build/Products/Debug-appletvos -I /Applications/Xcode-16.1.0.app/Contents/Developer/Platforms/AppleTVOS.platform/Developer/usr/lib -F /Users/admin/builder/spi-builder-workspace/.derivedData/Build/Products/Debug-appletvos -F /Applications/Xcode-16.1.0.app/Contents/Developer/Platforms/AppleTVOS.platform/Developer/Library/Frameworks -F /Applications/Xcode-16.1.0.app/Contents/Developer/Platforms/AppleTVOS.platform/Developer/SDKs/AppleTVOS18.1.sdk/Developer/Library/Frameworks -no-color-diagnostics -enable-testing -g -debug-info-format\=dwarf -dwarf-version\=4 -module-cache-path /Users/admin/builder/spi-builder-workspace/.derivedData/ModuleCache.noindex -profile-generate -profile-coverage-mapping -swift-version 5 -enforce-exclusivity\=checked -stats-output-dir /Users/admin/builder/spi-builder-workspace/.swiftpm/xcode/.stats -Onone -D SWIFT_PACKAGE -D DEBUG -serialize-debugging-options -const-gather-protocols-file /Users/admin/builder/spi-builder-workspace/.derivedData/Build/Intermediates.noindex/CameraView.build/Debug-appletvos/CameraView.build/Objects-normal/arm64/CameraView_const_extract_protocols.json -enable-experimental-feature DebugDescriptionMacro -enable-experimental-feature OpaqueTypeErasure -enable-upcoming-feature StrictConcurrency -enable-upcoming-feature DisableOutwardActorInference -enable-upcoming-feature GlobalActorIsolatedTypesUsability -enable-upcoming-feature InferSendableFromCaptures -strict-concurrency\=complete -empty-abi-descriptor -plugin-path /Applications/Xcode-16.1.0.app/Contents/Developer/Toolchains/XcodeDefault.xctoolchain/usr/lib/swift/host/plugins/testing -validate-clang-modules-once -clang-build-session-file /Users/admin/builder/spi-builder-workspace/.derivedData/ModuleCache.noindex/Session.modulevalidation -Xcc -working-directory -Xcc /Users/admin/builder/spi-builder-workspace/.swiftpm/xcode -resource-dir /Applications/Xcode-16.1.0.app/Contents/Developer/Toolchains/XcodeDefault.xctoolchain/usr/lib/swift -enable-anonymous-context-mangled-names -file-compilation-dir /Users/admin/builder/spi-builder-workspace/.swiftpm/xcode -Xcc -D_LIBCPP_HARDENING_MODE\=_LIBCPP_HARDENING_MODE_DEBUG -Xcc -ivfsstatcache -Xcc /Users/admin/builder/spi-builder-workspace/.derivedData/SDKStatCaches.noindex/appletvos18.1-22J572-e7fdd8cf9ffd4d4af20823079b51a726.sdkstatcache -Xcc -I/Users/admin/builder/spi-builder-workspace/.derivedData/Build/Intermediates.noindex/CameraView.build/Debug-appletvos/CameraView.build/swift-overrides.hmap -Xcc -I/Users/admin/builder/spi-builder-workspace/.derivedData/Build/Products/Debug-appletvos/include -Xcc -I/Users/admin/builder/spi-builder-workspace/.derivedData/Build/Intermediates.noindex/CameraView.build/Debug-appletvos/CameraView.build/DerivedSources-normal/arm64 -Xcc -I/Users/admin/builder/spi-builder-workspace/.derivedData/Build/Intermediates.noindex/CameraView.build/Debug-appletvos/CameraView.build/DerivedSources/arm64 -Xcc -I/Users/admin/builder/spi-builder-workspace/.derivedData/Build/Intermediates.noindex/CameraView.build/Debug-appletvos/CameraView.build/DerivedSources -Xcc -DSWIFT_PACKAGE -Xcc -DDEBUG\=1 -module-name CameraView -frontend-parseable-output -disable-clang-spi -target-sdk-version 18.1 -target-sdk-name appletvos18.1 -external-plugin-path /Applications/Xcode-16.1.0.app/Contents/Developer/Platforms/AppleTVOS.platform/Developer/usr/lib/swift/host/plugins\#/Applications/Xcode-16.1.0.app/Contents/Developer/Platforms/AppleTVOS.platform/Developer/usr/bin/swift-plugin-server -external-plugin-path /Applications/Xcode-16.1.0.app/Contents/Developer/Platforms/AppleTVOS.platform/Developer/usr/local/lib/swift/host/plugins\#/Applications/Xcode-16.1.0.app/Contents/Developer/Platforms/AppleTVOS.platform/Developer/usr/bin/swift-plugin-server -plugin-path /Applications/Xcode-16.1.0.app/Contents/Developer/Toolchains/XcodeDefault.xctoolchain/usr/lib/swift/host/plugins -plugin-path /Applications/Xcode-16.1.0.app/Contents/Developer/Toolchains/XcodeDefault.xctoolchain/usr/local/lib/swift/host/plugins -o /Users/admin/builder/spi-builder-workspace/.derivedData/Build/Intermediates.noindex/CameraView.build/Debug-appletvos/CameraView.build/Objects-normal/arm64/CameraViewDelegate.o -index-unit-output-path /CameraView.build/Debug-appletvos/CameraView.build/Objects-normal/arm64/CameraViewDelegate.o -index-store-path /Users/admin/builder/spi-builder-workspace/.derivedData/Index.noindex/DataStore -index-system-modules
SwiftCompile normal arm64 /Users/admin/builder/spi-builder-workspace/Sources/CameraView/CameraViewDelegate.swift (in target 'CameraView' from project 'CameraView')
    cd /Users/admin/builder/spi-builder-workspace/.swiftpm/xcode
    /Applications/Xcode-16.1.0.app/Contents/Developer/Toolchains/XcodeDefault.xctoolchain/usr/bin/swift-frontend -c /Users/admin/builder/spi-builder-workspace/Sources/CameraView/CameraView.swift -primary-file /Users/admin/builder/spi-builder-workspace/Sources/CameraView/CameraViewDelegate.swift -emit-dependencies-path /Users/admin/builder/spi-builder-workspace/.derivedData/Build/Intermediates.noindex/CameraView.build/Debug-appletvos/CameraView.build/Objects-normal/arm64/CameraViewDelegate.d -emit-const-values-path /Users/admin/builder/spi-builder-workspace/.derivedData/Build/Intermediates.noindex/CameraView.build/Debug-appletvos/CameraView.build/Objects-normal/arm64/CameraViewDelegate.swiftconstvalues -emit-reference-dependencies-path /Users/admin/builder/spi-builder-workspace/.derivedData/Build/Intermediates.noindex/CameraView.build/Debug-appletvos/CameraView.build/Objects-normal/arm64/CameraViewDelegate.swiftdeps -serialize-diagnostics-path /Users/admin/builder/spi-builder-workspace/.derivedData/Build/Intermediates.noindex/CameraView.build/Debug-appletvos/CameraView.build/Objects-normal/arm64/CameraViewDelegate.dia -target arm64-apple-tvos13.0 -Xllvm -aarch64-use-tbi -enable-objc-interop -stack-check -sdk /Applications/Xcode-16.1.0.app/Contents/Developer/Platforms/AppleTVOS.platform/Developer/SDKs/AppleTVOS18.1.sdk -I /Users/admin/builder/spi-builder-workspace/.derivedData/Build/Products/Debug-appletvos -I /Applications/Xcode-16.1.0.app/Contents/Developer/Platforms/AppleTVOS.platform/Developer/usr/lib -F /Users/admin/builder/spi-builder-workspace/.derivedData/Build/Products/Debug-appletvos -F /Applications/Xcode-16.1.0.app/Contents/Developer/Platforms/AppleTVOS.platform/Developer/Library/Frameworks -F /Applications/Xcode-16.1.0.app/Contents/Developer/Platforms/AppleTVOS.platform/Developer/SDKs/AppleTVOS18.1.sdk/Developer/Library/Frameworks -no-color-diagnostics -enable-testing -g -debug-info-format\=dwarf -dwarf-version\=4 -module-cache-path /Users/admin/builder/spi-builder-workspace/.derivedData/ModuleCache.noindex -profile-generate -profile-coverage-mapping -swift-version 5 -enforce-exclusivity\=checked -stats-output-dir /Users/admin/builder/spi-builder-workspace/.swiftpm/xcode/.stats -Onone -D SWIFT_PACKAGE -D DEBUG -serialize-debugging-options -const-gather-protocols-file /Users/admin/builder/spi-builder-workspace/.derivedData/Build/Intermediates.noindex/CameraView.build/Debug-appletvos/CameraView.build/Objects-normal/arm64/CameraView_const_extract_protocols.json -enable-experimental-feature DebugDescriptionMacro -enable-experimental-feature OpaqueTypeErasure -enable-upcoming-feature StrictConcurrency -enable-upcoming-feature DisableOutwardActorInference -enable-upcoming-feature GlobalActorIsolatedTypesUsability -enable-upcoming-feature InferSendableFromCaptures -strict-concurrency\=complete -empty-abi-descriptor -plugin-path /Applications/Xcode-16.1.0.app/Contents/Developer/Toolchains/XcodeDefault.xctoolchain/usr/lib/swift/host/plugins/testing -validate-clang-modules-once -clang-build-session-file /Users/admin/builder/spi-builder-workspace/.derivedData/ModuleCache.noindex/Session.modulevalidation -Xcc -working-directory -Xcc /Users/admin/builder/spi-builder-workspace/.swiftpm/xcode -resource-dir /Applications/Xcode-16.1.0.app/Contents/Developer/Toolchains/XcodeDefault.xctoolchain/usr/lib/swift -enable-anonymous-context-mangled-names -file-compilation-dir /Users/admin/builder/spi-builder-workspace/.swiftpm/xcode -Xcc -D_LIBCPP_HARDENING_MODE\=_LIBCPP_HARDENING_MODE_DEBUG -Xcc -ivfsstatcache -Xcc /Users/admin/builder/spi-builder-workspace/.derivedData/SDKStatCaches.noindex/appletvos18.1-22J572-e7fdd8cf9ffd4d4af20823079b51a726.sdkstatcache -Xcc -I/Users/admin/builder/spi-builder-workspace/.derivedData/Build/Intermediates.noindex/CameraView.build/Debug-appletvos/CameraView.build/swift-overrides.hmap -Xcc -I/Users/admin/builder/spi-builder-workspace/.derivedData/Build/Products/Debug-appletvos/include -Xcc -I/Users/admin/builder/spi-builder-workspace/.derivedData/Build/Intermediates.noindex/CameraView.build/Debug-appletvos/CameraView.build/DerivedSources-normal/arm64 -Xcc -I/Users/admin/builder/spi-builder-workspace/.derivedData/Build/Intermediates.noindex/CameraView.build/Debug-appletvos/CameraView.build/DerivedSources/arm64 -Xcc -I/Users/admin/builder/spi-builder-workspace/.derivedData/Build/Intermediates.noindex/CameraView.build/Debug-appletvos/CameraView.build/DerivedSources -Xcc -DSWIFT_PACKAGE -Xcc -DDEBUG\=1 -module-name CameraView -frontend-parseable-output -disable-clang-spi -target-sdk-version 18.1 -target-sdk-name appletvos18.1 -external-plugin-path /Applications/Xcode-16.1.0.app/Contents/Developer/Platforms/AppleTVOS.platform/Developer/usr/lib/swift/host/plugins\#/Applications/Xcode-16.1.0.app/Contents/Developer/Platforms/AppleTVOS.platform/Developer/usr/bin/swift-plugin-server -external-plugin-path /Applications/Xcode-16.1.0.app/Contents/Developer/Platforms/AppleTVOS.platform/Developer/usr/local/lib/swift/host/plugins\#/Applications/Xcode-16.1.0.app/Contents/Developer/Platforms/AppleTVOS.platform/Developer/usr/bin/swift-plugin-server -plugin-path /Applications/Xcode-16.1.0.app/Contents/Developer/Toolchains/XcodeDefault.xctoolchain/usr/lib/swift/host/plugins -plugin-path /Applications/Xcode-16.1.0.app/Contents/Developer/Toolchains/XcodeDefault.xctoolchain/usr/local/lib/swift/host/plugins -o /Users/admin/builder/spi-builder-workspace/.derivedData/Build/Intermediates.noindex/CameraView.build/Debug-appletvos/CameraView.build/Objects-normal/arm64/CameraViewDelegate.o -index-unit-output-path /CameraView.build/Debug-appletvos/CameraView.build/Objects-normal/arm64/CameraViewDelegate.o -index-store-path /Users/admin/builder/spi-builder-workspace/.derivedData/Index.noindex/DataStore -index-system-modules
SwiftCompile normal arm64 Compiling\ CameraView.swift /Users/admin/builder/spi-builder-workspace/Sources/CameraView/CameraView.swift (in target 'CameraView' from project 'CameraView')
    cd /Users/admin/builder/spi-builder-workspace/.swiftpm/xcode
    builtin-swiftTaskExecution -- /Applications/Xcode-16.1.0.app/Contents/Developer/Toolchains/XcodeDefault.xctoolchain/usr/bin/swift-frontend -frontend -c -primary-file /Users/admin/builder/spi-builder-workspace/Sources/CameraView/CameraView.swift /Users/admin/builder/spi-builder-workspace/Sources/CameraView/CameraViewDelegate.swift -emit-dependencies-path /Users/admin/builder/spi-builder-workspace/.derivedData/Build/Intermediates.noindex/CameraView.build/Debug-appletvos/CameraView.build/Objects-normal/arm64/CameraView.d -emit-const-values-path /Users/admin/builder/spi-builder-workspace/.derivedData/Build/Intermediates.noindex/CameraView.build/Debug-appletvos/CameraView.build/Objects-normal/arm64/CameraView.swiftconstvalues -emit-reference-dependencies-path /Users/admin/builder/spi-builder-workspace/.derivedData/Build/Intermediates.noindex/CameraView.build/Debug-appletvos/CameraView.build/Objects-normal/arm64/CameraView.swiftdeps -serialize-diagnostics-path /Users/admin/builder/spi-builder-workspace/.derivedData/Build/Intermediates.noindex/CameraView.build/Debug-appletvos/CameraView.build/Objects-normal/arm64/CameraView.dia -target arm64-apple-tvos13.0 -Xllvm -aarch64-use-tbi -enable-objc-interop -stack-check -sdk /Applications/Xcode-16.1.0.app/Contents/Developer/Platforms/AppleTVOS.platform/Developer/SDKs/AppleTVOS18.1.sdk -I /Users/admin/builder/spi-builder-workspace/.derivedData/Build/Products/Debug-appletvos -I /Applications/Xcode-16.1.0.app/Contents/Developer/Platforms/AppleTVOS.platform/Developer/usr/lib -F /Users/admin/builder/spi-builder-workspace/.derivedData/Build/Products/Debug-appletvos -F /Applications/Xcode-16.1.0.app/Contents/Developer/Platforms/AppleTVOS.platform/Developer/Library/Frameworks -F /Applications/Xcode-16.1.0.app/Contents/Developer/Platforms/AppleTVOS.platform/Developer/SDKs/AppleTVOS18.1.sdk/Developer/Library/Frameworks -no-color-diagnostics -enable-testing -g -debug-info-format\=dwarf -dwarf-version\=4 -module-cache-path /Users/admin/builder/spi-builder-workspace/.derivedData/ModuleCache.noindex -profile-generate -profile-coverage-mapping -swift-version 5 -enforce-exclusivity\=checked -stats-output-dir /Users/admin/builder/spi-builder-workspace/.swiftpm/xcode/.stats -Onone -D SWIFT_PACKAGE -D DEBUG -serialize-debugging-options -const-gather-protocols-file /Users/admin/builder/spi-builder-workspace/.derivedData/Build/Intermediates.noindex/CameraView.build/Debug-appletvos/CameraView.build/Objects-normal/arm64/CameraView_const_extract_protocols.json -enable-experimental-feature DebugDescriptionMacro -enable-experimental-feature OpaqueTypeErasure -enable-upcoming-feature StrictConcurrency -enable-upcoming-feature DisableOutwardActorInference -enable-upcoming-feature GlobalActorIsolatedTypesUsability -enable-upcoming-feature InferSendableFromCaptures -strict-concurrency\=complete -empty-abi-descriptor -plugin-path /Applications/Xcode-16.1.0.app/Contents/Developer/Toolchains/XcodeDefault.xctoolchain/usr/lib/swift/host/plugins/testing -validate-clang-modules-once -clang-build-session-file /Users/admin/builder/spi-builder-workspace/.derivedData/ModuleCache.noindex/Session.modulevalidation -Xcc -working-directory -Xcc /Users/admin/builder/spi-builder-workspace/.swiftpm/xcode -resource-dir /Applications/Xcode-16.1.0.app/Contents/Developer/Toolchains/XcodeDefault.xctoolchain/usr/lib/swift -enable-anonymous-context-mangled-names -file-compilation-dir /Users/admin/builder/spi-builder-workspace/.swiftpm/xcode -Xcc -D_LIBCPP_HARDENING_MODE\=_LIBCPP_HARDENING_MODE_DEBUG -Xcc -ivfsstatcache -Xcc /Users/admin/builder/spi-builder-workspace/.derivedData/SDKStatCaches.noindex/appletvos18.1-22J572-e7fdd8cf9ffd4d4af20823079b51a726.sdkstatcache -Xcc -I/Users/admin/builder/spi-builder-workspace/.derivedData/Build/Intermediates.noindex/CameraView.build/Debug-appletvos/CameraView.build/swift-overrides.hmap -Xcc -I/Users/admin/builder/spi-builder-workspace/.derivedData/Build/Products/Debug-appletvos/include -Xcc -I/Users/admin/builder/spi-builder-workspace/.derivedData/Build/Intermediates.noindex/CameraView.build/Debug-appletvos/CameraView.build/DerivedSources-normal/arm64 -Xcc -I/Users/admin/builder/spi-builder-workspace/.derivedData/Build/Intermediates.noindex/CameraView.build/Debug-appletvos/CameraView.build/DerivedSources/arm64 -Xcc -I/Users/admin/builder/spi-builder-workspace/.derivedData/Build/Intermediates.noindex/CameraView.build/Debug-appletvos/CameraView.build/DerivedSources -Xcc -DSWIFT_PACKAGE -Xcc -DDEBUG\=1 -module-name CameraView -frontend-parseable-output -disable-clang-spi -target-sdk-version 18.1 -target-sdk-name appletvos18.1 -external-plugin-path /Applications/Xcode-16.1.0.app/Contents/Developer/Platforms/AppleTVOS.platform/Developer/usr/lib/swift/host/plugins\#/Applications/Xcode-16.1.0.app/Contents/Developer/Platforms/AppleTVOS.platform/Developer/usr/bin/swift-plugin-server -external-plugin-path /Applications/Xcode-16.1.0.app/Contents/Developer/Platforms/AppleTVOS.platform/Developer/usr/local/lib/swift/host/plugins\#/Applications/Xcode-16.1.0.app/Contents/Developer/Platforms/AppleTVOS.platform/Developer/usr/bin/swift-plugin-server -plugin-path /Applications/Xcode-16.1.0.app/Contents/Developer/Toolchains/XcodeDefault.xctoolchain/usr/lib/swift/host/plugins -plugin-path /Applications/Xcode-16.1.0.app/Contents/Developer/Toolchains/XcodeDefault.xctoolchain/usr/local/lib/swift/host/plugins -o /Users/admin/builder/spi-builder-workspace/.derivedData/Build/Intermediates.noindex/CameraView.build/Debug-appletvos/CameraView.build/Objects-normal/arm64/CameraView.o -index-unit-output-path /CameraView.build/Debug-appletvos/CameraView.build/Objects-normal/arm64/CameraView.o -index-store-path /Users/admin/builder/spi-builder-workspace/.derivedData/Index.noindex/DataStore -index-system-modules
SwiftCompile normal arm64 /Users/admin/builder/spi-builder-workspace/Sources/CameraView/CameraView.swift (in target 'CameraView' from project 'CameraView')
    cd /Users/admin/builder/spi-builder-workspace/.swiftpm/xcode
    /Applications/Xcode-16.1.0.app/Contents/Developer/Toolchains/XcodeDefault.xctoolchain/usr/bin/swift-frontend -c -primary-file /Users/admin/builder/spi-builder-workspace/Sources/CameraView/CameraView.swift /Users/admin/builder/spi-builder-workspace/Sources/CameraView/CameraViewDelegate.swift -emit-dependencies-path /Users/admin/builder/spi-builder-workspace/.derivedData/Build/Intermediates.noindex/CameraView.build/Debug-appletvos/CameraView.build/Objects-normal/arm64/CameraView.d -emit-const-values-path /Users/admin/builder/spi-builder-workspace/.derivedData/Build/Intermediates.noindex/CameraView.build/Debug-appletvos/CameraView.build/Objects-normal/arm64/CameraView.swiftconstvalues -emit-reference-dependencies-path /Users/admin/builder/spi-builder-workspace/.derivedData/Build/Intermediates.noindex/CameraView.build/Debug-appletvos/CameraView.build/Objects-normal/arm64/CameraView.swiftdeps -serialize-diagnostics-path /Users/admin/builder/spi-builder-workspace/.derivedData/Build/Intermediates.noindex/CameraView.build/Debug-appletvos/CameraView.build/Objects-normal/arm64/CameraView.dia -target arm64-apple-tvos13.0 -Xllvm -aarch64-use-tbi -enable-objc-interop -stack-check -sdk /Applications/Xcode-16.1.0.app/Contents/Developer/Platforms/AppleTVOS.platform/Developer/SDKs/AppleTVOS18.1.sdk -I /Users/admin/builder/spi-builder-workspace/.derivedData/Build/Products/Debug-appletvos -I /Applications/Xcode-16.1.0.app/Contents/Developer/Platforms/AppleTVOS.platform/Developer/usr/lib -F /Users/admin/builder/spi-builder-workspace/.derivedData/Build/Products/Debug-appletvos -F /Applications/Xcode-16.1.0.app/Contents/Developer/Platforms/AppleTVOS.platform/Developer/Library/Frameworks -F /Applications/Xcode-16.1.0.app/Contents/Developer/Platforms/AppleTVOS.platform/Developer/SDKs/AppleTVOS18.1.sdk/Developer/Library/Frameworks -no-color-diagnostics -enable-testing -g -debug-info-format\=dwarf -dwarf-version\=4 -module-cache-path /Users/admin/builder/spi-builder-workspace/.derivedData/ModuleCache.noindex -profile-generate -profile-coverage-mapping -swift-version 5 -enforce-exclusivity\=checked -stats-output-dir /Users/admin/builder/spi-builder-workspace/.swiftpm/xcode/.stats -Onone -D SWIFT_PACKAGE -D DEBUG -serialize-debugging-options -const-gather-protocols-file /Users/admin/builder/spi-builder-workspace/.derivedData/Build/Intermediates.noindex/CameraView.build/Debug-appletvos/CameraView.build/Objects-normal/arm64/CameraView_const_extract_protocols.json -enable-experimental-feature DebugDescriptionMacro -enable-experimental-feature OpaqueTypeErasure -enable-upcoming-feature StrictConcurrency -enable-upcoming-feature DisableOutwardActorInference -enable-upcoming-feature GlobalActorIsolatedTypesUsability -enable-upcoming-feature InferSendableFromCaptures -strict-concurrency\=complete -empty-abi-descriptor -plugin-path /Applications/Xcode-16.1.0.app/Contents/Developer/Toolchains/XcodeDefault.xctoolchain/usr/lib/swift/host/plugins/testing -validate-clang-modules-once -clang-build-session-file /Users/admin/builder/spi-builder-workspace/.derivedData/ModuleCache.noindex/Session.modulevalidation -Xcc -working-directory -Xcc /Users/admin/builder/spi-builder-workspace/.swiftpm/xcode -resource-dir /Applications/Xcode-16.1.0.app/Contents/Developer/Toolchains/XcodeDefault.xctoolchain/usr/lib/swift -enable-anonymous-context-mangled-names -file-compilation-dir /Users/admin/builder/spi-builder-workspace/.swiftpm/xcode -Xcc -D_LIBCPP_HARDENING_MODE\=_LIBCPP_HARDENING_MODE_DEBUG -Xcc -ivfsstatcache -Xcc /Users/admin/builder/spi-builder-workspace/.derivedData/SDKStatCaches.noindex/appletvos18.1-22J572-e7fdd8cf9ffd4d4af20823079b51a726.sdkstatcache -Xcc -I/Users/admin/builder/spi-builder-workspace/.derivedData/Build/Intermediates.noindex/CameraView.build/Debug-appletvos/CameraView.build/swift-overrides.hmap -Xcc -I/Users/admin/builder/spi-builder-workspace/.derivedData/Build/Products/Debug-appletvos/include -Xcc -I/Users/admin/builder/spi-builder-workspace/.derivedData/Build/Intermediates.noindex/CameraView.build/Debug-appletvos/CameraView.build/DerivedSources-normal/arm64 -Xcc -I/Users/admin/builder/spi-builder-workspace/.derivedData/Build/Intermediates.noindex/CameraView.build/Debug-appletvos/CameraView.build/DerivedSources/arm64 -Xcc -I/Users/admin/builder/spi-builder-workspace/.derivedData/Build/Intermediates.noindex/CameraView.build/Debug-appletvos/CameraView.build/DerivedSources -Xcc -DSWIFT_PACKAGE -Xcc -DDEBUG\=1 -module-name CameraView -frontend-parseable-output -disable-clang-spi -target-sdk-version 18.1 -target-sdk-name appletvos18.1 -external-plugin-path /Applications/Xcode-16.1.0.app/Contents/Developer/Platforms/AppleTVOS.platform/Developer/usr/lib/swift/host/plugins\#/Applications/Xcode-16.1.0.app/Contents/Developer/Platforms/AppleTVOS.platform/Developer/usr/bin/swift-plugin-server -external-plugin-path /Applications/Xcode-16.1.0.app/Contents/Developer/Platforms/AppleTVOS.platform/Developer/usr/local/lib/swift/host/plugins\#/Applications/Xcode-16.1.0.app/Contents/Developer/Platforms/AppleTVOS.platform/Developer/usr/bin/swift-plugin-server -plugin-path /Applications/Xcode-16.1.0.app/Contents/Developer/Toolchains/XcodeDefault.xctoolchain/usr/lib/swift/host/plugins -plugin-path /Applications/Xcode-16.1.0.app/Contents/Developer/Toolchains/XcodeDefault.xctoolchain/usr/local/lib/swift/host/plugins -o /Users/admin/builder/spi-builder-workspace/.derivedData/Build/Intermediates.noindex/CameraView.build/Debug-appletvos/CameraView.build/Objects-normal/arm64/CameraView.o -index-unit-output-path /CameraView.build/Debug-appletvos/CameraView.build/Objects-normal/arm64/CameraView.o -index-store-path /Users/admin/builder/spi-builder-workspace/.derivedData/Index.noindex/DataStore -index-system-modules
** BUILD FAILED **
The following build commands failed:
	EmitSwiftModule normal arm64 (in target 'CameraView' from project 'CameraView')
	SwiftEmitModule normal arm64 Emitting\ module\ for\ CameraView (in target 'CameraView' from project 'CameraView')
	Building workspace spi-builder-workspace with scheme CameraView
(3 failures)
Command line invocation:
    /Applications/Xcode-16.1.0.app/Contents/Developer/usr/bin/xcodebuild -IDEClonedSourcePackagesDirPathOverride=/Users/admin/builder/spi-builder-workspace/.dependencies -skipMacroValidation -skipPackagePluginValidation -derivedDataPath /Users/admin/builder/spi-builder-workspace/.derivedData build -scheme CameraView -destination generic/platform=tvOS "OTHER_SWIFT_FLAGS=-stats-output-dir .stats -strict-concurrency=complete -enable-upcoming-feature StrictConcurrency -enable-upcoming-feature DisableOutwardActorInference -enable-upcoming-feature GlobalActorIsolatedTypesUsability -enable-upcoming-feature InferSendableFromCaptures"
User defaults from command line:
    IDEClonedSourcePackagesDirPathOverride = /Users/admin/builder/spi-builder-workspace/.dependencies
    IDEDerivedDataPathOverride = /Users/admin/builder/spi-builder-workspace/.derivedData
    IDEPackageSupportUseBuiltinSCM = YES
Build settings from command line:
    OTHER_SWIFT_FLAGS = -stats-output-dir .stats -strict-concurrency=complete -enable-upcoming-feature StrictConcurrency -enable-upcoming-feature DisableOutwardActorInference -enable-upcoming-feature GlobalActorIsolatedTypesUsability -enable-upcoming-feature InferSendableFromCaptures
Resolve Package Graph
Resolved source packages:
  CameraView: /Users/admin/builder/spi-builder-workspace
Prepare packages
ComputeTargetDependencyGraph
note: Building targets in dependency order
note: Target dependency graph (2 targets)
    Target 'CameraView' in project 'CameraView'
        ➜ Explicit dependency on target 'CameraView' in project 'CameraView'
    Target 'CameraView' in project 'CameraView' (no dependencies)
GatherProvisioningInputs
CreateBuildDescription
ClangStatCache /Applications/Xcode-16.1.0.app/Contents/Developer/Toolchains/XcodeDefault.xctoolchain/usr/bin/clang-stat-cache /Applications/Xcode-16.1.0.app/Contents/Developer/Platforms/AppleTVOS.platform/Developer/SDKs/AppleTVOS18.1.sdk /Users/admin/builder/spi-builder-workspace/.derivedData/SDKStatCaches.noindex/appletvos18.1-22J572-e7fdd8cf9ffd4d4af20823079b51a726.sdkstatcache
    cd /Users/admin/builder/spi-builder-workspace/.swiftpm/xcode
    /Applications/Xcode-16.1.0.app/Contents/Developer/Toolchains/XcodeDefault.xctoolchain/usr/bin/clang-stat-cache /Applications/Xcode-16.1.0.app/Contents/Developer/Platforms/AppleTVOS.platform/Developer/SDKs/AppleTVOS18.1.sdk -o /Users/admin/builder/spi-builder-workspace/.derivedData/SDKStatCaches.noindex/appletvos18.1-22J572-e7fdd8cf9ffd4d4af20823079b51a726.sdkstatcache
SwiftDriver CameraView normal arm64 com.apple.xcode.tools.swift.compiler (in target 'CameraView' from project 'CameraView')
    cd /Users/admin/builder/spi-builder-workspace/.swiftpm/xcode
    builtin-SwiftDriver -- /Applications/Xcode-16.1.0.app/Contents/Developer/Toolchains/XcodeDefault.xctoolchain/usr/bin/swiftc -module-name CameraView -Onone -enforce-exclusivity\=checked @/Users/admin/builder/spi-builder-workspace/.derivedData/Build/Intermediates.noindex/CameraView.build/Debug-appletvos/CameraView.build/Objects-normal/arm64/CameraView.SwiftFileList -DSWIFT_PACKAGE -DDEBUG -stats-output-dir .stats -strict-concurrency\=complete -enable-upcoming-feature StrictConcurrency -enable-upcoming-feature DisableOutwardActorInference -enable-upcoming-feature GlobalActorIsolatedTypesUsability -enable-upcoming-feature InferSendableFromCaptures -plugin-path /Applications/Xcode-16.1.0.app/Contents/Developer/Toolchains/XcodeDefault.xctoolchain/usr/lib/swift/host/plugins/testing -enable-experimental-feature DebugDescriptionMacro -sdk /Applications/Xcode-16.1.0.app/Contents/Developer/Platforms/AppleTVOS.platform/Developer/SDKs/AppleTVOS18.1.sdk -target arm64-apple-tvos13.0 -g -module-cache-path /Users/admin/builder/spi-builder-workspace/.derivedData/ModuleCache.noindex -Xfrontend -serialize-debugging-options -profile-coverage-mapping -profile-generate -enable-testing -index-store-path /Users/admin/builder/spi-builder-workspace/.derivedData/Index.noindex/DataStore -enable-experimental-feature OpaqueTypeErasure -Xcc -D_LIBCPP_HARDENING_MODE\=_LIBCPP_HARDENING_MODE_DEBUG -swift-version 5 -I /Users/admin/builder/spi-builder-workspace/.derivedData/Build/Products/Debug-appletvos -I /Applications/Xcode-16.1.0.app/Contents/Developer/Platforms/AppleTVOS.platform/Developer/usr/lib -F /Users/admin/builder/spi-builder-workspace/.derivedData/Build/Products/Debug-appletvos -F /Applications/Xcode-16.1.0.app/Contents/Developer/Platforms/AppleTVOS.platform/Developer/Library/Frameworks -F /Applications/Xcode-16.1.0.app/Contents/Developer/Platforms/AppleTVOS.platform/Developer/SDKs/AppleTVOS18.1.sdk/Developer/Library/Frameworks -c -j10 -enable-batch-mode -incremental -Xcc -ivfsstatcache -Xcc /Users/admin/builder/spi-builder-workspace/.derivedData/SDKStatCaches.noindex/appletvos18.1-22J572-e7fdd8cf9ffd4d4af20823079b51a726.sdkstatcache -output-file-map /Users/admin/builder/spi-builder-workspace/.derivedData/Build/Intermediates.noindex/CameraView.build/Debug-appletvos/CameraView.build/Objects-normal/arm64/CameraView-OutputFileMap.json -use-frontend-parseable-output -save-temps -no-color-diagnostics -serialize-diagnostics -emit-dependencies -emit-module -emit-module-path /Users/admin/builder/spi-builder-workspace/.derivedData/Build/Intermediates.noindex/CameraView.build/Debug-appletvos/CameraView.build/Objects-normal/arm64/CameraView.swiftmodule -validate-clang-modules-once -clang-build-session-file /Users/admin/builder/spi-builder-workspace/.derivedData/ModuleCache.noindex/Session.modulevalidation -Xcc -I/Users/admin/builder/spi-builder-workspace/.derivedData/Build/Intermediates.noindex/CameraView.build/Debug-appletvos/CameraView.build/swift-overrides.hmap -emit-const-values -Xfrontend -const-gather-protocols-file -Xfrontend /Users/admin/builder/spi-builder-workspace/.derivedData/Build/Intermediates.noindex/CameraView.build/Debug-appletvos/CameraView.build/Objects-normal/arm64/CameraView_const_extract_protocols.json -Xcc -I/Users/admin/builder/spi-builder-workspace/.derivedData/Build/Products/Debug-appletvos/include -Xcc -I/Users/admin/builder/spi-builder-workspace/.derivedData/Build/Intermediates.noindex/CameraView.build/Debug-appletvos/CameraView.build/DerivedSources-normal/arm64 -Xcc -I/Users/admin/builder/spi-builder-workspace/.derivedData/Build/Intermediates.noindex/CameraView.build/Debug-appletvos/CameraView.build/DerivedSources/arm64 -Xcc -I/Users/admin/builder/spi-builder-workspace/.derivedData/Build/Intermediates.noindex/CameraView.build/Debug-appletvos/CameraView.build/DerivedSources -Xcc -DSWIFT_PACKAGE -Xcc -DDEBUG\=1 -emit-objc-header -emit-objc-header-path /Users/admin/builder/spi-builder-workspace/.derivedData/Build/Intermediates.noindex/CameraView.build/Debug-appletvos/CameraView.build/Objects-normal/arm64/CameraView-Swift.h -working-directory /Users/admin/builder/spi-builder-workspace/.swiftpm/xcode -experimental-emit-module-separately -disable-cmo
SwiftEmitModule normal arm64 Emitting\ module\ for\ CameraView (in target 'CameraView' from project 'CameraView')
    cd /Users/admin/builder/spi-builder-workspace/.swiftpm/xcode
    builtin-swiftTaskExecution -- /Applications/Xcode-16.1.0.app/Contents/Developer/Toolchains/XcodeDefault.xctoolchain/usr/bin/swift-frontend -frontend -emit-module -experimental-skip-non-inlinable-function-bodies-without-types /Users/admin/builder/spi-builder-workspace/Sources/CameraView/CameraView.swift /Users/admin/builder/spi-builder-workspace/Sources/CameraView/CameraViewDelegate.swift -target arm64-apple-tvos13.0 -Xllvm -aarch64-use-tbi -enable-objc-interop -stack-check -sdk /Applications/Xcode-16.1.0.app/Contents/Developer/Platforms/AppleTVOS.platform/Developer/SDKs/AppleTVOS18.1.sdk -I /Users/admin/builder/spi-builder-workspace/.derivedData/Build/Products/Debug-appletvos -I /Applications/Xcode-16.1.0.app/Contents/Developer/Platforms/AppleTVOS.platform/Developer/usr/lib -F /Users/admin/builder/spi-builder-workspace/.derivedData/Build/Products/Debug-appletvos -F /Applications/Xcode-16.1.0.app/Contents/Developer/Platforms/AppleTVOS.platform/Developer/Library/Frameworks -F /Applications/Xcode-16.1.0.app/Contents/Developer/Platforms/AppleTVOS.platform/Developer/SDKs/AppleTVOS18.1.sdk/Developer/Library/Frameworks -no-color-diagnostics -enable-testing -g -debug-info-format\=dwarf -dwarf-version\=4 -module-cache-path /Users/admin/builder/spi-builder-workspace/.derivedData/ModuleCache.noindex -profile-generate -profile-coverage-mapping -swift-version 5 -enforce-exclusivity\=checked -stats-output-dir /Users/admin/builder/spi-builder-workspace/.swiftpm/xcode/.stats -Onone -D SWIFT_PACKAGE -D DEBUG -serialize-debugging-options -const-gather-protocols-file /Users/admin/builder/spi-builder-workspace/.derivedData/Build/Intermediates.noindex/CameraView.build/Debug-appletvos/CameraView.build/Objects-normal/arm64/CameraView_const_extract_protocols.json -enable-experimental-feature DebugDescriptionMacro -enable-experimental-feature OpaqueTypeErasure -enable-upcoming-feature StrictConcurrency -enable-upcoming-feature DisableOutwardActorInference -enable-upcoming-feature GlobalActorIsolatedTypesUsability -enable-upcoming-feature InferSendableFromCaptures -strict-concurrency\=complete -empty-abi-descriptor -plugin-path /Applications/Xcode-16.1.0.app/Contents/Developer/Toolchains/XcodeDefault.xctoolchain/usr/lib/swift/host/plugins/testing -validate-clang-modules-once -clang-build-session-file /Users/admin/builder/spi-builder-workspace/.derivedData/ModuleCache.noindex/Session.modulevalidation -Xcc -working-directory -Xcc /Users/admin/builder/spi-builder-workspace/.swiftpm/xcode -resource-dir /Applications/Xcode-16.1.0.app/Contents/Developer/Toolchains/XcodeDefault.xctoolchain/usr/lib/swift -enable-anonymous-context-mangled-names -file-compilation-dir /Users/admin/builder/spi-builder-workspace/.swiftpm/xcode -Xcc -D_LIBCPP_HARDENING_MODE\=_LIBCPP_HARDENING_MODE_DEBUG -Xcc -ivfsstatcache -Xcc /Users/admin/builder/spi-builder-workspace/.derivedData/SDKStatCaches.noindex/appletvos18.1-22J572-e7fdd8cf9ffd4d4af20823079b51a726.sdkstatcache -Xcc -I/Users/admin/builder/spi-builder-workspace/.derivedData/Build/Intermediates.noindex/CameraView.build/Debug-appletvos/CameraView.build/swift-overrides.hmap -Xcc -I/Users/admin/builder/spi-builder-workspace/.derivedData/Build/Products/Debug-appletvos/include -Xcc -I/Users/admin/builder/spi-builder-workspace/.derivedData/Build/Intermediates.noindex/CameraView.build/Debug-appletvos/CameraView.build/DerivedSources-normal/arm64 -Xcc -I/Users/admin/builder/spi-builder-workspace/.derivedData/Build/Intermediates.noindex/CameraView.build/Debug-appletvos/CameraView.build/DerivedSources/arm64 -Xcc -I/Users/admin/builder/spi-builder-workspace/.derivedData/Build/Intermediates.noindex/CameraView.build/Debug-appletvos/CameraView.build/DerivedSources -Xcc -DSWIFT_PACKAGE -Xcc -DDEBUG\=1 -module-name CameraView -frontend-parseable-output -disable-clang-spi -target-sdk-version 18.1 -target-sdk-name appletvos18.1 -external-plugin-path /Applications/Xcode-16.1.0.app/Contents/Developer/Platforms/AppleTVOS.platform/Developer/usr/lib/swift/host/plugins\#/Applications/Xcode-16.1.0.app/Contents/Developer/Platforms/AppleTVOS.platform/Developer/usr/bin/swift-plugin-server -external-plugin-path /Applications/Xcode-16.1.0.app/Contents/Developer/Platforms/AppleTVOS.platform/Developer/usr/local/lib/swift/host/plugins\#/Applications/Xcode-16.1.0.app/Contents/Developer/Platforms/AppleTVOS.platform/Developer/usr/bin/swift-plugin-server -plugin-path /Applications/Xcode-16.1.0.app/Contents/Developer/Toolchains/XcodeDefault.xctoolchain/usr/lib/swift/host/plugins -plugin-path /Applications/Xcode-16.1.0.app/Contents/Developer/Toolchains/XcodeDefault.xctoolchain/usr/local/lib/swift/host/plugins -emit-module-doc-path /Users/admin/builder/spi-builder-workspace/.derivedData/Build/Intermediates.noindex/CameraView.build/Debug-appletvos/CameraView.build/Objects-normal/arm64/CameraView.swiftdoc -emit-module-source-info-path /Users/admin/builder/spi-builder-workspace/.derivedData/Build/Intermediates.noindex/CameraView.build/Debug-appletvos/CameraView.build/Objects-normal/arm64/CameraView.swiftsourceinfo -emit-objc-header-path /Users/admin/builder/spi-builder-workspace/.derivedData/Build/Intermediates.noindex/CameraView.build/Debug-appletvos/CameraView.build/Objects-normal/arm64/CameraView-Swift.h -serialize-diagnostics-path /Users/admin/builder/spi-builder-workspace/.derivedData/Build/Intermediates.noindex/CameraView.build/Debug-appletvos/CameraView.build/Objects-normal/arm64/CameraView-master-emit-module.dia -emit-dependencies-path /Users/admin/builder/spi-builder-workspace/.derivedData/Build/Intermediates.noindex/CameraView.build/Debug-appletvos/CameraView.build/Objects-normal/arm64/CameraView-master-emit-module.d -o /Users/admin/builder/spi-builder-workspace/.derivedData/Build/Intermediates.noindex/CameraView.build/Debug-appletvos/CameraView.build/Objects-normal/arm64/CameraView.swiftmodule -emit-abi-descriptor-path /Users/admin/builder/spi-builder-workspace/.derivedData/Build/Intermediates.noindex/CameraView.build/Debug-appletvos/CameraView.build/Objects-normal/arm64/CameraView.abi.json
EmitSwiftModule normal arm64 (in target 'CameraView' from project 'CameraView')
    cd /Users/admin/builder/spi-builder-workspace/.swiftpm/xcode
    /Applications/Xcode-16.1.0.app/Contents/Developer/Toolchains/XcodeDefault.xctoolchain/usr/bin/swift-frontend -emit-module -experimental-skip-non-inlinable-function-bodies-without-types /Users/admin/builder/spi-builder-workspace/Sources/CameraView/CameraView.swift /Users/admin/builder/spi-builder-workspace/Sources/CameraView/CameraViewDelegate.swift -target arm64-apple-tvos13.0 -Xllvm -aarch64-use-tbi -enable-objc-interop -stack-check -sdk /Applications/Xcode-16.1.0.app/Contents/Developer/Platforms/AppleTVOS.platform/Developer/SDKs/AppleTVOS18.1.sdk -I /Users/admin/builder/spi-builder-workspace/.derivedData/Build/Products/Debug-appletvos -I /Applications/Xcode-16.1.0.app/Contents/Developer/Platforms/AppleTVOS.platform/Developer/usr/lib -F /Users/admin/builder/spi-builder-workspace/.derivedData/Build/Products/Debug-appletvos -F /Applications/Xcode-16.1.0.app/Contents/Developer/Platforms/AppleTVOS.platform/Developer/Library/Frameworks -F /Applications/Xcode-16.1.0.app/Contents/Developer/Platforms/AppleTVOS.platform/Developer/SDKs/AppleTVOS18.1.sdk/Developer/Library/Frameworks -no-color-diagnostics -enable-testing -g -debug-info-format\=dwarf -dwarf-version\=4 -module-cache-path /Users/admin/builder/spi-builder-workspace/.derivedData/ModuleCache.noindex -profile-generate -profile-coverage-mapping -swift-version 5 -enforce-exclusivity\=checked -stats-output-dir /Users/admin/builder/spi-builder-workspace/.swiftpm/xcode/.stats -Onone -D SWIFT_PACKAGE -D DEBUG -serialize-debugging-options -const-gather-protocols-file /Users/admin/builder/spi-builder-workspace/.derivedData/Build/Intermediates.noindex/CameraView.build/Debug-appletvos/CameraView.build/Objects-normal/arm64/CameraView_const_extract_protocols.json -enable-experimental-feature DebugDescriptionMacro -enable-experimental-feature OpaqueTypeErasure -enable-upcoming-feature StrictConcurrency -enable-upcoming-feature DisableOutwardActorInference -enable-upcoming-feature GlobalActorIsolatedTypesUsability -enable-upcoming-feature InferSendableFromCaptures -strict-concurrency\=complete -empty-abi-descriptor -plugin-path /Applications/Xcode-16.1.0.app/Contents/Developer/Toolchains/XcodeDefault.xctoolchain/usr/lib/swift/host/plugins/testing -validate-clang-modules-once -clang-build-session-file /Users/admin/builder/spi-builder-workspace/.derivedData/ModuleCache.noindex/Session.modulevalidation -Xcc -working-directory -Xcc /Users/admin/builder/spi-builder-workspace/.swiftpm/xcode -resource-dir /Applications/Xcode-16.1.0.app/Contents/Developer/Toolchains/XcodeDefault.xctoolchain/usr/lib/swift -enable-anonymous-context-mangled-names -file-compilation-dir /Users/admin/builder/spi-builder-workspace/.swiftpm/xcode -Xcc -D_LIBCPP_HARDENING_MODE\=_LIBCPP_HARDENING_MODE_DEBUG -Xcc -ivfsstatcache -Xcc /Users/admin/builder/spi-builder-workspace/.derivedData/SDKStatCaches.noindex/appletvos18.1-22J572-e7fdd8cf9ffd4d4af20823079b51a726.sdkstatcache -Xcc -I/Users/admin/builder/spi-builder-workspace/.derivedData/Build/Intermediates.noindex/CameraView.build/Debug-appletvos/CameraView.build/swift-overrides.hmap -Xcc -I/Users/admin/builder/spi-builder-workspace/.derivedData/Build/Products/Debug-appletvos/include -Xcc -I/Users/admin/builder/spi-builder-workspace/.derivedData/Build/Intermediates.noindex/CameraView.build/Debug-appletvos/CameraView.build/DerivedSources-normal/arm64 -Xcc -I/Users/admin/builder/spi-builder-workspace/.derivedData/Build/Intermediates.noindex/CameraView.build/Debug-appletvos/CameraView.build/DerivedSources/arm64 -Xcc -I/Users/admin/builder/spi-builder-workspace/.derivedData/Build/Intermediates.noindex/CameraView.build/Debug-appletvos/CameraView.build/DerivedSources -Xcc -DSWIFT_PACKAGE -Xcc -DDEBUG\=1 -module-name CameraView -frontend-parseable-output -disable-clang-spi -target-sdk-version 18.1 -target-sdk-name appletvos18.1 -external-plugin-path /Applications/Xcode-16.1.0.app/Contents/Developer/Platforms/AppleTVOS.platform/Developer/usr/lib/swift/host/plugins\#/Applications/Xcode-16.1.0.app/Contents/Developer/Platforms/AppleTVOS.platform/Developer/usr/bin/swift-plugin-server -external-plugin-path /Applications/Xcode-16.1.0.app/Contents/Developer/Platforms/AppleTVOS.platform/Developer/usr/local/lib/swift/host/plugins\#/Applications/Xcode-16.1.0.app/Contents/Developer/Platforms/AppleTVOS.platform/Developer/usr/bin/swift-plugin-server -plugin-path /Applications/Xcode-16.1.0.app/Contents/Developer/Toolchains/XcodeDefault.xctoolchain/usr/lib/swift/host/plugins -plugin-path /Applications/Xcode-16.1.0.app/Contents/Developer/Toolchains/XcodeDefault.xctoolchain/usr/local/lib/swift/host/plugins -emit-module-doc-path /Users/admin/builder/spi-builder-workspace/.derivedData/Build/Intermediates.noindex/CameraView.build/Debug-appletvos/CameraView.build/Objects-normal/arm64/CameraView.swiftdoc -emit-module-source-info-path /Users/admin/builder/spi-builder-workspace/.derivedData/Build/Intermediates.noindex/CameraView.build/Debug-appletvos/CameraView.build/Objects-normal/arm64/CameraView.swiftsourceinfo -emit-objc-header-path /Users/admin/builder/spi-builder-workspace/.derivedData/Build/Intermediates.noindex/CameraView.build/Debug-appletvos/CameraView.build/Objects-normal/arm64/CameraView-Swift.h -serialize-diagnostics-path /Users/admin/builder/spi-builder-workspace/.derivedData/Build/Intermediates.noindex/CameraView.build/Debug-appletvos/CameraView.build/Objects-normal/arm64/CameraView-master-emit-module.dia -emit-dependencies-path /Users/admin/builder/spi-builder-workspace/.derivedData/Build/Intermediates.noindex/CameraView.build/Debug-appletvos/CameraView.build/Objects-normal/arm64/CameraView-master-emit-module.d -o /Users/admin/builder/spi-builder-workspace/.derivedData/Build/Intermediates.noindex/CameraView.build/Debug-appletvos/CameraView.build/Objects-normal/arm64/CameraView.swiftmodule -emit-abi-descriptor-path /Users/admin/builder/spi-builder-workspace/.derivedData/Build/Intermediates.noindex/CameraView.build/Debug-appletvos/CameraView.build/Objects-normal/arm64/CameraView.abi.json
/Users/admin/builder/spi-builder-workspace/Sources/CameraView/CameraView.swift:14:29: error: 'AVCaptureDevice' is only available in tvOS 17.0 or newer
    private var cameraType: AVCaptureDevice.DeviceType
                            ^
/Users/admin/builder/spi-builder-workspace/Sources/CameraView/CameraView.swift:12:15: note: add @available attribute to enclosing struct
public struct CameraView: View {
              ^
/Users/admin/builder/spi-builder-workspace/Sources/CameraView/CameraView.swift:15:33: error: 'AVCaptureDevice' is only available in tvOS 17.0 or newer
    private var cameraPosition: AVCaptureDevice.Position
                                ^
/Users/admin/builder/spi-builder-workspace/Sources/CameraView/CameraView.swift:12:15: note: add @available attribute to enclosing struct
public struct CameraView: View {
              ^
/Users/admin/builder/spi-builder-workspace/Sources/CameraView/CameraView.swift:17:66: error: 'AVCaptureDevice' is only available in tvOS 17.0 or newer
    public init(delegate: CameraViewDelegate? = nil, cameraType: AVCaptureDevice.DeviceType = .builtInWideAngleCamera, cameraPosition: AVCaptureDevice.Position = .back) {
                                                                 ^
/Users/admin/builder/spi-builder-workspace/Sources/CameraView/CameraView.swift:17:12: note: add @available attribute to enclosing initializer
    public init(delegate: CameraViewDelegate? = nil, cameraType: AVCaptureDevice.DeviceType = .builtInWideAngleCamera, cameraPosition: AVCaptureDevice.Position = .back) {
           ^
/Users/admin/builder/spi-builder-workspace/Sources/CameraView/CameraView.swift:12:15: note: add @available attribute to enclosing struct
public struct CameraView: View {
              ^
/Users/admin/builder/spi-builder-workspace/Sources/CameraView/CameraView.swift:17:136: error: 'AVCaptureDevice' is only available in tvOS 17.0 or newer
    public init(delegate: CameraViewDelegate? = nil, cameraType: AVCaptureDevice.DeviceType = .builtInWideAngleCamera, cameraPosition: AVCaptureDevice.Position = .back) {
                                                                                                                                       ^
/Users/admin/builder/spi-builder-workspace/Sources/CameraView/CameraView.swift:17:12: note: add @available attribute to enclosing initializer
    public init(delegate: CameraViewDelegate? = nil, cameraType: AVCaptureDevice.DeviceType = .builtInWideAngleCamera, cameraPosition: AVCaptureDevice.Position = .back) {
           ^
/Users/admin/builder/spi-builder-workspace/Sources/CameraView/CameraView.swift:12:15: note: add @available attribute to enclosing struct
public struct CameraView: View {
              ^
/Users/admin/builder/spi-builder-workspace/Sources/CameraView/CameraView.swift:17:96: error: 'builtInWideAngleCamera' is only available in tvOS 17.0 or newer
    public init(delegate: CameraViewDelegate? = nil, cameraType: AVCaptureDevice.DeviceType = .builtInWideAngleCamera, cameraPosition: AVCaptureDevice.Position = .back) {
                                                                                               ^
/Users/admin/builder/spi-builder-workspace/Sources/CameraView/CameraView.swift:17:12: note: add @available attribute to enclosing initializer
    public init(delegate: CameraViewDelegate? = nil, cameraType: AVCaptureDevice.DeviceType = .builtInWideAngleCamera, cameraPosition: AVCaptureDevice.Position = .back) {
           ^
/Users/admin/builder/spi-builder-workspace/Sources/CameraView/CameraView.swift:12:15: note: add @available attribute to enclosing struct
public struct CameraView: View {
              ^
/Users/admin/builder/spi-builder-workspace/Sources/CameraView/CameraView.swift:32:33: error: 'AVCaptureSession' is only available in tvOS 17.0 or newer
    private var captureSession: AVCaptureSession?
                                ^
/Users/admin/builder/spi-builder-workspace/Sources/CameraView/CameraView.swift:28:15: note: add @available attribute to enclosing class
private class PreviewView: UIView {
              ^
/Users/admin/builder/spi-builder-workspace/Sources/CameraView/CameraView.swift:34:28: error: 'AVCaptureVideoPreviewLayer' is only available in tvOS 17.0 or newer
    var videoPreviewLayer: AVCaptureVideoPreviewLayer {
                           ^
/Users/admin/builder/spi-builder-workspace/Sources/CameraView/CameraView.swift:34:9: note: add @available attribute to enclosing property
    var videoPreviewLayer: AVCaptureVideoPreviewLayer {
        ^
/Users/admin/builder/spi-builder-workspace/Sources/CameraView/CameraView.swift:28:15: note: add @available attribute to enclosing class
private class PreviewView: UIView {
              ^
/Users/admin/builder/spi-builder-workspace/Sources/CameraView/CameraView.swift:38:59: error: 'AVCaptureDevice' is only available in tvOS 17.0 or newer
    init(delegate: CameraViewDelegate? = nil, cameraType: AVCaptureDevice.DeviceType = .builtInWideAngleCamera, cameraPosition: AVCaptureDevice.Position = .back) {
                                                          ^
/Users/admin/builder/spi-builder-workspace/Sources/CameraView/CameraView.swift:38:5: note: add @available attribute to enclosing initializer
    init(delegate: CameraViewDelegate? = nil, cameraType: AVCaptureDevice.DeviceType = .builtInWideAngleCamera, cameraPosition: AVCaptureDevice.Position = .back) {
    ^
/Users/admin/builder/spi-builder-workspace/Sources/CameraView/CameraView.swift:28:15: note: add @available attribute to enclosing class
private class PreviewView: UIView {
              ^
/Users/admin/builder/spi-builder-workspace/Sources/CameraView/CameraView.swift:38:129: error: 'AVCaptureDevice' is only available in tvOS 17.0 or newer
    init(delegate: CameraViewDelegate? = nil, cameraType: AVCaptureDevice.DeviceType = .builtInWideAngleCamera, cameraPosition: AVCaptureDevice.Position = .back) {
                                                                                                                                ^
/Users/admin/builder/spi-builder-workspace/Sources/CameraView/CameraView.swift:38:5: note: add @available attribute to enclosing initializer
    init(delegate: CameraViewDelegate? = nil, cameraType: AVCaptureDevice.DeviceType = .builtInWideAngleCamera, cameraPosition: AVCaptureDevice.Position = .back) {
    ^
/Users/admin/builder/spi-builder-workspace/Sources/CameraView/CameraView.swift:28:15: note: add @available attribute to enclosing class
private class PreviewView: UIView {
              ^
/Users/admin/builder/spi-builder-workspace/Sources/CameraView/CameraView.swift:38:89: error: 'builtInWideAngleCamera' is only available in tvOS 17.0 or newer
    init(delegate: CameraViewDelegate? = nil, cameraType: AVCaptureDevice.DeviceType = .builtInWideAngleCamera, cameraPosition: AVCaptureDevice.Position = .back) {
                                                                                        ^
/Users/admin/builder/spi-builder-workspace/Sources/CameraView/CameraView.swift:38:5: note: add @available attribute to enclosing initializer
    init(delegate: CameraViewDelegate? = nil, cameraType: AVCaptureDevice.DeviceType = .builtInWideAngleCamera, cameraPosition: AVCaptureDevice.Position = .back) {
    ^
/Users/admin/builder/spi-builder-workspace/Sources/CameraView/CameraView.swift:28:15: note: add @available attribute to enclosing class
private class PreviewView: UIView {
              ^
/Users/admin/builder/spi-builder-workspace/Sources/CameraView/CameraView.swift:100:29: error: 'AVCaptureDevice' is only available in tvOS 17.0 or newer
    private var cameraType: AVCaptureDevice.DeviceType
                            ^
/Users/admin/builder/spi-builder-workspace/Sources/CameraView/CameraView.swift:98:16: note: add @available attribute to enclosing struct
private struct PreviewHolder: UIViewRepresentable {
               ^
/Users/admin/builder/spi-builder-workspace/Sources/CameraView/CameraView.swift:101:33: error: 'AVCaptureDevice' is only available in tvOS 17.0 or newer
    private var cameraPosition: AVCaptureDevice.Position
                                ^
/Users/admin/builder/spi-builder-workspace/Sources/CameraView/CameraView.swift:98:16: note: add @available attribute to enclosing struct
private struct PreviewHolder: UIViewRepresentable {
               ^
/Users/admin/builder/spi-builder-workspace/Sources/CameraView/CameraView.swift:103:59: error: 'AVCaptureDevice' is only available in tvOS 17.0 or newer
    init(delegate: CameraViewDelegate? = nil, cameraType: AVCaptureDevice.DeviceType = .builtInWideAngleCamera, cameraPosition: AVCaptureDevice.Position = .back) {
                                                          ^
/Users/admin/builder/spi-builder-workspace/Sources/CameraView/CameraView.swift:103:5: note: add @available attribute to enclosing initializer
    init(delegate: CameraViewDelegate? = nil, cameraType: AVCaptureDevice.DeviceType = .builtInWideAngleCamera, cameraPosition: AVCaptureDevice.Position = .back) {
    ^
/Users/admin/builder/spi-builder-workspace/Sources/CameraView/CameraView.swift:98:16: note: add @available attribute to enclosing struct
private struct PreviewHolder: UIViewRepresentable {
               ^
/Users/admin/builder/spi-builder-workspace/Sources/CameraView/CameraView.swift:103:129: error: 'AVCaptureDevice' is only available in tvOS 17.0 or newer
    init(delegate: CameraViewDelegate? = nil, cameraType: AVCaptureDevice.DeviceType = .builtInWideAngleCamera, cameraPosition: AVCaptureDevice.Position = .back) {
                                                                                                                                ^
/Users/admin/builder/spi-builder-workspace/Sources/CameraView/CameraView.swift:103:5: note: add @available attribute to enclosing initializer
    init(delegate: CameraViewDelegate? = nil, cameraType: AVCaptureDevice.DeviceType = .builtInWideAngleCamera, cameraPosition: AVCaptureDevice.Position = .back) {
    ^
/Users/admin/builder/spi-builder-workspace/Sources/CameraView/CameraView.swift:98:16: note: add @available attribute to enclosing struct
private struct PreviewHolder: UIViewRepresentable {
               ^
/Users/admin/builder/spi-builder-workspace/Sources/CameraView/CameraView.swift:103:89: error: 'builtInWideAngleCamera' is only available in tvOS 17.0 or newer
    init(delegate: CameraViewDelegate? = nil, cameraType: AVCaptureDevice.DeviceType = .builtInWideAngleCamera, cameraPosition: AVCaptureDevice.Position = .back) {
                                                                                        ^
/Users/admin/builder/spi-builder-workspace/Sources/CameraView/CameraView.swift:103:5: note: add @available attribute to enclosing initializer
    init(delegate: CameraViewDelegate? = nil, cameraType: AVCaptureDevice.DeviceType = .builtInWideAngleCamera, cameraPosition: AVCaptureDevice.Position = .back) {
    ^
/Users/admin/builder/spi-builder-workspace/Sources/CameraView/CameraView.swift:98:16: note: add @available attribute to enclosing struct
private struct PreviewHolder: UIViewRepresentable {
               ^
SwiftCompile normal arm64 Compiling\ CameraViewDelegate.swift /Users/admin/builder/spi-builder-workspace/Sources/CameraView/CameraViewDelegate.swift (in target 'CameraView' from project 'CameraView')
    cd /Users/admin/builder/spi-builder-workspace/.swiftpm/xcode
    builtin-swiftTaskExecution -- /Applications/Xcode-16.1.0.app/Contents/Developer/Toolchains/XcodeDefault.xctoolchain/usr/bin/swift-frontend -frontend -c /Users/admin/builder/spi-builder-workspace/Sources/CameraView/CameraView.swift -primary-file /Users/admin/builder/spi-builder-workspace/Sources/CameraView/CameraViewDelegate.swift -emit-dependencies-path /Users/admin/builder/spi-builder-workspace/.derivedData/Build/Intermediates.noindex/CameraView.build/Debug-appletvos/CameraView.build/Objects-normal/arm64/CameraViewDelegate.d -emit-const-values-path /Users/admin/builder/spi-builder-workspace/.derivedData/Build/Intermediates.noindex/CameraView.build/Debug-appletvos/CameraView.build/Objects-normal/arm64/CameraViewDelegate.swiftconstvalues -emit-reference-dependencies-path /Users/admin/builder/spi-builder-workspace/.derivedData/Build/Intermediates.noindex/CameraView.build/Debug-appletvos/CameraView.build/Objects-normal/arm64/CameraViewDelegate.swiftdeps -serialize-diagnostics-path /Users/admin/builder/spi-builder-workspace/.derivedData/Build/Intermediates.noindex/CameraView.build/Debug-appletvos/CameraView.build/Objects-normal/arm64/CameraViewDelegate.dia -target arm64-apple-tvos13.0 -Xllvm -aarch64-use-tbi -enable-objc-interop -stack-check -sdk /Applications/Xcode-16.1.0.app/Contents/Developer/Platforms/AppleTVOS.platform/Developer/SDKs/AppleTVOS18.1.sdk -I /Users/admin/builder/spi-builder-workspace/.derivedData/Build/Products/Debug-appletvos -I /Applications/Xcode-16.1.0.app/Contents/Developer/Platforms/AppleTVOS.platform/Developer/usr/lib -F /Users/admin/builder/spi-builder-workspace/.derivedData/Build/Products/Debug-appletvos -F /Applications/Xcode-16.1.0.app/Contents/Developer/Platforms/AppleTVOS.platform/Developer/Library/Frameworks -F /Applications/Xcode-16.1.0.app/Contents/Developer/Platforms/AppleTVOS.platform/Developer/SDKs/AppleTVOS18.1.sdk/Developer/Library/Frameworks -no-color-diagnostics -enable-testing -g -debug-info-format\=dwarf -dwarf-version\=4 -module-cache-path /Users/admin/builder/spi-builder-workspace/.derivedData/ModuleCache.noindex -profile-generate -profile-coverage-mapping -swift-version 5 -enforce-exclusivity\=checked -stats-output-dir /Users/admin/builder/spi-builder-workspace/.swiftpm/xcode/.stats -Onone -D SWIFT_PACKAGE -D DEBUG -serialize-debugging-options -const-gather-protocols-file /Users/admin/builder/spi-builder-workspace/.derivedData/Build/Intermediates.noindex/CameraView.build/Debug-appletvos/CameraView.build/Objects-normal/arm64/CameraView_const_extract_protocols.json -enable-experimental-feature DebugDescriptionMacro -enable-experimental-feature OpaqueTypeErasure -enable-upcoming-feature StrictConcurrency -enable-upcoming-feature DisableOutwardActorInference -enable-upcoming-feature GlobalActorIsolatedTypesUsability -enable-upcoming-feature InferSendableFromCaptures -strict-concurrency\=complete -empty-abi-descriptor -plugin-path /Applications/Xcode-16.1.0.app/Contents/Developer/Toolchains/XcodeDefault.xctoolchain/usr/lib/swift/host/plugins/testing -validate-clang-modules-once -clang-build-session-file /Users/admin/builder/spi-builder-workspace/.derivedData/ModuleCache.noindex/Session.modulevalidation -Xcc -working-directory -Xcc /Users/admin/builder/spi-builder-workspace/.swiftpm/xcode -resource-dir /Applications/Xcode-16.1.0.app/Contents/Developer/Toolchains/XcodeDefault.xctoolchain/usr/lib/swift -enable-anonymous-context-mangled-names -file-compilation-dir /Users/admin/builder/spi-builder-workspace/.swiftpm/xcode -Xcc -D_LIBCPP_HARDENING_MODE\=_LIBCPP_HARDENING_MODE_DEBUG -Xcc -ivfsstatcache -Xcc /Users/admin/builder/spi-builder-workspace/.derivedData/SDKStatCaches.noindex/appletvos18.1-22J572-e7fdd8cf9ffd4d4af20823079b51a726.sdkstatcache -Xcc -I/Users/admin/builder/spi-builder-workspace/.derivedData/Build/Intermediates.noindex/CameraView.build/Debug-appletvos/CameraView.build/swift-overrides.hmap -Xcc -I/Users/admin/builder/spi-builder-workspace/.derivedData/Build/Products/Debug-appletvos/include -Xcc -I/Users/admin/builder/spi-builder-workspace/.derivedData/Build/Intermediates.noindex/CameraView.build/Debug-appletvos/CameraView.build/DerivedSources-normal/arm64 -Xcc -I/Users/admin/builder/spi-builder-workspace/.derivedData/Build/Intermediates.noindex/CameraView.build/Debug-appletvos/CameraView.build/DerivedSources/arm64 -Xcc -I/Users/admin/builder/spi-builder-workspace/.derivedData/Build/Intermediates.noindex/CameraView.build/Debug-appletvos/CameraView.build/DerivedSources -Xcc -DSWIFT_PACKAGE -Xcc -DDEBUG\=1 -module-name CameraView -frontend-parseable-output -disable-clang-spi -target-sdk-version 18.1 -target-sdk-name appletvos18.1 -external-plugin-path /Applications/Xcode-16.1.0.app/Contents/Developer/Platforms/AppleTVOS.platform/Developer/usr/lib/swift/host/plugins\#/Applications/Xcode-16.1.0.app/Contents/Developer/Platforms/AppleTVOS.platform/Developer/usr/bin/swift-plugin-server -external-plugin-path /Applications/Xcode-16.1.0.app/Contents/Developer/Platforms/AppleTVOS.platform/Developer/usr/local/lib/swift/host/plugins\#/Applications/Xcode-16.1.0.app/Contents/Developer/Platforms/AppleTVOS.platform/Developer/usr/bin/swift-plugin-server -plugin-path /Applications/Xcode-16.1.0.app/Contents/Developer/Toolchains/XcodeDefault.xctoolchain/usr/lib/swift/host/plugins -plugin-path /Applications/Xcode-16.1.0.app/Contents/Developer/Toolchains/XcodeDefault.xctoolchain/usr/local/lib/swift/host/plugins -o /Users/admin/builder/spi-builder-workspace/.derivedData/Build/Intermediates.noindex/CameraView.build/Debug-appletvos/CameraView.build/Objects-normal/arm64/CameraViewDelegate.o -index-unit-output-path /CameraView.build/Debug-appletvos/CameraView.build/Objects-normal/arm64/CameraViewDelegate.o -index-store-path /Users/admin/builder/spi-builder-workspace/.derivedData/Index.noindex/DataStore -index-system-modules
SwiftCompile normal arm64 /Users/admin/builder/spi-builder-workspace/Sources/CameraView/CameraViewDelegate.swift (in target 'CameraView' from project 'CameraView')
    cd /Users/admin/builder/spi-builder-workspace/.swiftpm/xcode
    /Applications/Xcode-16.1.0.app/Contents/Developer/Toolchains/XcodeDefault.xctoolchain/usr/bin/swift-frontend -c /Users/admin/builder/spi-builder-workspace/Sources/CameraView/CameraView.swift -primary-file /Users/admin/builder/spi-builder-workspace/Sources/CameraView/CameraViewDelegate.swift -emit-dependencies-path /Users/admin/builder/spi-builder-workspace/.derivedData/Build/Intermediates.noindex/CameraView.build/Debug-appletvos/CameraView.build/Objects-normal/arm64/CameraViewDelegate.d -emit-const-values-path /Users/admin/builder/spi-builder-workspace/.derivedData/Build/Intermediates.noindex/CameraView.build/Debug-appletvos/CameraView.build/Objects-normal/arm64/CameraViewDelegate.swiftconstvalues -emit-reference-dependencies-path /Users/admin/builder/spi-builder-workspace/.derivedData/Build/Intermediates.noindex/CameraView.build/Debug-appletvos/CameraView.build/Objects-normal/arm64/CameraViewDelegate.swiftdeps -serialize-diagnostics-path /Users/admin/builder/spi-builder-workspace/.derivedData/Build/Intermediates.noindex/CameraView.build/Debug-appletvos/CameraView.build/Objects-normal/arm64/CameraViewDelegate.dia -target arm64-apple-tvos13.0 -Xllvm -aarch64-use-tbi -enable-objc-interop -stack-check -sdk /Applications/Xcode-16.1.0.app/Contents/Developer/Platforms/AppleTVOS.platform/Developer/SDKs/AppleTVOS18.1.sdk -I /Users/admin/builder/spi-builder-workspace/.derivedData/Build/Products/Debug-appletvos -I /Applications/Xcode-16.1.0.app/Contents/Developer/Platforms/AppleTVOS.platform/Developer/usr/lib -F /Users/admin/builder/spi-builder-workspace/.derivedData/Build/Products/Debug-appletvos -F /Applications/Xcode-16.1.0.app/Contents/Developer/Platforms/AppleTVOS.platform/Developer/Library/Frameworks -F /Applications/Xcode-16.1.0.app/Contents/Developer/Platforms/AppleTVOS.platform/Developer/SDKs/AppleTVOS18.1.sdk/Developer/Library/Frameworks -no-color-diagnostics -enable-testing -g -debug-info-format\=dwarf -dwarf-version\=4 -module-cache-path /Users/admin/builder/spi-builder-workspace/.derivedData/ModuleCache.noindex -profile-generate -profile-coverage-mapping -swift-version 5 -enforce-exclusivity\=checked -stats-output-dir /Users/admin/builder/spi-builder-workspace/.swiftpm/xcode/.stats -Onone -D SWIFT_PACKAGE -D DEBUG -serialize-debugging-options -const-gather-protocols-file /Users/admin/builder/spi-builder-workspace/.derivedData/Build/Intermediates.noindex/CameraView.build/Debug-appletvos/CameraView.build/Objects-normal/arm64/CameraView_const_extract_protocols.json -enable-experimental-feature DebugDescriptionMacro -enable-experimental-feature OpaqueTypeErasure -enable-upcoming-feature StrictConcurrency -enable-upcoming-feature DisableOutwardActorInference -enable-upcoming-feature GlobalActorIsolatedTypesUsability -enable-upcoming-feature InferSendableFromCaptures -strict-concurrency\=complete -empty-abi-descriptor -plugin-path /Applications/Xcode-16.1.0.app/Contents/Developer/Toolchains/XcodeDefault.xctoolchain/usr/lib/swift/host/plugins/testing -validate-clang-modules-once -clang-build-session-file /Users/admin/builder/spi-builder-workspace/.derivedData/ModuleCache.noindex/Session.modulevalidation -Xcc -working-directory -Xcc /Users/admin/builder/spi-builder-workspace/.swiftpm/xcode -resource-dir /Applications/Xcode-16.1.0.app/Contents/Developer/Toolchains/XcodeDefault.xctoolchain/usr/lib/swift -enable-anonymous-context-mangled-names -file-compilation-dir /Users/admin/builder/spi-builder-workspace/.swiftpm/xcode -Xcc -D_LIBCPP_HARDENING_MODE\=_LIBCPP_HARDENING_MODE_DEBUG -Xcc -ivfsstatcache -Xcc /Users/admin/builder/spi-builder-workspace/.derivedData/SDKStatCaches.noindex/appletvos18.1-22J572-e7fdd8cf9ffd4d4af20823079b51a726.sdkstatcache -Xcc -I/Users/admin/builder/spi-builder-workspace/.derivedData/Build/Intermediates.noindex/CameraView.build/Debug-appletvos/CameraView.build/swift-overrides.hmap -Xcc -I/Users/admin/builder/spi-builder-workspace/.derivedData/Build/Products/Debug-appletvos/include -Xcc -I/Users/admin/builder/spi-builder-workspace/.derivedData/Build/Intermediates.noindex/CameraView.build/Debug-appletvos/CameraView.build/DerivedSources-normal/arm64 -Xcc -I/Users/admin/builder/spi-builder-workspace/.derivedData/Build/Intermediates.noindex/CameraView.build/Debug-appletvos/CameraView.build/DerivedSources/arm64 -Xcc -I/Users/admin/builder/spi-builder-workspace/.derivedData/Build/Intermediates.noindex/CameraView.build/Debug-appletvos/CameraView.build/DerivedSources -Xcc -DSWIFT_PACKAGE -Xcc -DDEBUG\=1 -module-name CameraView -frontend-parseable-output -disable-clang-spi -target-sdk-version 18.1 -target-sdk-name appletvos18.1 -external-plugin-path /Applications/Xcode-16.1.0.app/Contents/Developer/Platforms/AppleTVOS.platform/Developer/usr/lib/swift/host/plugins\#/Applications/Xcode-16.1.0.app/Contents/Developer/Platforms/AppleTVOS.platform/Developer/usr/bin/swift-plugin-server -external-plugin-path /Applications/Xcode-16.1.0.app/Contents/Developer/Platforms/AppleTVOS.platform/Developer/usr/local/lib/swift/host/plugins\#/Applications/Xcode-16.1.0.app/Contents/Developer/Platforms/AppleTVOS.platform/Developer/usr/bin/swift-plugin-server -plugin-path /Applications/Xcode-16.1.0.app/Contents/Developer/Toolchains/XcodeDefault.xctoolchain/usr/lib/swift/host/plugins -plugin-path /Applications/Xcode-16.1.0.app/Contents/Developer/Toolchains/XcodeDefault.xctoolchain/usr/local/lib/swift/host/plugins -o /Users/admin/builder/spi-builder-workspace/.derivedData/Build/Intermediates.noindex/CameraView.build/Debug-appletvos/CameraView.build/Objects-normal/arm64/CameraViewDelegate.o -index-unit-output-path /CameraView.build/Debug-appletvos/CameraView.build/Objects-normal/arm64/CameraViewDelegate.o -index-store-path /Users/admin/builder/spi-builder-workspace/.derivedData/Index.noindex/DataStore -index-system-modules
SwiftCompile normal arm64 Compiling\ CameraView.swift /Users/admin/builder/spi-builder-workspace/Sources/CameraView/CameraView.swift (in target 'CameraView' from project 'CameraView')
    cd /Users/admin/builder/spi-builder-workspace/.swiftpm/xcode
    builtin-swiftTaskExecution -- /Applications/Xcode-16.1.0.app/Contents/Developer/Toolchains/XcodeDefault.xctoolchain/usr/bin/swift-frontend -frontend -c -primary-file /Users/admin/builder/spi-builder-workspace/Sources/CameraView/CameraView.swift /Users/admin/builder/spi-builder-workspace/Sources/CameraView/CameraViewDelegate.swift -emit-dependencies-path /Users/admin/builder/spi-builder-workspace/.derivedData/Build/Intermediates.noindex/CameraView.build/Debug-appletvos/CameraView.build/Objects-normal/arm64/CameraView.d -emit-const-values-path /Users/admin/builder/spi-builder-workspace/.derivedData/Build/Intermediates.noindex/CameraView.build/Debug-appletvos/CameraView.build/Objects-normal/arm64/CameraView.swiftconstvalues -emit-reference-dependencies-path /Users/admin/builder/spi-builder-workspace/.derivedData/Build/Intermediates.noindex/CameraView.build/Debug-appletvos/CameraView.build/Objects-normal/arm64/CameraView.swiftdeps -serialize-diagnostics-path /Users/admin/builder/spi-builder-workspace/.derivedData/Build/Intermediates.noindex/CameraView.build/Debug-appletvos/CameraView.build/Objects-normal/arm64/CameraView.dia -target arm64-apple-tvos13.0 -Xllvm -aarch64-use-tbi -enable-objc-interop -stack-check -sdk /Applications/Xcode-16.1.0.app/Contents/Developer/Platforms/AppleTVOS.platform/Developer/SDKs/AppleTVOS18.1.sdk -I /Users/admin/builder/spi-builder-workspace/.derivedData/Build/Products/Debug-appletvos -I /Applications/Xcode-16.1.0.app/Contents/Developer/Platforms/AppleTVOS.platform/Developer/usr/lib -F /Users/admin/builder/spi-builder-workspace/.derivedData/Build/Products/Debug-appletvos -F /Applications/Xcode-16.1.0.app/Contents/Developer/Platforms/AppleTVOS.platform/Developer/Library/Frameworks -F /Applications/Xcode-16.1.0.app/Contents/Developer/Platforms/AppleTVOS.platform/Developer/SDKs/AppleTVOS18.1.sdk/Developer/Library/Frameworks -no-color-diagnostics -enable-testing -g -debug-info-format\=dwarf -dwarf-version\=4 -module-cache-path /Users/admin/builder/spi-builder-workspace/.derivedData/ModuleCache.noindex -profile-generate -profile-coverage-mapping -swift-version 5 -enforce-exclusivity\=checked -stats-output-dir /Users/admin/builder/spi-builder-workspace/.swiftpm/xcode/.stats -Onone -D SWIFT_PACKAGE -D DEBUG -serialize-debugging-options -const-gather-protocols-file /Users/admin/builder/spi-builder-workspace/.derivedData/Build/Intermediates.noindex/CameraView.build/Debug-appletvos/CameraView.build/Objects-normal/arm64/CameraView_const_extract_protocols.json -enable-experimental-feature DebugDescriptionMacro -enable-experimental-feature OpaqueTypeErasure -enable-upcoming-feature StrictConcurrency -enable-upcoming-feature DisableOutwardActorInference -enable-upcoming-feature GlobalActorIsolatedTypesUsability -enable-upcoming-feature InferSendableFromCaptures -strict-concurrency\=complete -empty-abi-descriptor -plugin-path /Applications/Xcode-16.1.0.app/Contents/Developer/Toolchains/XcodeDefault.xctoolchain/usr/lib/swift/host/plugins/testing -validate-clang-modules-once -clang-build-session-file /Users/admin/builder/spi-builder-workspace/.derivedData/ModuleCache.noindex/Session.modulevalidation -Xcc -working-directory -Xcc /Users/admin/builder/spi-builder-workspace/.swiftpm/xcode -resource-dir /Applications/Xcode-16.1.0.app/Contents/Developer/Toolchains/XcodeDefault.xctoolchain/usr/lib/swift -enable-anonymous-context-mangled-names -file-compilation-dir /Users/admin/builder/spi-builder-workspace/.swiftpm/xcode -Xcc -D_LIBCPP_HARDENING_MODE\=_LIBCPP_HARDENING_MODE_DEBUG -Xcc -ivfsstatcache -Xcc /Users/admin/builder/spi-builder-workspace/.derivedData/SDKStatCaches.noindex/appletvos18.1-22J572-e7fdd8cf9ffd4d4af20823079b51a726.sdkstatcache -Xcc -I/Users/admin/builder/spi-builder-workspace/.derivedData/Build/Intermediates.noindex/CameraView.build/Debug-appletvos/CameraView.build/swift-overrides.hmap -Xcc -I/Users/admin/builder/spi-builder-workspace/.derivedData/Build/Products/Debug-appletvos/include -Xcc -I/Users/admin/builder/spi-builder-workspace/.derivedData/Build/Intermediates.noindex/CameraView.build/Debug-appletvos/CameraView.build/DerivedSources-normal/arm64 -Xcc -I/Users/admin/builder/spi-builder-workspace/.derivedData/Build/Intermediates.noindex/CameraView.build/Debug-appletvos/CameraView.build/DerivedSources/arm64 -Xcc -I/Users/admin/builder/spi-builder-workspace/.derivedData/Build/Intermediates.noindex/CameraView.build/Debug-appletvos/CameraView.build/DerivedSources -Xcc -DSWIFT_PACKAGE -Xcc -DDEBUG\=1 -module-name CameraView -frontend-parseable-output -disable-clang-spi -target-sdk-version 18.1 -target-sdk-name appletvos18.1 -external-plugin-path /Applications/Xcode-16.1.0.app/Contents/Developer/Platforms/AppleTVOS.platform/Developer/usr/lib/swift/host/plugins\#/Applications/Xcode-16.1.0.app/Contents/Developer/Platforms/AppleTVOS.platform/Developer/usr/bin/swift-plugin-server -external-plugin-path /Applications/Xcode-16.1.0.app/Contents/Developer/Platforms/AppleTVOS.platform/Developer/usr/local/lib/swift/host/plugins\#/Applications/Xcode-16.1.0.app/Contents/Developer/Platforms/AppleTVOS.platform/Developer/usr/bin/swift-plugin-server -plugin-path /Applications/Xcode-16.1.0.app/Contents/Developer/Toolchains/XcodeDefault.xctoolchain/usr/lib/swift/host/plugins -plugin-path /Applications/Xcode-16.1.0.app/Contents/Developer/Toolchains/XcodeDefault.xctoolchain/usr/local/lib/swift/host/plugins -o /Users/admin/builder/spi-builder-workspace/.derivedData/Build/Intermediates.noindex/CameraView.build/Debug-appletvos/CameraView.build/Objects-normal/arm64/CameraView.o -index-unit-output-path /CameraView.build/Debug-appletvos/CameraView.build/Objects-normal/arm64/CameraView.o -index-store-path /Users/admin/builder/spi-builder-workspace/.derivedData/Index.noindex/DataStore -index-system-modules
SwiftCompile normal arm64 /Users/admin/builder/spi-builder-workspace/Sources/CameraView/CameraView.swift (in target 'CameraView' from project 'CameraView')
    cd /Users/admin/builder/spi-builder-workspace/.swiftpm/xcode
    /Applications/Xcode-16.1.0.app/Contents/Developer/Toolchains/XcodeDefault.xctoolchain/usr/bin/swift-frontend -c -primary-file /Users/admin/builder/spi-builder-workspace/Sources/CameraView/CameraView.swift /Users/admin/builder/spi-builder-workspace/Sources/CameraView/CameraViewDelegate.swift -emit-dependencies-path /Users/admin/builder/spi-builder-workspace/.derivedData/Build/Intermediates.noindex/CameraView.build/Debug-appletvos/CameraView.build/Objects-normal/arm64/CameraView.d -emit-const-values-path /Users/admin/builder/spi-builder-workspace/.derivedData/Build/Intermediates.noindex/CameraView.build/Debug-appletvos/CameraView.build/Objects-normal/arm64/CameraView.swiftconstvalues -emit-reference-dependencies-path /Users/admin/builder/spi-builder-workspace/.derivedData/Build/Intermediates.noindex/CameraView.build/Debug-appletvos/CameraView.build/Objects-normal/arm64/CameraView.swiftdeps -serialize-diagnostics-path /Users/admin/builder/spi-builder-workspace/.derivedData/Build/Intermediates.noindex/CameraView.build/Debug-appletvos/CameraView.build/Objects-normal/arm64/CameraView.dia -target arm64-apple-tvos13.0 -Xllvm -aarch64-use-tbi -enable-objc-interop -stack-check -sdk /Applications/Xcode-16.1.0.app/Contents/Developer/Platforms/AppleTVOS.platform/Developer/SDKs/AppleTVOS18.1.sdk -I /Users/admin/builder/spi-builder-workspace/.derivedData/Build/Products/Debug-appletvos -I /Applications/Xcode-16.1.0.app/Contents/Developer/Platforms/AppleTVOS.platform/Developer/usr/lib -F /Users/admin/builder/spi-builder-workspace/.derivedData/Build/Products/Debug-appletvos -F /Applications/Xcode-16.1.0.app/Contents/Developer/Platforms/AppleTVOS.platform/Developer/Library/Frameworks -F /Applications/Xcode-16.1.0.app/Contents/Developer/Platforms/AppleTVOS.platform/Developer/SDKs/AppleTVOS18.1.sdk/Developer/Library/Frameworks -no-color-diagnostics -enable-testing -g -debug-info-format\=dwarf -dwarf-version\=4 -module-cache-path /Users/admin/builder/spi-builder-workspace/.derivedData/ModuleCache.noindex -profile-generate -profile-coverage-mapping -swift-version 5 -enforce-exclusivity\=checked -stats-output-dir /Users/admin/builder/spi-builder-workspace/.swiftpm/xcode/.stats -Onone -D SWIFT_PACKAGE -D DEBUG -serialize-debugging-options -const-gather-protocols-file /Users/admin/builder/spi-builder-workspace/.derivedData/Build/Intermediates.noindex/CameraView.build/Debug-appletvos/CameraView.build/Objects-normal/arm64/CameraView_const_extract_protocols.json -enable-experimental-feature DebugDescriptionMacro -enable-experimental-feature OpaqueTypeErasure -enable-upcoming-feature StrictConcurrency -enable-upcoming-feature DisableOutwardActorInference -enable-upcoming-feature GlobalActorIsolatedTypesUsability -enable-upcoming-feature InferSendableFromCaptures -strict-concurrency\=complete -empty-abi-descriptor -plugin-path /Applications/Xcode-16.1.0.app/Contents/Developer/Toolchains/XcodeDefault.xctoolchain/usr/lib/swift/host/plugins/testing -validate-clang-modules-once -clang-build-session-file /Users/admin/builder/spi-builder-workspace/.derivedData/ModuleCache.noindex/Session.modulevalidation -Xcc -working-directory -Xcc /Users/admin/builder/spi-builder-workspace/.swiftpm/xcode -resource-dir /Applications/Xcode-16.1.0.app/Contents/Developer/Toolchains/XcodeDefault.xctoolchain/usr/lib/swift -enable-anonymous-context-mangled-names -file-compilation-dir /Users/admin/builder/spi-builder-workspace/.swiftpm/xcode -Xcc -D_LIBCPP_HARDENING_MODE\=_LIBCPP_HARDENING_MODE_DEBUG -Xcc -ivfsstatcache -Xcc /Users/admin/builder/spi-builder-workspace/.derivedData/SDKStatCaches.noindex/appletvos18.1-22J572-e7fdd8cf9ffd4d4af20823079b51a726.sdkstatcache -Xcc -I/Users/admin/builder/spi-builder-workspace/.derivedData/Build/Intermediates.noindex/CameraView.build/Debug-appletvos/CameraView.build/swift-overrides.hmap -Xcc -I/Users/admin/builder/spi-builder-workspace/.derivedData/Build/Products/Debug-appletvos/include -Xcc -I/Users/admin/builder/spi-builder-workspace/.derivedData/Build/Intermediates.noindex/CameraView.build/Debug-appletvos/CameraView.build/DerivedSources-normal/arm64 -Xcc -I/Users/admin/builder/spi-builder-workspace/.derivedData/Build/Intermediates.noindex/CameraView.build/Debug-appletvos/CameraView.build/DerivedSources/arm64 -Xcc -I/Users/admin/builder/spi-builder-workspace/.derivedData/Build/Intermediates.noindex/CameraView.build/Debug-appletvos/CameraView.build/DerivedSources -Xcc -DSWIFT_PACKAGE -Xcc -DDEBUG\=1 -module-name CameraView -frontend-parseable-output -disable-clang-spi -target-sdk-version 18.1 -target-sdk-name appletvos18.1 -external-plugin-path /Applications/Xcode-16.1.0.app/Contents/Developer/Platforms/AppleTVOS.platform/Developer/usr/lib/swift/host/plugins\#/Applications/Xcode-16.1.0.app/Contents/Developer/Platforms/AppleTVOS.platform/Developer/usr/bin/swift-plugin-server -external-plugin-path /Applications/Xcode-16.1.0.app/Contents/Developer/Platforms/AppleTVOS.platform/Developer/usr/local/lib/swift/host/plugins\#/Applications/Xcode-16.1.0.app/Contents/Developer/Platforms/AppleTVOS.platform/Developer/usr/bin/swift-plugin-server -plugin-path /Applications/Xcode-16.1.0.app/Contents/Developer/Toolchains/XcodeDefault.xctoolchain/usr/lib/swift/host/plugins -plugin-path /Applications/Xcode-16.1.0.app/Contents/Developer/Toolchains/XcodeDefault.xctoolchain/usr/local/lib/swift/host/plugins -o /Users/admin/builder/spi-builder-workspace/.derivedData/Build/Intermediates.noindex/CameraView.build/Debug-appletvos/CameraView.build/Objects-normal/arm64/CameraView.o -index-unit-output-path /CameraView.build/Debug-appletvos/CameraView.build/Objects-normal/arm64/CameraView.o -index-store-path /Users/admin/builder/spi-builder-workspace/.derivedData/Index.noindex/DataStore -index-system-modules
** BUILD FAILED **
The following build commands failed:
	EmitSwiftModule normal arm64 (in target 'CameraView' from project 'CameraView')
	SwiftEmitModule normal arm64 Emitting\ module\ for\ CameraView (in target 'CameraView' from project 'CameraView')
	Building workspace spi-builder-workspace with scheme CameraView
(3 failures)
BUILD FAILURE 6.0 tvOS