The Swift Package Index logo.Swift Package Index

Track the adoption of Swift 6 strict concurrency checks for data race safety. How many packages are Ready for Swift 6?

Build Information

Failed to build ScrollViewRTL, reference main (58a30b), with Swift 6.0 for macOS (Xcode) using Xcode 16.2 on 30 Nov 2024 20:14:48 UTC.

Build Command

env DEVELOPER_DIR=/Applications/Xcode-16.1.0.app xcrun xcodebuild -IDEClonedSourcePackagesDirPathOverride=$PWD/.dependencies -skipMacroValidation -skipPackagePluginValidation -derivedDataPath $PWD/.derivedData build -scheme ScrollViewRTL -destination platform=macOS,arch=arm64 OTHER_SWIFT_FLAGS=-stats-output-dir .stats -strict-concurrency=complete -enable-upcoming-feature StrictConcurrency -enable-upcoming-feature DisableOutwardActorInference -enable-upcoming-feature GlobalActorIsolatedTypesUsability -enable-upcoming-feature InferSendableFromCaptures

Build Log

========================================
RunAll
========================================
Builder version: 4.58.1
Interrupt handler set up.
========================================
Checkout
========================================
Clone URL: https://github.com/Muhammadbarznji/ScrollViewRTL.git
Reference: main
Initialized empty Git repository in /Users/admin/builder/spi-builder-workspace/.git/
From https://github.com/Muhammadbarznji/ScrollViewRTL
 * branch            main       -> FETCH_HEAD
 * [new branch]      main       -> origin/main
HEAD is now at 58a30b0 Update README.md
Cloned https://github.com/Muhammadbarznji/ScrollViewRTL.git
Revision (git rev-parse @):
58a30b0d80cdb0c930fe0e318f688e170c00c6c8
SUCCESS checkout https://github.com/Muhammadbarznji/ScrollViewRTL.git at main
========================================
Build
========================================
Selected platform:         macosXcodebuild
Swift version:             6.0
Building package at path:  $PWD
https://github.com/Muhammadbarznji/ScrollViewRTL.git
{
  "dependencies" : [
  ],
  "manifest_display_name" : "ScrollViewRTL",
  "name" : "ScrollViewRTL",
  "path" : "/Users/admin/builder/spi-builder-workspace",
  "platforms" : [
    {
      "name" : "macos",
      "version" : "10.14"
    },
    {
      "name" : "ios",
      "version" : "13.0"
    },
    {
      "name" : "tvos",
      "version" : "13.0"
    }
  ],
  "products" : [
    {
      "name" : "ScrollViewRTL",
      "targets" : [
        "ScrollViewRTL"
      ],
      "type" : {
        "library" : [
          "automatic"
        ]
      }
    }
  ],
  "targets" : [
    {
      "c99name" : "ScrollViewRTLTests",
      "module_type" : "SwiftTarget",
      "name" : "ScrollViewRTLTests",
      "path" : "Tests/ScrollViewRTLTests",
      "sources" : [
        "ScrollViewRTLTests.swift"
      ],
      "target_dependencies" : [
        "ScrollViewRTL"
      ],
      "type" : "test"
    },
    {
      "c99name" : "ScrollViewRTL",
      "module_type" : "SwiftTarget",
      "name" : "ScrollViewRTL",
      "path" : "Sources/ScrollViewRTL",
      "product_memberships" : [
        "ScrollViewRTL"
      ],
      "sources" : [
        "ScrollViewRTL.swift"
      ],
      "type" : "library"
    }
  ],
  "tools_version" : "5.9"
}
Command line invocation:
    /Applications/Xcode-16.1.0.app/Contents/Developer/usr/bin/xcodebuild -IDEClonedSourcePackagesDirPathOverride=/Users/admin/builder/spi-builder-workspace/.dependencies -resolvePackageDependencies
User defaults from command line:
    IDEClonedSourcePackagesDirPathOverride = /Users/admin/builder/spi-builder-workspace/.dependencies
    IDEPackageSupportUseBuiltinSCM = YES
Resolve Package Graph
Resolve Package Graph
Resolved source packages:
  ScrollViewRTL: /Users/admin/builder/spi-builder-workspace
resolved source packages: ScrollViewRTL
{
  "dependencies" : [
  ],
  "manifest_display_name" : "ScrollViewRTL",
  "name" : "ScrollViewRTL",
  "path" : "/Users/admin/builder/spi-builder-workspace",
  "platforms" : [
    {
      "name" : "macos",
      "version" : "10.14"
    },
    {
      "name" : "ios",
      "version" : "13.0"
    },
    {
      "name" : "tvos",
      "version" : "13.0"
    }
  ],
  "products" : [
    {
      "name" : "ScrollViewRTL",
      "targets" : [
        "ScrollViewRTL"
      ],
      "type" : {
        "library" : [
          "automatic"
        ]
      }
    }
  ],
  "targets" : [
    {
      "c99name" : "ScrollViewRTLTests",
      "module_type" : "SwiftTarget",
      "name" : "ScrollViewRTLTests",
      "path" : "Tests/ScrollViewRTLTests",
      "sources" : [
        "ScrollViewRTLTests.swift"
      ],
      "target_dependencies" : [
        "ScrollViewRTL"
      ],
      "type" : "test"
    },
    {
      "c99name" : "ScrollViewRTL",
      "module_type" : "SwiftTarget",
      "name" : "ScrollViewRTL",
      "path" : "Sources/ScrollViewRTL",
      "product_memberships" : [
        "ScrollViewRTL"
      ],
      "sources" : [
        "ScrollViewRTL.swift"
      ],
      "type" : "library"
    }
  ],
  "tools_version" : "5.9"
}
{
  "workspace" : {
    "name" : "spi-builder-workspace",
    "schemes" : [
      "ScrollViewRTL"
    ]
  }
}
Running build ...
env DEVELOPER_DIR=/Applications/Xcode-16.1.0.app xcrun xcodebuild -IDEClonedSourcePackagesDirPathOverride=$PWD/.dependencies -skipMacroValidation -skipPackagePluginValidation -derivedDataPath $PWD/.derivedData build -scheme ScrollViewRTL -destination platform=macOS,arch=arm64 OTHER_SWIFT_FLAGS=-stats-output-dir .stats -strict-concurrency=complete -enable-upcoming-feature StrictConcurrency -enable-upcoming-feature DisableOutwardActorInference -enable-upcoming-feature GlobalActorIsolatedTypesUsability -enable-upcoming-feature InferSendableFromCaptures
Command line invocation:
    /Applications/Xcode-16.1.0.app/Contents/Developer/usr/bin/xcodebuild -IDEClonedSourcePackagesDirPathOverride=/Users/admin/builder/spi-builder-workspace/.dependencies -skipMacroValidation -skipPackagePluginValidation -derivedDataPath /Users/admin/builder/spi-builder-workspace/.derivedData build -scheme ScrollViewRTL -destination platform=macOS,arch=arm64 "OTHER_SWIFT_FLAGS=-stats-output-dir .stats -strict-concurrency=complete -enable-upcoming-feature StrictConcurrency -enable-upcoming-feature DisableOutwardActorInference -enable-upcoming-feature GlobalActorIsolatedTypesUsability -enable-upcoming-feature InferSendableFromCaptures"
User defaults from command line:
    IDEClonedSourcePackagesDirPathOverride = /Users/admin/builder/spi-builder-workspace/.dependencies
    IDEDerivedDataPathOverride = /Users/admin/builder/spi-builder-workspace/.derivedData
    IDEPackageSupportUseBuiltinSCM = YES
Build settings from command line:
    OTHER_SWIFT_FLAGS = -stats-output-dir .stats -strict-concurrency=complete -enable-upcoming-feature StrictConcurrency -enable-upcoming-feature DisableOutwardActorInference -enable-upcoming-feature GlobalActorIsolatedTypesUsability -enable-upcoming-feature InferSendableFromCaptures
Resolve Package Graph
Resolved source packages:
  ScrollViewRTL: /Users/admin/builder/spi-builder-workspace
Prepare packages
ComputeTargetDependencyGraph
note: Building targets in dependency order
note: Target dependency graph (2 targets)
    Target 'ScrollViewRTL' in project 'ScrollViewRTL'
        ➜ Explicit dependency on target 'ScrollViewRTL' in project 'ScrollViewRTL'
    Target 'ScrollViewRTL' in project 'ScrollViewRTL' (no dependencies)
GatherProvisioningInputs
CreateBuildDescription
ExecuteExternalTool /Applications/Xcode-16.1.0.app/Contents/Developer/Toolchains/XcodeDefault.xctoolchain/usr/bin/clang -v -E -dM -isysroot /Applications/Xcode-16.1.0.app/Contents/Developer/Platforms/MacOSX.platform/Developer/SDKs/MacOSX15.1.sdk -x c -c /dev/null
ExecuteExternalTool /Applications/Xcode-16.1.0.app/Contents/Developer/Toolchains/XcodeDefault.xctoolchain/usr/bin/swiftc --version
ExecuteExternalTool /Applications/Xcode-16.1.0.app/Contents/Developer/Toolchains/XcodeDefault.xctoolchain/usr/bin/ld -version_details
Build description signature: 1c2c665f4876cad5be0a7d9cd7e69474
Build description path: /Users/admin/builder/spi-builder-workspace/.derivedData/Build/Intermediates.noindex/XCBuildData/1c2c665f4876cad5be0a7d9cd7e69474.xcbuilddata
CreateBuildDirectory /Users/admin/builder/spi-builder-workspace/.derivedData/Build/Products
    cd /Users/admin/builder/spi-builder-workspace/.swiftpm/xcode
    builtin-create-build-directory /Users/admin/builder/spi-builder-workspace/.derivedData/Build/Products
CreateBuildDirectory /Users/admin/builder/spi-builder-workspace/.derivedData/Build/Intermediates.noindex
    cd /Users/admin/builder/spi-builder-workspace/.swiftpm/xcode
    builtin-create-build-directory /Users/admin/builder/spi-builder-workspace/.derivedData/Build/Intermediates.noindex
ClangStatCache /Applications/Xcode-16.1.0.app/Contents/Developer/Toolchains/XcodeDefault.xctoolchain/usr/bin/clang-stat-cache /Applications/Xcode-16.1.0.app/Contents/Developer/Platforms/MacOSX.platform/Developer/SDKs/MacOSX15.1.sdk /Users/admin/builder/spi-builder-workspace/.derivedData/SDKStatCaches.noindex/macosx15.1-24B75-44d23fded74b714c58e69ec4af40d824.sdkstatcache
    cd /Users/admin/builder/spi-builder-workspace/.swiftpm/xcode
    /Applications/Xcode-16.1.0.app/Contents/Developer/Toolchains/XcodeDefault.xctoolchain/usr/bin/clang-stat-cache /Applications/Xcode-16.1.0.app/Contents/Developer/Platforms/MacOSX.platform/Developer/SDKs/MacOSX15.1.sdk -o /Users/admin/builder/spi-builder-workspace/.derivedData/SDKStatCaches.noindex/macosx15.1-24B75-44d23fded74b714c58e69ec4af40d824.sdkstatcache
CreateBuildDirectory /Users/admin/builder/spi-builder-workspace/.derivedData/Build/Products/Debug
    cd /Users/admin/builder/spi-builder-workspace/.swiftpm/xcode
    builtin-create-build-directory /Users/admin/builder/spi-builder-workspace/.derivedData/Build/Products/Debug
CreateBuildDirectory /Users/admin/builder/spi-builder-workspace/.derivedData/Build/Intermediates.noindex/EagerLinkingTBDs/Debug
    cd /Users/admin/builder/spi-builder-workspace/.swiftpm/xcode
    builtin-create-build-directory /Users/admin/builder/spi-builder-workspace/.derivedData/Build/Intermediates.noindex/EagerLinkingTBDs/Debug
CreateBuildDirectory /Users/admin/builder/spi-builder-workspace/.derivedData/Build/Products/Debug/PackageFrameworks
    cd /Users/admin/builder/spi-builder-workspace/.swiftpm/xcode
    builtin-create-build-directory /Users/admin/builder/spi-builder-workspace/.derivedData/Build/Products/Debug/PackageFrameworks
WriteAuxiliaryFile /Users/admin/builder/spi-builder-workspace/.derivedData/Build/Intermediates.noindex/ScrollViewRTL.build/Debug/ScrollViewRTL.build/ScrollViewRTL.modulemap (in target 'ScrollViewRTL' from project 'ScrollViewRTL')
    cd /Users/admin/builder/spi-builder-workspace
    write-file /Users/admin/builder/spi-builder-workspace/.derivedData/Build/Intermediates.noindex/ScrollViewRTL.build/Debug/ScrollViewRTL.build/ScrollViewRTL.modulemap
WriteAuxiliaryFile /Users/admin/builder/spi-builder-workspace/.derivedData/Build/Intermediates.noindex/ScrollViewRTL.build/Debug/ScrollViewRTL.build/ScrollViewRTL.DependencyMetadataFileList (in target 'ScrollViewRTL' from project 'ScrollViewRTL')
    cd /Users/admin/builder/spi-builder-workspace
    write-file /Users/admin/builder/spi-builder-workspace/.derivedData/Build/Intermediates.noindex/ScrollViewRTL.build/Debug/ScrollViewRTL.build/ScrollViewRTL.DependencyMetadataFileList
WriteAuxiliaryFile /Users/admin/builder/spi-builder-workspace/.derivedData/Build/Intermediates.noindex/ScrollViewRTL.build/Debug/ScrollViewRTL.build/Objects-normal/arm64/ScrollViewRTL.LinkFileList (in target 'ScrollViewRTL' from project 'ScrollViewRTL')
    cd /Users/admin/builder/spi-builder-workspace
    write-file /Users/admin/builder/spi-builder-workspace/.derivedData/Build/Intermediates.noindex/ScrollViewRTL.build/Debug/ScrollViewRTL.build/Objects-normal/arm64/ScrollViewRTL.LinkFileList
WriteAuxiliaryFile /Users/admin/builder/spi-builder-workspace/.derivedData/Build/Intermediates.noindex/ScrollViewRTL.build/Debug/ScrollViewRTL.build/Objects-normal/arm64/ScrollViewRTL_const_extract_protocols.json (in target 'ScrollViewRTL' from project 'ScrollViewRTL')
    cd /Users/admin/builder/spi-builder-workspace
    write-file /Users/admin/builder/spi-builder-workspace/.derivedData/Build/Intermediates.noindex/ScrollViewRTL.build/Debug/ScrollViewRTL.build/Objects-normal/arm64/ScrollViewRTL_const_extract_protocols.json
WriteAuxiliaryFile /Users/admin/builder/spi-builder-workspace/.derivedData/Build/Intermediates.noindex/ScrollViewRTL.build/Debug/ScrollViewRTL.build/Objects-normal/arm64/ScrollViewRTL.SwiftFileList (in target 'ScrollViewRTL' from project 'ScrollViewRTL')
    cd /Users/admin/builder/spi-builder-workspace
    write-file /Users/admin/builder/spi-builder-workspace/.derivedData/Build/Intermediates.noindex/ScrollViewRTL.build/Debug/ScrollViewRTL.build/Objects-normal/arm64/ScrollViewRTL.SwiftFileList
WriteAuxiliaryFile /Users/admin/builder/spi-builder-workspace/.derivedData/Build/Intermediates.noindex/ScrollViewRTL.build/Debug/ScrollViewRTL.build/Objects-normal/arm64/ScrollViewRTL-OutputFileMap.json (in target 'ScrollViewRTL' from project 'ScrollViewRTL')
    cd /Users/admin/builder/spi-builder-workspace
    write-file /Users/admin/builder/spi-builder-workspace/.derivedData/Build/Intermediates.noindex/ScrollViewRTL.build/Debug/ScrollViewRTL.build/Objects-normal/arm64/ScrollViewRTL-OutputFileMap.json
Copy /Users/admin/builder/spi-builder-workspace/.derivedData/Build/Intermediates.noindex/GeneratedModuleMaps/ScrollViewRTL.modulemap /Users/admin/builder/spi-builder-workspace/.derivedData/Build/Intermediates.noindex/ScrollViewRTL.build/Debug/ScrollViewRTL.build/ScrollViewRTL.modulemap (in target 'ScrollViewRTL' from project 'ScrollViewRTL')
    cd /Users/admin/builder/spi-builder-workspace
    builtin-copy -exclude .DS_Store -exclude CVS -exclude .svn -exclude .git -exclude .hg -resolve-src-symlinks /Users/admin/builder/spi-builder-workspace/.derivedData/Build/Intermediates.noindex/ScrollViewRTL.build/Debug/ScrollViewRTL.build/ScrollViewRTL.modulemap /Users/admin/builder/spi-builder-workspace/.derivedData/Build/Intermediates.noindex/GeneratedModuleMaps
SwiftDriver ScrollViewRTL normal arm64 com.apple.xcode.tools.swift.compiler (in target 'ScrollViewRTL' from project 'ScrollViewRTL')
    cd /Users/admin/builder/spi-builder-workspace/.swiftpm/xcode
    builtin-SwiftDriver -- /Applications/Xcode-16.1.0.app/Contents/Developer/Toolchains/XcodeDefault.xctoolchain/usr/bin/swiftc -module-name ScrollViewRTL -Onone -enforce-exclusivity\=checked @/Users/admin/builder/spi-builder-workspace/.derivedData/Build/Intermediates.noindex/ScrollViewRTL.build/Debug/ScrollViewRTL.build/Objects-normal/arm64/ScrollViewRTL.SwiftFileList -DSWIFT_PACKAGE -DDEBUG -stats-output-dir .stats -strict-concurrency\=complete -enable-upcoming-feature StrictConcurrency -enable-upcoming-feature DisableOutwardActorInference -enable-upcoming-feature GlobalActorIsolatedTypesUsability -enable-upcoming-feature InferSendableFromCaptures -plugin-path /Applications/Xcode-16.1.0.app/Contents/Developer/Toolchains/XcodeDefault.xctoolchain/usr/lib/swift/host/plugins/testing -enable-experimental-feature DebugDescriptionMacro -sdk /Applications/Xcode-16.1.0.app/Contents/Developer/Platforms/MacOSX.platform/Developer/SDKs/MacOSX15.1.sdk -target arm64-apple-macos10.14 -g -module-cache-path /Users/admin/builder/spi-builder-workspace/.derivedData/ModuleCache.noindex -Xfrontend -serialize-debugging-options -profile-coverage-mapping -profile-generate -enable-testing -index-store-path /Users/admin/builder/spi-builder-workspace/.derivedData/Index.noindex/DataStore -enable-experimental-feature OpaqueTypeErasure -Xcc -D_LIBCPP_HARDENING_MODE\=_LIBCPP_HARDENING_MODE_DEBUG -swift-version 5 -I /Users/admin/builder/spi-builder-workspace/.derivedData/Build/Products/Debug -I /Applications/Xcode-16.1.0.app/Contents/Developer/Platforms/MacOSX.platform/Developer/usr/lib -F /Users/admin/builder/spi-builder-workspace/.derivedData/Build/Products/Debug -F /Applications/Xcode-16.1.0.app/Contents/Developer/Platforms/MacOSX.platform/Developer/Library/Frameworks -parse-as-library -c -j10 -enable-batch-mode -incremental -Xcc -ivfsstatcache -Xcc /Users/admin/builder/spi-builder-workspace/.derivedData/SDKStatCaches.noindex/macosx15.1-24B75-44d23fded74b714c58e69ec4af40d824.sdkstatcache -output-file-map /Users/admin/builder/spi-builder-workspace/.derivedData/Build/Intermediates.noindex/ScrollViewRTL.build/Debug/ScrollViewRTL.build/Objects-normal/arm64/ScrollViewRTL-OutputFileMap.json -use-frontend-parseable-output -save-temps -no-color-diagnostics -serialize-diagnostics -emit-dependencies -emit-module -emit-module-path /Users/admin/builder/spi-builder-workspace/.derivedData/Build/Intermediates.noindex/ScrollViewRTL.build/Debug/ScrollViewRTL.build/Objects-normal/arm64/ScrollViewRTL.swiftmodule -validate-clang-modules-once -clang-build-session-file /Users/admin/builder/spi-builder-workspace/.derivedData/ModuleCache.noindex/Session.modulevalidation -package-name spi_builder_workspace -Xcc -I/Users/admin/builder/spi-builder-workspace/.derivedData/Build/Intermediates.noindex/ScrollViewRTL.build/Debug/ScrollViewRTL.build/swift-overrides.hmap -emit-const-values -Xfrontend -const-gather-protocols-file -Xfrontend /Users/admin/builder/spi-builder-workspace/.derivedData/Build/Intermediates.noindex/ScrollViewRTL.build/Debug/ScrollViewRTL.build/Objects-normal/arm64/ScrollViewRTL_const_extract_protocols.json -Xcc -I/Users/admin/builder/spi-builder-workspace/.derivedData/Build/Products/Debug/include -Xcc -I/Users/admin/builder/spi-builder-workspace/.derivedData/Build/Intermediates.noindex/ScrollViewRTL.build/Debug/ScrollViewRTL.build/DerivedSources-normal/arm64 -Xcc -I/Users/admin/builder/spi-builder-workspace/.derivedData/Build/Intermediates.noindex/ScrollViewRTL.build/Debug/ScrollViewRTL.build/DerivedSources/arm64 -Xcc -I/Users/admin/builder/spi-builder-workspace/.derivedData/Build/Intermediates.noindex/ScrollViewRTL.build/Debug/ScrollViewRTL.build/DerivedSources -Xcc -DSWIFT_PACKAGE -Xcc -DDEBUG\=1 -emit-objc-header -emit-objc-header-path /Users/admin/builder/spi-builder-workspace/.derivedData/Build/Intermediates.noindex/ScrollViewRTL.build/Debug/ScrollViewRTL.build/Objects-normal/arm64/ScrollViewRTL-Swift.h -working-directory /Users/admin/builder/spi-builder-workspace/.swiftpm/xcode -experimental-emit-module-separately -disable-cmo
SwiftEmitModule normal arm64 Emitting\ module\ for\ ScrollViewRTL (in target 'ScrollViewRTL' from project 'ScrollViewRTL')
    cd /Users/admin/builder/spi-builder-workspace/.swiftpm/xcode
    builtin-swiftTaskExecution -- /Applications/Xcode-16.1.0.app/Contents/Developer/Toolchains/XcodeDefault.xctoolchain/usr/bin/swift-frontend -frontend -emit-module -experimental-skip-non-inlinable-function-bodies-without-types /Users/admin/builder/spi-builder-workspace/Sources/ScrollViewRTL/ScrollViewRTL.swift -target arm64-apple-macos10.14 -Xllvm -aarch64-use-tbi -enable-objc-interop -sdk /Applications/Xcode-16.1.0.app/Contents/Developer/Platforms/MacOSX.platform/Developer/SDKs/MacOSX15.1.sdk -I /Users/admin/builder/spi-builder-workspace/.derivedData/Build/Products/Debug -I /Applications/Xcode-16.1.0.app/Contents/Developer/Platforms/MacOSX.platform/Developer/usr/lib -F /Users/admin/builder/spi-builder-workspace/.derivedData/Build/Products/Debug -F /Applications/Xcode-16.1.0.app/Contents/Developer/Platforms/MacOSX.platform/Developer/Library/Frameworks -no-color-diagnostics -enable-testing -g -debug-info-format\=dwarf -dwarf-version\=4 -module-cache-path /Users/admin/builder/spi-builder-workspace/.derivedData/ModuleCache.noindex -profile-generate -profile-coverage-mapping -swift-version 5 -enforce-exclusivity\=checked -stats-output-dir /Users/admin/builder/spi-builder-workspace/.swiftpm/xcode/.stats -Onone -D SWIFT_PACKAGE -D DEBUG -serialize-debugging-options -const-gather-protocols-file /Users/admin/builder/spi-builder-workspace/.derivedData/Build/Intermediates.noindex/ScrollViewRTL.build/Debug/ScrollViewRTL.build/Objects-normal/arm64/ScrollViewRTL_const_extract_protocols.json -enable-experimental-feature DebugDescriptionMacro -enable-experimental-feature OpaqueTypeErasure -enable-upcoming-feature StrictConcurrency -enable-upcoming-feature DisableOutwardActorInference -enable-upcoming-feature GlobalActorIsolatedTypesUsability -enable-upcoming-feature InferSendableFromCaptures -strict-concurrency\=complete -empty-abi-descriptor -plugin-path /Applications/Xcode-16.1.0.app/Contents/Developer/Toolchains/XcodeDefault.xctoolchain/usr/lib/swift/host/plugins/testing -validate-clang-modules-once -clang-build-session-file /Users/admin/builder/spi-builder-workspace/.derivedData/ModuleCache.noindex/Session.modulevalidation -Xcc -working-directory -Xcc /Users/admin/builder/spi-builder-workspace/.swiftpm/xcode -resource-dir /Applications/Xcode-16.1.0.app/Contents/Developer/Toolchains/XcodeDefault.xctoolchain/usr/lib/swift -enable-anonymous-context-mangled-names -file-compilation-dir /Users/admin/builder/spi-builder-workspace/.swiftpm/xcode -Xcc -D_LIBCPP_HARDENING_MODE\=_LIBCPP_HARDENING_MODE_DEBUG -Xcc -ivfsstatcache -Xcc /Users/admin/builder/spi-builder-workspace/.derivedData/SDKStatCaches.noindex/macosx15.1-24B75-44d23fded74b714c58e69ec4af40d824.sdkstatcache -Xcc -I/Users/admin/builder/spi-builder-workspace/.derivedData/Build/Intermediates.noindex/ScrollViewRTL.build/Debug/ScrollViewRTL.build/swift-overrides.hmap -Xcc -I/Users/admin/builder/spi-builder-workspace/.derivedData/Build/Products/Debug/include -Xcc -I/Users/admin/builder/spi-builder-workspace/.derivedData/Build/Intermediates.noindex/ScrollViewRTL.build/Debug/ScrollViewRTL.build/DerivedSources-normal/arm64 -Xcc -I/Users/admin/builder/spi-builder-workspace/.derivedData/Build/Intermediates.noindex/ScrollViewRTL.build/Debug/ScrollViewRTL.build/DerivedSources/arm64 -Xcc -I/Users/admin/builder/spi-builder-workspace/.derivedData/Build/Intermediates.noindex/ScrollViewRTL.build/Debug/ScrollViewRTL.build/DerivedSources -Xcc -DSWIFT_PACKAGE -Xcc -DDEBUG\=1 -module-name ScrollViewRTL -package-name spi_builder_workspace -frontend-parseable-output -disable-clang-spi -target-sdk-version 15.1 -target-sdk-name macosx15.1 -external-plugin-path /Applications/Xcode-16.1.0.app/Contents/Developer/Platforms/MacOSX.platform/Developer/usr/lib/swift/host/plugins\#/Applications/Xcode-16.1.0.app/Contents/Developer/Platforms/MacOSX.platform/Developer/usr/bin/swift-plugin-server -external-plugin-path /Applications/Xcode-16.1.0.app/Contents/Developer/Platforms/MacOSX.platform/Developer/usr/local/lib/swift/host/plugins\#/Applications/Xcode-16.1.0.app/Contents/Developer/Platforms/MacOSX.platform/Developer/usr/bin/swift-plugin-server -plugin-path /Applications/Xcode-16.1.0.app/Contents/Developer/Toolchains/XcodeDefault.xctoolchain/usr/lib/swift/host/plugins -plugin-path /Applications/Xcode-16.1.0.app/Contents/Developer/Toolchains/XcodeDefault.xctoolchain/usr/local/lib/swift/host/plugins -emit-module-doc-path /Users/admin/builder/spi-builder-workspace/.derivedData/Build/Intermediates.noindex/ScrollViewRTL.build/Debug/ScrollViewRTL.build/Objects-normal/arm64/ScrollViewRTL.swiftdoc -emit-module-source-info-path /Users/admin/builder/spi-builder-workspace/.derivedData/Build/Intermediates.noindex/ScrollViewRTL.build/Debug/ScrollViewRTL.build/Objects-normal/arm64/ScrollViewRTL.swiftsourceinfo -emit-objc-header-path /Users/admin/builder/spi-builder-workspace/.derivedData/Build/Intermediates.noindex/ScrollViewRTL.build/Debug/ScrollViewRTL.build/Objects-normal/arm64/ScrollViewRTL-Swift.h -serialize-diagnostics-path /Users/admin/builder/spi-builder-workspace/.derivedData/Build/Intermediates.noindex/ScrollViewRTL.build/Debug/ScrollViewRTL.build/Objects-normal/arm64/ScrollViewRTL-master-emit-module.dia -emit-dependencies-path /Users/admin/builder/spi-builder-workspace/.derivedData/Build/Intermediates.noindex/ScrollViewRTL.build/Debug/ScrollViewRTL.build/Objects-normal/arm64/ScrollViewRTL-master-emit-module.d -parse-as-library -o /Users/admin/builder/spi-builder-workspace/.derivedData/Build/Intermediates.noindex/ScrollViewRTL.build/Debug/ScrollViewRTL.build/Objects-normal/arm64/ScrollViewRTL.swiftmodule -emit-abi-descriptor-path /Users/admin/builder/spi-builder-workspace/.derivedData/Build/Intermediates.noindex/ScrollViewRTL.build/Debug/ScrollViewRTL.build/Objects-normal/arm64/ScrollViewRTL.abi.json
SwiftCompile normal arm64 /Users/admin/builder/spi-builder-workspace/Sources/ScrollViewRTL/ScrollViewRTL.swift (in target 'ScrollViewRTL' from project 'ScrollViewRTL')
    cd /Users/admin/builder/spi-builder-workspace/.swiftpm/xcode
    /Applications/Xcode-16.1.0.app/Contents/Developer/Toolchains/XcodeDefault.xctoolchain/usr/bin/swift-frontend -emit-module -experimental-skip-non-inlinable-function-bodies-without-types /Users/admin/builder/spi-builder-workspace/Sources/ScrollViewRTL/ScrollViewRTL.swift -target arm64-apple-macos10.14 -Xllvm -aarch64-use-tbi -enable-objc-interop -sdk /Applications/Xcode-16.1.0.app/Contents/Developer/Platforms/MacOSX.platform/Developer/SDKs/MacOSX15.1.sdk -I /Users/admin/builder/spi-builder-workspace/.derivedData/Build/Products/Debug -I /Applications/Xcode-16.1.0.app/Contents/Developer/Platforms/MacOSX.platform/Developer/usr/lib -F /Users/admin/builder/spi-builder-workspace/.derivedData/Build/Products/Debug -F /Applications/Xcode-16.1.0.app/Contents/Developer/Platforms/MacOSX.platform/Developer/Library/Frameworks -no-color-diagnostics -enable-testing -g -debug-info-format\=dwarf -dwarf-version\=4 -module-cache-path /Users/admin/builder/spi-builder-workspace/.derivedData/ModuleCache.noindex -profile-generate -profile-coverage-mapping -swift-version 5 -enforce-exclusivity\=checked -stats-output-dir /Users/admin/builder/spi-builder-workspace/.swiftpm/xcode/.stats -Onone -D SWIFT_PACKAGE -D DEBUG -serialize-debugging-options -const-gather-protocols-file /Users/admin/builder/spi-builder-workspace/.derivedData/Build/Intermediates.noindex/ScrollViewRTL.build/Debug/ScrollViewRTL.build/Objects-normal/arm64/ScrollViewRTL_const_extract_protocols.json -enable-experimental-feature DebugDescriptionMacro -enable-experimental-feature OpaqueTypeErasure -enable-upcoming-feature StrictConcurrency -enable-upcoming-feature DisableOutwardActorInference -enable-upcoming-feature GlobalActorIsolatedTypesUsability -enable-upcoming-feature InferSendableFromCaptures -strict-concurrency\=complete -empty-abi-descriptor -plugin-path /Applications/Xcode-16.1.0.app/Contents/Developer/Toolchains/XcodeDefault.xctoolchain/usr/lib/swift/host/plugins/testing -validate-clang-modules-once -clang-build-session-file /Users/admin/builder/spi-builder-workspace/.derivedData/ModuleCache.noindex/Session.modulevalidation -Xcc -working-directory -Xcc /Users/admin/builder/spi-builder-workspace/.swiftpm/xcode -resource-dir /Applications/Xcode-16.1.0.app/Contents/Developer/Toolchains/XcodeDefault.xctoolchain/usr/lib/swift -enable-anonymous-context-mangled-names -file-compilation-dir /Users/admin/builder/spi-builder-workspace/.swiftpm/xcode -Xcc -D_LIBCPP_HARDENING_MODE\=_LIBCPP_HARDENING_MODE_DEBUG -Xcc -ivfsstatcache -Xcc /Users/admin/builder/spi-builder-workspace/.derivedData/SDKStatCaches.noindex/macosx15.1-24B75-44d23fded74b714c58e69ec4af40d824.sdkstatcache -Xcc -I/Users/admin/builder/spi-builder-workspace/.derivedData/Build/Intermediates.noindex/ScrollViewRTL.build/Debug/ScrollViewRTL.build/swift-overrides.hmap -Xcc -I/Users/admin/builder/spi-builder-workspace/.derivedData/Build/Products/Debug/include -Xcc -I/Users/admin/builder/spi-builder-workspace/.derivedData/Build/Intermediates.noindex/ScrollViewRTL.build/Debug/ScrollViewRTL.build/DerivedSources-normal/arm64 -Xcc -I/Users/admin/builder/spi-builder-workspace/.derivedData/Build/Intermediates.noindex/ScrollViewRTL.build/Debug/ScrollViewRTL.build/DerivedSources/arm64 -Xcc -I/Users/admin/builder/spi-builder-workspace/.derivedData/Build/Intermediates.noindex/ScrollViewRTL.build/Debug/ScrollViewRTL.build/DerivedSources -Xcc -DSWIFT_PACKAGE -Xcc -DDEBUG\=1 -module-name ScrollViewRTL -package-name spi_builder_workspace -frontend-parseable-output -disable-clang-spi -target-sdk-version 15.1 -target-sdk-name macosx15.1 -external-plugin-path /Applications/Xcode-16.1.0.app/Contents/Developer/Platforms/MacOSX.platform/Developer/usr/lib/swift/host/plugins\#/Applications/Xcode-16.1.0.app/Contents/Developer/Platforms/MacOSX.platform/Developer/usr/bin/swift-plugin-server -external-plugin-path /Applications/Xcode-16.1.0.app/Contents/Developer/Platforms/MacOSX.platform/Developer/usr/local/lib/swift/host/plugins\#/Applications/Xcode-16.1.0.app/Contents/Developer/Platforms/MacOSX.platform/Developer/usr/bin/swift-plugin-server -plugin-path /Applications/Xcode-16.1.0.app/Contents/Developer/Toolchains/XcodeDefault.xctoolchain/usr/lib/swift/host/plugins -plugin-path /Applications/Xcode-16.1.0.app/Contents/Developer/Toolchains/XcodeDefault.xctoolchain/usr/local/lib/swift/host/plugins -emit-module-doc-path /Users/admin/builder/spi-builder-workspace/.derivedData/Build/Intermediates.noindex/ScrollViewRTL.build/Debug/ScrollViewRTL.build/Objects-normal/arm64/ScrollViewRTL.swiftdoc -emit-module-source-info-path /Users/admin/builder/spi-builder-workspace/.derivedData/Build/Intermediates.noindex/ScrollViewRTL.build/Debug/ScrollViewRTL.build/Objects-normal/arm64/ScrollViewRTL.swiftsourceinfo -emit-objc-header-path /Users/admin/builder/spi-builder-workspace/.derivedData/Build/Intermediates.noindex/ScrollViewRTL.build/Debug/ScrollViewRTL.build/Objects-normal/arm64/ScrollViewRTL-Swift.h -serialize-diagnostics-path /Users/admin/builder/spi-builder-workspace/.derivedData/Build/Intermediates.noindex/ScrollViewRTL.build/Debug/ScrollViewRTL.build/Objects-normal/arm64/ScrollViewRTL-master-emit-module.dia -emit-dependencies-path /Users/admin/builder/spi-builder-workspace/.derivedData/Build/Intermediates.noindex/ScrollViewRTL.build/Debug/ScrollViewRTL.build/Objects-normal/arm64/ScrollViewRTL-master-emit-module.d -parse-as-library -o /Users/admin/builder/spi-builder-workspace/.derivedData/Build/Intermediates.noindex/ScrollViewRTL.build/Debug/ScrollViewRTL.build/Objects-normal/arm64/ScrollViewRTL.swiftmodule -emit-abi-descriptor-path /Users/admin/builder/spi-builder-workspace/.derivedData/Build/Intermediates.noindex/ScrollViewRTL.build/Debug/ScrollViewRTL.build/Objects-normal/arm64/ScrollViewRTL.abi.json
/Users/admin/builder/spi-builder-workspace/Sources/ScrollViewRTL/ScrollViewRTL.swift:33:20: error: 'layoutDirection' is only available in macOS 10.15 or newer
    @Environment(\.layoutDirection) private var direction
                   ^
/Users/admin/builder/spi-builder-workspace/Sources/ScrollViewRTL/ScrollViewRTL.swift:28:15: note: add @available attribute to enclosing generic struct
public struct ScrollViewRTL<Content: View>: View {
              ^
/Users/admin/builder/spi-builder-workspace/Sources/ScrollViewRTL/ScrollViewRTL.swift:30:6: error: 'ViewBuilder' is only available in macOS 10.15 or newer
    @ViewBuilder var content: Content
     ^
/Users/admin/builder/spi-builder-workspace/Sources/ScrollViewRTL/ScrollViewRTL.swift:28:15: note: add @available attribute to enclosing generic struct
public struct ScrollViewRTL<Content: View>: View {
              ^
/Users/admin/builder/spi-builder-workspace/Sources/ScrollViewRTL/ScrollViewRTL.swift:33:6: error: 'Environment' is only available in macOS 10.15 or newer
    @Environment(\.layoutDirection) private var direction
     ^
/Users/admin/builder/spi-builder-workspace/Sources/ScrollViewRTL/ScrollViewRTL.swift:28:15: note: add @available attribute to enclosing generic struct
public struct ScrollViewRTL<Content: View>: View {
              ^
/Users/admin/builder/spi-builder-workspace/Sources/ScrollViewRTL/ScrollViewRTL.swift:47:63: error: 'ViewBuilder' is only available in macOS 10.15 or newer
    public init(type: RowType, showsIndicators: Bool = true, @ViewBuilder content: () -> Content) {
                                                              ^
/Users/admin/builder/spi-builder-workspace/Sources/ScrollViewRTL/ScrollViewRTL.swift:47:12: note: add @available attribute to enclosing initializer
    public init(type: RowType, showsIndicators: Bool = true, @ViewBuilder content: () -> Content) {
           ^
/Users/admin/builder/spi-builder-workspace/Sources/ScrollViewRTL/ScrollViewRTL.swift:28:15: note: add @available attribute to enclosing generic struct
public struct ScrollViewRTL<Content: View>: View {
              ^
/Users/admin/builder/spi-builder-workspace/Sources/ScrollViewRTL/ScrollViewRTL.swift:54:27: error: 'View' is only available in macOS 10.15 or newer
    public var body: some View {
                          ^
/Users/admin/builder/spi-builder-workspace/Sources/ScrollViewRTL/ScrollViewRTL.swift:54:16: note: add @available attribute to enclosing property
    public var body: some View {
               ^
/Users/admin/builder/spi-builder-workspace/Sources/ScrollViewRTL/ScrollViewRTL.swift:28:15: note: add @available attribute to enclosing generic struct
public struct ScrollViewRTL<Content: View>: View {
              ^
/Users/admin/builder/spi-builder-workspace/Sources/ScrollViewRTL/ScrollViewRTL.swift:72:47: error: 'View' is only available in macOS 10.15 or newer
    private var scrollViewForEarlieriOS: some View {
                                              ^
/Users/admin/builder/spi-builder-workspace/Sources/ScrollViewRTL/ScrollViewRTL.swift:72:17: note: add @available attribute to enclosing property
    private var scrollViewForEarlieriOS: some View {
                ^
/Users/admin/builder/spi-builder-workspace/Sources/ScrollViewRTL/ScrollViewRTL.swift:28:15: note: add @available attribute to enclosing generic struct
public struct ScrollViewRTL<Content: View>: View {
              ^
/Users/admin/builder/spi-builder-workspace/Sources/ScrollViewRTL/ScrollViewRTL.swift:28:38: error: 'View' is only available in macOS 10.15 or newer
public struct ScrollViewRTL<Content: View>: View {
                                     ^
/Users/admin/builder/spi-builder-workspace/Sources/ScrollViewRTL/ScrollViewRTL.swift:28:15: note: add @available attribute to enclosing generic struct
public struct ScrollViewRTL<Content: View>: View {
              ^
/Users/admin/builder/spi-builder-workspace/Sources/ScrollViewRTL/ScrollViewRTL.swift:101:28: error: 'Axis' is only available in macOS 10.15 or newer
    public var scrollAxis: Axis.Set {
                           ^
/Users/admin/builder/spi-builder-workspace/Sources/ScrollViewRTL/ScrollViewRTL.swift:101:16: note: add @available attribute to enclosing property
    public var scrollAxis: Axis.Set {
               ^
/Users/admin/builder/spi-builder-workspace/Sources/ScrollViewRTL/ScrollViewRTL.swift:96:13: note: add @available attribute to enclosing enum
public enum RowType {
            ^
SwiftCompile normal arm64 Compiling\ ScrollViewRTL.swift /Users/admin/builder/spi-builder-workspace/Sources/ScrollViewRTL/ScrollViewRTL.swift (in target 'ScrollViewRTL' from project 'ScrollViewRTL')
    cd /Users/admin/builder/spi-builder-workspace/.swiftpm/xcode
    builtin-swiftTaskExecution -- /Applications/Xcode-16.1.0.app/Contents/Developer/Toolchains/XcodeDefault.xctoolchain/usr/bin/swift-frontend -frontend -c -primary-file /Users/admin/builder/spi-builder-workspace/Sources/ScrollViewRTL/ScrollViewRTL.swift -emit-dependencies-path /Users/admin/builder/spi-builder-workspace/.derivedData/Build/Intermediates.noindex/ScrollViewRTL.build/Debug/ScrollViewRTL.build/Objects-normal/arm64/ScrollViewRTL.d -emit-const-values-path /Users/admin/builder/spi-builder-workspace/.derivedData/Build/Intermediates.noindex/ScrollViewRTL.build/Debug/ScrollViewRTL.build/Objects-normal/arm64/ScrollViewRTL.swiftconstvalues -emit-reference-dependencies-path /Users/admin/builder/spi-builder-workspace/.derivedData/Build/Intermediates.noindex/ScrollViewRTL.build/Debug/ScrollViewRTL.build/Objects-normal/arm64/ScrollViewRTL.swiftdeps -serialize-diagnostics-path /Users/admin/builder/spi-builder-workspace/.derivedData/Build/Intermediates.noindex/ScrollViewRTL.build/Debug/ScrollViewRTL.build/Objects-normal/arm64/ScrollViewRTL.dia -target arm64-apple-macos10.14 -Xllvm -aarch64-use-tbi -enable-objc-interop -sdk /Applications/Xcode-16.1.0.app/Contents/Developer/Platforms/MacOSX.platform/Developer/SDKs/MacOSX15.1.sdk -I /Users/admin/builder/spi-builder-workspace/.derivedData/Build/Products/Debug -I /Applications/Xcode-16.1.0.app/Contents/Developer/Platforms/MacOSX.platform/Developer/usr/lib -F /Users/admin/builder/spi-builder-workspace/.derivedData/Build/Products/Debug -F /Applications/Xcode-16.1.0.app/Contents/Developer/Platforms/MacOSX.platform/Developer/Library/Frameworks -no-color-diagnostics -enable-testing -g -debug-info-format\=dwarf -dwarf-version\=4 -module-cache-path /Users/admin/builder/spi-builder-workspace/.derivedData/ModuleCache.noindex -profile-generate -profile-coverage-mapping -swift-version 5 -enforce-exclusivity\=checked -stats-output-dir /Users/admin/builder/spi-builder-workspace/.swiftpm/xcode/.stats -Onone -D SWIFT_PACKAGE -D DEBUG -serialize-debugging-options -const-gather-protocols-file /Users/admin/builder/spi-builder-workspace/.derivedData/Build/Intermediates.noindex/ScrollViewRTL.build/Debug/ScrollViewRTL.build/Objects-normal/arm64/ScrollViewRTL_const_extract_protocols.json -enable-experimental-feature DebugDescriptionMacro -enable-experimental-feature OpaqueTypeErasure -enable-upcoming-feature StrictConcurrency -enable-upcoming-feature DisableOutwardActorInference -enable-upcoming-feature GlobalActorIsolatedTypesUsability -enable-upcoming-feature InferSendableFromCaptures -strict-concurrency\=complete -empty-abi-descriptor -plugin-path /Applications/Xcode-16.1.0.app/Contents/Developer/Toolchains/XcodeDefault.xctoolchain/usr/lib/swift/host/plugins/testing -validate-clang-modules-once -clang-build-session-file /Users/admin/builder/spi-builder-workspace/.derivedData/ModuleCache.noindex/Session.modulevalidation -Xcc -working-directory -Xcc /Users/admin/builder/spi-builder-workspace/.swiftpm/xcode -resource-dir /Applications/Xcode-16.1.0.app/Contents/Developer/Toolchains/XcodeDefault.xctoolchain/usr/lib/swift -enable-anonymous-context-mangled-names -file-compilation-dir /Users/admin/builder/spi-builder-workspace/.swiftpm/xcode -Xcc -D_LIBCPP_HARDENING_MODE\=_LIBCPP_HARDENING_MODE_DEBUG -Xcc -ivfsstatcache -Xcc /Users/admin/builder/spi-builder-workspace/.derivedData/SDKStatCaches.noindex/macosx15.1-24B75-44d23fded74b714c58e69ec4af40d824.sdkstatcache -Xcc -I/Users/admin/builder/spi-builder-workspace/.derivedData/Build/Intermediates.noindex/ScrollViewRTL.build/Debug/ScrollViewRTL.build/swift-overrides.hmap -Xcc -I/Users/admin/builder/spi-builder-workspace/.derivedData/Build/Products/Debug/include -Xcc -I/Users/admin/builder/spi-builder-workspace/.derivedData/Build/Intermediates.noindex/ScrollViewRTL.build/Debug/ScrollViewRTL.build/DerivedSources-normal/arm64 -Xcc -I/Users/admin/builder/spi-builder-workspace/.derivedData/Build/Intermediates.noindex/ScrollViewRTL.build/Debug/ScrollViewRTL.build/DerivedSources/arm64 -Xcc -I/Users/admin/builder/spi-builder-workspace/.derivedData/Build/Intermediates.noindex/ScrollViewRTL.build/Debug/ScrollViewRTL.build/DerivedSources -Xcc -DSWIFT_PACKAGE -Xcc -DDEBUG\=1 -module-name ScrollViewRTL -package-name spi_builder_workspace -frontend-parseable-output -disable-clang-spi -target-sdk-version 15.1 -target-sdk-name macosx15.1 -external-plugin-path /Applications/Xcode-16.1.0.app/Contents/Developer/Platforms/MacOSX.platform/Developer/usr/lib/swift/host/plugins\#/Applications/Xcode-16.1.0.app/Contents/Developer/Platforms/MacOSX.platform/Developer/usr/bin/swift-plugin-server -external-plugin-path /Applications/Xcode-16.1.0.app/Contents/Developer/Platforms/MacOSX.platform/Developer/usr/local/lib/swift/host/plugins\#/Applications/Xcode-16.1.0.app/Contents/Developer/Platforms/MacOSX.platform/Developer/usr/bin/swift-plugin-server -plugin-path /Applications/Xcode-16.1.0.app/Contents/Developer/Toolchains/XcodeDefault.xctoolchain/usr/lib/swift/host/plugins -plugin-path /Applications/Xcode-16.1.0.app/Contents/Developer/Toolchains/XcodeDefault.xctoolchain/usr/local/lib/swift/host/plugins -parse-as-library -o /Users/admin/builder/spi-builder-workspace/.derivedData/Build/Intermediates.noindex/ScrollViewRTL.build/Debug/ScrollViewRTL.build/Objects-normal/arm64/ScrollViewRTL.o -index-unit-output-path /ScrollViewRTL.build/Debug/ScrollViewRTL.build/Objects-normal/arm64/ScrollViewRTL.o -index-store-path /Users/admin/builder/spi-builder-workspace/.derivedData/Index.noindex/DataStore -index-system-modules
SwiftCompile normal arm64 /Users/admin/builder/spi-builder-workspace/Sources/ScrollViewRTL/ScrollViewRTL.swift (in target 'ScrollViewRTL' from project 'ScrollViewRTL')
    cd /Users/admin/builder/spi-builder-workspace/.swiftpm/xcode
    /Applications/Xcode-16.1.0.app/Contents/Developer/Toolchains/XcodeDefault.xctoolchain/usr/bin/swift-frontend -c -primary-file /Users/admin/builder/spi-builder-workspace/Sources/ScrollViewRTL/ScrollViewRTL.swift -emit-dependencies-path /Users/admin/builder/spi-builder-workspace/.derivedData/Build/Intermediates.noindex/ScrollViewRTL.build/Debug/ScrollViewRTL.build/Objects-normal/arm64/ScrollViewRTL.d -emit-const-values-path /Users/admin/builder/spi-builder-workspace/.derivedData/Build/Intermediates.noindex/ScrollViewRTL.build/Debug/ScrollViewRTL.build/Objects-normal/arm64/ScrollViewRTL.swiftconstvalues -emit-reference-dependencies-path /Users/admin/builder/spi-builder-workspace/.derivedData/Build/Intermediates.noindex/ScrollViewRTL.build/Debug/ScrollViewRTL.build/Objects-normal/arm64/ScrollViewRTL.swiftdeps -serialize-diagnostics-path /Users/admin/builder/spi-builder-workspace/.derivedData/Build/Intermediates.noindex/ScrollViewRTL.build/Debug/ScrollViewRTL.build/Objects-normal/arm64/ScrollViewRTL.dia -target arm64-apple-macos10.14 -Xllvm -aarch64-use-tbi -enable-objc-interop -sdk /Applications/Xcode-16.1.0.app/Contents/Developer/Platforms/MacOSX.platform/Developer/SDKs/MacOSX15.1.sdk -I /Users/admin/builder/spi-builder-workspace/.derivedData/Build/Products/Debug -I /Applications/Xcode-16.1.0.app/Contents/Developer/Platforms/MacOSX.platform/Developer/usr/lib -F /Users/admin/builder/spi-builder-workspace/.derivedData/Build/Products/Debug -F /Applications/Xcode-16.1.0.app/Contents/Developer/Platforms/MacOSX.platform/Developer/Library/Frameworks -no-color-diagnostics -enable-testing -g -debug-info-format\=dwarf -dwarf-version\=4 -module-cache-path /Users/admin/builder/spi-builder-workspace/.derivedData/ModuleCache.noindex -profile-generate -profile-coverage-mapping -swift-version 5 -enforce-exclusivity\=checked -stats-output-dir /Users/admin/builder/spi-builder-workspace/.swiftpm/xcode/.stats -Onone -D SWIFT_PACKAGE -D DEBUG -serialize-debugging-options -const-gather-protocols-file /Users/admin/builder/spi-builder-workspace/.derivedData/Build/Intermediates.noindex/ScrollViewRTL.build/Debug/ScrollViewRTL.build/Objects-normal/arm64/ScrollViewRTL_const_extract_protocols.json -enable-experimental-feature DebugDescriptionMacro -enable-experimental-feature OpaqueTypeErasure -enable-upcoming-feature StrictConcurrency -enable-upcoming-feature DisableOutwardActorInference -enable-upcoming-feature GlobalActorIsolatedTypesUsability -enable-upcoming-feature InferSendableFromCaptures -strict-concurrency\=complete -empty-abi-descriptor -plugin-path /Applications/Xcode-16.1.0.app/Contents/Developer/Toolchains/XcodeDefault.xctoolchain/usr/lib/swift/host/plugins/testing -validate-clang-modules-once -clang-build-session-file /Users/admin/builder/spi-builder-workspace/.derivedData/ModuleCache.noindex/Session.modulevalidation -Xcc -working-directory -Xcc /Users/admin/builder/spi-builder-workspace/.swiftpm/xcode -resource-dir /Applications/Xcode-16.1.0.app/Contents/Developer/Toolchains/XcodeDefault.xctoolchain/usr/lib/swift -enable-anonymous-context-mangled-names -file-compilation-dir /Users/admin/builder/spi-builder-workspace/.swiftpm/xcode -Xcc -D_LIBCPP_HARDENING_MODE\=_LIBCPP_HARDENING_MODE_DEBUG -Xcc -ivfsstatcache -Xcc /Users/admin/builder/spi-builder-workspace/.derivedData/SDKStatCaches.noindex/macosx15.1-24B75-44d23fded74b714c58e69ec4af40d824.sdkstatcache -Xcc -I/Users/admin/builder/spi-builder-workspace/.derivedData/Build/Intermediates.noindex/ScrollViewRTL.build/Debug/ScrollViewRTL.build/swift-overrides.hmap -Xcc -I/Users/admin/builder/spi-builder-workspace/.derivedData/Build/Products/Debug/include -Xcc -I/Users/admin/builder/spi-builder-workspace/.derivedData/Build/Intermediates.noindex/ScrollViewRTL.build/Debug/ScrollViewRTL.build/DerivedSources-normal/arm64 -Xcc -I/Users/admin/builder/spi-builder-workspace/.derivedData/Build/Intermediates.noindex/ScrollViewRTL.build/Debug/ScrollViewRTL.build/DerivedSources/arm64 -Xcc -I/Users/admin/builder/spi-builder-workspace/.derivedData/Build/Intermediates.noindex/ScrollViewRTL.build/Debug/ScrollViewRTL.build/DerivedSources -Xcc -DSWIFT_PACKAGE -Xcc -DDEBUG\=1 -module-name ScrollViewRTL -package-name spi_builder_workspace -frontend-parseable-output -disable-clang-spi -target-sdk-version 15.1 -target-sdk-name macosx15.1 -external-plugin-path /Applications/Xcode-16.1.0.app/Contents/Developer/Platforms/MacOSX.platform/Developer/usr/lib/swift/host/plugins\#/Applications/Xcode-16.1.0.app/Contents/Developer/Platforms/MacOSX.platform/Developer/usr/bin/swift-plugin-server -external-plugin-path /Applications/Xcode-16.1.0.app/Contents/Developer/Platforms/MacOSX.platform/Developer/usr/local/lib/swift/host/plugins\#/Applications/Xcode-16.1.0.app/Contents/Developer/Platforms/MacOSX.platform/Developer/usr/bin/swift-plugin-server -plugin-path /Applications/Xcode-16.1.0.app/Contents/Developer/Toolchains/XcodeDefault.xctoolchain/usr/lib/swift/host/plugins -plugin-path /Applications/Xcode-16.1.0.app/Contents/Developer/Toolchains/XcodeDefault.xctoolchain/usr/local/lib/swift/host/plugins -parse-as-library -o /Users/admin/builder/spi-builder-workspace/.derivedData/Build/Intermediates.noindex/ScrollViewRTL.build/Debug/ScrollViewRTL.build/Objects-normal/arm64/ScrollViewRTL.o -index-unit-output-path /ScrollViewRTL.build/Debug/ScrollViewRTL.build/Objects-normal/arm64/ScrollViewRTL.o -index-store-path /Users/admin/builder/spi-builder-workspace/.derivedData/Index.noindex/DataStore -index-system-modules
--- xcodebuild: WARNING: Using the first of multiple matching destinations:
{ platform:macOS, arch:arm64, id:0000FE00-8C151E3703BE51BE, name:My Mac }
{ platform:macOS, arch:arm64, variant:Mac Catalyst, id:0000FE00-8C151E3703BE51BE, name:My Mac }
{ platform:macOS, arch:arm64, variant:DriverKit, id:0000FE00-8C151E3703BE51BE, name:My Mac }
{ platform:macOS, arch:arm64, variant:Designed for [iPad,iPhone], id:0000FE00-8C151E3703BE51BE, name:My Mac }
** BUILD FAILED **
The following build commands failed:
	SwiftCompile normal arm64 /Users/admin/builder/spi-builder-workspace/Sources/ScrollViewRTL/ScrollViewRTL.swift (in target 'ScrollViewRTL' from project 'ScrollViewRTL')
	SwiftEmitModule normal arm64 Emitting\ module\ for\ ScrollViewRTL (in target 'ScrollViewRTL' from project 'ScrollViewRTL')
	Building workspace spi-builder-workspace with scheme ScrollViewRTL
(3 failures)
Command line invocation:
    /Applications/Xcode-16.1.0.app/Contents/Developer/usr/bin/xcodebuild -IDEClonedSourcePackagesDirPathOverride=/Users/admin/builder/spi-builder-workspace/.dependencies -skipMacroValidation -skipPackagePluginValidation -derivedDataPath /Users/admin/builder/spi-builder-workspace/.derivedData build -scheme ScrollViewRTL -destination platform=macOS,arch=arm64 "OTHER_SWIFT_FLAGS=-stats-output-dir .stats -strict-concurrency=complete -enable-upcoming-feature StrictConcurrency -enable-upcoming-feature DisableOutwardActorInference -enable-upcoming-feature GlobalActorIsolatedTypesUsability -enable-upcoming-feature InferSendableFromCaptures"
User defaults from command line:
    IDEClonedSourcePackagesDirPathOverride = /Users/admin/builder/spi-builder-workspace/.dependencies
    IDEDerivedDataPathOverride = /Users/admin/builder/spi-builder-workspace/.derivedData
    IDEPackageSupportUseBuiltinSCM = YES
Build settings from command line:
    OTHER_SWIFT_FLAGS = -stats-output-dir .stats -strict-concurrency=complete -enable-upcoming-feature StrictConcurrency -enable-upcoming-feature DisableOutwardActorInference -enable-upcoming-feature GlobalActorIsolatedTypesUsability -enable-upcoming-feature InferSendableFromCaptures
Resolve Package Graph
Resolved source packages:
  ScrollViewRTL: /Users/admin/builder/spi-builder-workspace
Prepare packages
ComputeTargetDependencyGraph
note: Building targets in dependency order
note: Target dependency graph (2 targets)
    Target 'ScrollViewRTL' in project 'ScrollViewRTL'
        ➜ Explicit dependency on target 'ScrollViewRTL' in project 'ScrollViewRTL'
    Target 'ScrollViewRTL' in project 'ScrollViewRTL' (no dependencies)
GatherProvisioningInputs
CreateBuildDescription
ClangStatCache /Applications/Xcode-16.1.0.app/Contents/Developer/Toolchains/XcodeDefault.xctoolchain/usr/bin/clang-stat-cache /Applications/Xcode-16.1.0.app/Contents/Developer/Platforms/MacOSX.platform/Developer/SDKs/MacOSX15.1.sdk /Users/admin/builder/spi-builder-workspace/.derivedData/SDKStatCaches.noindex/macosx15.1-24B75-44d23fded74b714c58e69ec4af40d824.sdkstatcache
    cd /Users/admin/builder/spi-builder-workspace/.swiftpm/xcode
    /Applications/Xcode-16.1.0.app/Contents/Developer/Toolchains/XcodeDefault.xctoolchain/usr/bin/clang-stat-cache /Applications/Xcode-16.1.0.app/Contents/Developer/Platforms/MacOSX.platform/Developer/SDKs/MacOSX15.1.sdk -o /Users/admin/builder/spi-builder-workspace/.derivedData/SDKStatCaches.noindex/macosx15.1-24B75-44d23fded74b714c58e69ec4af40d824.sdkstatcache
SwiftDriver ScrollViewRTL normal arm64 com.apple.xcode.tools.swift.compiler (in target 'ScrollViewRTL' from project 'ScrollViewRTL')
    cd /Users/admin/builder/spi-builder-workspace/.swiftpm/xcode
    builtin-SwiftDriver -- /Applications/Xcode-16.1.0.app/Contents/Developer/Toolchains/XcodeDefault.xctoolchain/usr/bin/swiftc -module-name ScrollViewRTL -Onone -enforce-exclusivity\=checked @/Users/admin/builder/spi-builder-workspace/.derivedData/Build/Intermediates.noindex/ScrollViewRTL.build/Debug/ScrollViewRTL.build/Objects-normal/arm64/ScrollViewRTL.SwiftFileList -DSWIFT_PACKAGE -DDEBUG -stats-output-dir .stats -strict-concurrency\=complete -enable-upcoming-feature StrictConcurrency -enable-upcoming-feature DisableOutwardActorInference -enable-upcoming-feature GlobalActorIsolatedTypesUsability -enable-upcoming-feature InferSendableFromCaptures -plugin-path /Applications/Xcode-16.1.0.app/Contents/Developer/Toolchains/XcodeDefault.xctoolchain/usr/lib/swift/host/plugins/testing -enable-experimental-feature DebugDescriptionMacro -sdk /Applications/Xcode-16.1.0.app/Contents/Developer/Platforms/MacOSX.platform/Developer/SDKs/MacOSX15.1.sdk -target arm64-apple-macos10.14 -g -module-cache-path /Users/admin/builder/spi-builder-workspace/.derivedData/ModuleCache.noindex -Xfrontend -serialize-debugging-options -profile-coverage-mapping -profile-generate -enable-testing -index-store-path /Users/admin/builder/spi-builder-workspace/.derivedData/Index.noindex/DataStore -enable-experimental-feature OpaqueTypeErasure -Xcc -D_LIBCPP_HARDENING_MODE\=_LIBCPP_HARDENING_MODE_DEBUG -swift-version 5 -I /Users/admin/builder/spi-builder-workspace/.derivedData/Build/Products/Debug -I /Applications/Xcode-16.1.0.app/Contents/Developer/Platforms/MacOSX.platform/Developer/usr/lib -F /Users/admin/builder/spi-builder-workspace/.derivedData/Build/Products/Debug -F /Applications/Xcode-16.1.0.app/Contents/Developer/Platforms/MacOSX.platform/Developer/Library/Frameworks -parse-as-library -c -j10 -enable-batch-mode -incremental -Xcc -ivfsstatcache -Xcc /Users/admin/builder/spi-builder-workspace/.derivedData/SDKStatCaches.noindex/macosx15.1-24B75-44d23fded74b714c58e69ec4af40d824.sdkstatcache -output-file-map /Users/admin/builder/spi-builder-workspace/.derivedData/Build/Intermediates.noindex/ScrollViewRTL.build/Debug/ScrollViewRTL.build/Objects-normal/arm64/ScrollViewRTL-OutputFileMap.json -use-frontend-parseable-output -save-temps -no-color-diagnostics -serialize-diagnostics -emit-dependencies -emit-module -emit-module-path /Users/admin/builder/spi-builder-workspace/.derivedData/Build/Intermediates.noindex/ScrollViewRTL.build/Debug/ScrollViewRTL.build/Objects-normal/arm64/ScrollViewRTL.swiftmodule -validate-clang-modules-once -clang-build-session-file /Users/admin/builder/spi-builder-workspace/.derivedData/ModuleCache.noindex/Session.modulevalidation -package-name spi_builder_workspace -Xcc -I/Users/admin/builder/spi-builder-workspace/.derivedData/Build/Intermediates.noindex/ScrollViewRTL.build/Debug/ScrollViewRTL.build/swift-overrides.hmap -emit-const-values -Xfrontend -const-gather-protocols-file -Xfrontend /Users/admin/builder/spi-builder-workspace/.derivedData/Build/Intermediates.noindex/ScrollViewRTL.build/Debug/ScrollViewRTL.build/Objects-normal/arm64/ScrollViewRTL_const_extract_protocols.json -Xcc -I/Users/admin/builder/spi-builder-workspace/.derivedData/Build/Products/Debug/include -Xcc -I/Users/admin/builder/spi-builder-workspace/.derivedData/Build/Intermediates.noindex/ScrollViewRTL.build/Debug/ScrollViewRTL.build/DerivedSources-normal/arm64 -Xcc -I/Users/admin/builder/spi-builder-workspace/.derivedData/Build/Intermediates.noindex/ScrollViewRTL.build/Debug/ScrollViewRTL.build/DerivedSources/arm64 -Xcc -I/Users/admin/builder/spi-builder-workspace/.derivedData/Build/Intermediates.noindex/ScrollViewRTL.build/Debug/ScrollViewRTL.build/DerivedSources -Xcc -DSWIFT_PACKAGE -Xcc -DDEBUG\=1 -emit-objc-header -emit-objc-header-path /Users/admin/builder/spi-builder-workspace/.derivedData/Build/Intermediates.noindex/ScrollViewRTL.build/Debug/ScrollViewRTL.build/Objects-normal/arm64/ScrollViewRTL-Swift.h -working-directory /Users/admin/builder/spi-builder-workspace/.swiftpm/xcode -experimental-emit-module-separately -disable-cmo
SwiftEmitModule normal arm64 Emitting\ module\ for\ ScrollViewRTL (in target 'ScrollViewRTL' from project 'ScrollViewRTL')
    cd /Users/admin/builder/spi-builder-workspace/.swiftpm/xcode
    builtin-swiftTaskExecution -- /Applications/Xcode-16.1.0.app/Contents/Developer/Toolchains/XcodeDefault.xctoolchain/usr/bin/swift-frontend -frontend -emit-module -experimental-skip-non-inlinable-function-bodies-without-types /Users/admin/builder/spi-builder-workspace/Sources/ScrollViewRTL/ScrollViewRTL.swift -target arm64-apple-macos10.14 -Xllvm -aarch64-use-tbi -enable-objc-interop -sdk /Applications/Xcode-16.1.0.app/Contents/Developer/Platforms/MacOSX.platform/Developer/SDKs/MacOSX15.1.sdk -I /Users/admin/builder/spi-builder-workspace/.derivedData/Build/Products/Debug -I /Applications/Xcode-16.1.0.app/Contents/Developer/Platforms/MacOSX.platform/Developer/usr/lib -F /Users/admin/builder/spi-builder-workspace/.derivedData/Build/Products/Debug -F /Applications/Xcode-16.1.0.app/Contents/Developer/Platforms/MacOSX.platform/Developer/Library/Frameworks -no-color-diagnostics -enable-testing -g -debug-info-format\=dwarf -dwarf-version\=4 -module-cache-path /Users/admin/builder/spi-builder-workspace/.derivedData/ModuleCache.noindex -profile-generate -profile-coverage-mapping -swift-version 5 -enforce-exclusivity\=checked -stats-output-dir /Users/admin/builder/spi-builder-workspace/.swiftpm/xcode/.stats -Onone -D SWIFT_PACKAGE -D DEBUG -serialize-debugging-options -const-gather-protocols-file /Users/admin/builder/spi-builder-workspace/.derivedData/Build/Intermediates.noindex/ScrollViewRTL.build/Debug/ScrollViewRTL.build/Objects-normal/arm64/ScrollViewRTL_const_extract_protocols.json -enable-experimental-feature DebugDescriptionMacro -enable-experimental-feature OpaqueTypeErasure -enable-upcoming-feature StrictConcurrency -enable-upcoming-feature DisableOutwardActorInference -enable-upcoming-feature GlobalActorIsolatedTypesUsability -enable-upcoming-feature InferSendableFromCaptures -strict-concurrency\=complete -empty-abi-descriptor -plugin-path /Applications/Xcode-16.1.0.app/Contents/Developer/Toolchains/XcodeDefault.xctoolchain/usr/lib/swift/host/plugins/testing -validate-clang-modules-once -clang-build-session-file /Users/admin/builder/spi-builder-workspace/.derivedData/ModuleCache.noindex/Session.modulevalidation -Xcc -working-directory -Xcc /Users/admin/builder/spi-builder-workspace/.swiftpm/xcode -resource-dir /Applications/Xcode-16.1.0.app/Contents/Developer/Toolchains/XcodeDefault.xctoolchain/usr/lib/swift -enable-anonymous-context-mangled-names -file-compilation-dir /Users/admin/builder/spi-builder-workspace/.swiftpm/xcode -Xcc -D_LIBCPP_HARDENING_MODE\=_LIBCPP_HARDENING_MODE_DEBUG -Xcc -ivfsstatcache -Xcc /Users/admin/builder/spi-builder-workspace/.derivedData/SDKStatCaches.noindex/macosx15.1-24B75-44d23fded74b714c58e69ec4af40d824.sdkstatcache -Xcc -I/Users/admin/builder/spi-builder-workspace/.derivedData/Build/Intermediates.noindex/ScrollViewRTL.build/Debug/ScrollViewRTL.build/swift-overrides.hmap -Xcc -I/Users/admin/builder/spi-builder-workspace/.derivedData/Build/Products/Debug/include -Xcc -I/Users/admin/builder/spi-builder-workspace/.derivedData/Build/Intermediates.noindex/ScrollViewRTL.build/Debug/ScrollViewRTL.build/DerivedSources-normal/arm64 -Xcc -I/Users/admin/builder/spi-builder-workspace/.derivedData/Build/Intermediates.noindex/ScrollViewRTL.build/Debug/ScrollViewRTL.build/DerivedSources/arm64 -Xcc -I/Users/admin/builder/spi-builder-workspace/.derivedData/Build/Intermediates.noindex/ScrollViewRTL.build/Debug/ScrollViewRTL.build/DerivedSources -Xcc -DSWIFT_PACKAGE -Xcc -DDEBUG\=1 -module-name ScrollViewRTL -package-name spi_builder_workspace -frontend-parseable-output -disable-clang-spi -target-sdk-version 15.1 -target-sdk-name macosx15.1 -external-plugin-path /Applications/Xcode-16.1.0.app/Contents/Developer/Platforms/MacOSX.platform/Developer/usr/lib/swift/host/plugins\#/Applications/Xcode-16.1.0.app/Contents/Developer/Platforms/MacOSX.platform/Developer/usr/bin/swift-plugin-server -external-plugin-path /Applications/Xcode-16.1.0.app/Contents/Developer/Platforms/MacOSX.platform/Developer/usr/local/lib/swift/host/plugins\#/Applications/Xcode-16.1.0.app/Contents/Developer/Platforms/MacOSX.platform/Developer/usr/bin/swift-plugin-server -plugin-path /Applications/Xcode-16.1.0.app/Contents/Developer/Toolchains/XcodeDefault.xctoolchain/usr/lib/swift/host/plugins -plugin-path /Applications/Xcode-16.1.0.app/Contents/Developer/Toolchains/XcodeDefault.xctoolchain/usr/local/lib/swift/host/plugins -emit-module-doc-path /Users/admin/builder/spi-builder-workspace/.derivedData/Build/Intermediates.noindex/ScrollViewRTL.build/Debug/ScrollViewRTL.build/Objects-normal/arm64/ScrollViewRTL.swiftdoc -emit-module-source-info-path /Users/admin/builder/spi-builder-workspace/.derivedData/Build/Intermediates.noindex/ScrollViewRTL.build/Debug/ScrollViewRTL.build/Objects-normal/arm64/ScrollViewRTL.swiftsourceinfo -emit-objc-header-path /Users/admin/builder/spi-builder-workspace/.derivedData/Build/Intermediates.noindex/ScrollViewRTL.build/Debug/ScrollViewRTL.build/Objects-normal/arm64/ScrollViewRTL-Swift.h -serialize-diagnostics-path /Users/admin/builder/spi-builder-workspace/.derivedData/Build/Intermediates.noindex/ScrollViewRTL.build/Debug/ScrollViewRTL.build/Objects-normal/arm64/ScrollViewRTL-master-emit-module.dia -emit-dependencies-path /Users/admin/builder/spi-builder-workspace/.derivedData/Build/Intermediates.noindex/ScrollViewRTL.build/Debug/ScrollViewRTL.build/Objects-normal/arm64/ScrollViewRTL-master-emit-module.d -parse-as-library -o /Users/admin/builder/spi-builder-workspace/.derivedData/Build/Intermediates.noindex/ScrollViewRTL.build/Debug/ScrollViewRTL.build/Objects-normal/arm64/ScrollViewRTL.swiftmodule -emit-abi-descriptor-path /Users/admin/builder/spi-builder-workspace/.derivedData/Build/Intermediates.noindex/ScrollViewRTL.build/Debug/ScrollViewRTL.build/Objects-normal/arm64/ScrollViewRTL.abi.json
SwiftCompile normal arm64 /Users/admin/builder/spi-builder-workspace/Sources/ScrollViewRTL/ScrollViewRTL.swift (in target 'ScrollViewRTL' from project 'ScrollViewRTL')
    cd /Users/admin/builder/spi-builder-workspace/.swiftpm/xcode
    /Applications/Xcode-16.1.0.app/Contents/Developer/Toolchains/XcodeDefault.xctoolchain/usr/bin/swift-frontend -emit-module -experimental-skip-non-inlinable-function-bodies-without-types /Users/admin/builder/spi-builder-workspace/Sources/ScrollViewRTL/ScrollViewRTL.swift -target arm64-apple-macos10.14 -Xllvm -aarch64-use-tbi -enable-objc-interop -sdk /Applications/Xcode-16.1.0.app/Contents/Developer/Platforms/MacOSX.platform/Developer/SDKs/MacOSX15.1.sdk -I /Users/admin/builder/spi-builder-workspace/.derivedData/Build/Products/Debug -I /Applications/Xcode-16.1.0.app/Contents/Developer/Platforms/MacOSX.platform/Developer/usr/lib -F /Users/admin/builder/spi-builder-workspace/.derivedData/Build/Products/Debug -F /Applications/Xcode-16.1.0.app/Contents/Developer/Platforms/MacOSX.platform/Developer/Library/Frameworks -no-color-diagnostics -enable-testing -g -debug-info-format\=dwarf -dwarf-version\=4 -module-cache-path /Users/admin/builder/spi-builder-workspace/.derivedData/ModuleCache.noindex -profile-generate -profile-coverage-mapping -swift-version 5 -enforce-exclusivity\=checked -stats-output-dir /Users/admin/builder/spi-builder-workspace/.swiftpm/xcode/.stats -Onone -D SWIFT_PACKAGE -D DEBUG -serialize-debugging-options -const-gather-protocols-file /Users/admin/builder/spi-builder-workspace/.derivedData/Build/Intermediates.noindex/ScrollViewRTL.build/Debug/ScrollViewRTL.build/Objects-normal/arm64/ScrollViewRTL_const_extract_protocols.json -enable-experimental-feature DebugDescriptionMacro -enable-experimental-feature OpaqueTypeErasure -enable-upcoming-feature StrictConcurrency -enable-upcoming-feature DisableOutwardActorInference -enable-upcoming-feature GlobalActorIsolatedTypesUsability -enable-upcoming-feature InferSendableFromCaptures -strict-concurrency\=complete -empty-abi-descriptor -plugin-path /Applications/Xcode-16.1.0.app/Contents/Developer/Toolchains/XcodeDefault.xctoolchain/usr/lib/swift/host/plugins/testing -validate-clang-modules-once -clang-build-session-file /Users/admin/builder/spi-builder-workspace/.derivedData/ModuleCache.noindex/Session.modulevalidation -Xcc -working-directory -Xcc /Users/admin/builder/spi-builder-workspace/.swiftpm/xcode -resource-dir /Applications/Xcode-16.1.0.app/Contents/Developer/Toolchains/XcodeDefault.xctoolchain/usr/lib/swift -enable-anonymous-context-mangled-names -file-compilation-dir /Users/admin/builder/spi-builder-workspace/.swiftpm/xcode -Xcc -D_LIBCPP_HARDENING_MODE\=_LIBCPP_HARDENING_MODE_DEBUG -Xcc -ivfsstatcache -Xcc /Users/admin/builder/spi-builder-workspace/.derivedData/SDKStatCaches.noindex/macosx15.1-24B75-44d23fded74b714c58e69ec4af40d824.sdkstatcache -Xcc -I/Users/admin/builder/spi-builder-workspace/.derivedData/Build/Intermediates.noindex/ScrollViewRTL.build/Debug/ScrollViewRTL.build/swift-overrides.hmap -Xcc -I/Users/admin/builder/spi-builder-workspace/.derivedData/Build/Products/Debug/include -Xcc -I/Users/admin/builder/spi-builder-workspace/.derivedData/Build/Intermediates.noindex/ScrollViewRTL.build/Debug/ScrollViewRTL.build/DerivedSources-normal/arm64 -Xcc -I/Users/admin/builder/spi-builder-workspace/.derivedData/Build/Intermediates.noindex/ScrollViewRTL.build/Debug/ScrollViewRTL.build/DerivedSources/arm64 -Xcc -I/Users/admin/builder/spi-builder-workspace/.derivedData/Build/Intermediates.noindex/ScrollViewRTL.build/Debug/ScrollViewRTL.build/DerivedSources -Xcc -DSWIFT_PACKAGE -Xcc -DDEBUG\=1 -module-name ScrollViewRTL -package-name spi_builder_workspace -frontend-parseable-output -disable-clang-spi -target-sdk-version 15.1 -target-sdk-name macosx15.1 -external-plugin-path /Applications/Xcode-16.1.0.app/Contents/Developer/Platforms/MacOSX.platform/Developer/usr/lib/swift/host/plugins\#/Applications/Xcode-16.1.0.app/Contents/Developer/Platforms/MacOSX.platform/Developer/usr/bin/swift-plugin-server -external-plugin-path /Applications/Xcode-16.1.0.app/Contents/Developer/Platforms/MacOSX.platform/Developer/usr/local/lib/swift/host/plugins\#/Applications/Xcode-16.1.0.app/Contents/Developer/Platforms/MacOSX.platform/Developer/usr/bin/swift-plugin-server -plugin-path /Applications/Xcode-16.1.0.app/Contents/Developer/Toolchains/XcodeDefault.xctoolchain/usr/lib/swift/host/plugins -plugin-path /Applications/Xcode-16.1.0.app/Contents/Developer/Toolchains/XcodeDefault.xctoolchain/usr/local/lib/swift/host/plugins -emit-module-doc-path /Users/admin/builder/spi-builder-workspace/.derivedData/Build/Intermediates.noindex/ScrollViewRTL.build/Debug/ScrollViewRTL.build/Objects-normal/arm64/ScrollViewRTL.swiftdoc -emit-module-source-info-path /Users/admin/builder/spi-builder-workspace/.derivedData/Build/Intermediates.noindex/ScrollViewRTL.build/Debug/ScrollViewRTL.build/Objects-normal/arm64/ScrollViewRTL.swiftsourceinfo -emit-objc-header-path /Users/admin/builder/spi-builder-workspace/.derivedData/Build/Intermediates.noindex/ScrollViewRTL.build/Debug/ScrollViewRTL.build/Objects-normal/arm64/ScrollViewRTL-Swift.h -serialize-diagnostics-path /Users/admin/builder/spi-builder-workspace/.derivedData/Build/Intermediates.noindex/ScrollViewRTL.build/Debug/ScrollViewRTL.build/Objects-normal/arm64/ScrollViewRTL-master-emit-module.dia -emit-dependencies-path /Users/admin/builder/spi-builder-workspace/.derivedData/Build/Intermediates.noindex/ScrollViewRTL.build/Debug/ScrollViewRTL.build/Objects-normal/arm64/ScrollViewRTL-master-emit-module.d -parse-as-library -o /Users/admin/builder/spi-builder-workspace/.derivedData/Build/Intermediates.noindex/ScrollViewRTL.build/Debug/ScrollViewRTL.build/Objects-normal/arm64/ScrollViewRTL.swiftmodule -emit-abi-descriptor-path /Users/admin/builder/spi-builder-workspace/.derivedData/Build/Intermediates.noindex/ScrollViewRTL.build/Debug/ScrollViewRTL.build/Objects-normal/arm64/ScrollViewRTL.abi.json
/Users/admin/builder/spi-builder-workspace/Sources/ScrollViewRTL/ScrollViewRTL.swift:33:20: error: 'layoutDirection' is only available in macOS 10.15 or newer
    @Environment(\.layoutDirection) private var direction
                   ^
/Users/admin/builder/spi-builder-workspace/Sources/ScrollViewRTL/ScrollViewRTL.swift:28:15: note: add @available attribute to enclosing generic struct
public struct ScrollViewRTL<Content: View>: View {
              ^
/Users/admin/builder/spi-builder-workspace/Sources/ScrollViewRTL/ScrollViewRTL.swift:30:6: error: 'ViewBuilder' is only available in macOS 10.15 or newer
    @ViewBuilder var content: Content
     ^
/Users/admin/builder/spi-builder-workspace/Sources/ScrollViewRTL/ScrollViewRTL.swift:28:15: note: add @available attribute to enclosing generic struct
public struct ScrollViewRTL<Content: View>: View {
              ^
/Users/admin/builder/spi-builder-workspace/Sources/ScrollViewRTL/ScrollViewRTL.swift:33:6: error: 'Environment' is only available in macOS 10.15 or newer
    @Environment(\.layoutDirection) private var direction
     ^
/Users/admin/builder/spi-builder-workspace/Sources/ScrollViewRTL/ScrollViewRTL.swift:28:15: note: add @available attribute to enclosing generic struct
public struct ScrollViewRTL<Content: View>: View {
              ^
/Users/admin/builder/spi-builder-workspace/Sources/ScrollViewRTL/ScrollViewRTL.swift:47:63: error: 'ViewBuilder' is only available in macOS 10.15 or newer
    public init(type: RowType, showsIndicators: Bool = true, @ViewBuilder content: () -> Content) {
                                                              ^
/Users/admin/builder/spi-builder-workspace/Sources/ScrollViewRTL/ScrollViewRTL.swift:47:12: note: add @available attribute to enclosing initializer
    public init(type: RowType, showsIndicators: Bool = true, @ViewBuilder content: () -> Content) {
           ^
/Users/admin/builder/spi-builder-workspace/Sources/ScrollViewRTL/ScrollViewRTL.swift:28:15: note: add @available attribute to enclosing generic struct
public struct ScrollViewRTL<Content: View>: View {
              ^
/Users/admin/builder/spi-builder-workspace/Sources/ScrollViewRTL/ScrollViewRTL.swift:54:27: error: 'View' is only available in macOS 10.15 or newer
    public var body: some View {
                          ^
/Users/admin/builder/spi-builder-workspace/Sources/ScrollViewRTL/ScrollViewRTL.swift:54:16: note: add @available attribute to enclosing property
    public var body: some View {
               ^
/Users/admin/builder/spi-builder-workspace/Sources/ScrollViewRTL/ScrollViewRTL.swift:28:15: note: add @available attribute to enclosing generic struct
public struct ScrollViewRTL<Content: View>: View {
              ^
/Users/admin/builder/spi-builder-workspace/Sources/ScrollViewRTL/ScrollViewRTL.swift:72:47: error: 'View' is only available in macOS 10.15 or newer
    private var scrollViewForEarlieriOS: some View {
                                              ^
/Users/admin/builder/spi-builder-workspace/Sources/ScrollViewRTL/ScrollViewRTL.swift:72:17: note: add @available attribute to enclosing property
    private var scrollViewForEarlieriOS: some View {
                ^
/Users/admin/builder/spi-builder-workspace/Sources/ScrollViewRTL/ScrollViewRTL.swift:28:15: note: add @available attribute to enclosing generic struct
public struct ScrollViewRTL<Content: View>: View {
              ^
/Users/admin/builder/spi-builder-workspace/Sources/ScrollViewRTL/ScrollViewRTL.swift:28:38: error: 'View' is only available in macOS 10.15 or newer
public struct ScrollViewRTL<Content: View>: View {
                                     ^
/Users/admin/builder/spi-builder-workspace/Sources/ScrollViewRTL/ScrollViewRTL.swift:28:15: note: add @available attribute to enclosing generic struct
public struct ScrollViewRTL<Content: View>: View {
              ^
/Users/admin/builder/spi-builder-workspace/Sources/ScrollViewRTL/ScrollViewRTL.swift:101:28: error: 'Axis' is only available in macOS 10.15 or newer
    public var scrollAxis: Axis.Set {
                           ^
/Users/admin/builder/spi-builder-workspace/Sources/ScrollViewRTL/ScrollViewRTL.swift:101:16: note: add @available attribute to enclosing property
    public var scrollAxis: Axis.Set {
               ^
/Users/admin/builder/spi-builder-workspace/Sources/ScrollViewRTL/ScrollViewRTL.swift:96:13: note: add @available attribute to enclosing enum
public enum RowType {
            ^
SwiftCompile normal arm64 Compiling\ ScrollViewRTL.swift /Users/admin/builder/spi-builder-workspace/Sources/ScrollViewRTL/ScrollViewRTL.swift (in target 'ScrollViewRTL' from project 'ScrollViewRTL')
    cd /Users/admin/builder/spi-builder-workspace/.swiftpm/xcode
    builtin-swiftTaskExecution -- /Applications/Xcode-16.1.0.app/Contents/Developer/Toolchains/XcodeDefault.xctoolchain/usr/bin/swift-frontend -frontend -c -primary-file /Users/admin/builder/spi-builder-workspace/Sources/ScrollViewRTL/ScrollViewRTL.swift -emit-dependencies-path /Users/admin/builder/spi-builder-workspace/.derivedData/Build/Intermediates.noindex/ScrollViewRTL.build/Debug/ScrollViewRTL.build/Objects-normal/arm64/ScrollViewRTL.d -emit-const-values-path /Users/admin/builder/spi-builder-workspace/.derivedData/Build/Intermediates.noindex/ScrollViewRTL.build/Debug/ScrollViewRTL.build/Objects-normal/arm64/ScrollViewRTL.swiftconstvalues -emit-reference-dependencies-path /Users/admin/builder/spi-builder-workspace/.derivedData/Build/Intermediates.noindex/ScrollViewRTL.build/Debug/ScrollViewRTL.build/Objects-normal/arm64/ScrollViewRTL.swiftdeps -serialize-diagnostics-path /Users/admin/builder/spi-builder-workspace/.derivedData/Build/Intermediates.noindex/ScrollViewRTL.build/Debug/ScrollViewRTL.build/Objects-normal/arm64/ScrollViewRTL.dia -target arm64-apple-macos10.14 -Xllvm -aarch64-use-tbi -enable-objc-interop -sdk /Applications/Xcode-16.1.0.app/Contents/Developer/Platforms/MacOSX.platform/Developer/SDKs/MacOSX15.1.sdk -I /Users/admin/builder/spi-builder-workspace/.derivedData/Build/Products/Debug -I /Applications/Xcode-16.1.0.app/Contents/Developer/Platforms/MacOSX.platform/Developer/usr/lib -F /Users/admin/builder/spi-builder-workspace/.derivedData/Build/Products/Debug -F /Applications/Xcode-16.1.0.app/Contents/Developer/Platforms/MacOSX.platform/Developer/Library/Frameworks -no-color-diagnostics -enable-testing -g -debug-info-format\=dwarf -dwarf-version\=4 -module-cache-path /Users/admin/builder/spi-builder-workspace/.derivedData/ModuleCache.noindex -profile-generate -profile-coverage-mapping -swift-version 5 -enforce-exclusivity\=checked -stats-output-dir /Users/admin/builder/spi-builder-workspace/.swiftpm/xcode/.stats -Onone -D SWIFT_PACKAGE -D DEBUG -serialize-debugging-options -const-gather-protocols-file /Users/admin/builder/spi-builder-workspace/.derivedData/Build/Intermediates.noindex/ScrollViewRTL.build/Debug/ScrollViewRTL.build/Objects-normal/arm64/ScrollViewRTL_const_extract_protocols.json -enable-experimental-feature DebugDescriptionMacro -enable-experimental-feature OpaqueTypeErasure -enable-upcoming-feature StrictConcurrency -enable-upcoming-feature DisableOutwardActorInference -enable-upcoming-feature GlobalActorIsolatedTypesUsability -enable-upcoming-feature InferSendableFromCaptures -strict-concurrency\=complete -empty-abi-descriptor -plugin-path /Applications/Xcode-16.1.0.app/Contents/Developer/Toolchains/XcodeDefault.xctoolchain/usr/lib/swift/host/plugins/testing -validate-clang-modules-once -clang-build-session-file /Users/admin/builder/spi-builder-workspace/.derivedData/ModuleCache.noindex/Session.modulevalidation -Xcc -working-directory -Xcc /Users/admin/builder/spi-builder-workspace/.swiftpm/xcode -resource-dir /Applications/Xcode-16.1.0.app/Contents/Developer/Toolchains/XcodeDefault.xctoolchain/usr/lib/swift -enable-anonymous-context-mangled-names -file-compilation-dir /Users/admin/builder/spi-builder-workspace/.swiftpm/xcode -Xcc -D_LIBCPP_HARDENING_MODE\=_LIBCPP_HARDENING_MODE_DEBUG -Xcc -ivfsstatcache -Xcc /Users/admin/builder/spi-builder-workspace/.derivedData/SDKStatCaches.noindex/macosx15.1-24B75-44d23fded74b714c58e69ec4af40d824.sdkstatcache -Xcc -I/Users/admin/builder/spi-builder-workspace/.derivedData/Build/Intermediates.noindex/ScrollViewRTL.build/Debug/ScrollViewRTL.build/swift-overrides.hmap -Xcc -I/Users/admin/builder/spi-builder-workspace/.derivedData/Build/Products/Debug/include -Xcc -I/Users/admin/builder/spi-builder-workspace/.derivedData/Build/Intermediates.noindex/ScrollViewRTL.build/Debug/ScrollViewRTL.build/DerivedSources-normal/arm64 -Xcc -I/Users/admin/builder/spi-builder-workspace/.derivedData/Build/Intermediates.noindex/ScrollViewRTL.build/Debug/ScrollViewRTL.build/DerivedSources/arm64 -Xcc -I/Users/admin/builder/spi-builder-workspace/.derivedData/Build/Intermediates.noindex/ScrollViewRTL.build/Debug/ScrollViewRTL.build/DerivedSources -Xcc -DSWIFT_PACKAGE -Xcc -DDEBUG\=1 -module-name ScrollViewRTL -package-name spi_builder_workspace -frontend-parseable-output -disable-clang-spi -target-sdk-version 15.1 -target-sdk-name macosx15.1 -external-plugin-path /Applications/Xcode-16.1.0.app/Contents/Developer/Platforms/MacOSX.platform/Developer/usr/lib/swift/host/plugins\#/Applications/Xcode-16.1.0.app/Contents/Developer/Platforms/MacOSX.platform/Developer/usr/bin/swift-plugin-server -external-plugin-path /Applications/Xcode-16.1.0.app/Contents/Developer/Platforms/MacOSX.platform/Developer/usr/local/lib/swift/host/plugins\#/Applications/Xcode-16.1.0.app/Contents/Developer/Platforms/MacOSX.platform/Developer/usr/bin/swift-plugin-server -plugin-path /Applications/Xcode-16.1.0.app/Contents/Developer/Toolchains/XcodeDefault.xctoolchain/usr/lib/swift/host/plugins -plugin-path /Applications/Xcode-16.1.0.app/Contents/Developer/Toolchains/XcodeDefault.xctoolchain/usr/local/lib/swift/host/plugins -parse-as-library -o /Users/admin/builder/spi-builder-workspace/.derivedData/Build/Intermediates.noindex/ScrollViewRTL.build/Debug/ScrollViewRTL.build/Objects-normal/arm64/ScrollViewRTL.o -index-unit-output-path /ScrollViewRTL.build/Debug/ScrollViewRTL.build/Objects-normal/arm64/ScrollViewRTL.o -index-store-path /Users/admin/builder/spi-builder-workspace/.derivedData/Index.noindex/DataStore -index-system-modules
SwiftCompile normal arm64 /Users/admin/builder/spi-builder-workspace/Sources/ScrollViewRTL/ScrollViewRTL.swift (in target 'ScrollViewRTL' from project 'ScrollViewRTL')
    cd /Users/admin/builder/spi-builder-workspace/.swiftpm/xcode
    /Applications/Xcode-16.1.0.app/Contents/Developer/Toolchains/XcodeDefault.xctoolchain/usr/bin/swift-frontend -c -primary-file /Users/admin/builder/spi-builder-workspace/Sources/ScrollViewRTL/ScrollViewRTL.swift -emit-dependencies-path /Users/admin/builder/spi-builder-workspace/.derivedData/Build/Intermediates.noindex/ScrollViewRTL.build/Debug/ScrollViewRTL.build/Objects-normal/arm64/ScrollViewRTL.d -emit-const-values-path /Users/admin/builder/spi-builder-workspace/.derivedData/Build/Intermediates.noindex/ScrollViewRTL.build/Debug/ScrollViewRTL.build/Objects-normal/arm64/ScrollViewRTL.swiftconstvalues -emit-reference-dependencies-path /Users/admin/builder/spi-builder-workspace/.derivedData/Build/Intermediates.noindex/ScrollViewRTL.build/Debug/ScrollViewRTL.build/Objects-normal/arm64/ScrollViewRTL.swiftdeps -serialize-diagnostics-path /Users/admin/builder/spi-builder-workspace/.derivedData/Build/Intermediates.noindex/ScrollViewRTL.build/Debug/ScrollViewRTL.build/Objects-normal/arm64/ScrollViewRTL.dia -target arm64-apple-macos10.14 -Xllvm -aarch64-use-tbi -enable-objc-interop -sdk /Applications/Xcode-16.1.0.app/Contents/Developer/Platforms/MacOSX.platform/Developer/SDKs/MacOSX15.1.sdk -I /Users/admin/builder/spi-builder-workspace/.derivedData/Build/Products/Debug -I /Applications/Xcode-16.1.0.app/Contents/Developer/Platforms/MacOSX.platform/Developer/usr/lib -F /Users/admin/builder/spi-builder-workspace/.derivedData/Build/Products/Debug -F /Applications/Xcode-16.1.0.app/Contents/Developer/Platforms/MacOSX.platform/Developer/Library/Frameworks -no-color-diagnostics -enable-testing -g -debug-info-format\=dwarf -dwarf-version\=4 -module-cache-path /Users/admin/builder/spi-builder-workspace/.derivedData/ModuleCache.noindex -profile-generate -profile-coverage-mapping -swift-version 5 -enforce-exclusivity\=checked -stats-output-dir /Users/admin/builder/spi-builder-workspace/.swiftpm/xcode/.stats -Onone -D SWIFT_PACKAGE -D DEBUG -serialize-debugging-options -const-gather-protocols-file /Users/admin/builder/spi-builder-workspace/.derivedData/Build/Intermediates.noindex/ScrollViewRTL.build/Debug/ScrollViewRTL.build/Objects-normal/arm64/ScrollViewRTL_const_extract_protocols.json -enable-experimental-feature DebugDescriptionMacro -enable-experimental-feature OpaqueTypeErasure -enable-upcoming-feature StrictConcurrency -enable-upcoming-feature DisableOutwardActorInference -enable-upcoming-feature GlobalActorIsolatedTypesUsability -enable-upcoming-feature InferSendableFromCaptures -strict-concurrency\=complete -empty-abi-descriptor -plugin-path /Applications/Xcode-16.1.0.app/Contents/Developer/Toolchains/XcodeDefault.xctoolchain/usr/lib/swift/host/plugins/testing -validate-clang-modules-once -clang-build-session-file /Users/admin/builder/spi-builder-workspace/.derivedData/ModuleCache.noindex/Session.modulevalidation -Xcc -working-directory -Xcc /Users/admin/builder/spi-builder-workspace/.swiftpm/xcode -resource-dir /Applications/Xcode-16.1.0.app/Contents/Developer/Toolchains/XcodeDefault.xctoolchain/usr/lib/swift -enable-anonymous-context-mangled-names -file-compilation-dir /Users/admin/builder/spi-builder-workspace/.swiftpm/xcode -Xcc -D_LIBCPP_HARDENING_MODE\=_LIBCPP_HARDENING_MODE_DEBUG -Xcc -ivfsstatcache -Xcc /Users/admin/builder/spi-builder-workspace/.derivedData/SDKStatCaches.noindex/macosx15.1-24B75-44d23fded74b714c58e69ec4af40d824.sdkstatcache -Xcc -I/Users/admin/builder/spi-builder-workspace/.derivedData/Build/Intermediates.noindex/ScrollViewRTL.build/Debug/ScrollViewRTL.build/swift-overrides.hmap -Xcc -I/Users/admin/builder/spi-builder-workspace/.derivedData/Build/Products/Debug/include -Xcc -I/Users/admin/builder/spi-builder-workspace/.derivedData/Build/Intermediates.noindex/ScrollViewRTL.build/Debug/ScrollViewRTL.build/DerivedSources-normal/arm64 -Xcc -I/Users/admin/builder/spi-builder-workspace/.derivedData/Build/Intermediates.noindex/ScrollViewRTL.build/Debug/ScrollViewRTL.build/DerivedSources/arm64 -Xcc -I/Users/admin/builder/spi-builder-workspace/.derivedData/Build/Intermediates.noindex/ScrollViewRTL.build/Debug/ScrollViewRTL.build/DerivedSources -Xcc -DSWIFT_PACKAGE -Xcc -DDEBUG\=1 -module-name ScrollViewRTL -package-name spi_builder_workspace -frontend-parseable-output -disable-clang-spi -target-sdk-version 15.1 -target-sdk-name macosx15.1 -external-plugin-path /Applications/Xcode-16.1.0.app/Contents/Developer/Platforms/MacOSX.platform/Developer/usr/lib/swift/host/plugins\#/Applications/Xcode-16.1.0.app/Contents/Developer/Platforms/MacOSX.platform/Developer/usr/bin/swift-plugin-server -external-plugin-path /Applications/Xcode-16.1.0.app/Contents/Developer/Platforms/MacOSX.platform/Developer/usr/local/lib/swift/host/plugins\#/Applications/Xcode-16.1.0.app/Contents/Developer/Platforms/MacOSX.platform/Developer/usr/bin/swift-plugin-server -plugin-path /Applications/Xcode-16.1.0.app/Contents/Developer/Toolchains/XcodeDefault.xctoolchain/usr/lib/swift/host/plugins -plugin-path /Applications/Xcode-16.1.0.app/Contents/Developer/Toolchains/XcodeDefault.xctoolchain/usr/local/lib/swift/host/plugins -parse-as-library -o /Users/admin/builder/spi-builder-workspace/.derivedData/Build/Intermediates.noindex/ScrollViewRTL.build/Debug/ScrollViewRTL.build/Objects-normal/arm64/ScrollViewRTL.o -index-unit-output-path /ScrollViewRTL.build/Debug/ScrollViewRTL.build/Objects-normal/arm64/ScrollViewRTL.o -index-store-path /Users/admin/builder/spi-builder-workspace/.derivedData/Index.noindex/DataStore -index-system-modules
--- xcodebuild: WARNING: Using the first of multiple matching destinations:
{ platform:macOS, arch:arm64, id:0000FE00-8C151E3703BE51BE, name:My Mac }
{ platform:macOS, arch:arm64, variant:Mac Catalyst, id:0000FE00-8C151E3703BE51BE, name:My Mac }
{ platform:macOS, arch:arm64, variant:DriverKit, id:0000FE00-8C151E3703BE51BE, name:My Mac }
{ platform:macOS, arch:arm64, variant:Designed for [iPad,iPhone], id:0000FE00-8C151E3703BE51BE, name:My Mac }
** BUILD FAILED **
The following build commands failed:
	SwiftCompile normal arm64 /Users/admin/builder/spi-builder-workspace/Sources/ScrollViewRTL/ScrollViewRTL.swift (in target 'ScrollViewRTL' from project 'ScrollViewRTL')
	SwiftEmitModule normal arm64 Emitting\ module\ for\ ScrollViewRTL (in target 'ScrollViewRTL' from project 'ScrollViewRTL')
	Building workspace spi-builder-workspace with scheme ScrollViewRTL
(3 failures)
BUILD FAILURE 6.0 macosXcodebuild