Build Information
Failed to build Baggins, reference 1.1.0 (c31a6c
), with Swift 6.0 for iOS using Xcode 16.2 on 28 Nov 2024 10:57:15 UTC.
Build Command
env DEVELOPER_DIR=/Applications/Xcode-16.1.0.app xcrun xcodebuild -IDEClonedSourcePackagesDirPathOverride=$PWD/.dependencies -skipMacroValidation -skipPackagePluginValidation -derivedDataPath $PWD/.derivedData build -scheme Baggins-Package -destination generic/platform=iOS OTHER_SWIFT_FLAGS=-stats-output-dir .stats -strict-concurrency=complete -enable-upcoming-feature StrictConcurrency -enable-upcoming-feature DisableOutwardActorInference -enable-upcoming-feature GlobalActorIsolatedTypesUsability -enable-upcoming-feature InferSendableFromCaptures
Build Log
========================================
RunAll
========================================
Builder version: 4.58.0
Interrupt handler set up.
========================================
Checkout
========================================
Clone URL: https://github.com/alexito4/Baggins.git
Reference: 1.1.0
Initialized empty Git repository in /Users/admin/builder/spi-builder-workspace/.git/
From https://github.com/alexito4/Baggins
* tag 1.1.0 -> FETCH_HEAD
HEAD is now at c31a6ce Update ci.yml
Cloned https://github.com/alexito4/Baggins.git
Revision (git rev-parse @):
c31a6cec7936aacfd8a18cdb0a4aafa02c1954bf
SUCCESS checkout https://github.com/alexito4/Baggins.git at 1.1.0
========================================
Build
========================================
Selected platform: iOS
Swift version: 6.0
Building package at path: $PWD
https://github.com/alexito4/Baggins.git
Command line invocation:
/Applications/Xcode-16.1.0.app/Contents/Developer/usr/bin/xcodebuild -IDEClonedSourcePackagesDirPathOverride=/Users/admin/builder/spi-builder-workspace/.dependencies -resolvePackageDependencies
User defaults from command line:
IDEClonedSourcePackagesDirPathOverride = /Users/admin/builder/spi-builder-workspace/.dependencies
IDEPackageSupportUseBuiltinSCM = YES
resolved source packages:
{
"dependencies" : [
{
"identity" : "flow",
"requirement" : {
"range" : [
{
"lower_bound" : "1.0.0",
"upper_bound" : "2.0.0"
}
]
},
"type" : "sourceControl",
"url" : "https://github.com/alexito4/Flow.git"
},
{
"identity" : "unwraporthrow",
"requirement" : {
"range" : [
{
"lower_bound" : "1.0.0",
"upper_bound" : "2.0.0"
}
]
},
"type" : "sourceControl",
"url" : "https://github.com/alexito4/UnwrapOrThrow"
}
],
"manifest_display_name" : "Baggins",
"name" : "Baggins",
"path" : "/Users/admin/builder/spi-builder-workspace",
"platforms" : [
{
"name" : "ios",
"version" : "14.0"
},
{
"name" : "macos",
"version" : "10.15"
}
],
"products" : [
{
"name" : "Baggins",
"targets" : [
"Baggins"
],
"type" : {
"library" : [
"automatic"
]
}
}
],
"targets" : [
{
"c99name" : "BagginsTests",
"module_type" : "SwiftTarget",
"name" : "BagginsTests",
"path" : "Tests/BagginsTests",
"sources" : [
"BoolTests.swift",
"BrewingTests.swift",
"CollectionTests.swift",
"ConcurrencyTests.swift",
"ConcurrencyUnsafeBlockingTests.swift",
"SequenceTests.swift",
"StringTests.swift"
],
"target_dependencies" : [
"Baggins"
],
"type" : "test"
},
{
"c99name" : "Baggins",
"module_type" : "SwiftTarget",
"name" : "Baggins",
"path" : "Sources/Baggins",
"product_dependencies" : [
"Flow",
"UnwrapOrThrow"
],
"product_memberships" : [
"Baggins"
],
"sources" : [
"Bool.swift",
"Collection.swift",
"Concurrency.swift",
"Flow.swift",
"Sequence.swift",
"String.swift",
"UnwrapOrThrow.swift",
"_Brewing.swift"
],
"type" : "library"
}
],
"tools_version" : "5.5"
}
{
"project" : {
"configurations" : [
"Debug",
"Release"
],
"name" : "Baggins",
"schemes" : [
"Baggins-Package",
"BagginsPackageDescription",
"BagginsPackageTests"
],
"targets" : [
"BagginsPackageDescription",
"BagginsTests",
"Baggins",
"BagginsPackageTests"
]
}
}
Running build ...
env DEVELOPER_DIR=/Applications/Xcode-16.1.0.app xcrun xcodebuild -IDEClonedSourcePackagesDirPathOverride=$PWD/.dependencies -skipMacroValidation -skipPackagePluginValidation -derivedDataPath $PWD/.derivedData build -scheme Baggins-Package -destination generic/platform=iOS OTHER_SWIFT_FLAGS=-stats-output-dir .stats -strict-concurrency=complete -enable-upcoming-feature StrictConcurrency -enable-upcoming-feature DisableOutwardActorInference -enable-upcoming-feature GlobalActorIsolatedTypesUsability -enable-upcoming-feature InferSendableFromCaptures
Command line invocation:
/Applications/Xcode-16.1.0.app/Contents/Developer/usr/bin/xcodebuild -IDEClonedSourcePackagesDirPathOverride=/Users/admin/builder/spi-builder-workspace/.dependencies -skipMacroValidation -skipPackagePluginValidation -derivedDataPath /Users/admin/builder/spi-builder-workspace/.derivedData build -scheme Baggins-Package -destination generic/platform=iOS "OTHER_SWIFT_FLAGS=-stats-output-dir .stats -strict-concurrency=complete -enable-upcoming-feature StrictConcurrency -enable-upcoming-feature DisableOutwardActorInference -enable-upcoming-feature GlobalActorIsolatedTypesUsability -enable-upcoming-feature InferSendableFromCaptures"
User defaults from command line:
IDEClonedSourcePackagesDirPathOverride = /Users/admin/builder/spi-builder-workspace/.dependencies
IDEDerivedDataPathOverride = /Users/admin/builder/spi-builder-workspace/.derivedData
IDEPackageSupportUseBuiltinSCM = YES
Build settings from command line:
OTHER_SWIFT_FLAGS = -stats-output-dir .stats -strict-concurrency=complete -enable-upcoming-feature StrictConcurrency -enable-upcoming-feature DisableOutwardActorInference -enable-upcoming-feature GlobalActorIsolatedTypesUsability -enable-upcoming-feature InferSendableFromCaptures
Prepare packages
ComputeTargetDependencyGraph
note: Building targets in dependency order
note: Target dependency graph (1 target)
Target 'Baggins' in project 'Baggins' (no dependencies)
GatherProvisioningInputs
CreateBuildDescription
ExecuteExternalTool /Applications/Xcode-16.1.0.app/Contents/Developer/Toolchains/XcodeDefault.xctoolchain/usr/bin/clang -v -E -dM -isysroot /Applications/Xcode-16.1.0.app/Contents/Developer/Platforms/iPhoneOS.platform/Developer/SDKs/iPhoneOS18.1.sdk -x c -c /dev/null
ExecuteExternalTool /Applications/Xcode-16.1.0.app/Contents/Developer/Toolchains/XcodeDefault.xctoolchain/usr/bin/swiftc --version
ExecuteExternalTool /Applications/Xcode-16.1.0.app/Contents/Developer/Toolchains/XcodeDefault.xctoolchain/usr/bin/ld -version_details
Build description signature: 3363275928c55435d493630636fc80c9
Build description path: /Users/admin/builder/spi-builder-workspace/.derivedData/Build/Intermediates.noindex/XCBuildData/3363275928c55435d493630636fc80c9.xcbuilddata
CreateBuildDirectory /Users/admin/builder/spi-builder-workspace/.derivedData/Build/Products
cd /Users/admin/builder/spi-builder-workspace/Baggins.xcodeproj
builtin-create-build-directory /Users/admin/builder/spi-builder-workspace/.derivedData/Build/Products
ClangStatCache /Applications/Xcode-16.1.0.app/Contents/Developer/Toolchains/XcodeDefault.xctoolchain/usr/bin/clang-stat-cache /Applications/Xcode-16.1.0.app/Contents/Developer/Platforms/iPhoneOS.platform/Developer/SDKs/iPhoneOS18.1.sdk /Users/admin/builder/spi-builder-workspace/.derivedData/SDKStatCaches.noindex/iphoneos18.1-22B74-f2ea1940d4ae1642e20681c3a33270e4.sdkstatcache
cd /Users/admin/builder/spi-builder-workspace/Baggins.xcodeproj
/Applications/Xcode-16.1.0.app/Contents/Developer/Toolchains/XcodeDefault.xctoolchain/usr/bin/clang-stat-cache /Applications/Xcode-16.1.0.app/Contents/Developer/Platforms/iPhoneOS.platform/Developer/SDKs/iPhoneOS18.1.sdk -o /Users/admin/builder/spi-builder-workspace/.derivedData/SDKStatCaches.noindex/iphoneos18.1-22B74-f2ea1940d4ae1642e20681c3a33270e4.sdkstatcache
CreateBuildDirectory /Users/admin/builder/spi-builder-workspace/.derivedData/Build/Intermediates.noindex
cd /Users/admin/builder/spi-builder-workspace/Baggins.xcodeproj
builtin-create-build-directory /Users/admin/builder/spi-builder-workspace/.derivedData/Build/Intermediates.noindex
CreateBuildDirectory /Users/admin/builder/spi-builder-workspace/.derivedData/Build/Products/Debug-iphoneos
cd /Users/admin/builder/spi-builder-workspace/Baggins.xcodeproj
builtin-create-build-directory /Users/admin/builder/spi-builder-workspace/.derivedData/Build/Products/Debug-iphoneos
CreateBuildDirectory /Users/admin/builder/spi-builder-workspace/.derivedData/Build/Intermediates.noindex/EagerLinkingTBDs/Debug-iphoneos
cd /Users/admin/builder/spi-builder-workspace/Baggins.xcodeproj
builtin-create-build-directory /Users/admin/builder/spi-builder-workspace/.derivedData/Build/Intermediates.noindex/EagerLinkingTBDs/Debug-iphoneos
MkDir /Users/admin/builder/spi-builder-workspace/.derivedData/Build/Products/Debug-iphoneos/Baggins.framework (in target 'Baggins' from project 'Baggins')
cd /Users/admin/builder/spi-builder-workspace
/bin/mkdir -p /Users/admin/builder/spi-builder-workspace/.derivedData/Build/Products/Debug-iphoneos/Baggins.framework
WriteAuxiliaryFile /Users/admin/builder/spi-builder-workspace/.derivedData/Build/Intermediates.noindex/Baggins.build/Debug-iphoneos/Baggins.build/Baggins.DependencyMetadataFileList (in target 'Baggins' from project 'Baggins')
cd /Users/admin/builder/spi-builder-workspace
write-file /Users/admin/builder/spi-builder-workspace/.derivedData/Build/Intermediates.noindex/Baggins.build/Debug-iphoneos/Baggins.build/Baggins.DependencyMetadataFileList
MkDir /Users/admin/builder/spi-builder-workspace/.derivedData/Build/Products/Debug-iphoneos/Baggins.framework/Headers (in target 'Baggins' from project 'Baggins')
cd /Users/admin/builder/spi-builder-workspace
/bin/mkdir -p /Users/admin/builder/spi-builder-workspace/.derivedData/Build/Products/Debug-iphoneos/Baggins.framework/Headers
WriteAuxiliaryFile /Users/admin/builder/spi-builder-workspace/.derivedData/Build/Intermediates.noindex/Baggins.build/Debug-iphoneos/Baggins.build/Objects-normal/arm64/Baggins_const_extract_protocols.json (in target 'Baggins' from project 'Baggins')
cd /Users/admin/builder/spi-builder-workspace
write-file /Users/admin/builder/spi-builder-workspace/.derivedData/Build/Intermediates.noindex/Baggins.build/Debug-iphoneos/Baggins.build/Objects-normal/arm64/Baggins_const_extract_protocols.json
WriteAuxiliaryFile /Users/admin/builder/spi-builder-workspace/.derivedData/Build/Intermediates.noindex/Baggins.build/Debug-iphoneos/Baggins.build/Objects-normal/arm64/Baggins.SwiftConstValuesFileList (in target 'Baggins' from project 'Baggins')
cd /Users/admin/builder/spi-builder-workspace
write-file /Users/admin/builder/spi-builder-workspace/.derivedData/Build/Intermediates.noindex/Baggins.build/Debug-iphoneos/Baggins.build/Objects-normal/arm64/Baggins.SwiftConstValuesFileList
WriteAuxiliaryFile /Users/admin/builder/spi-builder-workspace/.derivedData/Build/Intermediates.noindex/Baggins.build/Debug-iphoneos/Baggins.build/Objects-normal/arm64/Baggins-OutputFileMap.json (in target 'Baggins' from project 'Baggins')
cd /Users/admin/builder/spi-builder-workspace
write-file /Users/admin/builder/spi-builder-workspace/.derivedData/Build/Intermediates.noindex/Baggins.build/Debug-iphoneos/Baggins.build/Objects-normal/arm64/Baggins-OutputFileMap.json
WriteAuxiliaryFile /Users/admin/builder/spi-builder-workspace/.derivedData/Build/Intermediates.noindex/Baggins.build/Debug-iphoneos/Baggins.build/Objects-normal/arm64/Baggins.SwiftFileList (in target 'Baggins' from project 'Baggins')
cd /Users/admin/builder/spi-builder-workspace
write-file /Users/admin/builder/spi-builder-workspace/.derivedData/Build/Intermediates.noindex/Baggins.build/Debug-iphoneos/Baggins.build/Objects-normal/arm64/Baggins.SwiftFileList
WriteAuxiliaryFile /Users/admin/builder/spi-builder-workspace/.derivedData/Build/Intermediates.noindex/Baggins.build/Debug-iphoneos/Baggins.build/Objects-normal/arm64/Baggins.LinkFileList (in target 'Baggins' from project 'Baggins')
cd /Users/admin/builder/spi-builder-workspace
write-file /Users/admin/builder/spi-builder-workspace/.derivedData/Build/Intermediates.noindex/Baggins.build/Debug-iphoneos/Baggins.build/Objects-normal/arm64/Baggins.LinkFileList
ProcessInfoPlistFile /Users/admin/builder/spi-builder-workspace/.derivedData/Build/Products/Debug-iphoneos/Baggins.framework/Info.plist /Users/admin/builder/spi-builder-workspace/Baggins.xcodeproj/Baggins_Info.plist (in target 'Baggins' from project 'Baggins')
cd /Users/admin/builder/spi-builder-workspace
builtin-infoPlistUtility /Users/admin/builder/spi-builder-workspace/Baggins.xcodeproj/Baggins_Info.plist -producttype com.apple.product-type.framework -expandbuildsettings -format binary -platform iphoneos -requiredArchitecture arm64 -o /Users/admin/builder/spi-builder-workspace/.derivedData/Build/Products/Debug-iphoneos/Baggins.framework/Info.plist
SwiftDriver\ Compilation Baggins normal arm64 com.apple.xcode.tools.swift.compiler (in target 'Baggins' from project 'Baggins')
cd /Users/admin/builder/spi-builder-workspace
builtin-Swift-Compilation -- /Applications/Xcode-16.1.0.app/Contents/Developer/Toolchains/XcodeDefault.xctoolchain/usr/bin/swiftc -module-name Baggins -Onone -enforce-exclusivity\=checked @/Users/admin/builder/spi-builder-workspace/.derivedData/Build/Intermediates.noindex/Baggins.build/Debug-iphoneos/Baggins.build/Objects-normal/arm64/Baggins.SwiftFileList -DSWIFT_PACKAGE -stats-output-dir .stats -strict-concurrency\=complete -enable-upcoming-feature StrictConcurrency -enable-upcoming-feature DisableOutwardActorInference -enable-upcoming-feature GlobalActorIsolatedTypesUsability -enable-upcoming-feature InferSendableFromCaptures -enable-bare-slash-regex -enable-experimental-feature DebugDescriptionMacro -sdk /Applications/Xcode-16.1.0.app/Contents/Developer/Platforms/iPhoneOS.platform/Developer/SDKs/iPhoneOS18.1.sdk -target arm64-apple-ios18.1 -g -module-cache-path /Users/admin/builder/spi-builder-workspace/.derivedData/ModuleCache.noindex -Xfrontend -serialize-debugging-options -enable-testing -index-store-path /Users/admin/builder/spi-builder-workspace/.derivedData/Index.noindex/DataStore -enable-experimental-feature OpaqueTypeErasure -Xcc -D_LIBCPP_HARDENING_MODE\=_LIBCPP_HARDENING_MODE_DEBUG -swift-version 4 -I /Users/admin/builder/spi-builder-workspace/.derivedData/Build/Products/Debug-iphoneos -F /Users/admin/builder/spi-builder-workspace/.derivedData/Build/Products/Debug-iphoneos -F /Applications/Xcode-16.1.0.app/Contents/Developer/Platforms/iPhoneOS.platform/Developer/Library/Frameworks -c -j10 -enable-batch-mode -incremental -Xcc -ivfsstatcache -Xcc /Users/admin/builder/spi-builder-workspace/.derivedData/SDKStatCaches.noindex/iphoneos18.1-22B74-f2ea1940d4ae1642e20681c3a33270e4.sdkstatcache -output-file-map /Users/admin/builder/spi-builder-workspace/.derivedData/Build/Intermediates.noindex/Baggins.build/Debug-iphoneos/Baggins.build/Objects-normal/arm64/Baggins-OutputFileMap.json -use-frontend-parseable-output -save-temps -no-color-diagnostics -serialize-diagnostics -emit-dependencies -emit-module -emit-module-path /Users/admin/builder/spi-builder-workspace/.derivedData/Build/Intermediates.noindex/Baggins.build/Debug-iphoneos/Baggins.build/Objects-normal/arm64/Baggins.swiftmodule -validate-clang-modules-once -clang-build-session-file /Users/admin/builder/spi-builder-workspace/.derivedData/ModuleCache.noindex/Session.modulevalidation -Xcc -I/Users/admin/builder/spi-builder-workspace/.derivedData/Build/Intermediates.noindex/Baggins.build/Debug-iphoneos/Baggins.build/swift-overrides.hmap -emit-const-values -Xfrontend -const-gather-protocols-file -Xfrontend /Users/admin/builder/spi-builder-workspace/.derivedData/Build/Intermediates.noindex/Baggins.build/Debug-iphoneos/Baggins.build/Objects-normal/arm64/Baggins_const_extract_protocols.json -Xcc -I/Users/admin/builder/spi-builder-workspace/.derivedData/Build/Products/Debug-iphoneos/include -Xcc -I/Users/admin/builder/spi-builder-workspace/.derivedData/Build/Intermediates.noindex/Baggins.build/Debug-iphoneos/Baggins.build/DerivedSources-normal/arm64 -Xcc -I/Users/admin/builder/spi-builder-workspace/.derivedData/Build/Intermediates.noindex/Baggins.build/Debug-iphoneos/Baggins.build/DerivedSources/arm64 -Xcc -I/Users/admin/builder/spi-builder-workspace/.derivedData/Build/Intermediates.noindex/Baggins.build/Debug-iphoneos/Baggins.build/DerivedSources -emit-objc-header -emit-objc-header-path /Users/admin/builder/spi-builder-workspace/.derivedData/Build/Intermediates.noindex/Baggins.build/Debug-iphoneos/Baggins.build/Objects-normal/arm64/Baggins-Swift.h -working-directory /Users/admin/builder/spi-builder-workspace -experimental-emit-module-separately -disable-cmo
error: Build input files cannot be found: '/Users/admin/builder/spi-builder-workspace/Sources/Baggins/Baggings+Parsing.swift', '/Users/admin/builder/spi-builder-workspace/Sources/Baggins/Baggins+Throwing.swift', '/Users/admin/builder/spi-builder-workspace/Sources/Baggins/Baggins.swift'. Did you forget to declare these files as outputs of any script phases or custom build rules which produce them? (in target 'Baggins' from project 'Baggins')
SwiftDriver\ Compilation\ Requirements Baggins normal arm64 com.apple.xcode.tools.swift.compiler (in target 'Baggins' from project 'Baggins')
cd /Users/admin/builder/spi-builder-workspace
builtin-Swift-Compilation-Requirements -- /Applications/Xcode-16.1.0.app/Contents/Developer/Toolchains/XcodeDefault.xctoolchain/usr/bin/swiftc -module-name Baggins -Onone -enforce-exclusivity\=checked @/Users/admin/builder/spi-builder-workspace/.derivedData/Build/Intermediates.noindex/Baggins.build/Debug-iphoneos/Baggins.build/Objects-normal/arm64/Baggins.SwiftFileList -DSWIFT_PACKAGE -stats-output-dir .stats -strict-concurrency\=complete -enable-upcoming-feature StrictConcurrency -enable-upcoming-feature DisableOutwardActorInference -enable-upcoming-feature GlobalActorIsolatedTypesUsability -enable-upcoming-feature InferSendableFromCaptures -enable-bare-slash-regex -enable-experimental-feature DebugDescriptionMacro -sdk /Applications/Xcode-16.1.0.app/Contents/Developer/Platforms/iPhoneOS.platform/Developer/SDKs/iPhoneOS18.1.sdk -target arm64-apple-ios18.1 -g -module-cache-path /Users/admin/builder/spi-builder-workspace/.derivedData/ModuleCache.noindex -Xfrontend -serialize-debugging-options -enable-testing -index-store-path /Users/admin/builder/spi-builder-workspace/.derivedData/Index.noindex/DataStore -enable-experimental-feature OpaqueTypeErasure -Xcc -D_LIBCPP_HARDENING_MODE\=_LIBCPP_HARDENING_MODE_DEBUG -swift-version 4 -I /Users/admin/builder/spi-builder-workspace/.derivedData/Build/Products/Debug-iphoneos -F /Users/admin/builder/spi-builder-workspace/.derivedData/Build/Products/Debug-iphoneos -F /Applications/Xcode-16.1.0.app/Contents/Developer/Platforms/iPhoneOS.platform/Developer/Library/Frameworks -c -j10 -enable-batch-mode -incremental -Xcc -ivfsstatcache -Xcc /Users/admin/builder/spi-builder-workspace/.derivedData/SDKStatCaches.noindex/iphoneos18.1-22B74-f2ea1940d4ae1642e20681c3a33270e4.sdkstatcache -output-file-map /Users/admin/builder/spi-builder-workspace/.derivedData/Build/Intermediates.noindex/Baggins.build/Debug-iphoneos/Baggins.build/Objects-normal/arm64/Baggins-OutputFileMap.json -use-frontend-parseable-output -save-temps -no-color-diagnostics -serialize-diagnostics -emit-dependencies -emit-module -emit-module-path /Users/admin/builder/spi-builder-workspace/.derivedData/Build/Intermediates.noindex/Baggins.build/Debug-iphoneos/Baggins.build/Objects-normal/arm64/Baggins.swiftmodule -validate-clang-modules-once -clang-build-session-file /Users/admin/builder/spi-builder-workspace/.derivedData/ModuleCache.noindex/Session.modulevalidation -Xcc -I/Users/admin/builder/spi-builder-workspace/.derivedData/Build/Intermediates.noindex/Baggins.build/Debug-iphoneos/Baggins.build/swift-overrides.hmap -emit-const-values -Xfrontend -const-gather-protocols-file -Xfrontend /Users/admin/builder/spi-builder-workspace/.derivedData/Build/Intermediates.noindex/Baggins.build/Debug-iphoneos/Baggins.build/Objects-normal/arm64/Baggins_const_extract_protocols.json -Xcc -I/Users/admin/builder/spi-builder-workspace/.derivedData/Build/Products/Debug-iphoneos/include -Xcc -I/Users/admin/builder/spi-builder-workspace/.derivedData/Build/Intermediates.noindex/Baggins.build/Debug-iphoneos/Baggins.build/DerivedSources-normal/arm64 -Xcc -I/Users/admin/builder/spi-builder-workspace/.derivedData/Build/Intermediates.noindex/Baggins.build/Debug-iphoneos/Baggins.build/DerivedSources/arm64 -Xcc -I/Users/admin/builder/spi-builder-workspace/.derivedData/Build/Intermediates.noindex/Baggins.build/Debug-iphoneos/Baggins.build/DerivedSources -emit-objc-header -emit-objc-header-path /Users/admin/builder/spi-builder-workspace/.derivedData/Build/Intermediates.noindex/Baggins.build/Debug-iphoneos/Baggins.build/Objects-normal/arm64/Baggins-Swift.h -working-directory /Users/admin/builder/spi-builder-workspace -experimental-emit-module-separately -disable-cmo
error: Build input files cannot be found: '/Users/admin/builder/spi-builder-workspace/Sources/Baggins/Baggings+Parsing.swift', '/Users/admin/builder/spi-builder-workspace/Sources/Baggins/Baggins+Throwing.swift', '/Users/admin/builder/spi-builder-workspace/Sources/Baggins/Baggins.swift'. Did you forget to declare these files as outputs of any script phases or custom build rules which produce them? (in target 'Baggins' from project 'Baggins')
** BUILD FAILED **
The following build commands failed:
SwiftDriver\ Compilation Baggins normal arm64 com.apple.xcode.tools.swift.compiler (in target 'Baggins' from project 'Baggins')
SwiftDriver\ Compilation\ Requirements Baggins normal arm64 com.apple.xcode.tools.swift.compiler (in target 'Baggins' from project 'Baggins')
Building project Baggins with scheme Baggins-Package
(3 failures)
Command line invocation:
/Applications/Xcode-16.1.0.app/Contents/Developer/usr/bin/xcodebuild -IDEClonedSourcePackagesDirPathOverride=/Users/admin/builder/spi-builder-workspace/.dependencies -skipMacroValidation -skipPackagePluginValidation -derivedDataPath /Users/admin/builder/spi-builder-workspace/.derivedData build -scheme Baggins-Package -destination generic/platform=iOS "OTHER_SWIFT_FLAGS=-stats-output-dir .stats -strict-concurrency=complete -enable-upcoming-feature StrictConcurrency -enable-upcoming-feature DisableOutwardActorInference -enable-upcoming-feature GlobalActorIsolatedTypesUsability -enable-upcoming-feature InferSendableFromCaptures"
User defaults from command line:
IDEClonedSourcePackagesDirPathOverride = /Users/admin/builder/spi-builder-workspace/.dependencies
IDEDerivedDataPathOverride = /Users/admin/builder/spi-builder-workspace/.derivedData
IDEPackageSupportUseBuiltinSCM = YES
Build settings from command line:
OTHER_SWIFT_FLAGS = -stats-output-dir .stats -strict-concurrency=complete -enable-upcoming-feature StrictConcurrency -enable-upcoming-feature DisableOutwardActorInference -enable-upcoming-feature GlobalActorIsolatedTypesUsability -enable-upcoming-feature InferSendableFromCaptures
Prepare packages
ComputeTargetDependencyGraph
note: Building targets in dependency order
note: Target dependency graph (1 target)
Target 'Baggins' in project 'Baggins' (no dependencies)
GatherProvisioningInputs
CreateBuildDescription
ClangStatCache /Applications/Xcode-16.1.0.app/Contents/Developer/Toolchains/XcodeDefault.xctoolchain/usr/bin/clang-stat-cache /Applications/Xcode-16.1.0.app/Contents/Developer/Platforms/iPhoneOS.platform/Developer/SDKs/iPhoneOS18.1.sdk /Users/admin/builder/spi-builder-workspace/.derivedData/SDKStatCaches.noindex/iphoneos18.1-22B74-f2ea1940d4ae1642e20681c3a33270e4.sdkstatcache
cd /Users/admin/builder/spi-builder-workspace/Baggins.xcodeproj
/Applications/Xcode-16.1.0.app/Contents/Developer/Toolchains/XcodeDefault.xctoolchain/usr/bin/clang-stat-cache /Applications/Xcode-16.1.0.app/Contents/Developer/Platforms/iPhoneOS.platform/Developer/SDKs/iPhoneOS18.1.sdk -o /Users/admin/builder/spi-builder-workspace/.derivedData/SDKStatCaches.noindex/iphoneos18.1-22B74-f2ea1940d4ae1642e20681c3a33270e4.sdkstatcache
SwiftDriver\ Compilation\ Requirements Baggins normal arm64 com.apple.xcode.tools.swift.compiler (in target 'Baggins' from project 'Baggins')
cd /Users/admin/builder/spi-builder-workspace
builtin-Swift-Compilation-Requirements -- /Applications/Xcode-16.1.0.app/Contents/Developer/Toolchains/XcodeDefault.xctoolchain/usr/bin/swiftc -module-name Baggins -Onone -enforce-exclusivity\=checked @/Users/admin/builder/spi-builder-workspace/.derivedData/Build/Intermediates.noindex/Baggins.build/Debug-iphoneos/Baggins.build/Objects-normal/arm64/Baggins.SwiftFileList -DSWIFT_PACKAGE -stats-output-dir .stats -strict-concurrency\=complete -enable-upcoming-feature StrictConcurrency -enable-upcoming-feature DisableOutwardActorInference -enable-upcoming-feature GlobalActorIsolatedTypesUsability -enable-upcoming-feature InferSendableFromCaptures -enable-bare-slash-regex -enable-experimental-feature DebugDescriptionMacro -sdk /Applications/Xcode-16.1.0.app/Contents/Developer/Platforms/iPhoneOS.platform/Developer/SDKs/iPhoneOS18.1.sdk -target arm64-apple-ios18.1 -g -module-cache-path /Users/admin/builder/spi-builder-workspace/.derivedData/ModuleCache.noindex -Xfrontend -serialize-debugging-options -enable-testing -index-store-path /Users/admin/builder/spi-builder-workspace/.derivedData/Index.noindex/DataStore -enable-experimental-feature OpaqueTypeErasure -Xcc -D_LIBCPP_HARDENING_MODE\=_LIBCPP_HARDENING_MODE_DEBUG -swift-version 4 -I /Users/admin/builder/spi-builder-workspace/.derivedData/Build/Products/Debug-iphoneos -F /Users/admin/builder/spi-builder-workspace/.derivedData/Build/Products/Debug-iphoneos -F /Applications/Xcode-16.1.0.app/Contents/Developer/Platforms/iPhoneOS.platform/Developer/Library/Frameworks -c -j10 -enable-batch-mode -incremental -Xcc -ivfsstatcache -Xcc /Users/admin/builder/spi-builder-workspace/.derivedData/SDKStatCaches.noindex/iphoneos18.1-22B74-f2ea1940d4ae1642e20681c3a33270e4.sdkstatcache -output-file-map /Users/admin/builder/spi-builder-workspace/.derivedData/Build/Intermediates.noindex/Baggins.build/Debug-iphoneos/Baggins.build/Objects-normal/arm64/Baggins-OutputFileMap.json -use-frontend-parseable-output -save-temps -no-color-diagnostics -serialize-diagnostics -emit-dependencies -emit-module -emit-module-path /Users/admin/builder/spi-builder-workspace/.derivedData/Build/Intermediates.noindex/Baggins.build/Debug-iphoneos/Baggins.build/Objects-normal/arm64/Baggins.swiftmodule -validate-clang-modules-once -clang-build-session-file /Users/admin/builder/spi-builder-workspace/.derivedData/ModuleCache.noindex/Session.modulevalidation -Xcc -I/Users/admin/builder/spi-builder-workspace/.derivedData/Build/Intermediates.noindex/Baggins.build/Debug-iphoneos/Baggins.build/swift-overrides.hmap -emit-const-values -Xfrontend -const-gather-protocols-file -Xfrontend /Users/admin/builder/spi-builder-workspace/.derivedData/Build/Intermediates.noindex/Baggins.build/Debug-iphoneos/Baggins.build/Objects-normal/arm64/Baggins_const_extract_protocols.json -Xcc -I/Users/admin/builder/spi-builder-workspace/.derivedData/Build/Products/Debug-iphoneos/include -Xcc -I/Users/admin/builder/spi-builder-workspace/.derivedData/Build/Intermediates.noindex/Baggins.build/Debug-iphoneos/Baggins.build/DerivedSources-normal/arm64 -Xcc -I/Users/admin/builder/spi-builder-workspace/.derivedData/Build/Intermediates.noindex/Baggins.build/Debug-iphoneos/Baggins.build/DerivedSources/arm64 -Xcc -I/Users/admin/builder/spi-builder-workspace/.derivedData/Build/Intermediates.noindex/Baggins.build/Debug-iphoneos/Baggins.build/DerivedSources -emit-objc-header -emit-objc-header-path /Users/admin/builder/spi-builder-workspace/.derivedData/Build/Intermediates.noindex/Baggins.build/Debug-iphoneos/Baggins.build/Objects-normal/arm64/Baggins-Swift.h -working-directory /Users/admin/builder/spi-builder-workspace -experimental-emit-module-separately -disable-cmo
error: Build input files cannot be found: '/Users/admin/builder/spi-builder-workspace/Sources/Baggins/Baggins.swift', '/Users/admin/builder/spi-builder-workspace/Sources/Baggins/Baggins+Throwing.swift', '/Users/admin/builder/spi-builder-workspace/Sources/Baggins/Baggings+Parsing.swift'. Did you forget to declare these files as outputs of any script phases or custom build rules which produce them? (in target 'Baggins' from project 'Baggins')
SwiftDriver\ Compilation Baggins normal arm64 com.apple.xcode.tools.swift.compiler (in target 'Baggins' from project 'Baggins')
cd /Users/admin/builder/spi-builder-workspace
builtin-Swift-Compilation -- /Applications/Xcode-16.1.0.app/Contents/Developer/Toolchains/XcodeDefault.xctoolchain/usr/bin/swiftc -module-name Baggins -Onone -enforce-exclusivity\=checked @/Users/admin/builder/spi-builder-workspace/.derivedData/Build/Intermediates.noindex/Baggins.build/Debug-iphoneos/Baggins.build/Objects-normal/arm64/Baggins.SwiftFileList -DSWIFT_PACKAGE -stats-output-dir .stats -strict-concurrency\=complete -enable-upcoming-feature StrictConcurrency -enable-upcoming-feature DisableOutwardActorInference -enable-upcoming-feature GlobalActorIsolatedTypesUsability -enable-upcoming-feature InferSendableFromCaptures -enable-bare-slash-regex -enable-experimental-feature DebugDescriptionMacro -sdk /Applications/Xcode-16.1.0.app/Contents/Developer/Platforms/iPhoneOS.platform/Developer/SDKs/iPhoneOS18.1.sdk -target arm64-apple-ios18.1 -g -module-cache-path /Users/admin/builder/spi-builder-workspace/.derivedData/ModuleCache.noindex -Xfrontend -serialize-debugging-options -enable-testing -index-store-path /Users/admin/builder/spi-builder-workspace/.derivedData/Index.noindex/DataStore -enable-experimental-feature OpaqueTypeErasure -Xcc -D_LIBCPP_HARDENING_MODE\=_LIBCPP_HARDENING_MODE_DEBUG -swift-version 4 -I /Users/admin/builder/spi-builder-workspace/.derivedData/Build/Products/Debug-iphoneos -F /Users/admin/builder/spi-builder-workspace/.derivedData/Build/Products/Debug-iphoneos -F /Applications/Xcode-16.1.0.app/Contents/Developer/Platforms/iPhoneOS.platform/Developer/Library/Frameworks -c -j10 -enable-batch-mode -incremental -Xcc -ivfsstatcache -Xcc /Users/admin/builder/spi-builder-workspace/.derivedData/SDKStatCaches.noindex/iphoneos18.1-22B74-f2ea1940d4ae1642e20681c3a33270e4.sdkstatcache -output-file-map /Users/admin/builder/spi-builder-workspace/.derivedData/Build/Intermediates.noindex/Baggins.build/Debug-iphoneos/Baggins.build/Objects-normal/arm64/Baggins-OutputFileMap.json -use-frontend-parseable-output -save-temps -no-color-diagnostics -serialize-diagnostics -emit-dependencies -emit-module -emit-module-path /Users/admin/builder/spi-builder-workspace/.derivedData/Build/Intermediates.noindex/Baggins.build/Debug-iphoneos/Baggins.build/Objects-normal/arm64/Baggins.swiftmodule -validate-clang-modules-once -clang-build-session-file /Users/admin/builder/spi-builder-workspace/.derivedData/ModuleCache.noindex/Session.modulevalidation -Xcc -I/Users/admin/builder/spi-builder-workspace/.derivedData/Build/Intermediates.noindex/Baggins.build/Debug-iphoneos/Baggins.build/swift-overrides.hmap -emit-const-values -Xfrontend -const-gather-protocols-file -Xfrontend /Users/admin/builder/spi-builder-workspace/.derivedData/Build/Intermediates.noindex/Baggins.build/Debug-iphoneos/Baggins.build/Objects-normal/arm64/Baggins_const_extract_protocols.json -Xcc -I/Users/admin/builder/spi-builder-workspace/.derivedData/Build/Products/Debug-iphoneos/include -Xcc -I/Users/admin/builder/spi-builder-workspace/.derivedData/Build/Intermediates.noindex/Baggins.build/Debug-iphoneos/Baggins.build/DerivedSources-normal/arm64 -Xcc -I/Users/admin/builder/spi-builder-workspace/.derivedData/Build/Intermediates.noindex/Baggins.build/Debug-iphoneos/Baggins.build/DerivedSources/arm64 -Xcc -I/Users/admin/builder/spi-builder-workspace/.derivedData/Build/Intermediates.noindex/Baggins.build/Debug-iphoneos/Baggins.build/DerivedSources -emit-objc-header -emit-objc-header-path /Users/admin/builder/spi-builder-workspace/.derivedData/Build/Intermediates.noindex/Baggins.build/Debug-iphoneos/Baggins.build/Objects-normal/arm64/Baggins-Swift.h -working-directory /Users/admin/builder/spi-builder-workspace -experimental-emit-module-separately -disable-cmo
error: Build input files cannot be found: '/Users/admin/builder/spi-builder-workspace/Sources/Baggins/Baggins.swift', '/Users/admin/builder/spi-builder-workspace/Sources/Baggins/Baggins+Throwing.swift', '/Users/admin/builder/spi-builder-workspace/Sources/Baggins/Baggings+Parsing.swift'. Did you forget to declare these files as outputs of any script phases or custom build rules which produce them? (in target 'Baggins' from project 'Baggins')
** BUILD FAILED **
The following build commands failed:
SwiftDriver\ Compilation\ Requirements Baggins normal arm64 com.apple.xcode.tools.swift.compiler (in target 'Baggins' from project 'Baggins')
SwiftDriver\ Compilation Baggins normal arm64 com.apple.xcode.tools.swift.compiler (in target 'Baggins' from project 'Baggins')
Building project Baggins with scheme Baggins-Package
(3 failures)
BUILD FAILURE 6.0 iOS