Build Information
Failed to build Model3DView, reference 0.1.1 (8b3ee5
), with Swift 6.1 for watchOS using Xcode 16.3 on 28 Apr 2025 01:43:14 UTC.
Build Command
env DEVELOPER_DIR=/Applications/Xcode-16.3.0.app xcrun xcodebuild -IDEClonedSourcePackagesDirPathOverride=$PWD/.dependencies -skipMacroValidation -skipPackagePluginValidation -derivedDataPath $PWD/.derivedData build -scheme Model3DView -destination generic/platform=watchOS
Build Log
========================================
RunAll
========================================
Builder version: 4.61.0
Interrupt handler set up.
========================================
Checkout
========================================
Clone URL: https://github.com/frzi/swiftui-model3dview.git
Reference: 0.1.1
Initialized empty Git repository in /Users/admin/builder/spi-builder-workspace/.git/
From https://github.com/frzi/swiftui-model3dview
* tag 0.1.1 -> FETCH_HEAD
HEAD is now at 8b3ee58 Link to a tagged version of GLTFSceneKit
Cloned https://github.com/frzi/swiftui-model3dview.git
Revision (git rev-parse @):
8b3ee58a9a752c11511f9ead61ec42c4d533109a
SUCCESS checkout https://github.com/frzi/swiftui-model3dview.git at 0.1.1
========================================
Build
========================================
Selected platform: watchOS
Swift version: 6.1
Building package at path: $PWD
https://github.com/frzi/swiftui-model3dview.git
https://github.com/frzi/swiftui-model3dview.git
{
"dependencies" : [
{
"identity" : "gltfscenekit",
"requirement" : {
"range" : [
{
"lower_bound" : "0.3.1",
"upper_bound" : "1.0.0"
}
]
},
"type" : "sourceControl",
"url" : "https://github.com/frzi/GLTFSceneKit"
},
{
"identity" : "displaylink",
"requirement" : {
"range" : [
{
"lower_bound" : "0.2.0",
"upper_bound" : "1.0.0"
}
]
},
"type" : "sourceControl",
"url" : "https://github.com/timdonnelly/DisplayLink"
}
],
"manifest_display_name" : "Model3DView",
"name" : "Model3DView",
"path" : "/Users/admin/builder/spi-builder-workspace",
"platforms" : [
{
"name" : "macos",
"version" : "11.0"
},
{
"name" : "ios",
"version" : "14.0"
},
{
"name" : "tvos",
"version" : "14.0"
}
],
"products" : [
{
"name" : "Model3DView",
"targets" : [
"Model3DView"
],
"type" : {
"library" : [
"automatic"
]
}
}
],
"targets" : [
{
"c99name" : "Model3DViewTests",
"module_type" : "SwiftTarget",
"name" : "Model3DViewTests",
"path" : "Tests/Model3DViewTests",
"sources" : [
"Model3DViewTests.swift"
],
"target_dependencies" : [
"Model3DView"
],
"type" : "test"
},
{
"c99name" : "Model3DView",
"module_type" : "SwiftTarget",
"name" : "Model3DView",
"path" : "Sources/Model3DView",
"product_dependencies" : [
"GLTFSceneKit",
"DisplayLink"
],
"product_memberships" : [
"Model3DView"
],
"sources" : [
"Camera/CameraControls.swift",
"Camera/Cameras.swift",
"EnvironmentValues.swift",
"Model3DView.swift",
"Transform3D.swift",
"Types.swift",
"Utils/Euler.swift",
"Utils/Math.swift",
"Utils/ResourcesCache.swift",
"View+Modifiers.swift"
],
"type" : "library"
}
],
"tools_version" : "5.5"
}
Command line invocation:
/Applications/Xcode-16.3.0.app/Contents/Developer/usr/bin/xcodebuild -IDEClonedSourcePackagesDirPathOverride=/Users/admin/builder/spi-builder-workspace/.dependencies -resolvePackageDependencies
Resolve Package Graph
Fetching from https://github.com/timdonnelly/DisplayLink
Fetching from https://github.com/frzi/GLTFSceneKit
Creating working copy of package ‘GLTFSceneKit’
Checking out 0.4.1 of package ‘GLTFSceneKit’
Creating working copy of package ‘DisplayLink’
Checking out 0.2.0 of package ‘DisplayLink’
Resolve Package Graph
Resolve Package Graph
Resolved source packages:
GLTFSceneKit: https://github.com/frzi/GLTFSceneKit @ 0.4.1
Model3DView: /Users/admin/builder/spi-builder-workspace
DisplayLink: https://github.com/timdonnelly/DisplayLink @ 0.2.0
resolved source packages: GLTFSceneKit, Model3DView, DisplayLink
{
"dependencies" : [
{
"identity" : "gltfscenekit",
"requirement" : {
"range" : [
{
"lower_bound" : "0.3.1",
"upper_bound" : "1.0.0"
}
]
},
"type" : "sourceControl",
"url" : "https://github.com/frzi/GLTFSceneKit"
},
{
"identity" : "displaylink",
"requirement" : {
"range" : [
{
"lower_bound" : "0.2.0",
"upper_bound" : "1.0.0"
}
]
},
"type" : "sourceControl",
"url" : "https://github.com/timdonnelly/DisplayLink"
}
],
"manifest_display_name" : "Model3DView",
"name" : "Model3DView",
"path" : "/Users/admin/builder/spi-builder-workspace",
"platforms" : [
{
"name" : "macos",
"version" : "11.0"
},
{
"name" : "ios",
"version" : "14.0"
},
{
"name" : "tvos",
"version" : "14.0"
}
],
"products" : [
{
"name" : "Model3DView",
"targets" : [
"Model3DView"
],
"type" : {
"library" : [
"automatic"
]
}
}
],
"targets" : [
{
"c99name" : "Model3DViewTests",
"module_type" : "SwiftTarget",
"name" : "Model3DViewTests",
"path" : "Tests/Model3DViewTests",
"sources" : [
"Model3DViewTests.swift"
],
"target_dependencies" : [
"Model3DView"
],
"type" : "test"
},
{
"c99name" : "Model3DView",
"module_type" : "SwiftTarget",
"name" : "Model3DView",
"path" : "Sources/Model3DView",
"product_dependencies" : [
"GLTFSceneKit",
"DisplayLink"
],
"product_memberships" : [
"Model3DView"
],
"sources" : [
"Camera/CameraControls.swift",
"Camera/Cameras.swift",
"EnvironmentValues.swift",
"Model3DView.swift",
"Transform3D.swift",
"Types.swift",
"Utils/Euler.swift",
"Utils/Math.swift",
"Utils/ResourcesCache.swift",
"View+Modifiers.swift"
],
"type" : "library"
}
],
"tools_version" : "5.5"
}
{
"workspace" : {
"name" : "spi-builder-workspace",
"schemes" : [
"Model3DView"
]
}
}
Running build ...
env DEVELOPER_DIR=/Applications/Xcode-16.3.0.app xcrun xcodebuild -IDEClonedSourcePackagesDirPathOverride=$PWD/.dependencies -skipMacroValidation -skipPackagePluginValidation -derivedDataPath $PWD/.derivedData build -scheme Model3DView -destination generic/platform=watchOS OTHER_SWIFT_FLAGS=-stats-output-dir .stats -strict-concurrency=complete -enable-upcoming-feature StrictConcurrency -enable-upcoming-feature DisableOutwardActorInference -enable-upcoming-feature GlobalActorIsolatedTypesUsability -enable-upcoming-feature InferSendableFromCaptures
Command line invocation:
/Applications/Xcode-16.3.0.app/Contents/Developer/usr/bin/xcodebuild -IDEClonedSourcePackagesDirPathOverride=/Users/admin/builder/spi-builder-workspace/.dependencies -skipMacroValidation -skipPackagePluginValidation -derivedDataPath /Users/admin/builder/spi-builder-workspace/.derivedData build -scheme Model3DView -destination generic/platform=watchOS "OTHER_SWIFT_FLAGS=-stats-output-dir .stats -strict-concurrency=complete -enable-upcoming-feature StrictConcurrency -enable-upcoming-feature DisableOutwardActorInference -enable-upcoming-feature GlobalActorIsolatedTypesUsability -enable-upcoming-feature InferSendableFromCaptures"
Build settings from command line:
OTHER_SWIFT_FLAGS = -stats-output-dir .stats -strict-concurrency=complete -enable-upcoming-feature StrictConcurrency -enable-upcoming-feature DisableOutwardActorInference -enable-upcoming-feature GlobalActorIsolatedTypesUsability -enable-upcoming-feature InferSendableFromCaptures
Resolve Package Graph
Resolve Package Graph
Resolved source packages:
GLTFSceneKit: https://github.com/frzi/GLTFSceneKit @ 0.4.1
DisplayLink: https://github.com/timdonnelly/DisplayLink @ 0.2.0
Model3DView: /Users/admin/builder/spi-builder-workspace
ComputePackagePrebuildTargetDependencyGraph
Prepare packages
CreateBuildRequest
SendProjectDescription
CreateBuildOperation
ComputeTargetDependencyGraph
note: Building targets in dependency order
note: Target dependency graph (7 targets)
Target 'Model3DView' in project 'Model3DView'
➜ Explicit dependency on target 'Model3DView' in project 'Model3DView'
➜ Explicit dependency on target 'GLTFSceneKit' in project 'GLTFSceneKit'
➜ Explicit dependency on target 'DisplayLink' in project 'DisplayLink'
Target 'Model3DView' in project 'Model3DView'
➜ Explicit dependency on target 'GLTFSceneKit' in project 'GLTFSceneKit'
➜ Explicit dependency on target 'DisplayLink' in project 'DisplayLink'
Target 'DisplayLink' in project 'DisplayLink'
➜ Explicit dependency on target 'DisplayLink' in project 'DisplayLink'
Target 'DisplayLink' in project 'DisplayLink' (no dependencies)
Target 'GLTFSceneKit' in project 'GLTFSceneKit'
➜ Explicit dependency on target 'GLTFSceneKit' in project 'GLTFSceneKit'
➜ Explicit dependency on target 'GLTFSceneKit_GLTFSceneKit' in project 'GLTFSceneKit'
Target 'GLTFSceneKit' in project 'GLTFSceneKit'
➜ Explicit dependency on target 'GLTFSceneKit_GLTFSceneKit' in project 'GLTFSceneKit'
Target 'GLTFSceneKit_GLTFSceneKit' in project 'GLTFSceneKit' (no dependencies)
GatherProvisioningInputs
CreateBuildDescription
ExecuteExternalTool /Applications/Xcode-16.3.0.app/Contents/Developer/Toolchains/XcodeDefault.xctoolchain/usr/bin/swiftc --version
ExecuteExternalTool /Applications/Xcode-16.3.0.app/Contents/Developer/Toolchains/XcodeDefault.xctoolchain/usr/bin/clang -v -E -dM -isysroot /Applications/Xcode-16.3.0.app/Contents/Developer/Platforms/WatchOS.platform/Developer/SDKs/WatchOS11.4.sdk -x c -c /dev/null
ExecuteExternalTool /Applications/Xcode-16.3.0.app/Contents/Developer/Toolchains/XcodeDefault.xctoolchain/usr/bin/ld -version_details
ReadFileContents /Applications/Xcode-16.3.0.app/Contents/Developer/Toolchains/XcodeDefault.xctoolchain/usr/share/docc/features.json
Build description signature: 027ac711063e3e0d32bc45ab8fe717e3
Build description path: /Users/admin/builder/spi-builder-workspace/.derivedData/Build/Intermediates.noindex/XCBuildData/027ac711063e3e0d32bc45ab8fe717e3.xcbuilddata
ClangStatCache /Applications/Xcode-16.3.0.app/Contents/Developer/Toolchains/XcodeDefault.xctoolchain/usr/bin/clang-stat-cache /Applications/Xcode-16.3.0.app/Contents/Developer/Platforms/WatchOS.platform/Developer/SDKs/WatchOS11.4.sdk /Users/admin/builder/spi-builder-workspace/.derivedData/SDKStatCaches.noindex/watchos11.4-22T246-43efb940ff07ba2497b70ec94253f576.sdkstatcache
cd /Users/admin/builder/spi-builder-workspace/.swiftpm/xcode
/Applications/Xcode-16.3.0.app/Contents/Developer/Toolchains/XcodeDefault.xctoolchain/usr/bin/clang-stat-cache /Applications/Xcode-16.3.0.app/Contents/Developer/Platforms/WatchOS.platform/Developer/SDKs/WatchOS11.4.sdk -o /Users/admin/builder/spi-builder-workspace/.derivedData/SDKStatCaches.noindex/watchos11.4-22T246-43efb940ff07ba2497b70ec94253f576.sdkstatcache
CreateBuildDirectory /Users/admin/builder/spi-builder-workspace/.derivedData/Build/Products
cd /Users/admin/builder/spi-builder-workspace/.swiftpm/xcode
builtin-create-build-directory /Users/admin/builder/spi-builder-workspace/.derivedData/Build/Products
CreateBuildDirectory /Users/admin/builder/spi-builder-workspace/.derivedData/Build/Intermediates.noindex
cd /Users/admin/builder/spi-builder-workspace/.swiftpm/xcode
builtin-create-build-directory /Users/admin/builder/spi-builder-workspace/.derivedData/Build/Intermediates.noindex
CreateBuildDirectory /Users/admin/builder/spi-builder-workspace/.derivedData/Build/Products/Debug-watchos
cd /Users/admin/builder/spi-builder-workspace/.swiftpm/xcode
builtin-create-build-directory /Users/admin/builder/spi-builder-workspace/.derivedData/Build/Products/Debug-watchos
CreateBuildDirectory /Users/admin/builder/spi-builder-workspace/.derivedData/Build/Intermediates.noindex/EagerLinkingTBDs/Debug-watchos
cd /Users/admin/builder/spi-builder-workspace/.swiftpm/xcode
builtin-create-build-directory /Users/admin/builder/spi-builder-workspace/.derivedData/Build/Intermediates.noindex/EagerLinkingTBDs/Debug-watchos
CreateBuildDirectory /Users/admin/builder/spi-builder-workspace/.derivedData/Build/Products/Debug-watchos/PackageFrameworks
cd /Users/admin/builder/spi-builder-workspace/.swiftpm/xcode
builtin-create-build-directory /Users/admin/builder/spi-builder-workspace/.derivedData/Build/Products/Debug-watchos/PackageFrameworks
WriteAuxiliaryFile /Users/admin/builder/spi-builder-workspace/.derivedData/Build/Intermediates.noindex/Model3DView.build/Debug-watchos/Model3DView.build/Objects-normal/armv7k/Model3DView.LinkFileList (in target 'Model3DView' from project 'Model3DView')
cd /Users/admin/builder/spi-builder-workspace
write-file /Users/admin/builder/spi-builder-workspace/.derivedData/Build/Intermediates.noindex/Model3DView.build/Debug-watchos/Model3DView.build/Objects-normal/armv7k/Model3DView.LinkFileList
WriteAuxiliaryFile /Users/admin/builder/spi-builder-workspace/.derivedData/Build/Intermediates.noindex/Model3DView.build/Debug-watchos/Model3DView.build/Objects-normal/arm64_32/Model3DView.SwiftConstValuesFileList (in target 'Model3DView' from project 'Model3DView')
cd /Users/admin/builder/spi-builder-workspace
write-file /Users/admin/builder/spi-builder-workspace/.derivedData/Build/Intermediates.noindex/Model3DView.build/Debug-watchos/Model3DView.build/Objects-normal/arm64_32/Model3DView.SwiftConstValuesFileList
WriteAuxiliaryFile /Users/admin/builder/spi-builder-workspace/.derivedData/Build/Intermediates.noindex/Model3DView.build/Debug-watchos/Model3DView.build/Objects-normal/armv7k/Model3DView.SwiftFileList (in target 'Model3DView' from project 'Model3DView')
cd /Users/admin/builder/spi-builder-workspace
write-file /Users/admin/builder/spi-builder-workspace/.derivedData/Build/Intermediates.noindex/Model3DView.build/Debug-watchos/Model3DView.build/Objects-normal/armv7k/Model3DView.SwiftFileList
WriteAuxiliaryFile /Users/admin/builder/spi-builder-workspace/.derivedData/Build/Intermediates.noindex/Model3DView.build/Debug-watchos/Model3DView.build/Objects-normal/armv7k/Model3DView.SwiftConstValuesFileList (in target 'Model3DView' from project 'Model3DView')
cd /Users/admin/builder/spi-builder-workspace
write-file /Users/admin/builder/spi-builder-workspace/.derivedData/Build/Intermediates.noindex/Model3DView.build/Debug-watchos/Model3DView.build/Objects-normal/armv7k/Model3DView.SwiftConstValuesFileList
WriteAuxiliaryFile /Users/admin/builder/spi-builder-workspace/.derivedData/Build/Intermediates.noindex/Model3DView.build/Debug-watchos/Model3DView.build/Objects-normal/arm64_32/Model3DView.LinkFileList (in target 'Model3DView' from project 'Model3DView')
cd /Users/admin/builder/spi-builder-workspace
write-file /Users/admin/builder/spi-builder-workspace/.derivedData/Build/Intermediates.noindex/Model3DView.build/Debug-watchos/Model3DView.build/Objects-normal/arm64_32/Model3DView.LinkFileList
WriteAuxiliaryFile /Users/admin/builder/spi-builder-workspace/.derivedData/Build/Intermediates.noindex/Model3DView.build/Debug-watchos/Model3DView.build/Objects-normal/armv7k/Model3DView-OutputFileMap.json (in target 'Model3DView' from project 'Model3DView')
cd /Users/admin/builder/spi-builder-workspace
write-file /Users/admin/builder/spi-builder-workspace/.derivedData/Build/Intermediates.noindex/Model3DView.build/Debug-watchos/Model3DView.build/Objects-normal/armv7k/Model3DView-OutputFileMap.json
WriteAuxiliaryFile /Users/admin/builder/spi-builder-workspace/.derivedData/Build/Intermediates.noindex/Model3DView.build/Debug-watchos/Model3DView.build/Objects-normal/armv7k/Model3DView_const_extract_protocols.json (in target 'Model3DView' from project 'Model3DView')
cd /Users/admin/builder/spi-builder-workspace
write-file /Users/admin/builder/spi-builder-workspace/.derivedData/Build/Intermediates.noindex/Model3DView.build/Debug-watchos/Model3DView.build/Objects-normal/armv7k/Model3DView_const_extract_protocols.json
WriteAuxiliaryFile /Users/admin/builder/spi-builder-workspace/.derivedData/Build/Intermediates.noindex/Model3DView.build/Debug-watchos/Model3DView.build/Objects-normal/arm64_32/Model3DView.SwiftFileList (in target 'Model3DView' from project 'Model3DView')
cd /Users/admin/builder/spi-builder-workspace
write-file /Users/admin/builder/spi-builder-workspace/.derivedData/Build/Intermediates.noindex/Model3DView.build/Debug-watchos/Model3DView.build/Objects-normal/arm64_32/Model3DView.SwiftFileList
WriteAuxiliaryFile /Users/admin/builder/spi-builder-workspace/.derivedData/Build/Intermediates.noindex/Model3DView.build/Debug-watchos/Model3DView.build/Objects-normal/arm64_32/Model3DView_const_extract_protocols.json (in target 'Model3DView' from project 'Model3DView')
cd /Users/admin/builder/spi-builder-workspace
write-file /Users/admin/builder/spi-builder-workspace/.derivedData/Build/Intermediates.noindex/Model3DView.build/Debug-watchos/Model3DView.build/Objects-normal/arm64_32/Model3DView_const_extract_protocols.json
WriteAuxiliaryFile /Users/admin/builder/spi-builder-workspace/.derivedData/Build/Intermediates.noindex/Model3DView.build/Debug-watchos/Model3DView.build/Objects-normal/arm64_32/Model3DView-OutputFileMap.json (in target 'Model3DView' from project 'Model3DView')
cd /Users/admin/builder/spi-builder-workspace
write-file /Users/admin/builder/spi-builder-workspace/.derivedData/Build/Intermediates.noindex/Model3DView.build/Debug-watchos/Model3DView.build/Objects-normal/arm64_32/Model3DView-OutputFileMap.json
WriteAuxiliaryFile /Users/admin/builder/spi-builder-workspace/.derivedData/Build/Intermediates.noindex/Model3DView.build/Debug-watchos/Model3DView.build/Objects-normal/arm64/Model3DView_const_extract_protocols.json (in target 'Model3DView' from project 'Model3DView')
cd /Users/admin/builder/spi-builder-workspace
write-file /Users/admin/builder/spi-builder-workspace/.derivedData/Build/Intermediates.noindex/Model3DView.build/Debug-watchos/Model3DView.build/Objects-normal/arm64/Model3DView_const_extract_protocols.json
WriteAuxiliaryFile /Users/admin/builder/spi-builder-workspace/.derivedData/Build/Intermediates.noindex/Model3DView.build/Debug-watchos/Model3DView.build/Objects-normal/arm64/Model3DView.SwiftFileList (in target 'Model3DView' from project 'Model3DView')
cd /Users/admin/builder/spi-builder-workspace
write-file /Users/admin/builder/spi-builder-workspace/.derivedData/Build/Intermediates.noindex/Model3DView.build/Debug-watchos/Model3DView.build/Objects-normal/arm64/Model3DView.SwiftFileList
WriteAuxiliaryFile /Users/admin/builder/spi-builder-workspace/.derivedData/Build/Intermediates.noindex/Model3DView.build/Debug-watchos/Model3DView.build/Objects-normal/arm64/Model3DView.SwiftConstValuesFileList (in target 'Model3DView' from project 'Model3DView')
cd /Users/admin/builder/spi-builder-workspace
write-file /Users/admin/builder/spi-builder-workspace/.derivedData/Build/Intermediates.noindex/Model3DView.build/Debug-watchos/Model3DView.build/Objects-normal/arm64/Model3DView.SwiftConstValuesFileList
WriteAuxiliaryFile /Users/admin/builder/spi-builder-workspace/.derivedData/Build/Intermediates.noindex/Model3DView.build/Debug-watchos/Model3DView.build/Objects-normal/arm64/Model3DView.LinkFileList (in target 'Model3DView' from project 'Model3DView')
cd /Users/admin/builder/spi-builder-workspace
write-file /Users/admin/builder/spi-builder-workspace/.derivedData/Build/Intermediates.noindex/Model3DView.build/Debug-watchos/Model3DView.build/Objects-normal/arm64/Model3DView.LinkFileList
WriteAuxiliaryFile /Users/admin/builder/spi-builder-workspace/.derivedData/Build/Intermediates.noindex/Model3DView.build/Debug-watchos/Model3DView.build/Objects-normal/arm64/Model3DView-OutputFileMap.json (in target 'Model3DView' from project 'Model3DView')
cd /Users/admin/builder/spi-builder-workspace
write-file /Users/admin/builder/spi-builder-workspace/.derivedData/Build/Intermediates.noindex/Model3DView.build/Debug-watchos/Model3DView.build/Objects-normal/arm64/Model3DView-OutputFileMap.json
WriteAuxiliaryFile /Users/admin/builder/spi-builder-workspace/.derivedData/Build/Intermediates.noindex/Model3DView.build/Debug-watchos/Model3DView.build/Model3DView.modulemap (in target 'Model3DView' from project 'Model3DView')
cd /Users/admin/builder/spi-builder-workspace
write-file /Users/admin/builder/spi-builder-workspace/.derivedData/Build/Intermediates.noindex/Model3DView.build/Debug-watchos/Model3DView.build/Model3DView.modulemap
WriteAuxiliaryFile /Users/admin/builder/spi-builder-workspace/.derivedData/Build/Intermediates.noindex/Model3DView.build/Debug-watchos/Model3DView.build/Model3DView.DependencyStaticMetadataFileList (in target 'Model3DView' from project 'Model3DView')
cd /Users/admin/builder/spi-builder-workspace
write-file /Users/admin/builder/spi-builder-workspace/.derivedData/Build/Intermediates.noindex/Model3DView.build/Debug-watchos/Model3DView.build/Model3DView.DependencyStaticMetadataFileList
WriteAuxiliaryFile /Users/admin/builder/spi-builder-workspace/.derivedData/Build/Intermediates.noindex/Model3DView.build/Debug-watchos/Model3DView.build/Model3DView.DependencyMetadataFileList (in target 'Model3DView' from project 'Model3DView')
cd /Users/admin/builder/spi-builder-workspace
write-file /Users/admin/builder/spi-builder-workspace/.derivedData/Build/Intermediates.noindex/Model3DView.build/Debug-watchos/Model3DView.build/Model3DView.DependencyMetadataFileList
WriteAuxiliaryFile /Users/admin/builder/spi-builder-workspace/.derivedData/Build/Intermediates.noindex/GLTFSceneKit.build/Debug-watchos/GLTFSceneKit_GLTFSceneKit.build/empty-GLTFSceneKit_GLTFSceneKit.plist (in target 'GLTFSceneKit_GLTFSceneKit' from project 'GLTFSceneKit')
cd /Users/admin/builder/spi-builder-workspace/.dependencies/checkouts/GLTFSceneKit
write-file /Users/admin/builder/spi-builder-workspace/.derivedData/Build/Intermediates.noindex/GLTFSceneKit.build/Debug-watchos/GLTFSceneKit_GLTFSceneKit.build/empty-GLTFSceneKit_GLTFSceneKit.plist
WriteAuxiliaryFile /Users/admin/builder/spi-builder-workspace/.derivedData/Build/Intermediates.noindex/GLTFSceneKit.build/Debug-watchos/GLTFSceneKit_GLTFSceneKit.build/GLTFSceneKit_GLTFSceneKit.DependencyStaticMetadataFileList (in target 'GLTFSceneKit_GLTFSceneKit' from project 'GLTFSceneKit')
cd /Users/admin/builder/spi-builder-workspace/.dependencies/checkouts/GLTFSceneKit
write-file /Users/admin/builder/spi-builder-workspace/.derivedData/Build/Intermediates.noindex/GLTFSceneKit.build/Debug-watchos/GLTFSceneKit_GLTFSceneKit.build/GLTFSceneKit_GLTFSceneKit.DependencyStaticMetadataFileList
WriteAuxiliaryFile /Users/admin/builder/spi-builder-workspace/.derivedData/Build/Intermediates.noindex/GLTFSceneKit.build/Debug-watchos/GLTFSceneKit_GLTFSceneKit.build/GLTFSceneKit_GLTFSceneKit.DependencyMetadataFileList (in target 'GLTFSceneKit_GLTFSceneKit' from project 'GLTFSceneKit')
cd /Users/admin/builder/spi-builder-workspace/.dependencies/checkouts/GLTFSceneKit
write-file /Users/admin/builder/spi-builder-workspace/.derivedData/Build/Intermediates.noindex/GLTFSceneKit.build/Debug-watchos/GLTFSceneKit_GLTFSceneKit.build/GLTFSceneKit_GLTFSceneKit.DependencyMetadataFileList
WriteAuxiliaryFile /Users/admin/builder/spi-builder-workspace/.derivedData/Build/Intermediates.noindex/GLTFSceneKit.build/Debug-watchos/GLTFSceneKit.build/Objects-normal/armv7k/GLTFSceneKit_const_extract_protocols.json (in target 'GLTFSceneKit' from project 'GLTFSceneKit')
cd /Users/admin/builder/spi-builder-workspace/.dependencies/checkouts/GLTFSceneKit
write-file /Users/admin/builder/spi-builder-workspace/.derivedData/Build/Intermediates.noindex/GLTFSceneKit.build/Debug-watchos/GLTFSceneKit.build/Objects-normal/armv7k/GLTFSceneKit_const_extract_protocols.json
WriteAuxiliaryFile /Users/admin/builder/spi-builder-workspace/.derivedData/Build/Intermediates.noindex/GLTFSceneKit.build/Debug-watchos/GLTFSceneKit.build/Objects-normal/armv7k/GLTFSceneKit.SwiftFileList (in target 'GLTFSceneKit' from project 'GLTFSceneKit')
cd /Users/admin/builder/spi-builder-workspace/.dependencies/checkouts/GLTFSceneKit
write-file /Users/admin/builder/spi-builder-workspace/.derivedData/Build/Intermediates.noindex/GLTFSceneKit.build/Debug-watchos/GLTFSceneKit.build/Objects-normal/armv7k/GLTFSceneKit.SwiftFileList
WriteAuxiliaryFile /Users/admin/builder/spi-builder-workspace/.derivedData/Build/Intermediates.noindex/GLTFSceneKit.build/Debug-watchos/GLTFSceneKit.build/Objects-normal/armv7k/GLTFSceneKit.SwiftConstValuesFileList (in target 'GLTFSceneKit' from project 'GLTFSceneKit')
cd /Users/admin/builder/spi-builder-workspace/.dependencies/checkouts/GLTFSceneKit
write-file /Users/admin/builder/spi-builder-workspace/.derivedData/Build/Intermediates.noindex/GLTFSceneKit.build/Debug-watchos/GLTFSceneKit.build/Objects-normal/armv7k/GLTFSceneKit.SwiftConstValuesFileList
WriteAuxiliaryFile /Users/admin/builder/spi-builder-workspace/.derivedData/Build/Intermediates.noindex/GLTFSceneKit.build/Debug-watchos/GLTFSceneKit.build/Objects-normal/armv7k/GLTFSceneKit.LinkFileList (in target 'GLTFSceneKit' from project 'GLTFSceneKit')
cd /Users/admin/builder/spi-builder-workspace/.dependencies/checkouts/GLTFSceneKit
write-file /Users/admin/builder/spi-builder-workspace/.derivedData/Build/Intermediates.noindex/GLTFSceneKit.build/Debug-watchos/GLTFSceneKit.build/Objects-normal/armv7k/GLTFSceneKit.LinkFileList
WriteAuxiliaryFile /Users/admin/builder/spi-builder-workspace/.derivedData/Build/Intermediates.noindex/GLTFSceneKit.build/Debug-watchos/GLTFSceneKit.build/Objects-normal/armv7k/GLTFSceneKit-OutputFileMap.json (in target 'GLTFSceneKit' from project 'GLTFSceneKit')
cd /Users/admin/builder/spi-builder-workspace/.dependencies/checkouts/GLTFSceneKit
write-file /Users/admin/builder/spi-builder-workspace/.derivedData/Build/Intermediates.noindex/GLTFSceneKit.build/Debug-watchos/GLTFSceneKit.build/Objects-normal/armv7k/GLTFSceneKit-OutputFileMap.json
WriteAuxiliaryFile /Users/admin/builder/spi-builder-workspace/.derivedData/Build/Intermediates.noindex/GLTFSceneKit.build/Debug-watchos/GLTFSceneKit.build/Objects-normal/arm64_32/GLTFSceneKit_const_extract_protocols.json (in target 'GLTFSceneKit' from project 'GLTFSceneKit')
cd /Users/admin/builder/spi-builder-workspace/.dependencies/checkouts/GLTFSceneKit
write-file /Users/admin/builder/spi-builder-workspace/.derivedData/Build/Intermediates.noindex/GLTFSceneKit.build/Debug-watchos/GLTFSceneKit.build/Objects-normal/arm64_32/GLTFSceneKit_const_extract_protocols.json
Copy /Users/admin/builder/spi-builder-workspace/.derivedData/Build/Intermediates.noindex/GeneratedModuleMaps-watchos/Model3DView.modulemap /Users/admin/builder/spi-builder-workspace/.derivedData/Build/Intermediates.noindex/Model3DView.build/Debug-watchos/Model3DView.build/Model3DView.modulemap (in target 'Model3DView' from project 'Model3DView')
cd /Users/admin/builder/spi-builder-workspace
builtin-copy -exclude .DS_Store -exclude CVS -exclude .svn -exclude .git -exclude .hg -resolve-src-symlinks /Users/admin/builder/spi-builder-workspace/.derivedData/Build/Intermediates.noindex/Model3DView.build/Debug-watchos/Model3DView.build/Model3DView.modulemap /Users/admin/builder/spi-builder-workspace/.derivedData/Build/Intermediates.noindex/GeneratedModuleMaps-watchos
WriteAuxiliaryFile /Users/admin/builder/spi-builder-workspace/.derivedData/Build/Intermediates.noindex/GLTFSceneKit.build/Debug-watchos/GLTFSceneKit.build/Objects-normal/arm64_32/GLTFSceneKit.SwiftFileList (in target 'GLTFSceneKit' from project 'GLTFSceneKit')
cd /Users/admin/builder/spi-builder-workspace/.dependencies/checkouts/GLTFSceneKit
write-file /Users/admin/builder/spi-builder-workspace/.derivedData/Build/Intermediates.noindex/GLTFSceneKit.build/Debug-watchos/GLTFSceneKit.build/Objects-normal/arm64_32/GLTFSceneKit.SwiftFileList
WriteAuxiliaryFile /Users/admin/builder/spi-builder-workspace/.derivedData/Build/Intermediates.noindex/GLTFSceneKit.build/Debug-watchos/GLTFSceneKit.build/Objects-normal/arm64_32/GLTFSceneKit.SwiftConstValuesFileList (in target 'GLTFSceneKit' from project 'GLTFSceneKit')
cd /Users/admin/builder/spi-builder-workspace/.dependencies/checkouts/GLTFSceneKit
write-file /Users/admin/builder/spi-builder-workspace/.derivedData/Build/Intermediates.noindex/GLTFSceneKit.build/Debug-watchos/GLTFSceneKit.build/Objects-normal/arm64_32/GLTFSceneKit.SwiftConstValuesFileList
WriteAuxiliaryFile /Users/admin/builder/spi-builder-workspace/.derivedData/Build/Intermediates.noindex/GLTFSceneKit.build/Debug-watchos/GLTFSceneKit.build/Objects-normal/arm64_32/GLTFSceneKit.LinkFileList (in target 'GLTFSceneKit' from project 'GLTFSceneKit')
cd /Users/admin/builder/spi-builder-workspace/.dependencies/checkouts/GLTFSceneKit
write-file /Users/admin/builder/spi-builder-workspace/.derivedData/Build/Intermediates.noindex/GLTFSceneKit.build/Debug-watchos/GLTFSceneKit.build/Objects-normal/arm64_32/GLTFSceneKit.LinkFileList
WriteAuxiliaryFile /Users/admin/builder/spi-builder-workspace/.derivedData/Build/Intermediates.noindex/GLTFSceneKit.build/Debug-watchos/GLTFSceneKit.build/Objects-normal/arm64_32/GLTFSceneKit-OutputFileMap.json (in target 'GLTFSceneKit' from project 'GLTFSceneKit')
cd /Users/admin/builder/spi-builder-workspace/.dependencies/checkouts/GLTFSceneKit
write-file /Users/admin/builder/spi-builder-workspace/.derivedData/Build/Intermediates.noindex/GLTFSceneKit.build/Debug-watchos/GLTFSceneKit.build/Objects-normal/arm64_32/GLTFSceneKit-OutputFileMap.json
WriteAuxiliaryFile /Users/admin/builder/spi-builder-workspace/.derivedData/Build/Intermediates.noindex/GLTFSceneKit.build/Debug-watchos/GLTFSceneKit.build/Objects-normal/arm64/GLTFSceneKit_const_extract_protocols.json (in target 'GLTFSceneKit' from project 'GLTFSceneKit')
cd /Users/admin/builder/spi-builder-workspace/.dependencies/checkouts/GLTFSceneKit
write-file /Users/admin/builder/spi-builder-workspace/.derivedData/Build/Intermediates.noindex/GLTFSceneKit.build/Debug-watchos/GLTFSceneKit.build/Objects-normal/arm64/GLTFSceneKit_const_extract_protocols.json
WriteAuxiliaryFile /Users/admin/builder/spi-builder-workspace/.derivedData/Build/Intermediates.noindex/GLTFSceneKit.build/Debug-watchos/GLTFSceneKit.build/Objects-normal/arm64/GLTFSceneKit.SwiftFileList (in target 'GLTFSceneKit' from project 'GLTFSceneKit')
cd /Users/admin/builder/spi-builder-workspace/.dependencies/checkouts/GLTFSceneKit
write-file /Users/admin/builder/spi-builder-workspace/.derivedData/Build/Intermediates.noindex/GLTFSceneKit.build/Debug-watchos/GLTFSceneKit.build/Objects-normal/arm64/GLTFSceneKit.SwiftFileList
WriteAuxiliaryFile /Users/admin/builder/spi-builder-workspace/.derivedData/Build/Intermediates.noindex/GLTFSceneKit.build/Debug-watchos/GLTFSceneKit.build/Objects-normal/arm64/GLTFSceneKit.SwiftConstValuesFileList (in target 'GLTFSceneKit' from project 'GLTFSceneKit')
cd /Users/admin/builder/spi-builder-workspace/.dependencies/checkouts/GLTFSceneKit
write-file /Users/admin/builder/spi-builder-workspace/.derivedData/Build/Intermediates.noindex/GLTFSceneKit.build/Debug-watchos/GLTFSceneKit.build/Objects-normal/arm64/GLTFSceneKit.SwiftConstValuesFileList
WriteAuxiliaryFile /Users/admin/builder/spi-builder-workspace/.derivedData/Build/Intermediates.noindex/GLTFSceneKit.build/Debug-watchos/GLTFSceneKit.build/Objects-normal/arm64/GLTFSceneKit.LinkFileList (in target 'GLTFSceneKit' from project 'GLTFSceneKit')
cd /Users/admin/builder/spi-builder-workspace/.dependencies/checkouts/GLTFSceneKit
write-file /Users/admin/builder/spi-builder-workspace/.derivedData/Build/Intermediates.noindex/GLTFSceneKit.build/Debug-watchos/GLTFSceneKit.build/Objects-normal/arm64/GLTFSceneKit.LinkFileList
WriteAuxiliaryFile /Users/admin/builder/spi-builder-workspace/.derivedData/Build/Intermediates.noindex/GLTFSceneKit.build/Debug-watchos/GLTFSceneKit.build/Objects-normal/arm64/GLTFSceneKit-OutputFileMap.json (in target 'GLTFSceneKit' from project 'GLTFSceneKit')
cd /Users/admin/builder/spi-builder-workspace/.dependencies/checkouts/GLTFSceneKit
write-file /Users/admin/builder/spi-builder-workspace/.derivedData/Build/Intermediates.noindex/GLTFSceneKit.build/Debug-watchos/GLTFSceneKit.build/Objects-normal/arm64/GLTFSceneKit-OutputFileMap.json
WriteAuxiliaryFile /Users/admin/builder/spi-builder-workspace/.derivedData/Build/Intermediates.noindex/GLTFSceneKit.build/Debug-watchos/GLTFSceneKit.build/GLTFSceneKit.modulemap (in target 'GLTFSceneKit' from project 'GLTFSceneKit')
cd /Users/admin/builder/spi-builder-workspace/.dependencies/checkouts/GLTFSceneKit
write-file /Users/admin/builder/spi-builder-workspace/.derivedData/Build/Intermediates.noindex/GLTFSceneKit.build/Debug-watchos/GLTFSceneKit.build/GLTFSceneKit.modulemap
WriteAuxiliaryFile /Users/admin/builder/spi-builder-workspace/.derivedData/Build/Intermediates.noindex/GLTFSceneKit.build/Debug-watchos/GLTFSceneKit.build/GLTFSceneKit.DependencyStaticMetadataFileList (in target 'GLTFSceneKit' from project 'GLTFSceneKit')
cd /Users/admin/builder/spi-builder-workspace/.dependencies/checkouts/GLTFSceneKit
write-file /Users/admin/builder/spi-builder-workspace/.derivedData/Build/Intermediates.noindex/GLTFSceneKit.build/Debug-watchos/GLTFSceneKit.build/GLTFSceneKit.DependencyStaticMetadataFileList
WriteAuxiliaryFile /Users/admin/builder/spi-builder-workspace/.derivedData/Build/Intermediates.noindex/GLTFSceneKit.build/Debug-watchos/GLTFSceneKit.build/GLTFSceneKit.DependencyMetadataFileList (in target 'GLTFSceneKit' from project 'GLTFSceneKit')
cd /Users/admin/builder/spi-builder-workspace/.dependencies/checkouts/GLTFSceneKit
write-file /Users/admin/builder/spi-builder-workspace/.derivedData/Build/Intermediates.noindex/GLTFSceneKit.build/Debug-watchos/GLTFSceneKit.build/GLTFSceneKit.DependencyMetadataFileList
WriteAuxiliaryFile /Users/admin/builder/spi-builder-workspace/.derivedData/Build/Intermediates.noindex/GLTFSceneKit.build/Debug-watchos/GLTFSceneKit.build/DerivedSources/resource_bundle_accessor.swift (in target 'GLTFSceneKit' from project 'GLTFSceneKit')
cd /Users/admin/builder/spi-builder-workspace/.dependencies/checkouts/GLTFSceneKit
write-file /Users/admin/builder/spi-builder-workspace/.derivedData/Build/Intermediates.noindex/GLTFSceneKit.build/Debug-watchos/GLTFSceneKit.build/DerivedSources/resource_bundle_accessor.swift
WriteAuxiliaryFile /Users/admin/builder/spi-builder-workspace/.derivedData/Build/Intermediates.noindex/DisplayLink.build/Debug-watchos/DisplayLink.build/Objects-normal/armv7k/DisplayLink.LinkFileList (in target 'DisplayLink' from project 'DisplayLink')
cd /Users/admin/builder/spi-builder-workspace/.dependencies/checkouts/DisplayLink
write-file /Users/admin/builder/spi-builder-workspace/.derivedData/Build/Intermediates.noindex/DisplayLink.build/Debug-watchos/DisplayLink.build/Objects-normal/armv7k/DisplayLink.LinkFileList
WriteAuxiliaryFile /Users/admin/builder/spi-builder-workspace/.derivedData/Build/Intermediates.noindex/DisplayLink.build/Debug-watchos/DisplayLink.build/Objects-normal/armv7k/DisplayLink_const_extract_protocols.json (in target 'DisplayLink' from project 'DisplayLink')
cd /Users/admin/builder/spi-builder-workspace/.dependencies/checkouts/DisplayLink
write-file /Users/admin/builder/spi-builder-workspace/.derivedData/Build/Intermediates.noindex/DisplayLink.build/Debug-watchos/DisplayLink.build/Objects-normal/armv7k/DisplayLink_const_extract_protocols.json
WriteAuxiliaryFile /Users/admin/builder/spi-builder-workspace/.derivedData/Build/Intermediates.noindex/DisplayLink.build/Debug-watchos/DisplayLink.build/Objects-normal/armv7k/DisplayLink.SwiftConstValuesFileList (in target 'DisplayLink' from project 'DisplayLink')
cd /Users/admin/builder/spi-builder-workspace/.dependencies/checkouts/DisplayLink
write-file /Users/admin/builder/spi-builder-workspace/.derivedData/Build/Intermediates.noindex/DisplayLink.build/Debug-watchos/DisplayLink.build/Objects-normal/armv7k/DisplayLink.SwiftConstValuesFileList
WriteAuxiliaryFile /Users/admin/builder/spi-builder-workspace/.derivedData/Build/Intermediates.noindex/DisplayLink.build/Debug-watchos/DisplayLink.build/Objects-normal/armv7k/DisplayLink.SwiftFileList (in target 'DisplayLink' from project 'DisplayLink')
cd /Users/admin/builder/spi-builder-workspace/.dependencies/checkouts/DisplayLink
write-file /Users/admin/builder/spi-builder-workspace/.derivedData/Build/Intermediates.noindex/DisplayLink.build/Debug-watchos/DisplayLink.build/Objects-normal/armv7k/DisplayLink.SwiftFileList
WriteAuxiliaryFile /Users/admin/builder/spi-builder-workspace/.derivedData/Build/Intermediates.noindex/DisplayLink.build/Debug-watchos/DisplayLink.build/Objects-normal/armv7k/DisplayLink-OutputFileMap.json (in target 'DisplayLink' from project 'DisplayLink')
cd /Users/admin/builder/spi-builder-workspace/.dependencies/checkouts/DisplayLink
write-file /Users/admin/builder/spi-builder-workspace/.derivedData/Build/Intermediates.noindex/DisplayLink.build/Debug-watchos/DisplayLink.build/Objects-normal/armv7k/DisplayLink-OutputFileMap.json
WriteAuxiliaryFile /Users/admin/builder/spi-builder-workspace/.derivedData/Build/Intermediates.noindex/DisplayLink.build/Debug-watchos/DisplayLink.build/Objects-normal/arm64_32/DisplayLink_const_extract_protocols.json (in target 'DisplayLink' from project 'DisplayLink')
cd /Users/admin/builder/spi-builder-workspace/.dependencies/checkouts/DisplayLink
write-file /Users/admin/builder/spi-builder-workspace/.derivedData/Build/Intermediates.noindex/DisplayLink.build/Debug-watchos/DisplayLink.build/Objects-normal/arm64_32/DisplayLink_const_extract_protocols.json
Copy /Users/admin/builder/spi-builder-workspace/.derivedData/Build/Intermediates.noindex/GeneratedModuleMaps-watchos/GLTFSceneKit.modulemap /Users/admin/builder/spi-builder-workspace/.derivedData/Build/Intermediates.noindex/GLTFSceneKit.build/Debug-watchos/GLTFSceneKit.build/GLTFSceneKit.modulemap (in target 'GLTFSceneKit' from project 'GLTFSceneKit')
cd /Users/admin/builder/spi-builder-workspace/.dependencies/checkouts/GLTFSceneKit
builtin-copy -exclude .DS_Store -exclude CVS -exclude .svn -exclude .git -exclude .hg -resolve-src-symlinks /Users/admin/builder/spi-builder-workspace/.derivedData/Build/Intermediates.noindex/GLTFSceneKit.build/Debug-watchos/GLTFSceneKit.build/GLTFSceneKit.modulemap /Users/admin/builder/spi-builder-workspace/.derivedData/Build/Intermediates.noindex/GeneratedModuleMaps-watchos
WriteAuxiliaryFile /Users/admin/builder/spi-builder-workspace/.derivedData/Build/Intermediates.noindex/DisplayLink.build/Debug-watchos/DisplayLink.build/Objects-normal/arm64_32/DisplayLink.SwiftFileList (in target 'DisplayLink' from project 'DisplayLink')
cd /Users/admin/builder/spi-builder-workspace/.dependencies/checkouts/DisplayLink
write-file /Users/admin/builder/spi-builder-workspace/.derivedData/Build/Intermediates.noindex/DisplayLink.build/Debug-watchos/DisplayLink.build/Objects-normal/arm64_32/DisplayLink.SwiftFileList
WriteAuxiliaryFile /Users/admin/builder/spi-builder-workspace/.derivedData/Build/Intermediates.noindex/DisplayLink.build/Debug-watchos/DisplayLink.build/Objects-normal/arm64_32/DisplayLink.SwiftConstValuesFileList (in target 'DisplayLink' from project 'DisplayLink')
cd /Users/admin/builder/spi-builder-workspace/.dependencies/checkouts/DisplayLink
write-file /Users/admin/builder/spi-builder-workspace/.derivedData/Build/Intermediates.noindex/DisplayLink.build/Debug-watchos/DisplayLink.build/Objects-normal/arm64_32/DisplayLink.SwiftConstValuesFileList
WriteAuxiliaryFile /Users/admin/builder/spi-builder-workspace/.derivedData/Build/Intermediates.noindex/DisplayLink.build/Debug-watchos/DisplayLink.build/Objects-normal/arm64_32/DisplayLink.LinkFileList (in target 'DisplayLink' from project 'DisplayLink')
cd /Users/admin/builder/spi-builder-workspace/.dependencies/checkouts/DisplayLink
write-file /Users/admin/builder/spi-builder-workspace/.derivedData/Build/Intermediates.noindex/DisplayLink.build/Debug-watchos/DisplayLink.build/Objects-normal/arm64_32/DisplayLink.LinkFileList
WriteAuxiliaryFile /Users/admin/builder/spi-builder-workspace/.derivedData/Build/Intermediates.noindex/DisplayLink.build/Debug-watchos/DisplayLink.build/Objects-normal/arm64_32/DisplayLink-OutputFileMap.json (in target 'DisplayLink' from project 'DisplayLink')
cd /Users/admin/builder/spi-builder-workspace/.dependencies/checkouts/DisplayLink
write-file /Users/admin/builder/spi-builder-workspace/.derivedData/Build/Intermediates.noindex/DisplayLink.build/Debug-watchos/DisplayLink.build/Objects-normal/arm64_32/DisplayLink-OutputFileMap.json
WriteAuxiliaryFile /Users/admin/builder/spi-builder-workspace/.derivedData/Build/Intermediates.noindex/DisplayLink.build/Debug-watchos/DisplayLink.build/Objects-normal/arm64/DisplayLink_const_extract_protocols.json (in target 'DisplayLink' from project 'DisplayLink')
cd /Users/admin/builder/spi-builder-workspace/.dependencies/checkouts/DisplayLink
write-file /Users/admin/builder/spi-builder-workspace/.derivedData/Build/Intermediates.noindex/DisplayLink.build/Debug-watchos/DisplayLink.build/Objects-normal/arm64/DisplayLink_const_extract_protocols.json
WriteAuxiliaryFile /Users/admin/builder/spi-builder-workspace/.derivedData/Build/Intermediates.noindex/DisplayLink.build/Debug-watchos/DisplayLink.build/Objects-normal/arm64/DisplayLink.SwiftFileList (in target 'DisplayLink' from project 'DisplayLink')
cd /Users/admin/builder/spi-builder-workspace/.dependencies/checkouts/DisplayLink
write-file /Users/admin/builder/spi-builder-workspace/.derivedData/Build/Intermediates.noindex/DisplayLink.build/Debug-watchos/DisplayLink.build/Objects-normal/arm64/DisplayLink.SwiftFileList
WriteAuxiliaryFile /Users/admin/builder/spi-builder-workspace/.derivedData/Build/Intermediates.noindex/DisplayLink.build/Debug-watchos/DisplayLink.build/Objects-normal/arm64/DisplayLink.SwiftConstValuesFileList (in target 'DisplayLink' from project 'DisplayLink')
cd /Users/admin/builder/spi-builder-workspace/.dependencies/checkouts/DisplayLink
write-file /Users/admin/builder/spi-builder-workspace/.derivedData/Build/Intermediates.noindex/DisplayLink.build/Debug-watchos/DisplayLink.build/Objects-normal/arm64/DisplayLink.SwiftConstValuesFileList
WriteAuxiliaryFile /Users/admin/builder/spi-builder-workspace/.derivedData/Build/Intermediates.noindex/DisplayLink.build/Debug-watchos/DisplayLink.build/Objects-normal/arm64/DisplayLink.LinkFileList (in target 'DisplayLink' from project 'DisplayLink')
cd /Users/admin/builder/spi-builder-workspace/.dependencies/checkouts/DisplayLink
write-file /Users/admin/builder/spi-builder-workspace/.derivedData/Build/Intermediates.noindex/DisplayLink.build/Debug-watchos/DisplayLink.build/Objects-normal/arm64/DisplayLink.LinkFileList
WriteAuxiliaryFile /Users/admin/builder/spi-builder-workspace/.derivedData/Build/Intermediates.noindex/DisplayLink.build/Debug-watchos/DisplayLink.build/Objects-normal/arm64/DisplayLink-OutputFileMap.json (in target 'DisplayLink' from project 'DisplayLink')
cd /Users/admin/builder/spi-builder-workspace/.dependencies/checkouts/DisplayLink
write-file /Users/admin/builder/spi-builder-workspace/.derivedData/Build/Intermediates.noindex/DisplayLink.build/Debug-watchos/DisplayLink.build/Objects-normal/arm64/DisplayLink-OutputFileMap.json
WriteAuxiliaryFile /Users/admin/builder/spi-builder-workspace/.derivedData/Build/Intermediates.noindex/DisplayLink.build/Debug-watchos/DisplayLink.build/DisplayLink.modulemap (in target 'DisplayLink' from project 'DisplayLink')
cd /Users/admin/builder/spi-builder-workspace/.dependencies/checkouts/DisplayLink
write-file /Users/admin/builder/spi-builder-workspace/.derivedData/Build/Intermediates.noindex/DisplayLink.build/Debug-watchos/DisplayLink.build/DisplayLink.modulemap
WriteAuxiliaryFile /Users/admin/builder/spi-builder-workspace/.derivedData/Build/Intermediates.noindex/DisplayLink.build/Debug-watchos/DisplayLink.build/DisplayLink.DependencyStaticMetadataFileList (in target 'DisplayLink' from project 'DisplayLink')
cd /Users/admin/builder/spi-builder-workspace/.dependencies/checkouts/DisplayLink
write-file /Users/admin/builder/spi-builder-workspace/.derivedData/Build/Intermediates.noindex/DisplayLink.build/Debug-watchos/DisplayLink.build/DisplayLink.DependencyStaticMetadataFileList
WriteAuxiliaryFile /Users/admin/builder/spi-builder-workspace/.derivedData/Build/Intermediates.noindex/DisplayLink.build/Debug-watchos/DisplayLink.build/DisplayLink.DependencyMetadataFileList (in target 'DisplayLink' from project 'DisplayLink')
cd /Users/admin/builder/spi-builder-workspace/.dependencies/checkouts/DisplayLink
write-file /Users/admin/builder/spi-builder-workspace/.derivedData/Build/Intermediates.noindex/DisplayLink.build/Debug-watchos/DisplayLink.build/DisplayLink.DependencyMetadataFileList
MkDir /Users/admin/builder/spi-builder-workspace/.derivedData/Build/Products/Debug-watchos/GLTFSceneKit_GLTFSceneKit.bundle (in target 'GLTFSceneKit_GLTFSceneKit' from project 'GLTFSceneKit')
cd /Users/admin/builder/spi-builder-workspace/.dependencies/checkouts/GLTFSceneKit
/bin/mkdir -p /Users/admin/builder/spi-builder-workspace/.derivedData/Build/Products/Debug-watchos/GLTFSceneKit_GLTFSceneKit.bundle
ProcessInfoPlistFile /Users/admin/builder/spi-builder-workspace/.derivedData/Build/Products/Debug-watchos/GLTFSceneKit_GLTFSceneKit.bundle/Info.plist /Users/admin/builder/spi-builder-workspace/.derivedData/Build/Intermediates.noindex/GLTFSceneKit.build/Debug-watchos/GLTFSceneKit_GLTFSceneKit.build/empty-GLTFSceneKit_GLTFSceneKit.plist (in target 'GLTFSceneKit_GLTFSceneKit' from project 'GLTFSceneKit')
cd /Users/admin/builder/spi-builder-workspace/.dependencies/checkouts/GLTFSceneKit
builtin-infoPlistUtility /Users/admin/builder/spi-builder-workspace/.derivedData/Build/Intermediates.noindex/GLTFSceneKit.build/Debug-watchos/GLTFSceneKit_GLTFSceneKit.build/empty-GLTFSceneKit_GLTFSceneKit.plist -producttype com.apple.product-type.bundle -expandbuildsettings -format binary -platform watchos -o /Users/admin/builder/spi-builder-workspace/.derivedData/Build/Products/Debug-watchos/GLTFSceneKit_GLTFSceneKit.bundle/Info.plist
CpResource /Users/admin/builder/spi-builder-workspace/.derivedData/Build/Products/Debug-watchos/GLTFSceneKit_GLTFSceneKit.bundle/GLTFShaderModifierSurface_pbrSpecularGlossiness_doubleSidedWorkaround.shader /Users/admin/builder/spi-builder-workspace/.dependencies/checkouts/GLTFSceneKit/Sources/GLTFSceneKit/Resources/KHR_materials_pbrSpecularGlossiness/GLTFShaderModifierSurface_pbrSpecularGlossiness_doubleSidedWorkaround.shader (in target 'GLTFSceneKit_GLTFSceneKit' from project 'GLTFSceneKit')
cd /Users/admin/builder/spi-builder-workspace/.dependencies/checkouts/GLTFSceneKit
builtin-copy -exclude .DS_Store -exclude CVS -exclude .svn -exclude .git -exclude .hg -resolve-src-symlinks /Users/admin/builder/spi-builder-workspace/.dependencies/checkouts/GLTFSceneKit/Sources/GLTFSceneKit/Resources/KHR_materials_pbrSpecularGlossiness/GLTFShaderModifierSurface_pbrSpecularGlossiness_doubleSidedWorkaround.shader /Users/admin/builder/spi-builder-workspace/.derivedData/Build/Products/Debug-watchos/GLTFSceneKit_GLTFSceneKit.bundle
CpResource /Users/admin/builder/spi-builder-workspace/.derivedData/Build/Products/Debug-watchos/GLTFSceneKit_GLTFSceneKit.bundle/GLTFShaderModifierSurface_pbrSpecularGlossiness_texture_doubleSidedWorkaround.shader /Users/admin/builder/spi-builder-workspace/.dependencies/checkouts/GLTFSceneKit/Sources/GLTFSceneKit/Resources/KHR_materials_pbrSpecularGlossiness/GLTFShaderModifierSurface_pbrSpecularGlossiness_texture_doubleSidedWorkaround.shader (in target 'GLTFSceneKit_GLTFSceneKit' from project 'GLTFSceneKit')
cd /Users/admin/builder/spi-builder-workspace/.dependencies/checkouts/GLTFSceneKit
builtin-copy -exclude .DS_Store -exclude CVS -exclude .svn -exclude .git -exclude .hg -resolve-src-symlinks /Users/admin/builder/spi-builder-workspace/.dependencies/checkouts/GLTFSceneKit/Sources/GLTFSceneKit/Resources/KHR_materials_pbrSpecularGlossiness/GLTFShaderModifierSurface_pbrSpecularGlossiness_texture_doubleSidedWorkaround.shader /Users/admin/builder/spi-builder-workspace/.derivedData/Build/Products/Debug-watchos/GLTFSceneKit_GLTFSceneKit.bundle
CpResource /Users/admin/builder/spi-builder-workspace/.derivedData/Build/Products/Debug-watchos/GLTFSceneKit_GLTFSceneKit.bundle/GLTFShaderModifierSurface_pbrSpecularGlossiness.shader /Users/admin/builder/spi-builder-workspace/.dependencies/checkouts/GLTFSceneKit/Sources/GLTFSceneKit/Resources/KHR_materials_pbrSpecularGlossiness/GLTFShaderModifierSurface_pbrSpecularGlossiness.shader (in target 'GLTFSceneKit_GLTFSceneKit' from project 'GLTFSceneKit')
cd /Users/admin/builder/spi-builder-workspace/.dependencies/checkouts/GLTFSceneKit
builtin-copy -exclude .DS_Store -exclude CVS -exclude .svn -exclude .git -exclude .hg -resolve-src-symlinks /Users/admin/builder/spi-builder-workspace/.dependencies/checkouts/GLTFSceneKit/Sources/GLTFSceneKit/Resources/KHR_materials_pbrSpecularGlossiness/GLTFShaderModifierSurface_pbrSpecularGlossiness.shader /Users/admin/builder/spi-builder-workspace/.derivedData/Build/Products/Debug-watchos/GLTFSceneKit_GLTFSceneKit.bundle
CpResource /Users/admin/builder/spi-builder-workspace/.derivedData/Build/Products/Debug-watchos/GLTFSceneKit_GLTFSceneKit.bundle/GLTFShaderModifierSurface_alphaModeBlend.shader /Users/admin/builder/spi-builder-workspace/.dependencies/checkouts/GLTFSceneKit/Sources/GLTFSceneKit/Resources/GLTFShaderModifierSurface_alphaModeBlend.shader (in target 'GLTFSceneKit_GLTFSceneKit' from project 'GLTFSceneKit')
cd /Users/admin/builder/spi-builder-workspace/.dependencies/checkouts/GLTFSceneKit
builtin-copy -exclude .DS_Store -exclude CVS -exclude .svn -exclude .git -exclude .hg -resolve-src-symlinks /Users/admin/builder/spi-builder-workspace/.dependencies/checkouts/GLTFSceneKit/Sources/GLTFSceneKit/Resources/GLTFShaderModifierSurface_alphaModeBlend.shader /Users/admin/builder/spi-builder-workspace/.derivedData/Build/Products/Debug-watchos/GLTFSceneKit_GLTFSceneKit.bundle
CpResource /Users/admin/builder/spi-builder-workspace/.derivedData/Build/Products/Debug-watchos/GLTFSceneKit_GLTFSceneKit.bundle/GLTFShaderModifierSurface_doubleSidedWorkaround.shader /Users/admin/builder/spi-builder-workspace/.dependencies/checkouts/GLTFSceneKit/Sources/GLTFSceneKit/Resources/GLTFShaderModifierSurface_doubleSidedWorkaround.shader (in target 'GLTFSceneKit_GLTFSceneKit' from project 'GLTFSceneKit')
cd /Users/admin/builder/spi-builder-workspace/.dependencies/checkouts/GLTFSceneKit
builtin-copy -exclude .DS_Store -exclude CVS -exclude .svn -exclude .git -exclude .hg -resolve-src-symlinks /Users/admin/builder/spi-builder-workspace/.dependencies/checkouts/GLTFSceneKit/Sources/GLTFSceneKit/Resources/GLTFShaderModifierSurface_doubleSidedWorkaround.shader /Users/admin/builder/spi-builder-workspace/.derivedData/Build/Products/Debug-watchos/GLTFSceneKit_GLTFSceneKit.bundle
CpResource /Users/admin/builder/spi-builder-workspace/.derivedData/Build/Products/Debug-watchos/GLTFSceneKit_GLTFSceneKit.bundle/GLTFShaderModifierSurface_VRMMToon.shader /Users/admin/builder/spi-builder-workspace/.dependencies/checkouts/GLTFSceneKit/Sources/GLTFSceneKit/Resources/VRM/GLTFShaderModifierSurface_VRMMToon.shader (in target 'GLTFSceneKit_GLTFSceneKit' from project 'GLTFSceneKit')
cd /Users/admin/builder/spi-builder-workspace/.dependencies/checkouts/GLTFSceneKit
builtin-copy -exclude .DS_Store -exclude CVS -exclude .svn -exclude .git -exclude .hg -resolve-src-symlinks /Users/admin/builder/spi-builder-workspace/.dependencies/checkouts/GLTFSceneKit/Sources/GLTFSceneKit/Resources/VRM/GLTFShaderModifierSurface_VRMMToon.shader /Users/admin/builder/spi-builder-workspace/.derivedData/Build/Products/Debug-watchos/GLTFSceneKit_GLTFSceneKit.bundle
Copy /Users/admin/builder/spi-builder-workspace/.derivedData/Build/Intermediates.noindex/GeneratedModuleMaps-watchos/DisplayLink.modulemap /Users/admin/builder/spi-builder-workspace/.derivedData/Build/Intermediates.noindex/DisplayLink.build/Debug-watchos/DisplayLink.build/DisplayLink.modulemap (in target 'DisplayLink' from project 'DisplayLink')
cd /Users/admin/builder/spi-builder-workspace/.dependencies/checkouts/DisplayLink
builtin-copy -exclude .DS_Store -exclude CVS -exclude .svn -exclude .git -exclude .hg -resolve-src-symlinks /Users/admin/builder/spi-builder-workspace/.derivedData/Build/Intermediates.noindex/DisplayLink.build/Debug-watchos/DisplayLink.build/DisplayLink.modulemap /Users/admin/builder/spi-builder-workspace/.derivedData/Build/Intermediates.noindex/GeneratedModuleMaps-watchos
CpResource /Users/admin/builder/spi-builder-workspace/.derivedData/Build/Products/Debug-watchos/GLTFSceneKit_GLTFSceneKit.bundle/GLTFShaderModifierSurface.shader /Users/admin/builder/spi-builder-workspace/.dependencies/checkouts/GLTFSceneKit/Sources/GLTFSceneKit/Resources/GLTFShaderModifierSurface.shader (in target 'GLTFSceneKit_GLTFSceneKit' from project 'GLTFSceneKit')
cd /Users/admin/builder/spi-builder-workspace/.dependencies/checkouts/GLTFSceneKit
builtin-copy -exclude .DS_Store -exclude CVS -exclude .svn -exclude .git -exclude .hg -resolve-src-symlinks /Users/admin/builder/spi-builder-workspace/.dependencies/checkouts/GLTFSceneKit/Sources/GLTFSceneKit/Resources/GLTFShaderModifierSurface.shader /Users/admin/builder/spi-builder-workspace/.derivedData/Build/Products/Debug-watchos/GLTFSceneKit_GLTFSceneKit.bundle
CpResource /Users/admin/builder/spi-builder-workspace/.derivedData/Build/Products/Debug-watchos/GLTFSceneKit_GLTFSceneKit.bundle/GLTFShaderModifierFragment_alphaCutoff.shader /Users/admin/builder/spi-builder-workspace/.dependencies/checkouts/GLTFSceneKit/Sources/GLTFSceneKit/Resources/GLTFShaderModifierFragment_alphaCutoff.shader (in target 'GLTFSceneKit_GLTFSceneKit' from project 'GLTFSceneKit')
cd /Users/admin/builder/spi-builder-workspace/.dependencies/checkouts/GLTFSceneKit
builtin-copy -exclude .DS_Store -exclude CVS -exclude .svn -exclude .git -exclude .hg -resolve-src-symlinks /Users/admin/builder/spi-builder-workspace/.dependencies/checkouts/GLTFSceneKit/Sources/GLTFSceneKit/Resources/GLTFShaderModifierFragment_alphaCutoff.shader /Users/admin/builder/spi-builder-workspace/.derivedData/Build/Products/Debug-watchos/GLTFSceneKit_GLTFSceneKit.bundle
CpResource /Users/admin/builder/spi-builder-workspace/.derivedData/Build/Products/Debug-watchos/GLTFSceneKit_GLTFSceneKit.bundle/GLTFShaderModifierFragment_VRMUnlitTexture_Cutoff.shader /Users/admin/builder/spi-builder-workspace/.dependencies/checkouts/GLTFSceneKit/Sources/GLTFSceneKit/Resources/VRM/GLTFShaderModifierFragment_VRMUnlitTexture_Cutoff.shader (in target 'GLTFSceneKit_GLTFSceneKit' from project 'GLTFSceneKit')
cd /Users/admin/builder/spi-builder-workspace/.dependencies/checkouts/GLTFSceneKit
builtin-copy -exclude .DS_Store -exclude CVS -exclude .svn -exclude .git -exclude .hg -resolve-src-symlinks /Users/admin/builder/spi-builder-workspace/.dependencies/checkouts/GLTFSceneKit/Sources/GLTFSceneKit/Resources/VRM/GLTFShaderModifierFragment_VRMUnlitTexture_Cutoff.shader /Users/admin/builder/spi-builder-workspace/.derivedData/Build/Products/Debug-watchos/GLTFSceneKit_GLTFSceneKit.bundle
CpResource /Users/admin/builder/spi-builder-workspace/.derivedData/Build/Products/Debug-watchos/GLTFSceneKit_GLTFSceneKit.bundle/GLTFShaderModifierFragment_VRMUnlitTexture.shader /Users/admin/builder/spi-builder-workspace/.dependencies/checkouts/GLTFSceneKit/Sources/GLTFSceneKit/Resources/VRM/GLTFShaderModifierFragment_VRMUnlitTexture.shader (in target 'GLTFSceneKit_GLTFSceneKit' from project 'GLTFSceneKit')
cd /Users/admin/builder/spi-builder-workspace/.dependencies/checkouts/GLTFSceneKit
builtin-copy -exclude .DS_Store -exclude CVS -exclude .svn -exclude .git -exclude .hg -resolve-src-symlinks /Users/admin/builder/spi-builder-workspace/.dependencies/checkouts/GLTFSceneKit/Sources/GLTFSceneKit/Resources/VRM/GLTFShaderModifierFragment_VRMUnlitTexture.shader /Users/admin/builder/spi-builder-workspace/.derivedData/Build/Products/Debug-watchos/GLTFSceneKit_GLTFSceneKit.bundle
RegisterExecutionPolicyException /Users/admin/builder/spi-builder-workspace/.derivedData/Build/Products/Debug-watchos/GLTFSceneKit_GLTFSceneKit.bundle (in target 'GLTFSceneKit_GLTFSceneKit' from project 'GLTFSceneKit')
cd /Users/admin/builder/spi-builder-workspace/.dependencies/checkouts/GLTFSceneKit
builtin-RegisterExecutionPolicyException /Users/admin/builder/spi-builder-workspace/.derivedData/Build/Products/Debug-watchos/GLTFSceneKit_GLTFSceneKit.bundle
Touch /Users/admin/builder/spi-builder-workspace/.derivedData/Build/Products/Debug-watchos/GLTFSceneKit_GLTFSceneKit.bundle (in target 'GLTFSceneKit_GLTFSceneKit' from project 'GLTFSceneKit')
cd /Users/admin/builder/spi-builder-workspace/.dependencies/checkouts/GLTFSceneKit
/usr/bin/touch -c /Users/admin/builder/spi-builder-workspace/.derivedData/Build/Products/Debug-watchos/GLTFSceneKit_GLTFSceneKit.bundle
SwiftDriver GLTFSceneKit normal arm64_32 com.apple.xcode.tools.swift.compiler (in target 'GLTFSceneKit' from project 'GLTFSceneKit')
cd /Users/admin/builder/spi-builder-workspace/.swiftpm/xcode
builtin-SwiftDriver -- /Applications/Xcode-16.3.0.app/Contents/Developer/Toolchains/XcodeDefault.xctoolchain/usr/bin/swiftc -module-name GLTFSceneKit -Onone -enforce-exclusivity\=checked @/Users/admin/builder/spi-builder-workspace/.derivedData/Build/Intermediates.noindex/GLTFSceneKit.build/Debug-watchos/GLTFSceneKit.build/Objects-normal/arm64_32/GLTFSceneKit.SwiftFileList -DSWIFT_PACKAGE -DDEBUG -stats-output-dir .stats -strict-concurrency\=complete -enable-upcoming-feature StrictConcurrency -enable-upcoming-feature DisableOutwardActorInference -enable-upcoming-feature GlobalActorIsolatedTypesUsability -enable-upcoming-feature InferSendableFromCaptures -plugin-path /Applications/Xcode-16.3.0.app/Contents/Developer/Toolchains/XcodeDefault.xctoolchain/usr/lib/swift/host/plugins/testing -enable-experimental-feature DebugDescriptionMacro -sdk /Applications/Xcode-16.3.0.app/Contents/Developer/Platforms/WatchOS.platform/Developer/SDKs/WatchOS11.4.sdk -target arm64_32-apple-watchos5.0 -g -module-cache-path /Users/admin/builder/spi-builder-workspace/.derivedData/ModuleCache.noindex -Xfrontend -serialize-debugging-options -profile-coverage-mapping -profile-generate -enable-testing -suppress-warnings -index-store-path /Users/admin/builder/spi-builder-workspace/.derivedData/Index.noindex/DataStore -swift-version 5 -I /Users/admin/builder/spi-builder-workspace/.derivedData/Build/Products/Debug-watchos -I /Applications/Xcode-16.3.0.app/Contents/Developer/Platforms/WatchOS.platform/Developer/usr/lib -F /Users/admin/builder/spi-builder-workspace/.derivedData/Build/Products/Debug-watchos -F /Applications/Xcode-16.3.0.app/Contents/Developer/Platforms/WatchOS.platform/Developer/Library/Frameworks -F /Applications/Xcode-16.3.0.app/Contents/Developer/Platforms/WatchOS.platform/Developer/SDKs/WatchOS11.4.sdk/Developer/Library/Frameworks -c -j10 -enable-batch-mode -incremental -Xcc -ivfsstatcache -Xcc /Users/admin/builder/spi-builder-workspace/.derivedData/SDKStatCaches.noindex/watchos11.4-22T246-43efb940ff07ba2497b70ec94253f576.sdkstatcache -output-file-map /Users/admin/builder/spi-builder-workspace/.derivedData/Build/Intermediates.noindex/GLTFSceneKit.build/Debug-watchos/GLTFSceneKit.build/Objects-normal/arm64_32/GLTFSceneKit-OutputFileMap.json -use-frontend-parseable-output -save-temps -no-color-diagnostics -serialize-diagnostics -emit-dependencies -emit-module -emit-module-path /Users/admin/builder/spi-builder-workspace/.derivedData/Build/Intermediates.noindex/GLTFSceneKit.build/Debug-watchos/GLTFSceneKit.build/Objects-normal/arm64_32/GLTFSceneKit.swiftmodule -validate-clang-modules-once -clang-build-session-file /Users/admin/builder/spi-builder-workspace/.derivedData/ModuleCache.noindex/Session.modulevalidation -Xcc -I/Users/admin/builder/spi-builder-workspace/.derivedData/Build/Intermediates.noindex/GLTFSceneKit.build/Debug-watchos/GLTFSceneKit.build/swift-overrides.hmap -emit-const-values -Xfrontend -const-gather-protocols-file -Xfrontend /Users/admin/builder/spi-builder-workspace/.derivedData/Build/Intermediates.noindex/GLTFSceneKit.build/Debug-watchos/GLTFSceneKit.build/Objects-normal/arm64_32/GLTFSceneKit_const_extract_protocols.json -Xcc -I/Users/admin/builder/spi-builder-workspace/.derivedData/Build/Products/Debug-watchos/include -Xcc -I/Users/admin/builder/spi-builder-workspace/.derivedData/Build/Intermediates.noindex/GLTFSceneKit.build/Debug-watchos/GLTFSceneKit.build/DerivedSources-normal/arm64_32 -Xcc -I/Users/admin/builder/spi-builder-workspace/.derivedData/Build/Intermediates.noindex/GLTFSceneKit.build/Debug-watchos/GLTFSceneKit.build/DerivedSources/arm64_32 -Xcc -I/Users/admin/builder/spi-builder-workspace/.derivedData/Build/Intermediates.noindex/GLTFSceneKit.build/Debug-watchos/GLTFSceneKit.build/DerivedSources -Xcc -DSWIFT_PACKAGE -Xcc -DDEBUG\=1 -emit-objc-header -emit-objc-header-path /Users/admin/builder/spi-builder-workspace/.derivedData/Build/Intermediates.noindex/GLTFSceneKit.build/Debug-watchos/GLTFSceneKit.build/Objects-normal/arm64_32/GLTFSceneKit-Swift.h -working-directory /Users/admin/builder/spi-builder-workspace/.swiftpm/xcode -experimental-emit-module-separately -disable-cmo
SwiftDriver GLTFSceneKit normal armv7k com.apple.xcode.tools.swift.compiler (in target 'GLTFSceneKit' from project 'GLTFSceneKit')
cd /Users/admin/builder/spi-builder-workspace/.swiftpm/xcode
builtin-SwiftDriver -- /Applications/Xcode-16.3.0.app/Contents/Developer/Toolchains/XcodeDefault.xctoolchain/usr/bin/swiftc -module-name GLTFSceneKit -Onone -enforce-exclusivity\=checked @/Users/admin/builder/spi-builder-workspace/.derivedData/Build/Intermediates.noindex/GLTFSceneKit.build/Debug-watchos/GLTFSceneKit.build/Objects-normal/armv7k/GLTFSceneKit.SwiftFileList -DSWIFT_PACKAGE -DDEBUG -stats-output-dir .stats -strict-concurrency\=complete -enable-upcoming-feature StrictConcurrency -enable-upcoming-feature DisableOutwardActorInference -enable-upcoming-feature GlobalActorIsolatedTypesUsability -enable-upcoming-feature InferSendableFromCaptures -plugin-path /Applications/Xcode-16.3.0.app/Contents/Developer/Toolchains/XcodeDefault.xctoolchain/usr/lib/swift/host/plugins/testing -enable-experimental-feature DebugDescriptionMacro -sdk /Applications/Xcode-16.3.0.app/Contents/Developer/Platforms/WatchOS.platform/Developer/SDKs/WatchOS11.4.sdk -target armv7k-apple-watchos5.0 -g -module-cache-path /Users/admin/builder/spi-builder-workspace/.derivedData/ModuleCache.noindex -Xfrontend -serialize-debugging-options -profile-coverage-mapping -profile-generate -enable-testing -suppress-warnings -index-store-path /Users/admin/builder/spi-builder-workspace/.derivedData/Index.noindex/DataStore -swift-version 5 -I /Users/admin/builder/spi-builder-workspace/.derivedData/Build/Products/Debug-watchos -I /Applications/Xcode-16.3.0.app/Contents/Developer/Platforms/WatchOS.platform/Developer/usr/lib -F /Users/admin/builder/spi-builder-workspace/.derivedData/Build/Products/Debug-watchos -F /Applications/Xcode-16.3.0.app/Contents/Developer/Platforms/WatchOS.platform/Developer/Library/Frameworks -F /Applications/Xcode-16.3.0.app/Contents/Developer/Platforms/WatchOS.platform/Developer/SDKs/WatchOS11.4.sdk/Developer/Library/Frameworks -c -j10 -enable-batch-mode -incremental -Xcc -ivfsstatcache -Xcc /Users/admin/builder/spi-builder-workspace/.derivedData/SDKStatCaches.noindex/watchos11.4-22T246-43efb940ff07ba2497b70ec94253f576.sdkstatcache -output-file-map /Users/admin/builder/spi-builder-workspace/.derivedData/Build/Intermediates.noindex/GLTFSceneKit.build/Debug-watchos/GLTFSceneKit.build/Objects-normal/armv7k/GLTFSceneKit-OutputFileMap.json -use-frontend-parseable-output -save-temps -no-color-diagnostics -serialize-diagnostics -emit-dependencies -emit-module -emit-module-path /Users/admin/builder/spi-builder-workspace/.derivedData/Build/Intermediates.noindex/GLTFSceneKit.build/Debug-watchos/GLTFSceneKit.build/Objects-normal/armv7k/GLTFSceneKit.swiftmodule -validate-clang-modules-once -clang-build-session-file /Users/admin/builder/spi-builder-workspace/.derivedData/ModuleCache.noindex/Session.modulevalidation -Xcc -I/Users/admin/builder/spi-builder-workspace/.derivedData/Build/Intermediates.noindex/GLTFSceneKit.build/Debug-watchos/GLTFSceneKit.build/swift-overrides.hmap -emit-const-values -Xfrontend -const-gather-protocols-file -Xfrontend /Users/admin/builder/spi-builder-workspace/.derivedData/Build/Intermediates.noindex/GLTFSceneKit.build/Debug-watchos/GLTFSceneKit.build/Objects-normal/armv7k/GLTFSceneKit_const_extract_protocols.json -Xcc -I/Users/admin/builder/spi-builder-workspace/.derivedData/Build/Products/Debug-watchos/include -Xcc -I/Users/admin/builder/spi-builder-workspace/.derivedData/Build/Intermediates.noindex/GLTFSceneKit.build/Debug-watchos/GLTFSceneKit.build/DerivedSources-normal/armv7k -Xcc -I/Users/admin/builder/spi-builder-workspace/.derivedData/Build/Intermediates.noindex/GLTFSceneKit.build/Debug-watchos/GLTFSceneKit.build/DerivedSources/armv7k -Xcc -I/Users/admin/builder/spi-builder-workspace/.derivedData/Build/Intermediates.noindex/GLTFSceneKit.build/Debug-watchos/GLTFSceneKit.build/DerivedSources -Xcc -DSWIFT_PACKAGE -Xcc -DDEBUG\=1 -emit-objc-header -emit-objc-header-path /Users/admin/builder/spi-builder-workspace/.derivedData/Build/Intermediates.noindex/GLTFSceneKit.build/Debug-watchos/GLTFSceneKit.build/Objects-normal/armv7k/GLTFSceneKit-Swift.h -working-directory /Users/admin/builder/spi-builder-workspace/.swiftpm/xcode -experimental-emit-module-separately -disable-cmo
SwiftDriver GLTFSceneKit normal arm64 com.apple.xcode.tools.swift.compiler (in target 'GLTFSceneKit' from project 'GLTFSceneKit')
cd /Users/admin/builder/spi-builder-workspace/.swiftpm/xcode
builtin-SwiftDriver -- /Applications/Xcode-16.3.0.app/Contents/Developer/Toolchains/XcodeDefault.xctoolchain/usr/bin/swiftc -module-name GLTFSceneKit -Onone -enforce-exclusivity\=checked @/Users/admin/builder/spi-builder-workspace/.derivedData/Build/Intermediates.noindex/GLTFSceneKit.build/Debug-watchos/GLTFSceneKit.build/Objects-normal/arm64/GLTFSceneKit.SwiftFileList -DSWIFT_PACKAGE -DDEBUG -stats-output-dir .stats -strict-concurrency\=complete -enable-upcoming-feature StrictConcurrency -enable-upcoming-feature DisableOutwardActorInference -enable-upcoming-feature GlobalActorIsolatedTypesUsability -enable-upcoming-feature InferSendableFromCaptures -plugin-path /Applications/Xcode-16.3.0.app/Contents/Developer/Toolchains/XcodeDefault.xctoolchain/usr/lib/swift/host/plugins/testing -enable-experimental-feature DebugDescriptionMacro -sdk /Applications/Xcode-16.3.0.app/Contents/Developer/Platforms/WatchOS.platform/Developer/SDKs/WatchOS11.4.sdk -target arm64-apple-watchos5.0 -g -module-cache-path /Users/admin/builder/spi-builder-workspace/.derivedData/ModuleCache.noindex -Xfrontend -serialize-debugging-options -profile-coverage-mapping -profile-generate -enable-testing -suppress-warnings -index-store-path /Users/admin/builder/spi-builder-workspace/.derivedData/Index.noindex/DataStore -swift-version 5 -I /Users/admin/builder/spi-builder-workspace/.derivedData/Build/Products/Debug-watchos -I /Applications/Xcode-16.3.0.app/Contents/Developer/Platforms/WatchOS.platform/Developer/usr/lib -F /Users/admin/builder/spi-builder-workspace/.derivedData/Build/Products/Debug-watchos -F /Applications/Xcode-16.3.0.app/Contents/Developer/Platforms/WatchOS.platform/Developer/Library/Frameworks -F /Applications/Xcode-16.3.0.app/Contents/Developer/Platforms/WatchOS.platform/Developer/SDKs/WatchOS11.4.sdk/Developer/Library/Frameworks -c -j10 -enable-batch-mode -incremental -Xcc -ivfsstatcache -Xcc /Users/admin/builder/spi-builder-workspace/.derivedData/SDKStatCaches.noindex/watchos11.4-22T246-43efb940ff07ba2497b70ec94253f576.sdkstatcache -output-file-map /Users/admin/builder/spi-builder-workspace/.derivedData/Build/Intermediates.noindex/GLTFSceneKit.build/Debug-watchos/GLTFSceneKit.build/Objects-normal/arm64/GLTFSceneKit-OutputFileMap.json -use-frontend-parseable-output -save-temps -no-color-diagnostics -serialize-diagnostics -emit-dependencies -emit-module -emit-module-path /Users/admin/builder/spi-builder-workspace/.derivedData/Build/Intermediates.noindex/GLTFSceneKit.build/Debug-watchos/GLTFSceneKit.build/Objects-normal/arm64/GLTFSceneKit.swiftmodule -validate-clang-modules-once -clang-build-session-file /Users/admin/builder/spi-builder-workspace/.derivedData/ModuleCache.noindex/Session.modulevalidation -Xcc -I/Users/admin/builder/spi-builder-workspace/.derivedData/Build/Intermediates.noindex/GLTFSceneKit.build/Debug-watchos/GLTFSceneKit.build/swift-overrides.hmap -emit-const-values -Xfrontend -const-gather-protocols-file -Xfrontend /Users/admin/builder/spi-builder-workspace/.derivedData/Build/Intermediates.noindex/GLTFSceneKit.build/Debug-watchos/GLTFSceneKit.build/Objects-normal/arm64/GLTFSceneKit_const_extract_protocols.json -Xcc -I/Users/admin/builder/spi-builder-workspace/.derivedData/Build/Products/Debug-watchos/include -Xcc -I/Users/admin/builder/spi-builder-workspace/.derivedData/Build/Intermediates.noindex/GLTFSceneKit.build/Debug-watchos/GLTFSceneKit.build/DerivedSources-normal/arm64 -Xcc -I/Users/admin/builder/spi-builder-workspace/.derivedData/Build/Intermediates.noindex/GLTFSceneKit.build/Debug-watchos/GLTFSceneKit.build/DerivedSources/arm64 -Xcc -I/Users/admin/builder/spi-builder-workspace/.derivedData/Build/Intermediates.noindex/GLTFSceneKit.build/Debug-watchos/GLTFSceneKit.build/DerivedSources -Xcc -DSWIFT_PACKAGE -Xcc -DDEBUG\=1 -emit-objc-header -emit-objc-header-path /Users/admin/builder/spi-builder-workspace/.derivedData/Build/Intermediates.noindex/GLTFSceneKit.build/Debug-watchos/GLTFSceneKit.build/Objects-normal/arm64/GLTFSceneKit-Swift.h -working-directory /Users/admin/builder/spi-builder-workspace/.swiftpm/xcode -experimental-emit-module-separately -disable-cmo
SwiftDriver DisplayLink normal armv7k com.apple.xcode.tools.swift.compiler (in target 'DisplayLink' from project 'DisplayLink')
cd /Users/admin/builder/spi-builder-workspace/.swiftpm/xcode
builtin-SwiftDriver -- /Applications/Xcode-16.3.0.app/Contents/Developer/Toolchains/XcodeDefault.xctoolchain/usr/bin/swiftc -module-name DisplayLink -Onone -enforce-exclusivity\=checked @/Users/admin/builder/spi-builder-workspace/.derivedData/Build/Intermediates.noindex/DisplayLink.build/Debug-watchos/DisplayLink.build/Objects-normal/armv7k/DisplayLink.SwiftFileList -DSWIFT_PACKAGE -DDEBUG -stats-output-dir .stats -strict-concurrency\=complete -enable-upcoming-feature StrictConcurrency -enable-upcoming-feature DisableOutwardActorInference -enable-upcoming-feature GlobalActorIsolatedTypesUsability -enable-upcoming-feature InferSendableFromCaptures -plugin-path /Applications/Xcode-16.3.0.app/Contents/Developer/Toolchains/XcodeDefault.xctoolchain/usr/lib/swift/host/plugins/testing -enable-experimental-feature DebugDescriptionMacro -sdk /Applications/Xcode-16.3.0.app/Contents/Developer/Platforms/WatchOS.platform/Developer/SDKs/WatchOS11.4.sdk -target armv7k-apple-watchos6.0 -g -module-cache-path /Users/admin/builder/spi-builder-workspace/.derivedData/ModuleCache.noindex -Xfrontend -serialize-debugging-options -profile-coverage-mapping -profile-generate -enable-testing -suppress-warnings -index-store-path /Users/admin/builder/spi-builder-workspace/.derivedData/Index.noindex/DataStore -swift-version 5 -I /Users/admin/builder/spi-builder-workspace/.derivedData/Build/Products/Debug-watchos -I /Applications/Xcode-16.3.0.app/Contents/Developer/Platforms/WatchOS.platform/Developer/usr/lib -F /Users/admin/builder/spi-builder-workspace/.derivedData/Build/Products/Debug-watchos -F /Applications/Xcode-16.3.0.app/Contents/Developer/Platforms/WatchOS.platform/Developer/Library/Frameworks -F /Applications/Xcode-16.3.0.app/Contents/Developer/Platforms/WatchOS.platform/Developer/SDKs/WatchOS11.4.sdk/Developer/Library/Frameworks -c -j10 -enable-batch-mode -incremental -Xcc -ivfsstatcache -Xcc /Users/admin/builder/spi-builder-workspace/.derivedData/SDKStatCaches.noindex/watchos11.4-22T246-43efb940ff07ba2497b70ec94253f576.sdkstatcache -output-file-map /Users/admin/builder/spi-builder-workspace/.derivedData/Build/Intermediates.noindex/DisplayLink.build/Debug-watchos/DisplayLink.build/Objects-normal/armv7k/DisplayLink-OutputFileMap.json -use-frontend-parseable-output -save-temps -no-color-diagnostics -serialize-diagnostics -emit-dependencies -emit-module -emit-module-path /Users/admin/builder/spi-builder-workspace/.derivedData/Build/Intermediates.noindex/DisplayLink.build/Debug-watchos/DisplayLink.build/Objects-normal/armv7k/DisplayLink.swiftmodule -validate-clang-modules-once -clang-build-session-file /Users/admin/builder/spi-builder-workspace/.derivedData/ModuleCache.noindex/Session.modulevalidation -Xcc -I/Users/admin/builder/spi-builder-workspace/.derivedData/Build/Intermediates.noindex/DisplayLink.build/Debug-watchos/DisplayLink.build/swift-overrides.hmap -emit-const-values -Xfrontend -const-gather-protocols-file -Xfrontend /Users/admin/builder/spi-builder-workspace/.derivedData/Build/Intermediates.noindex/DisplayLink.build/Debug-watchos/DisplayLink.build/Objects-normal/armv7k/DisplayLink_const_extract_protocols.json -Xcc -I/Users/admin/builder/spi-builder-workspace/.derivedData/Build/Products/Debug-watchos/include -Xcc -I/Users/admin/builder/spi-builder-workspace/.derivedData/Build/Intermediates.noindex/DisplayLink.build/Debug-watchos/DisplayLink.build/DerivedSources-normal/armv7k -Xcc -I/Users/admin/builder/spi-builder-workspace/.derivedData/Build/Intermediates.noindex/DisplayLink.build/Debug-watchos/DisplayLink.build/DerivedSources/armv7k -Xcc -I/Users/admin/builder/spi-builder-workspace/.derivedData/Build/Intermediates.noindex/DisplayLink.build/Debug-watchos/DisplayLink.build/DerivedSources -Xcc -DSWIFT_PACKAGE -Xcc -DDEBUG\=1 -emit-objc-header -emit-objc-header-path /Users/admin/builder/spi-builder-workspace/.derivedData/Build/Intermediates.noindex/DisplayLink.build/Debug-watchos/DisplayLink.build/Objects-normal/armv7k/DisplayLink-Swift.h -working-directory /Users/admin/builder/spi-builder-workspace/.swiftpm/xcode -experimental-emit-module-separately -disable-cmo
SwiftDriver DisplayLink normal arm64_32 com.apple.xcode.tools.swift.compiler (in target 'DisplayLink' from project 'DisplayLink')
cd /Users/admin/builder/spi-builder-workspace/.swiftpm/xcode
builtin-SwiftDriver -- /Applications/Xcode-16.3.0.app/Contents/Developer/Toolchains/XcodeDefault.xctoolchain/usr/bin/swiftc -module-name DisplayLink -Onone -enforce-exclusivity\=checked @/Users/admin/builder/spi-builder-workspace/.derivedData/Build/Intermediates.noindex/DisplayLink.build/Debug-watchos/DisplayLink.build/Objects-normal/arm64_32/DisplayLink.SwiftFileList -DSWIFT_PACKAGE -DDEBUG -stats-output-dir .stats -strict-concurrency\=complete -enable-upcoming-feature StrictConcurrency -enable-upcoming-feature DisableOutwardActorInference -enable-upcoming-feature GlobalActorIsolatedTypesUsability -enable-upcoming-feature InferSendableFromCaptures -plugin-path /Applications/Xcode-16.3.0.app/Contents/Developer/Toolchains/XcodeDefault.xctoolchain/usr/lib/swift/host/plugins/testing -enable-experimental-feature DebugDescriptionMacro -sdk /Applications/Xcode-16.3.0.app/Contents/Developer/Platforms/WatchOS.platform/Developer/SDKs/WatchOS11.4.sdk -target arm64_32-apple-watchos6.0 -g -module-cache-path /Users/admin/builder/spi-builder-workspace/.derivedData/ModuleCache.noindex -Xfrontend -serialize-debugging-options -profile-coverage-mapping -profile-generate -enable-testing -suppress-warnings -index-store-path /Users/admin/builder/spi-builder-workspace/.derivedData/Index.noindex/DataStore -swift-version 5 -I /Users/admin/builder/spi-builder-workspace/.derivedData/Build/Products/Debug-watchos -I /Applications/Xcode-16.3.0.app/Contents/Developer/Platforms/WatchOS.platform/Developer/usr/lib -F /Users/admin/builder/spi-builder-workspace/.derivedData/Build/Products/Debug-watchos -F /Applications/Xcode-16.3.0.app/Contents/Developer/Platforms/WatchOS.platform/Developer/Library/Frameworks -F /Applications/Xcode-16.3.0.app/Contents/Developer/Platforms/WatchOS.platform/Developer/SDKs/WatchOS11.4.sdk/Developer/Library/Frameworks -c -j10 -enable-batch-mode -incremental -Xcc -ivfsstatcache -Xcc /Users/admin/builder/spi-builder-workspace/.derivedData/SDKStatCaches.noindex/watchos11.4-22T246-43efb940ff07ba2497b70ec94253f576.sdkstatcache -output-file-map /Users/admin/builder/spi-builder-workspace/.derivedData/Build/Intermediates.noindex/DisplayLink.build/Debug-watchos/DisplayLink.build/Objects-normal/arm64_32/DisplayLink-OutputFileMap.json -use-frontend-parseable-output -save-temps -no-color-diagnostics -serialize-diagnostics -emit-dependencies -emit-module -emit-module-path /Users/admin/builder/spi-builder-workspace/.derivedData/Build/Intermediates.noindex/DisplayLink.build/Debug-watchos/DisplayLink.build/Objects-normal/arm64_32/DisplayLink.swiftmodule -validate-clang-modules-once -clang-build-session-file /Users/admin/builder/spi-builder-workspace/.derivedData/ModuleCache.noindex/Session.modulevalidation -Xcc -I/Users/admin/builder/spi-builder-workspace/.derivedData/Build/Intermediates.noindex/DisplayLink.build/Debug-watchos/DisplayLink.build/swift-overrides.hmap -emit-const-values -Xfrontend -const-gather-protocols-file -Xfrontend /Users/admin/builder/spi-builder-workspace/.derivedData/Build/Intermediates.noindex/DisplayLink.build/Debug-watchos/DisplayLink.build/Objects-normal/arm64_32/DisplayLink_const_extract_protocols.json -Xcc -I/Users/admin/builder/spi-builder-workspace/.derivedData/Build/Products/Debug-watchos/include -Xcc -I/Users/admin/builder/spi-builder-workspace/.derivedData/Build/Intermediates.noindex/DisplayLink.build/Debug-watchos/DisplayLink.build/DerivedSources-normal/arm64_32 -Xcc -I/Users/admin/builder/spi-builder-workspace/.derivedData/Build/Intermediates.noindex/DisplayLink.build/Debug-watchos/DisplayLink.build/DerivedSources/arm64_32 -Xcc -I/Users/admin/builder/spi-builder-workspace/.derivedData/Build/Intermediates.noindex/DisplayLink.build/Debug-watchos/DisplayLink.build/DerivedSources -Xcc -DSWIFT_PACKAGE -Xcc -DDEBUG\=1 -emit-objc-header -emit-objc-header-path /Users/admin/builder/spi-builder-workspace/.derivedData/Build/Intermediates.noindex/DisplayLink.build/Debug-watchos/DisplayLink.build/Objects-normal/arm64_32/DisplayLink-Swift.h -working-directory /Users/admin/builder/spi-builder-workspace/.swiftpm/xcode -experimental-emit-module-separately -disable-cmo
SwiftDriver DisplayLink normal arm64 com.apple.xcode.tools.swift.compiler (in target 'DisplayLink' from project 'DisplayLink')
cd /Users/admin/builder/spi-builder-workspace/.swiftpm/xcode
builtin-SwiftDriver -- /Applications/Xcode-16.3.0.app/Contents/Developer/Toolchains/XcodeDefault.xctoolchain/usr/bin/swiftc -module-name DisplayLink -Onone -enforce-exclusivity\=checked @/Users/admin/builder/spi-builder-workspace/.derivedData/Build/Intermediates.noindex/DisplayLink.build/Debug-watchos/DisplayLink.build/Objects-normal/arm64/DisplayLink.SwiftFileList -DSWIFT_PACKAGE -DDEBUG -stats-output-dir .stats -strict-concurrency\=complete -enable-upcoming-feature StrictConcurrency -enable-upcoming-feature DisableOutwardActorInference -enable-upcoming-feature GlobalActorIsolatedTypesUsability -enable-upcoming-feature InferSendableFromCaptures -plugin-path /Applications/Xcode-16.3.0.app/Contents/Developer/Toolchains/XcodeDefault.xctoolchain/usr/lib/swift/host/plugins/testing -enable-experimental-feature DebugDescriptionMacro -sdk /Applications/Xcode-16.3.0.app/Contents/Developer/Platforms/WatchOS.platform/Developer/SDKs/WatchOS11.4.sdk -target arm64-apple-watchos6.0 -g -module-cache-path /Users/admin/builder/spi-builder-workspace/.derivedData/ModuleCache.noindex -Xfrontend -serialize-debugging-options -profile-coverage-mapping -profile-generate -enable-testing -suppress-warnings -index-store-path /Users/admin/builder/spi-builder-workspace/.derivedData/Index.noindex/DataStore -swift-version 5 -I /Users/admin/builder/spi-builder-workspace/.derivedData/Build/Products/Debug-watchos -I /Applications/Xcode-16.3.0.app/Contents/Developer/Platforms/WatchOS.platform/Developer/usr/lib -F /Users/admin/builder/spi-builder-workspace/.derivedData/Build/Products/Debug-watchos -F /Applications/Xcode-16.3.0.app/Contents/Developer/Platforms/WatchOS.platform/Developer/Library/Frameworks -F /Applications/Xcode-16.3.0.app/Contents/Developer/Platforms/WatchOS.platform/Developer/SDKs/WatchOS11.4.sdk/Developer/Library/Frameworks -c -j10 -enable-batch-mode -incremental -Xcc -ivfsstatcache -Xcc /Users/admin/builder/spi-builder-workspace/.derivedData/SDKStatCaches.noindex/watchos11.4-22T246-43efb940ff07ba2497b70ec94253f576.sdkstatcache -output-file-map /Users/admin/builder/spi-builder-workspace/.derivedData/Build/Intermediates.noindex/DisplayLink.build/Debug-watchos/DisplayLink.build/Objects-normal/arm64/DisplayLink-OutputFileMap.json -use-frontend-parseable-output -save-temps -no-color-diagnostics -serialize-diagnostics -emit-dependencies -emit-module -emit-module-path /Users/admin/builder/spi-builder-workspace/.derivedData/Build/Intermediates.noindex/DisplayLink.build/Debug-watchos/DisplayLink.build/Objects-normal/arm64/DisplayLink.swiftmodule -validate-clang-modules-once -clang-build-session-file /Users/admin/builder/spi-builder-workspace/.derivedData/ModuleCache.noindex/Session.modulevalidation -Xcc -I/Users/admin/builder/spi-builder-workspace/.derivedData/Build/Intermediates.noindex/DisplayLink.build/Debug-watchos/DisplayLink.build/swift-overrides.hmap -emit-const-values -Xfrontend -const-gather-protocols-file -Xfrontend /Users/admin/builder/spi-builder-workspace/.derivedData/Build/Intermediates.noindex/DisplayLink.build/Debug-watchos/DisplayLink.build/Objects-normal/arm64/DisplayLink_const_extract_protocols.json -Xcc -I/Users/admin/builder/spi-builder-workspace/.derivedData/Build/Products/Debug-watchos/include -Xcc -I/Users/admin/builder/spi-builder-workspace/.derivedData/Build/Intermediates.noindex/DisplayLink.build/Debug-watchos/DisplayLink.build/DerivedSources-normal/arm64 -Xcc -I/Users/admin/builder/spi-builder-workspace/.derivedData/Build/Intermediates.noindex/DisplayLink.build/Debug-watchos/DisplayLink.build/DerivedSources/arm64 -Xcc -I/Users/admin/builder/spi-builder-workspace/.derivedData/Build/Intermediates.noindex/DisplayLink.build/Debug-watchos/DisplayLink.build/DerivedSources -Xcc -DSWIFT_PACKAGE -Xcc -DDEBUG\=1 -emit-objc-header -emit-objc-header-path /Users/admin/builder/spi-builder-workspace/.derivedData/Build/Intermediates.noindex/DisplayLink.build/Debug-watchos/DisplayLink.build/Objects-normal/arm64/DisplayLink-Swift.h -working-directory /Users/admin/builder/spi-builder-workspace/.swiftpm/xcode -experimental-emit-module-separately -disable-cmo
SwiftEmitModule normal arm64_32 Emitting\ module\ for\ DisplayLink (in target 'DisplayLink' from project 'DisplayLink')
EmitSwiftModule normal arm64_32 (in target 'DisplayLink' from project 'DisplayLink')
cd /Users/admin/builder/spi-builder-workspace/.swiftpm/xcode
SwiftEmitModule normal armv7k Emitting\ module\ for\ DisplayLink (in target 'DisplayLink' from project 'DisplayLink')
EmitSwiftModule normal armv7k (in target 'DisplayLink' from project 'DisplayLink')
cd /Users/admin/builder/spi-builder-workspace/.swiftpm/xcode
SwiftCompile normal arm64 Compiling\ DisplayLink.swift /Users/admin/builder/spi-builder-workspace/.dependencies/checkouts/DisplayLink/Sources/DisplayLink/DisplayLink.swift (in target 'DisplayLink' from project 'DisplayLink')
SwiftCompile normal arm64 /Users/admin/builder/spi-builder-workspace/.dependencies/checkouts/DisplayLink/Sources/DisplayLink/DisplayLink.swift (in target 'DisplayLink' from project 'DisplayLink')
cd /Users/admin/builder/spi-builder-workspace/.swiftpm/xcode
SwiftCompile normal arm64_32 Compiling\ DisplayLink.swift /Users/admin/builder/spi-builder-workspace/.dependencies/checkouts/DisplayLink/Sources/DisplayLink/DisplayLink.swift (in target 'DisplayLink' from project 'DisplayLink')
SwiftCompile normal arm64_32 /Users/admin/builder/spi-builder-workspace/.dependencies/checkouts/DisplayLink/Sources/DisplayLink/DisplayLink.swift (in target 'DisplayLink' from project 'DisplayLink')
cd /Users/admin/builder/spi-builder-workspace/.swiftpm/xcode
SwiftCompile normal armv7k Compiling\ OnFrame.swift /Users/admin/builder/spi-builder-workspace/.dependencies/checkouts/DisplayLink/Sources/DisplayLink/OnFrame.swift (in target 'DisplayLink' from project 'DisplayLink')
SwiftCompile normal armv7k /Users/admin/builder/spi-builder-workspace/.dependencies/checkouts/DisplayLink/Sources/DisplayLink/OnFrame.swift (in target 'DisplayLink' from project 'DisplayLink')
cd /Users/admin/builder/spi-builder-workspace/.swiftpm/xcode
SwiftEmitModule normal arm64 Emitting\ module\ for\ DisplayLink (in target 'DisplayLink' from project 'DisplayLink')
EmitSwiftModule normal arm64 (in target 'DisplayLink' from project 'DisplayLink')
cd /Users/admin/builder/spi-builder-workspace/.swiftpm/xcode
SwiftCompile normal arm64_32 Compiling\ OnFrame.swift /Users/admin/builder/spi-builder-workspace/.dependencies/checkouts/DisplayLink/Sources/DisplayLink/OnFrame.swift (in target 'DisplayLink' from project 'DisplayLink')
SwiftCompile normal arm64_32 /Users/admin/builder/spi-builder-workspace/.dependencies/checkouts/DisplayLink/Sources/DisplayLink/OnFrame.swift (in target 'DisplayLink' from project 'DisplayLink')
cd /Users/admin/builder/spi-builder-workspace/.swiftpm/xcode
SwiftCompile normal armv7k Compiling\ DisplayLink.swift /Users/admin/builder/spi-builder-workspace/.dependencies/checkouts/DisplayLink/Sources/DisplayLink/DisplayLink.swift (in target 'DisplayLink' from project 'DisplayLink')
SwiftCompile normal armv7k /Users/admin/builder/spi-builder-workspace/.dependencies/checkouts/DisplayLink/Sources/DisplayLink/DisplayLink.swift (in target 'DisplayLink' from project 'DisplayLink')
cd /Users/admin/builder/spi-builder-workspace/.swiftpm/xcode
SwiftCompile normal arm64 Compiling\ OnFrame.swift /Users/admin/builder/spi-builder-workspace/.dependencies/checkouts/DisplayLink/Sources/DisplayLink/OnFrame.swift (in target 'DisplayLink' from project 'DisplayLink')
SwiftCompile normal arm64 /Users/admin/builder/spi-builder-workspace/.dependencies/checkouts/DisplayLink/Sources/DisplayLink/OnFrame.swift (in target 'DisplayLink' from project 'DisplayLink')
cd /Users/admin/builder/spi-builder-workspace/.swiftpm/xcode
SwiftEmitModule normal arm64 Emitting\ module\ for\ GLTFSceneKit (in target 'GLTFSceneKit' from project 'GLTFSceneKit')
Failed frontend command:
/Applications/Xcode-16.3.0.app/Contents/Developer/Toolchains/XcodeDefault.xctoolchain/usr/bin/swift-frontend -frontend -emit-module -experimental-skip-non-inlinable-function-bodies-without-types /Users/admin/builder/spi-builder-workspace/.derivedData/Build/Intermediates.noindex/GLTFSceneKit.build/Debug-watchos/GLTFSceneKit.build/DerivedSources/resource_bundle_accessor.swift /Users/admin/builder/spi-builder-workspace/.dependencies/checkouts/GLTFSceneKit/Sources/GLTFSceneKit/GLTFErrors.swift /Users/admin/builder/spi-builder-workspace/.dependencies/checkouts/GLTFSceneKit/Sources/GLTFSceneKit/GLTFFunctions.swift /Users/admin/builder/spi-builder-workspace/.dependencies/checkouts/GLTFSceneKit/Sources/GLTFSceneKit/GLTFSceneKit+BundleFinder.swift /Users/admin/builder/spi-builder-workspace/.dependencies/checkouts/GLTFSceneKit/Sources/GLTFSceneKit/GLTFSceneSource.swift /Users/admin/builder/spi-builder-workspace/.dependencies/checkouts/GLTFSceneKit/Sources/GLTFSceneKit/GLTFTypes.swift /Users/admin/builder/spi-builder-workspace/.dependencies/checkouts/GLTFSceneKit/Sources/GLTFSceneKit/GLTFUnarchiver.swift /Users/admin/builder/spi-builder-workspace/.dependencies/checkouts/GLTFSceneKit/Sources/GLTFSceneKit/schema/GLTFAccessor.swift /Users/admin/builder/spi-builder-workspace/.dependencies/checkouts/GLTFSceneKit/Sources/GLTFSceneKit/schema/GLTFAccessorSparse.swift /Users/admin/builder/spi-builder-workspace/.dependencies/checkouts/GLTFSceneKit/Sources/GLTFSceneKit/schema/GLTFAccessorSparseIndices.swift /Users/admin/builder/spi-builder-workspace/.dependencies/checkouts/GLTFSceneKit/Sources/GLTFSceneKit/schema/GLTFAccessorSparseValues.swift /Users/admin/builder/spi-builder-workspace/.dependencies/checkouts/GLTFSceneKit/Sources/GLTFSceneKit/schema/GLTFAnimation.swift /Users/admin/builder/spi-builder-workspace/.dependencies/checkouts/GLTFSceneKit/Sources/GLTFSceneKit/schema/GLTFAnimationChannel.swift /Users/admin/builder/spi-builder-workspace/.dependencies/checkouts/GLTFSceneKit/Sources/GLTFSceneKit/schema/GLTFAnimationChannelTarget.swift /Users/admin/builder/spi-builder-workspace/.dependencies/checkouts/GLTFSceneKit/Sources/GLTFSceneKit/schema/GLTFAnimationSampler.swift /Users/admin/builder/spi-builder-workspace/.dependencies/checkouts/GLTFSceneKit/Sources/GLTFSceneKit/schema/GLTFAsset.swift /Users/admin/builder/spi-builder-workspace/.dependencies/checkouts/GLTFSceneKit/Sources/GLTFSceneKit/schema/GLTFBuffer.swift /Users/admin/builder/spi-builder-workspace/.dependencies/checkouts/GLTFSceneKit/Sources/GLTFSceneKit/schema/GLTFBufferView.swift /Users/admin/builder/spi-builder-workspace/.dependencies/checkouts/GLTFSceneKit/Sources/GLTFSceneKit/schema/GLTFCamera.swift /Users/admin/builder/spi-builder-workspace/.dependencies/checkouts/GLTFSceneKit/Sources/GLTFSceneKit/schema/GLTFCameraOrthographic.swift /Users/admin/builder/spi-builder-workspace/.dependencies/checkouts/GLTFSceneKit/Sources/GLTFSceneKit/schema/GLTFCameraPerspective.swift /Users/admin/builder/spi-builder-workspace/.dependencies/checkouts/GLTFSceneKit/Sources/GLTFSceneKit/schema/GLTFExtension.swift /Users/admin/builder/spi-builder-workspace/.dependencies/checkouts/GLTFSceneKit/Sources/GLTFSceneKit/schema/GLTFExtras.swift /Users/admin/builder/spi-builder-workspace/.dependencies/checkouts/GLTFSceneKit/Sources/GLTFSceneKit/schema/GLTFExtrasTargetNames.swift /Users/admin/builder/spi-builder-workspace/.dependencies/checkouts/GLTFSceneKit/Sources/GLTFSceneKit/schema/GLTFGlTF.swift /Users/admin/builder/spi-builder-workspace/.dependencies/checkouts/GLTFSceneKit/Sources/GLTFSceneKit/schema/GLTFGlTFChildOfRootProperty.swift /Users/admin/builder/spi-builder-workspace/.dependencies/checkouts/GLTFSceneKit/Sources/GLTFSceneKit/schema/GLTFGlTFProperty.swift /Users/admin/builder/spi-builder-workspace/.dependencies/checkouts/GLTFSceneKit/Sources/GLTFSceneKit/schema/GLTFGlTFid.swift /Users/admin/builder/spi-builder-workspace/.dependencies/checkouts/GLTFSceneKit/Sources/GLTFSceneKit/schema/GLTFImage.swift /Users/admin/builder/spi-builder-workspace/.dependencies/checkouts/GLTFSceneKit/Sources/GLTFSceneKit/schema/GLTFMaterial.swift /Users/admin/builder/spi-builder-workspace/.dependencies/checkouts/GLTFSceneKit/Sources/GLTFSceneKit/schema/GLTFMaterialNormalTextureInfo.swift /Users/admin/builder/spi-builder-workspace/.dependencies/checkouts/GLTFSceneKit/Sources/GLTFSceneKit/schema/GLTFMaterialOcclusionTextureInfo.swift /Users/admin/builder/spi-builder-workspace/.dependencies/checkouts/GLTFSceneKit/Sources/GLTFSceneKit/schema/GLTFMaterialPbrMetallicRoughness.swift /Users/admin/builder/spi-builder-workspace/.dependencies/checkouts/GLTFSceneKit/Sources/GLTFSceneKit/schema/GLTFMesh.swift /Users/admin/builder/spi-builder-workspace/.dependencies/checkouts/GLTFSceneKit/Sources/GLTFSceneKit/schema/GLTFMeshPrimitive.swift /Users/admin/builder/spi-builder-workspace/.dependencies/checkouts/GLTFSceneKit/Sources/GLTFSceneKit/schema/GLTFNode.swift /Users/admin/builder/spi-builder-workspace/.dependencies/checkouts/GLTFSceneKit/Sources/GLTFSceneKit/schema/GLTFSampler.swift /Users/admin/builder/spi-builder-workspace/.dependencies/checkouts/GLTFSceneKit/Sources/GLTFSceneKit/schema/GLTFScene.swift /Users/admin/builder/spi-builder-workspace/.dependencies/checkouts/GLTFSceneKit/Sources/GLTFSceneKit/schema/GLTFSkin.swift /Users/admin/builder/spi-builder-workspace/.dependencies/checkouts/GLTFSceneKit/Sources/GLTFSceneKit/schema/GLTFTexture.swift /Users/admin/builder/spi-builder-workspace/.dependencies/checkouts/GLTFSceneKit/Sources/GLTFSceneKit/schema/GLTFTextureInfo.swift /Users/admin/builder/spi-builder-workspace/.dependencies/checkouts/GLTFSceneKit/Sources/GLTFSceneKit/schema/extensions/ExtensionList.swift /Users/admin/builder/spi-builder-workspace/.dependencies/checkouts/GLTFSceneKit/Sources/GLTFSceneKit/schema/extensions/KHR_materials_common/GLTFKHRMaterialsCommon_GLTFKHRMaterialsCommon.swift /Users/admin/builder/spi-builder-workspace/.dependencies/checkouts/GLTFSceneKit/Sources/GLTFSceneKit/schema/extensions/KHR_materials_pbrSpecularGlossiness/GLTFKHRMaterialsPbrSpecularGlossiness_GLTFKHRMaterialsPbrSpecularGlossiness.swift /Users/admin/builder/spi-builder-workspace/.dependencies/checkouts/GLTFSceneKit/Sources/GLTFSceneKit/schema/extensions/VRM/GLTFVRM_VRM.swift /Users/admin/builder/spi-builder-workspace/.dependencies/checkouts/GLTFSceneKit/Sources/GLTFSceneKit/schema/extensions/VRM/GLTFVRM_VRMSpringBone.swift /Users/admin/builder/spi-builder-workspace/.dependencies/checkouts/GLTFSceneKit/Sources/GLTFSceneKit/schema/extensions/VRM/GLTFVRM_VRMSpringBoneLogic.swift /Users/admin/builder/spi-builder-workspace/.dependencies/checkouts/GLTFSceneKit/Sources/GLTFSceneKit/schema/extensions/VRM/GLTFVRM_VRMState.swift /Users/admin/builder/spi-builder-workspace/.dependencies/checkouts/GLTFSceneKit/Sources/GLTFSceneKit/schema/extensions/VRM/GLTFVRM_VRMTypes.swift -target arm64-apple-watchos5.0 -Xllvm -aarch64-use-tbi -enable-objc-interop -sdk /Applications/Xcode-16.3.0.app/Contents/Developer/Platforms/WatchOS.platform/Developer/SDKs/WatchOS11.4.sdk -I /Users/admin/builder/spi-builder-workspace/.derivedData/Build/Products/Debug-watchos -I /Applications/Xcode-16.3.0.app/Contents/Developer/Platforms/WatchOS.platform/Developer/usr/lib -F /Users/admin/builder/spi-builder-workspace/.derivedData/Build/Products/Debug-watchos -F /Applications/Xcode-16.3.0.app/Contents/Developer/Platforms/WatchOS.platform/Developer/Library/Frameworks -F /Applications/Xcode-16.3.0.app/Contents/Developer/Platforms/WatchOS.platform/Developer/SDKs/WatchOS11.4.sdk/Developer/Library/Frameworks -no-color-diagnostics -enable-testing -g -debug-info-format\=dwarf -dwarf-version\=4 -module-cache-path /Users/admin/builder/spi-builder-workspace/.derivedData/ModuleCache.noindex -suppress-warnings -profile-generate -profile-coverage-mapping -swift-version 5 -enforce-exclusivity\=checked -stats-output-dir /Users/admin/builder/spi-builder-workspace/.swiftpm/xcode/.stats -Onone -D SWIFT_PACKAGE -D DEBUG -serialize-debugging-options -const-gather-protocols-file /Users/admin/builder/spi-builder-workspace/.derivedData/Build/Intermediates.noindex/GLTFSceneKit.build/Debug-watchos/GLTFSceneKit.build/Objects-normal/arm64/GLTFSceneKit_const_extract_protocols.json -enable-upcoming-feature StrictConcurrency -enable-upcoming-feature DisableOutwardActorInference -enable-upcoming-feature GlobalActorIsolatedTypesUsability -enable-upcoming-feature InferSendableFromCaptures -enable-experimental-feature DebugDescriptionMacro -strict-concurrency\=complete -empty-abi-descriptor -plugin-path /Applications/Xcode-16.3.0.app/Contents/Developer/Toolchains/XcodeDefault.xctoolchain/usr/lib/swift/host/plugins/testing -validate-clang-modules-once -clang-build-session-file /Users/admin/builder/spi-builder-workspace/.derivedData/ModuleCache.noindex/Session.modulevalidation -Xcc -working-directory -Xcc /Users/admin/builder/spi-builder-workspace/.swiftpm/xcode -resource-dir /Applications/Xcode-16.3.0.app/Contents/Developer/Toolchains/XcodeDefault.xctoolchain/usr/lib/swift -enable-anonymous-context-mangled-names -file-compilation-dir /Users/admin/builder/spi-builder-workspace/.swiftpm/xcode -Xcc -ivfsstatcache -Xcc /Users/admin/builder/spi-builder-workspace/.derivedData/SDKStatCaches.noindex/watchos11.4-22T246-43efb940ff07ba2497b70ec94253f576.sdkstatcache -Xcc -I/Users/admin/builder/spi-builder-workspace/.derivedData/Build/Intermediates.noindex/GLTFSceneKit.build/Debug-watchos/GLTFSceneKit.build/swift-overrides.hmap -Xcc -I/Users/admin/builder/spi-builder-workspace/.derivedData/Build/Products/Debug-watchos/include -Xcc -I/Users/admin/builder/spi-builder-workspace/.derivedData/Build/Intermediates.noindex/GLTFSceneKit.build/Debug-watchos/GLTFSceneKit.build/DerivedSources-normal/arm64 -Xcc -I/Users/admin/builder/spi-builder-workspace/.derivedData/Build/Intermediates.noindex/GLTFSceneKit.build/Debug-watchos/GLTFSceneKit.build/DerivedSources/arm64 -Xcc -I/Users/admin/builder/spi-builder-workspace/.derivedData/Build/Intermediates.noindex/GLTFSceneKit.build/Debug-watchos/GLTFSceneKit.build/DerivedSources -Xcc -DSWIFT_PACKAGE -Xcc -DDEBUG\=1 -module-name GLTFSceneKit -frontend-parseable-output -disable-clang-spi -target-sdk-version 11.4 -target-sdk-name watchos11.4 -external-plugin-path /Applications/Xcode-16.3.0.app/Contents/Developer/Platforms/WatchOS.platform/Developer/usr/lib/swift/host/plugins\#/Applications/Xcode-16.3.0.app/Contents/Developer/Platforms/WatchOS.platform/Developer/usr/bin/swift-plugin-server -external-plugin-path /Applications/Xcode-16.3.0.app/Contents/Developer/Platforms/WatchOS.platform/Developer/usr/local/lib/swift/host/plugins\#/Applications/Xcode-16.3.0.app/Contents/Developer/Platforms/WatchOS.platform/Developer/usr/bin/swift-plugin-server -in-process-plugin-server-path /Applications/Xcode-16.3.0.app/Contents/Developer/Toolchains/XcodeDefault.xctoolchain/usr/lib/swift/host/libSwiftInProcPluginServer.dylib -plugin-path /Applications/Xcode-16.3.0.app/Contents/Developer/Toolchains/XcodeDefault.xctoolchain/usr/lib/swift/host/plugins -plugin-path /Applications/Xcode-16.3.0.app/Contents/Developer/Toolchains/XcodeDefault.xctoolchain/usr/local/lib/swift/host/plugins -emit-module-doc-path /Users/admin/builder/spi-builder-workspace/.derivedData/Build/Intermediates.noindex/GLTFSceneKit.build/Debug-watchos/GLTFSceneKit.build/Objects-normal/arm64/GLTFSceneKit.swiftdoc -emit-module-source-info-path /Users/admin/builder/spi-builder-workspace/.derivedData/Build/Intermediates.noindex/GLTFSceneKit.build/Debug-watchos/GLTFSceneKit.build/Objects-normal/arm64/GLTFSceneKit.swiftsourceinfo -emit-objc-header-path /Users/admin/builder/spi-builder-workspace/.derivedData/Build/Intermediates.noindex/GLTFSceneKit.build/Debug-watchos/GLTFSceneKit.build/Objects-normal/arm64/GLTFSceneKit-Swift.h -serialize-diagnostics-path /Users/admin/builder/spi-builder-workspace/.derivedData/Build/Intermediates.noindex/GLTFSceneKit.build/Debug-watchos/GLTFSceneKit.build/Objects-normal/arm64/GLTFSceneKit-master-emit-module.dia -emit-dependencies-path /Users/admin/builder/spi-builder-workspace/.derivedData/Build/Intermediates.noindex/GLTFSceneKit.build/Debug-watchos/GLTFSceneKit.build/Objects-normal/arm64/GLTFSceneKit-master-emit-module.d -o /Users/admin/builder/spi-builder-workspace/.derivedData/Build/Intermediates.noindex/GLTFSceneKit.build/Debug-watchos/GLTFSceneKit.build/Objects-normal/arm64/GLTFSceneKit.swiftmodule -emit-abi-descriptor-path /Users/admin/builder/spi-builder-workspace/.derivedData/Build/Intermediates.noindex/GLTFSceneKit.build/Debug-watchos/GLTFSceneKit.build/Objects-normal/arm64/GLTFSceneKit.abi.json
EmitSwiftModule normal arm64 (in target 'GLTFSceneKit' from project 'GLTFSceneKit')
cd /Users/admin/builder/spi-builder-workspace/.swiftpm/xcode
/Users/admin/builder/spi-builder-workspace/.dependencies/checkouts/GLTFSceneKit/Sources/GLTFSceneKit/GLTFTypes.swift:112:23: error: cannot find type 'UIImage' in scope
typealias Image = UIImage
^~~~~~~
/Users/admin/builder/spi-builder-workspace/.dependencies/checkouts/GLTFSceneKit/Sources/GLTFSceneKit/GLTFTypes.swift:26:21: error: cannot find 'GL_BYTE' in scope
let GLTF_BYTE = Int(GL_BYTE)
^~~~~~~
/Users/admin/builder/spi-builder-workspace/.dependencies/checkouts/GLTFSceneKit/Sources/GLTFSceneKit/GLTFTypes.swift:27:30: error: cannot find 'GL_UNSIGNED_BYTE' in scope
let GLTF_UNSIGNED_BYTE = Int(GL_UNSIGNED_BYTE)
^~~~~~~~~~~~~~~~
/Users/admin/builder/spi-builder-workspace/.dependencies/checkouts/GLTFSceneKit/Sources/GLTFSceneKit/GLTFTypes.swift:28:22: error: cannot find 'GL_SHORT' in scope
let GLTF_SHORT = Int(GL_SHORT)
^~~~~~~~
/Users/admin/builder/spi-builder-workspace/.dependencies/checkouts/GLTFSceneKit/Sources/GLTFSceneKit/GLTFTypes.swift:29:31: error: cannot find 'GL_UNSIGNED_SHORT' in scope
let GLTF_UNSIGNED_SHORT = Int(GL_UNSIGNED_SHORT)
^~~~~~~~~~~~~~~~~
/Users/admin/builder/spi-builder-workspace/.dependencies/checkouts/GLTFSceneKit/Sources/GLTFSceneKit/GLTFTypes.swift:30:29: error: cannot find 'GL_UNSIGNED_INT' in scope
let GLTF_UNSIGNED_INT = Int(GL_UNSIGNED_INT)
^~~~~~~~~~~~~~~
/Users/admin/builder/spi-builder-workspace/.dependencies/checkouts/GLTFSceneKit/Sources/GLTFSceneKit/GLTFTypes.swift:31:22: error: cannot find 'GL_FLOAT' in scope
let GLTF_FLOAT = Int(GL_FLOAT)
^~~~~~~~
/Users/admin/builder/spi-builder-workspace/.dependencies/checkouts/GLTFSceneKit/Sources/GLTFSceneKit/GLTFTypes.swift:33:29: error: cannot find 'GL_ARRAY_BUFFER' in scope
let GLTF_ARRAY_BUFFER = Int(GL_ARRAY_BUFFER)
^~~~~~~~~~~~~~~
/Users/admin/builder/spi-builder-workspace/.dependencies/checkouts/GLTFSceneKit/Sources/GLTFSceneKit/GLTFTypes.swift:34:37: error: cannot find 'GL_ELEMENT_ARRAY_BUFFER' in scope
let GLTF_ELEMENT_ARRAY_BUFFER = Int(GL_ELEMENT_ARRAY_BUFFER)
^~~~~~~~~~~~~~~~~~~~~~~
/Users/admin/builder/spi-builder-workspace/.dependencies/checkouts/GLTFSceneKit/Sources/GLTFSceneKit/GLTFTypes.swift:36:23: error: cannot find 'GL_POINTS' in scope
let GLTF_POINTS = Int(GL_POINTS)
^~~~~~~~~
/Users/admin/builder/spi-builder-workspace/.dependencies/checkouts/GLTFSceneKit/Sources/GLTFSceneKit/GLTFTypes.swift:37:22: error: cannot find 'GL_LINES' in scope
let GLTF_LINES = Int(GL_LINES)
^~~~~~~~
/Users/admin/builder/spi-builder-workspace/.dependencies/checkouts/GLTFSceneKit/Sources/GLTFSceneKit/GLTFTypes.swift:38:26: error: cannot find 'GL_LINE_LOOP' in scope
let GLTF_LINE_LOOP = Int(GL_LINE_LOOP)
^~~~~~~~~~~~
/Users/admin/builder/spi-builder-workspace/.dependencies/checkouts/GLTFSceneKit/Sources/GLTFSceneKit/GLTFTypes.swift:39:27: error: cannot find 'GL_LINE_STRIP' in scope
let GLTF_LINE_STRIP = Int(GL_LINE_STRIP)
^~~~~~~~~~~~~
/Users/admin/builder/spi-builder-workspace/.dependencies/checkouts/GLTFSceneKit/Sources/GLTFSceneKit/GLTFTypes.swift:40:26: error: cannot find 'GL_TRIANGLES' in scope
let GLTF_TRIANGLES = Int(GL_TRIANGLES)
^~~~~~~~~~~~
/Users/admin/builder/spi-builder-workspace/.dependencies/checkouts/GLTFSceneKit/Sources/GLTFSceneKit/GLTFTypes.swift:41:31: error: cannot find 'GL_TRIANGLE_STRIP' in scope
let GLTF_TRIANGLE_STRIP = Int(GL_TRIANGLE_STRIP)
^~~~~~~~~~~~~~~~~
/Users/admin/builder/spi-builder-workspace/.dependencies/checkouts/GLTFSceneKit/Sources/GLTFSceneKit/GLTFTypes.swift:42:29: error: cannot find 'GL_TRIANGLE_FAN' in scope
let GLTF_TRIANGLE_FAN = Int(GL_TRIANGLE_FAN)
^~~~~~~~~~~~~~~
/Users/admin/builder/spi-builder-workspace/.dependencies/checkouts/GLTFSceneKit/Sources/GLTFSceneKit/GLTFTypes.swift:44:24: error: cannot find 'GL_NEAREST' in scope
let GLTF_NEAREST = Int(GL_NEAREST)
^~~~~~~~~~
/Users/admin/builder/spi-builder-workspace/.dependencies/checkouts/GLTFSceneKit/Sources/GLTFSceneKit/GLTFTypes.swift:45:23: error: cannot find 'GL_LINEAR' in scope
let GLTF_LINEAR = Int(GL_LINEAR)
^~~~~~~~~
/Users/admin/builder/spi-builder-workspace/.dependencies/checkouts/GLTFSceneKit/Sources/GLTFSceneKit/GLTFTypes.swift:46:39: error: cannot find 'GL_NEAREST_MIPMAP_NEAREST' in scope
let GLTF_NEAREST_MIPMAP_NEAREST = Int(GL_NEAREST_MIPMAP_NEAREST)
^~~~~~~~~~~~~~~~~~~~~~~~~
/Users/admin/builder/spi-builder-workspace/.dependencies/checkouts/GLTFSceneKit/Sources/GLTFSceneKit/GLTFTypes.swift:47:38: error: cannot find 'GL_LINEAR_MIPMAP_NEAREST' in scope
let GLTF_LINEAR_MIPMAP_NEAREST = Int(GL_LINEAR_MIPMAP_NEAREST)
^~~~~~~~~~~~~~~~~~~~~~~~
/Users/admin/builder/spi-builder-workspace/.dependencies/checkouts/GLTFSceneKit/Sources/GLTFSceneKit/GLTFTypes.swift:48:38: error: cannot find 'GL_NEAREST_MIPMAP_LINEAR' in scope
let GLTF_NEAREST_MIPMAP_LINEAR = Int(GL_NEAREST_MIPMAP_LINEAR)
^~~~~~~~~~~~~~~~~~~~~~~~
/Users/admin/builder/spi-builder-workspace/.dependencies/checkouts/GLTFSceneKit/Sources/GLTFSceneKit/GLTFTypes.swift:49:37: error: cannot find 'GL_LINEAR_MIPMAP_LINEAR' in scope
let GLTF_LINEAR_MIPMAP_LINEAR = Int(GL_LINEAR_MIPMAP_LINEAR)
^~~~~~~~~~~~~~~~~~~~~~~
/Users/admin/builder/spi-builder-workspace/.dependencies/checkouts/GLTFSceneKit/Sources/GLTFSceneKit/GLTFTypes.swift:51:30: error: cannot find 'GL_CLAMP_TO_EDGE' in scope
let GLTF_CLAMP_TO_EDGE = Int(GL_CLAMP_TO_EDGE)
^~~~~~~~~~~~~~~~
/Users/admin/builder/spi-builder-workspace/.dependencies/checkouts/GLTFSceneKit/Sources/GLTFSceneKit/GLTFTypes.swift:52:32: error: cannot find 'GL_MIRRORED_REPEAT' in scope
let GLTF_MIRRORED_REPEAT = Int(GL_MIRRORED_REPEAT)
^~~~~~~~~~~~~~~~~~
/Users/admin/builder/spi-builder-workspace/.dependencies/checkouts/GLTFSceneKit/Sources/GLTFSceneKit/GLTFTypes.swift:53:23: error: cannot find 'GL_REPEAT' in scope
let GLTF_REPEAT = Int(GL_REPEAT)
^~~~~~~~~
/Users/admin/builder/spi-builder-workspace/.dependencies/checkouts/GLTFSceneKit/Sources/GLTFSceneKit/GLTFTypes.swift:113:23: error: cannot find type 'UIColor' in scope
typealias Color = UIColor
^~~~~~~
/Users/admin/builder/spi-builder-workspace/.dependencies/checkouts/GLTFSceneKit/Sources/GLTFSceneKit/GLTFUnarchiver.swift:30:39: error: 'CAAnimation' is unavailable in watchOS
internal var animationChannels: [[CAAnimation?]?] = []
^~~~~~~~~~~
/Applications/Xcode-16.3.0.app/Contents/Developer/Platforms/WatchOS.platform/Developer/SDKs/WatchOS11.4.sdk/System/Library/Frameworks/QuartzCore.framework/Headers/CAAnimation.h:25:12: note: 'CAAnimation' has been explicitly marked unavailable here
@interface CAAnimation : NSObject
^
/Users/admin/builder/spi-builder-workspace/.dependencies/checkouts/GLTFSceneKit/Sources/GLTFSceneKit/GLTFUnarchiver.swift:31:39: error: 'CAAnimation' is unavailable in watchOS
internal var animationSamplers: [[CAAnimation?]?] = []
^~~~~~~~~~~
/Applications/Xcode-16.3.0.app/Contents/Developer/Platforms/WatchOS.platform/Developer/SDKs/WatchOS11.4.sdk/System/Library/Frameworks/QuartzCore.framework/Headers/CAAnimation.h:25:12: note: 'CAAnimation' has been explicitly marked unavailable here
@interface CAAnimation : NSObject
^
/Users/admin/builder/spi-builder-workspace/.dependencies/checkouts/GLTFSceneKit/Sources/GLTFSceneKit/GLTFUnarchiver.swift:1214:96: error: 'CAAnimationGroup' is unavailable in watchOS
private func loadAnimationSampler(index: Int, sampler: Int, flipW: Bool = false) throws -> CAAnimationGroup {
^~~~~~~~~~~~~~~~
/Applications/Xcode-16.3.0.app/Contents/Developer/Platforms/WatchOS.platform/Developer/SDKs/WatchOS11.4.sdk/System/Library/Frameworks/QuartzCore.framework/Headers/CAAnimation.h:384:12: note: 'CAAnimationGroup' has been explicitly marked unavailable here
@interface CAAnimationGroup : CAAnimation
^
/Users/admin/builder/spi-builder-workspace/.dependencies/checkouts/GLTFSceneKit/Sources/GLTFSceneKit/GLTFUnarchiver.swift:1266:99: error: 'CAAnimationGroup' is unavailable in watchOS
private func loadWeightAnimationsSampler(index: Int, sampler: Int, paths: [String]) throws -> CAAnimationGroup {
^~~~~~~~~~~~~~~~
/Applications/Xcode-16.3.0.app/Contents/Developer/Platforms/WatchOS.platform/Developer/SDKs/WatchOS11.4.sdk/System/Library/Frameworks/QuartzCore.framework/Headers/CAAnimation.h:384:12: note: 'CAAnimationGroup' has been explicitly marked unavailable here
@interface CAAnimationGroup : CAAnimation
^
/Users/admin/builder/spi-builder-workspace/.dependencies/checkouts/GLTFSceneKit/Sources/GLTFSceneKit/GLTFUnarchiver.swift:1331:92: error: 'CAAnimation' is unavailable in watchOS
private func loadAnimation(index: Int, channel: Int, weightPaths: [String]?) throws -> CAAnimation {
^~~~~~~~~~~
/Applications/Xcode-16.3.0.app/Contents/Developer/Platforms/WatchOS.platform/Developer/SDKs/WatchOS11.4.sdk/System/Library/Frameworks/QuartzCore.framework/Headers/CAAnimation.h:25:12: note: 'CAAnimation' has been explicitly marked unavailable here
@interface CAAnimation : NSObject
^
SwiftEmitModule normal armv7k Emitting\ module\ for\ GLTFSceneKit (in target 'GLTFSceneKit' from project 'GLTFSceneKit')
Command SwiftEmitModule failed with a nonzero exit code
** BUILD FAILED **
The following build commands failed:
SwiftEmitModule normal arm64 Emitting\ module\ for\ GLTFSceneKit (in target 'GLTFSceneKit' from project 'GLTFSceneKit')
EmitSwiftModule normal arm64 (in target 'GLTFSceneKit' from project 'GLTFSceneKit')
SwiftEmitModule normal armv7k Emitting\ module\ for\ GLTFSceneKit (in target 'GLTFSceneKit' from project 'GLTFSceneKit')
Building workspace spi-builder-workspace with scheme Model3DView
(4 failures)
Command line invocation:
/Applications/Xcode-16.3.0.app/Contents/Developer/usr/bin/xcodebuild -IDEClonedSourcePackagesDirPathOverride=/Users/admin/builder/spi-builder-workspace/.dependencies -resolvePackageDependencies
Resolve Package Graph
Resolved source packages:
DisplayLink: https://github.com/timdonnelly/DisplayLink @ 0.2.0
GLTFSceneKit: https://github.com/frzi/GLTFSceneKit @ 0.4.1
Model3DView: /Users/admin/builder/spi-builder-workspace
resolved source packages: DisplayLink, GLTFSceneKit, Model3DView
{
"dependencies" : [
{
"identity" : "gltfscenekit",
"requirement" : {
"range" : [
{
"lower_bound" : "0.3.1",
"upper_bound" : "1.0.0"
}
]
},
"type" : "sourceControl",
"url" : "https://github.com/frzi/GLTFSceneKit"
},
{
"identity" : "displaylink",
"requirement" : {
"range" : [
{
"lower_bound" : "0.2.0",
"upper_bound" : "1.0.0"
}
]
},
"type" : "sourceControl",
"url" : "https://github.com/timdonnelly/DisplayLink"
}
],
"manifest_display_name" : "Model3DView",
"name" : "Model3DView",
"path" : "/Users/admin/builder/spi-builder-workspace",
"platforms" : [
{
"name" : "macos",
"version" : "11.0"
},
{
"name" : "ios",
"version" : "14.0"
},
{
"name" : "tvos",
"version" : "14.0"
}
],
"products" : [
{
"name" : "Model3DView",
"targets" : [
"Model3DView"
],
"type" : {
"library" : [
"automatic"
]
}
}
],
"targets" : [
{
"c99name" : "Model3DViewTests",
"module_type" : "SwiftTarget",
"name" : "Model3DViewTests",
"path" : "Tests/Model3DViewTests",
"sources" : [
"Model3DViewTests.swift"
],
"target_dependencies" : [
"Model3DView"
],
"type" : "test"
},
{
"c99name" : "Model3DView",
"module_type" : "SwiftTarget",
"name" : "Model3DView",
"path" : "Sources/Model3DView",
"product_dependencies" : [
"GLTFSceneKit",
"DisplayLink"
],
"product_memberships" : [
"Model3DView"
],
"sources" : [
"Camera/CameraControls.swift",
"Camera/Cameras.swift",
"EnvironmentValues.swift",
"Model3DView.swift",
"Transform3D.swift",
"Types.swift",
"Utils/Euler.swift",
"Utils/Math.swift",
"Utils/ResourcesCache.swift",
"View+Modifiers.swift"
],
"type" : "library"
}
],
"tools_version" : "5.5"
}
{
"workspace" : {
"name" : "spi-builder-workspace",
"schemes" : [
"Model3DView"
]
}
}
Running build ...
env DEVELOPER_DIR=/Applications/Xcode-16.3.0.app xcrun xcodebuild -IDEClonedSourcePackagesDirPathOverride=$PWD/.dependencies -skipMacroValidation -skipPackagePluginValidation -derivedDataPath $PWD/.derivedData build -scheme Model3DView -destination generic/platform=watchOS
Command line invocation:
/Applications/Xcode-16.3.0.app/Contents/Developer/usr/bin/xcodebuild -IDEClonedSourcePackagesDirPathOverride=/Users/admin/builder/spi-builder-workspace/.dependencies -skipMacroValidation -skipPackagePluginValidation -derivedDataPath /Users/admin/builder/spi-builder-workspace/.derivedData build -scheme Model3DView -destination generic/platform=watchOS
Resolve Package Graph
Resolved source packages:
GLTFSceneKit: https://github.com/frzi/GLTFSceneKit @ 0.4.1
Model3DView: /Users/admin/builder/spi-builder-workspace
DisplayLink: https://github.com/timdonnelly/DisplayLink @ 0.2.0
ComputePackagePrebuildTargetDependencyGraph
Prepare packages
CreateBuildRequest
SendProjectDescription
CreateBuildOperation
ComputeTargetDependencyGraph
note: Building targets in dependency order
note: Target dependency graph (7 targets)
Target 'Model3DView' in project 'Model3DView'
➜ Explicit dependency on target 'Model3DView' in project 'Model3DView'
➜ Explicit dependency on target 'GLTFSceneKit' in project 'GLTFSceneKit'
➜ Explicit dependency on target 'DisplayLink' in project 'DisplayLink'
Target 'Model3DView' in project 'Model3DView'
➜ Explicit dependency on target 'GLTFSceneKit' in project 'GLTFSceneKit'
➜ Explicit dependency on target 'DisplayLink' in project 'DisplayLink'
Target 'DisplayLink' in project 'DisplayLink'
➜ Explicit dependency on target 'DisplayLink' in project 'DisplayLink'
Target 'DisplayLink' in project 'DisplayLink' (no dependencies)
Target 'GLTFSceneKit' in project 'GLTFSceneKit'
➜ Explicit dependency on target 'GLTFSceneKit' in project 'GLTFSceneKit'
➜ Explicit dependency on target 'GLTFSceneKit_GLTFSceneKit' in project 'GLTFSceneKit'
Target 'GLTFSceneKit' in project 'GLTFSceneKit'
➜ Explicit dependency on target 'GLTFSceneKit_GLTFSceneKit' in project 'GLTFSceneKit'
Target 'GLTFSceneKit_GLTFSceneKit' in project 'GLTFSceneKit' (no dependencies)
GatherProvisioningInputs
CreateBuildDescription
ExecuteExternalTool /Applications/Xcode-16.3.0.app/Contents/Developer/Toolchains/XcodeDefault.xctoolchain/usr/bin/swiftc --version
ExecuteExternalTool /Applications/Xcode-16.3.0.app/Contents/Developer/Toolchains/XcodeDefault.xctoolchain/usr/bin/clang -v -E -dM -isysroot /Applications/Xcode-16.3.0.app/Contents/Developer/Platforms/WatchOS.platform/Developer/SDKs/WatchOS11.4.sdk -x c -c /dev/null
ExecuteExternalTool /Applications/Xcode-16.3.0.app/Contents/Developer/Toolchains/XcodeDefault.xctoolchain/usr/bin/ld -version_details
ReadFileContents /Applications/Xcode-16.3.0.app/Contents/Developer/Toolchains/XcodeDefault.xctoolchain/usr/share/docc/features.json
Build description signature: d0c0ed925c2a5b84f4d9821198c2688f
Build description path: /Users/admin/builder/spi-builder-workspace/.derivedData/Build/Intermediates.noindex/XCBuildData/d0c0ed925c2a5b84f4d9821198c2688f.xcbuilddata
ClangStatCache /Applications/Xcode-16.3.0.app/Contents/Developer/Toolchains/XcodeDefault.xctoolchain/usr/bin/clang-stat-cache /Applications/Xcode-16.3.0.app/Contents/Developer/Platforms/WatchOS.platform/Developer/SDKs/WatchOS11.4.sdk /Users/admin/builder/spi-builder-workspace/.derivedData/SDKStatCaches.noindex/watchos11.4-22T246-43efb940ff07ba2497b70ec94253f576.sdkstatcache
cd /Users/admin/builder/spi-builder-workspace/.swiftpm/xcode
/Applications/Xcode-16.3.0.app/Contents/Developer/Toolchains/XcodeDefault.xctoolchain/usr/bin/clang-stat-cache /Applications/Xcode-16.3.0.app/Contents/Developer/Platforms/WatchOS.platform/Developer/SDKs/WatchOS11.4.sdk -o /Users/admin/builder/spi-builder-workspace/.derivedData/SDKStatCaches.noindex/watchos11.4-22T246-43efb940ff07ba2497b70ec94253f576.sdkstatcache
ProcessInfoPlistFile /Users/admin/builder/spi-builder-workspace/.derivedData/Build/Products/Debug-watchos/GLTFSceneKit_GLTFSceneKit.bundle/Info.plist /Users/admin/builder/spi-builder-workspace/.derivedData/Build/Intermediates.noindex/GLTFSceneKit.build/Debug-watchos/GLTFSceneKit_GLTFSceneKit.build/empty-GLTFSceneKit_GLTFSceneKit.plist (in target 'GLTFSceneKit_GLTFSceneKit' from project 'GLTFSceneKit')
cd /Users/admin/builder/spi-builder-workspace/.dependencies/checkouts/GLTFSceneKit
builtin-infoPlistUtility /Users/admin/builder/spi-builder-workspace/.derivedData/Build/Intermediates.noindex/GLTFSceneKit.build/Debug-watchos/GLTFSceneKit_GLTFSceneKit.build/empty-GLTFSceneKit_GLTFSceneKit.plist -producttype com.apple.product-type.bundle -expandbuildsettings -format binary -platform watchos -o /Users/admin/builder/spi-builder-workspace/.derivedData/Build/Products/Debug-watchos/GLTFSceneKit_GLTFSceneKit.bundle/Info.plist
SwiftDriver GLTFSceneKit normal arm64_32 com.apple.xcode.tools.swift.compiler (in target 'GLTFSceneKit' from project 'GLTFSceneKit')
cd /Users/admin/builder/spi-builder-workspace/.swiftpm/xcode
builtin-SwiftDriver -- /Applications/Xcode-16.3.0.app/Contents/Developer/Toolchains/XcodeDefault.xctoolchain/usr/bin/swiftc -module-name GLTFSceneKit -Onone -enforce-exclusivity\=checked @/Users/admin/builder/spi-builder-workspace/.derivedData/Build/Intermediates.noindex/GLTFSceneKit.build/Debug-watchos/GLTFSceneKit.build/Objects-normal/arm64_32/GLTFSceneKit.SwiftFileList -DSWIFT_PACKAGE -DDEBUG -DXcode -plugin-path /Applications/Xcode-16.3.0.app/Contents/Developer/Toolchains/XcodeDefault.xctoolchain/usr/lib/swift/host/plugins/testing -enable-experimental-feature DebugDescriptionMacro -sdk /Applications/Xcode-16.3.0.app/Contents/Developer/Platforms/WatchOS.platform/Developer/SDKs/WatchOS11.4.sdk -target arm64_32-apple-watchos5.0 -g -module-cache-path /Users/admin/builder/spi-builder-workspace/.derivedData/ModuleCache.noindex -Xfrontend -serialize-debugging-options -profile-coverage-mapping -profile-generate -enable-testing -suppress-warnings -index-store-path /Users/admin/builder/spi-builder-workspace/.derivedData/Index.noindex/DataStore -swift-version 5 -I /Users/admin/builder/spi-builder-workspace/.derivedData/Build/Products/Debug-watchos -I /Applications/Xcode-16.3.0.app/Contents/Developer/Platforms/WatchOS.platform/Developer/usr/lib -F /Users/admin/builder/spi-builder-workspace/.derivedData/Build/Products/Debug-watchos -F /Applications/Xcode-16.3.0.app/Contents/Developer/Platforms/WatchOS.platform/Developer/Library/Frameworks -F /Applications/Xcode-16.3.0.app/Contents/Developer/Platforms/WatchOS.platform/Developer/SDKs/WatchOS11.4.sdk/Developer/Library/Frameworks -c -j10 -enable-batch-mode -incremental -Xcc -ivfsstatcache -Xcc /Users/admin/builder/spi-builder-workspace/.derivedData/SDKStatCaches.noindex/watchos11.4-22T246-43efb940ff07ba2497b70ec94253f576.sdkstatcache -output-file-map /Users/admin/builder/spi-builder-workspace/.derivedData/Build/Intermediates.noindex/GLTFSceneKit.build/Debug-watchos/GLTFSceneKit.build/Objects-normal/arm64_32/GLTFSceneKit-OutputFileMap.json -use-frontend-parseable-output -save-temps -no-color-diagnostics -serialize-diagnostics -emit-dependencies -emit-module -emit-module-path /Users/admin/builder/spi-builder-workspace/.derivedData/Build/Intermediates.noindex/GLTFSceneKit.build/Debug-watchos/GLTFSceneKit.build/Objects-normal/arm64_32/GLTFSceneKit.swiftmodule -validate-clang-modules-once -clang-build-session-file /Users/admin/builder/spi-builder-workspace/.derivedData/ModuleCache.noindex/Session.modulevalidation -Xcc -I/Users/admin/builder/spi-builder-workspace/.derivedData/Build/Intermediates.noindex/GLTFSceneKit.build/Debug-watchos/GLTFSceneKit.build/swift-overrides.hmap -emit-const-values -Xfrontend -const-gather-protocols-file -Xfrontend /Users/admin/builder/spi-builder-workspace/.derivedData/Build/Intermediates.noindex/GLTFSceneKit.build/Debug-watchos/GLTFSceneKit.build/Objects-normal/arm64_32/GLTFSceneKit_const_extract_protocols.json -Xcc -I/Users/admin/builder/spi-builder-workspace/.derivedData/Build/Products/Debug-watchos/include -Xcc -I/Users/admin/builder/spi-builder-workspace/.derivedData/Build/Intermediates.noindex/GLTFSceneKit.build/Debug-watchos/GLTFSceneKit.build/DerivedSources-normal/arm64_32 -Xcc -I/Users/admin/builder/spi-builder-workspace/.derivedData/Build/Intermediates.noindex/GLTFSceneKit.build/Debug-watchos/GLTFSceneKit.build/DerivedSources/arm64_32 -Xcc -I/Users/admin/builder/spi-builder-workspace/.derivedData/Build/Intermediates.noindex/GLTFSceneKit.build/Debug-watchos/GLTFSceneKit.build/DerivedSources -Xcc -DSWIFT_PACKAGE -Xcc -DDEBUG\=1 -emit-objc-header -emit-objc-header-path /Users/admin/builder/spi-builder-workspace/.derivedData/Build/Intermediates.noindex/GLTFSceneKit.build/Debug-watchos/GLTFSceneKit.build/Objects-normal/arm64_32/GLTFSceneKit-Swift.h -working-directory /Users/admin/builder/spi-builder-workspace/.swiftpm/xcode -experimental-emit-module-separately -disable-cmo
SwiftDriver GLTFSceneKit normal arm64 com.apple.xcode.tools.swift.compiler (in target 'GLTFSceneKit' from project 'GLTFSceneKit')
cd /Users/admin/builder/spi-builder-workspace/.swiftpm/xcode
builtin-SwiftDriver -- /Applications/Xcode-16.3.0.app/Contents/Developer/Toolchains/XcodeDefault.xctoolchain/usr/bin/swiftc -module-name GLTFSceneKit -Onone -enforce-exclusivity\=checked @/Users/admin/builder/spi-builder-workspace/.derivedData/Build/Intermediates.noindex/GLTFSceneKit.build/Debug-watchos/GLTFSceneKit.build/Objects-normal/arm64/GLTFSceneKit.SwiftFileList -DSWIFT_PACKAGE -DDEBUG -DXcode -plugin-path /Applications/Xcode-16.3.0.app/Contents/Developer/Toolchains/XcodeDefault.xctoolchain/usr/lib/swift/host/plugins/testing -enable-experimental-feature DebugDescriptionMacro -sdk /Applications/Xcode-16.3.0.app/Contents/Developer/Platforms/WatchOS.platform/Developer/SDKs/WatchOS11.4.sdk -target arm64-apple-watchos5.0 -g -module-cache-path /Users/admin/builder/spi-builder-workspace/.derivedData/ModuleCache.noindex -Xfrontend -serialize-debugging-options -profile-coverage-mapping -profile-generate -enable-testing -suppress-warnings -index-store-path /Users/admin/builder/spi-builder-workspace/.derivedData/Index.noindex/DataStore -swift-version 5 -I /Users/admin/builder/spi-builder-workspace/.derivedData/Build/Products/Debug-watchos -I /Applications/Xcode-16.3.0.app/Contents/Developer/Platforms/WatchOS.platform/Developer/usr/lib -F /Users/admin/builder/spi-builder-workspace/.derivedData/Build/Products/Debug-watchos -F /Applications/Xcode-16.3.0.app/Contents/Developer/Platforms/WatchOS.platform/Developer/Library/Frameworks -F /Applications/Xcode-16.3.0.app/Contents/Developer/Platforms/WatchOS.platform/Developer/SDKs/WatchOS11.4.sdk/Developer/Library/Frameworks -c -j10 -enable-batch-mode -incremental -Xcc -ivfsstatcache -Xcc /Users/admin/builder/spi-builder-workspace/.derivedData/SDKStatCaches.noindex/watchos11.4-22T246-43efb940ff07ba2497b70ec94253f576.sdkstatcache -output-file-map /Users/admin/builder/spi-builder-workspace/.derivedData/Build/Intermediates.noindex/GLTFSceneKit.build/Debug-watchos/GLTFSceneKit.build/Objects-normal/arm64/GLTFSceneKit-OutputFileMap.json -use-frontend-parseable-output -save-temps -no-color-diagnostics -serialize-diagnostics -emit-dependencies -emit-module -emit-module-path /Users/admin/builder/spi-builder-workspace/.derivedData/Build/Intermediates.noindex/GLTFSceneKit.build/Debug-watchos/GLTFSceneKit.build/Objects-normal/arm64/GLTFSceneKit.swiftmodule -validate-clang-modules-once -clang-build-session-file /Users/admin/builder/spi-builder-workspace/.derivedData/ModuleCache.noindex/Session.modulevalidation -Xcc -I/Users/admin/builder/spi-builder-workspace/.derivedData/Build/Intermediates.noindex/GLTFSceneKit.build/Debug-watchos/GLTFSceneKit.build/swift-overrides.hmap -emit-const-values -Xfrontend -const-gather-protocols-file -Xfrontend /Users/admin/builder/spi-builder-workspace/.derivedData/Build/Intermediates.noindex/GLTFSceneKit.build/Debug-watchos/GLTFSceneKit.build/Objects-normal/arm64/GLTFSceneKit_const_extract_protocols.json -Xcc -I/Users/admin/builder/spi-builder-workspace/.derivedData/Build/Products/Debug-watchos/include -Xcc -I/Users/admin/builder/spi-builder-workspace/.derivedData/Build/Intermediates.noindex/GLTFSceneKit.build/Debug-watchos/GLTFSceneKit.build/DerivedSources-normal/arm64 -Xcc -I/Users/admin/builder/spi-builder-workspace/.derivedData/Build/Intermediates.noindex/GLTFSceneKit.build/Debug-watchos/GLTFSceneKit.build/DerivedSources/arm64 -Xcc -I/Users/admin/builder/spi-builder-workspace/.derivedData/Build/Intermediates.noindex/GLTFSceneKit.build/Debug-watchos/GLTFSceneKit.build/DerivedSources -Xcc -DSWIFT_PACKAGE -Xcc -DDEBUG\=1 -emit-objc-header -emit-objc-header-path /Users/admin/builder/spi-builder-workspace/.derivedData/Build/Intermediates.noindex/GLTFSceneKit.build/Debug-watchos/GLTFSceneKit.build/Objects-normal/arm64/GLTFSceneKit-Swift.h -working-directory /Users/admin/builder/spi-builder-workspace/.swiftpm/xcode -experimental-emit-module-separately -disable-cmo
SwiftDriver DisplayLink normal arm64 com.apple.xcode.tools.swift.compiler (in target 'DisplayLink' from project 'DisplayLink')
cd /Users/admin/builder/spi-builder-workspace/.swiftpm/xcode
builtin-SwiftDriver -- /Applications/Xcode-16.3.0.app/Contents/Developer/Toolchains/XcodeDefault.xctoolchain/usr/bin/swiftc -module-name DisplayLink -Onone -enforce-exclusivity\=checked @/Users/admin/builder/spi-builder-workspace/.derivedData/Build/Intermediates.noindex/DisplayLink.build/Debug-watchos/DisplayLink.build/Objects-normal/arm64/DisplayLink.SwiftFileList -DSWIFT_PACKAGE -DDEBUG -DXcode -plugin-path /Applications/Xcode-16.3.0.app/Contents/Developer/Toolchains/XcodeDefault.xctoolchain/usr/lib/swift/host/plugins/testing -enable-experimental-feature DebugDescriptionMacro -sdk /Applications/Xcode-16.3.0.app/Contents/Developer/Platforms/WatchOS.platform/Developer/SDKs/WatchOS11.4.sdk -target arm64-apple-watchos6.0 -g -module-cache-path /Users/admin/builder/spi-builder-workspace/.derivedData/ModuleCache.noindex -Xfrontend -serialize-debugging-options -profile-coverage-mapping -profile-generate -enable-testing -suppress-warnings -index-store-path /Users/admin/builder/spi-builder-workspace/.derivedData/Index.noindex/DataStore -swift-version 5 -I /Users/admin/builder/spi-builder-workspace/.derivedData/Build/Products/Debug-watchos -I /Applications/Xcode-16.3.0.app/Contents/Developer/Platforms/WatchOS.platform/Developer/usr/lib -F /Users/admin/builder/spi-builder-workspace/.derivedData/Build/Products/Debug-watchos -F /Applications/Xcode-16.3.0.app/Contents/Developer/Platforms/WatchOS.platform/Developer/Library/Frameworks -F /Applications/Xcode-16.3.0.app/Contents/Developer/Platforms/WatchOS.platform/Developer/SDKs/WatchOS11.4.sdk/Developer/Library/Frameworks -c -j10 -enable-batch-mode -incremental -Xcc -ivfsstatcache -Xcc /Users/admin/builder/spi-builder-workspace/.derivedData/SDKStatCaches.noindex/watchos11.4-22T246-43efb940ff07ba2497b70ec94253f576.sdkstatcache -output-file-map /Users/admin/builder/spi-builder-workspace/.derivedData/Build/Intermediates.noindex/DisplayLink.build/Debug-watchos/DisplayLink.build/Objects-normal/arm64/DisplayLink-OutputFileMap.json -use-frontend-parseable-output -save-temps -no-color-diagnostics -serialize-diagnostics -emit-dependencies -emit-module -emit-module-path /Users/admin/builder/spi-builder-workspace/.derivedData/Build/Intermediates.noindex/DisplayLink.build/Debug-watchos/DisplayLink.build/Objects-normal/arm64/DisplayLink.swiftmodule -validate-clang-modules-once -clang-build-session-file /Users/admin/builder/spi-builder-workspace/.derivedData/ModuleCache.noindex/Session.modulevalidation -Xcc -I/Users/admin/builder/spi-builder-workspace/.derivedData/Build/Intermediates.noindex/DisplayLink.build/Debug-watchos/DisplayLink.build/swift-overrides.hmap -emit-const-values -Xfrontend -const-gather-protocols-file -Xfrontend /Users/admin/builder/spi-builder-workspace/.derivedData/Build/Intermediates.noindex/DisplayLink.build/Debug-watchos/DisplayLink.build/Objects-normal/arm64/DisplayLink_const_extract_protocols.json -Xcc -I/Users/admin/builder/spi-builder-workspace/.derivedData/Build/Products/Debug-watchos/include -Xcc -I/Users/admin/builder/spi-builder-workspace/.derivedData/Build/Intermediates.noindex/DisplayLink.build/Debug-watchos/DisplayLink.build/DerivedSources-normal/arm64 -Xcc -I/Users/admin/builder/spi-builder-workspace/.derivedData/Build/Intermediates.noindex/DisplayLink.build/Debug-watchos/DisplayLink.build/DerivedSources/arm64 -Xcc -I/Users/admin/builder/spi-builder-workspace/.derivedData/Build/Intermediates.noindex/DisplayLink.build/Debug-watchos/DisplayLink.build/DerivedSources -Xcc -DSWIFT_PACKAGE -Xcc -DDEBUG\=1 -emit-objc-header -emit-objc-header-path /Users/admin/builder/spi-builder-workspace/.derivedData/Build/Intermediates.noindex/DisplayLink.build/Debug-watchos/DisplayLink.build/Objects-normal/arm64/DisplayLink-Swift.h -working-directory /Users/admin/builder/spi-builder-workspace/.swiftpm/xcode -experimental-emit-module-separately -disable-cmo
SwiftDriver DisplayLink normal arm64_32 com.apple.xcode.tools.swift.compiler (in target 'DisplayLink' from project 'DisplayLink')
cd /Users/admin/builder/spi-builder-workspace/.swiftpm/xcode
builtin-SwiftDriver -- /Applications/Xcode-16.3.0.app/Contents/Developer/Toolchains/XcodeDefault.xctoolchain/usr/bin/swiftc -module-name DisplayLink -Onone -enforce-exclusivity\=checked @/Users/admin/builder/spi-builder-workspace/.derivedData/Build/Intermediates.noindex/DisplayLink.build/Debug-watchos/DisplayLink.build/Objects-normal/arm64_32/DisplayLink.SwiftFileList -DSWIFT_PACKAGE -DDEBUG -DXcode -plugin-path /Applications/Xcode-16.3.0.app/Contents/Developer/Toolchains/XcodeDefault.xctoolchain/usr/lib/swift/host/plugins/testing -enable-experimental-feature DebugDescriptionMacro -sdk /Applications/Xcode-16.3.0.app/Contents/Developer/Platforms/WatchOS.platform/Developer/SDKs/WatchOS11.4.sdk -target arm64_32-apple-watchos6.0 -g -module-cache-path /Users/admin/builder/spi-builder-workspace/.derivedData/ModuleCache.noindex -Xfrontend -serialize-debugging-options -profile-coverage-mapping -profile-generate -enable-testing -suppress-warnings -index-store-path /Users/admin/builder/spi-builder-workspace/.derivedData/Index.noindex/DataStore -swift-version 5 -I /Users/admin/builder/spi-builder-workspace/.derivedData/Build/Products/Debug-watchos -I /Applications/Xcode-16.3.0.app/Contents/Developer/Platforms/WatchOS.platform/Developer/usr/lib -F /Users/admin/builder/spi-builder-workspace/.derivedData/Build/Products/Debug-watchos -F /Applications/Xcode-16.3.0.app/Contents/Developer/Platforms/WatchOS.platform/Developer/Library/Frameworks -F /Applications/Xcode-16.3.0.app/Contents/Developer/Platforms/WatchOS.platform/Developer/SDKs/WatchOS11.4.sdk/Developer/Library/Frameworks -c -j10 -enable-batch-mode -incremental -Xcc -ivfsstatcache -Xcc /Users/admin/builder/spi-builder-workspace/.derivedData/SDKStatCaches.noindex/watchos11.4-22T246-43efb940ff07ba2497b70ec94253f576.sdkstatcache -output-file-map /Users/admin/builder/spi-builder-workspace/.derivedData/Build/Intermediates.noindex/DisplayLink.build/Debug-watchos/DisplayLink.build/Objects-normal/arm64_32/DisplayLink-OutputFileMap.json -use-frontend-parseable-output -save-temps -no-color-diagnostics -serialize-diagnostics -emit-dependencies -emit-module -emit-module-path /Users/admin/builder/spi-builder-workspace/.derivedData/Build/Intermediates.noindex/DisplayLink.build/Debug-watchos/DisplayLink.build/Objects-normal/arm64_32/DisplayLink.swiftmodule -validate-clang-modules-once -clang-build-session-file /Users/admin/builder/spi-builder-workspace/.derivedData/ModuleCache.noindex/Session.modulevalidation -Xcc -I/Users/admin/builder/spi-builder-workspace/.derivedData/Build/Intermediates.noindex/DisplayLink.build/Debug-watchos/DisplayLink.build/swift-overrides.hmap -emit-const-values -Xfrontend -const-gather-protocols-file -Xfrontend /Users/admin/builder/spi-builder-workspace/.derivedData/Build/Intermediates.noindex/DisplayLink.build/Debug-watchos/DisplayLink.build/Objects-normal/arm64_32/DisplayLink_const_extract_protocols.json -Xcc -I/Users/admin/builder/spi-builder-workspace/.derivedData/Build/Products/Debug-watchos/include -Xcc -I/Users/admin/builder/spi-builder-workspace/.derivedData/Build/Intermediates.noindex/DisplayLink.build/Debug-watchos/DisplayLink.build/DerivedSources-normal/arm64_32 -Xcc -I/Users/admin/builder/spi-builder-workspace/.derivedData/Build/Intermediates.noindex/DisplayLink.build/Debug-watchos/DisplayLink.build/DerivedSources/arm64_32 -Xcc -I/Users/admin/builder/spi-builder-workspace/.derivedData/Build/Intermediates.noindex/DisplayLink.build/Debug-watchos/DisplayLink.build/DerivedSources -Xcc -DSWIFT_PACKAGE -Xcc -DDEBUG\=1 -emit-objc-header -emit-objc-header-path /Users/admin/builder/spi-builder-workspace/.derivedData/Build/Intermediates.noindex/DisplayLink.build/Debug-watchos/DisplayLink.build/Objects-normal/arm64_32/DisplayLink-Swift.h -working-directory /Users/admin/builder/spi-builder-workspace/.swiftpm/xcode -experimental-emit-module-separately -disable-cmo
SwiftDriver DisplayLink normal armv7k com.apple.xcode.tools.swift.compiler (in target 'DisplayLink' from project 'DisplayLink')
cd /Users/admin/builder/spi-builder-workspace/.swiftpm/xcode
builtin-SwiftDriver -- /Applications/Xcode-16.3.0.app/Contents/Developer/Toolchains/XcodeDefault.xctoolchain/usr/bin/swiftc -module-name DisplayLink -Onone -enforce-exclusivity\=checked @/Users/admin/builder/spi-builder-workspace/.derivedData/Build/Intermediates.noindex/DisplayLink.build/Debug-watchos/DisplayLink.build/Objects-normal/armv7k/DisplayLink.SwiftFileList -DSWIFT_PACKAGE -DDEBUG -DXcode -plugin-path /Applications/Xcode-16.3.0.app/Contents/Developer/Toolchains/XcodeDefault.xctoolchain/usr/lib/swift/host/plugins/testing -enable-experimental-feature DebugDescriptionMacro -sdk /Applications/Xcode-16.3.0.app/Contents/Developer/Platforms/WatchOS.platform/Developer/SDKs/WatchOS11.4.sdk -target armv7k-apple-watchos6.0 -g -module-cache-path /Users/admin/builder/spi-builder-workspace/.derivedData/ModuleCache.noindex -Xfrontend -serialize-debugging-options -profile-coverage-mapping -profile-generate -enable-testing -suppress-warnings -index-store-path /Users/admin/builder/spi-builder-workspace/.derivedData/Index.noindex/DataStore -swift-version 5 -I /Users/admin/builder/spi-builder-workspace/.derivedData/Build/Products/Debug-watchos -I /Applications/Xcode-16.3.0.app/Contents/Developer/Platforms/WatchOS.platform/Developer/usr/lib -F /Users/admin/builder/spi-builder-workspace/.derivedData/Build/Products/Debug-watchos -F /Applications/Xcode-16.3.0.app/Contents/Developer/Platforms/WatchOS.platform/Developer/Library/Frameworks -F /Applications/Xcode-16.3.0.app/Contents/Developer/Platforms/WatchOS.platform/Developer/SDKs/WatchOS11.4.sdk/Developer/Library/Frameworks -c -j10 -enable-batch-mode -incremental -Xcc -ivfsstatcache -Xcc /Users/admin/builder/spi-builder-workspace/.derivedData/SDKStatCaches.noindex/watchos11.4-22T246-43efb940ff07ba2497b70ec94253f576.sdkstatcache -output-file-map /Users/admin/builder/spi-builder-workspace/.derivedData/Build/Intermediates.noindex/DisplayLink.build/Debug-watchos/DisplayLink.build/Objects-normal/armv7k/DisplayLink-OutputFileMap.json -use-frontend-parseable-output -save-temps -no-color-diagnostics -serialize-diagnostics -emit-dependencies -emit-module -emit-module-path /Users/admin/builder/spi-builder-workspace/.derivedData/Build/Intermediates.noindex/DisplayLink.build/Debug-watchos/DisplayLink.build/Objects-normal/armv7k/DisplayLink.swiftmodule -validate-clang-modules-once -clang-build-session-file /Users/admin/builder/spi-builder-workspace/.derivedData/ModuleCache.noindex/Session.modulevalidation -Xcc -I/Users/admin/builder/spi-builder-workspace/.derivedData/Build/Intermediates.noindex/DisplayLink.build/Debug-watchos/DisplayLink.build/swift-overrides.hmap -emit-const-values -Xfrontend -const-gather-protocols-file -Xfrontend /Users/admin/builder/spi-builder-workspace/.derivedData/Build/Intermediates.noindex/DisplayLink.build/Debug-watchos/DisplayLink.build/Objects-normal/armv7k/DisplayLink_const_extract_protocols.json -Xcc -I/Users/admin/builder/spi-builder-workspace/.derivedData/Build/Products/Debug-watchos/include -Xcc -I/Users/admin/builder/spi-builder-workspace/.derivedData/Build/Intermediates.noindex/DisplayLink.build/Debug-watchos/DisplayLink.build/DerivedSources-normal/armv7k -Xcc -I/Users/admin/builder/spi-builder-workspace/.derivedData/Build/Intermediates.noindex/DisplayLink.build/Debug-watchos/DisplayLink.build/DerivedSources/armv7k -Xcc -I/Users/admin/builder/spi-builder-workspace/.derivedData/Build/Intermediates.noindex/DisplayLink.build/Debug-watchos/DisplayLink.build/DerivedSources -Xcc -DSWIFT_PACKAGE -Xcc -DDEBUG\=1 -emit-objc-header -emit-objc-header-path /Users/admin/builder/spi-builder-workspace/.derivedData/Build/Intermediates.noindex/DisplayLink.build/Debug-watchos/DisplayLink.build/Objects-normal/armv7k/DisplayLink-Swift.h -working-directory /Users/admin/builder/spi-builder-workspace/.swiftpm/xcode -experimental-emit-module-separately -disable-cmo
SwiftDriver GLTFSceneKit normal armv7k com.apple.xcode.tools.swift.compiler (in target 'GLTFSceneKit' from project 'GLTFSceneKit')
cd /Users/admin/builder/spi-builder-workspace/.swiftpm/xcode
builtin-SwiftDriver -- /Applications/Xcode-16.3.0.app/Contents/Developer/Toolchains/XcodeDefault.xctoolchain/usr/bin/swiftc -module-name GLTFSceneKit -Onone -enforce-exclusivity\=checked @/Users/admin/builder/spi-builder-workspace/.derivedData/Build/Intermediates.noindex/GLTFSceneKit.build/Debug-watchos/GLTFSceneKit.build/Objects-normal/armv7k/GLTFSceneKit.SwiftFileList -DSWIFT_PACKAGE -DDEBUG -DXcode -plugin-path /Applications/Xcode-16.3.0.app/Contents/Developer/Toolchains/XcodeDefault.xctoolchain/usr/lib/swift/host/plugins/testing -enable-experimental-feature DebugDescriptionMacro -sdk /Applications/Xcode-16.3.0.app/Contents/Developer/Platforms/WatchOS.platform/Developer/SDKs/WatchOS11.4.sdk -target armv7k-apple-watchos5.0 -g -module-cache-path /Users/admin/builder/spi-builder-workspace/.derivedData/ModuleCache.noindex -Xfrontend -serialize-debugging-options -profile-coverage-mapping -profile-generate -enable-testing -suppress-warnings -index-store-path /Users/admin/builder/spi-builder-workspace/.derivedData/Index.noindex/DataStore -swift-version 5 -I /Users/admin/builder/spi-builder-workspace/.derivedData/Build/Products/Debug-watchos -I /Applications/Xcode-16.3.0.app/Contents/Developer/Platforms/WatchOS.platform/Developer/usr/lib -F /Users/admin/builder/spi-builder-workspace/.derivedData/Build/Products/Debug-watchos -F /Applications/Xcode-16.3.0.app/Contents/Developer/Platforms/WatchOS.platform/Developer/Library/Frameworks -F /Applications/Xcode-16.3.0.app/Contents/Developer/Platforms/WatchOS.platform/Developer/SDKs/WatchOS11.4.sdk/Developer/Library/Frameworks -c -j10 -enable-batch-mode -incremental -Xcc -ivfsstatcache -Xcc /Users/admin/builder/spi-builder-workspace/.derivedData/SDKStatCaches.noindex/watchos11.4-22T246-43efb940ff07ba2497b70ec94253f576.sdkstatcache -output-file-map /Users/admin/builder/spi-builder-workspace/.derivedData/Build/Intermediates.noindex/GLTFSceneKit.build/Debug-watchos/GLTFSceneKit.build/Objects-normal/armv7k/GLTFSceneKit-OutputFileMap.json -use-frontend-parseable-output -save-temps -no-color-diagnostics -serialize-diagnostics -emit-dependencies -emit-module -emit-module-path /Users/admin/builder/spi-builder-workspace/.derivedData/Build/Intermediates.noindex/GLTFSceneKit.build/Debug-watchos/GLTFSceneKit.build/Objects-normal/armv7k/GLTFSceneKit.swiftmodule -validate-clang-modules-once -clang-build-session-file /Users/admin/builder/spi-builder-workspace/.derivedData/ModuleCache.noindex/Session.modulevalidation -Xcc -I/Users/admin/builder/spi-builder-workspace/.derivedData/Build/Intermediates.noindex/GLTFSceneKit.build/Debug-watchos/GLTFSceneKit.build/swift-overrides.hmap -emit-const-values -Xfrontend -const-gather-protocols-file -Xfrontend /Users/admin/builder/spi-builder-workspace/.derivedData/Build/Intermediates.noindex/GLTFSceneKit.build/Debug-watchos/GLTFSceneKit.build/Objects-normal/armv7k/GLTFSceneKit_const_extract_protocols.json -Xcc -I/Users/admin/builder/spi-builder-workspace/.derivedData/Build/Products/Debug-watchos/include -Xcc -I/Users/admin/builder/spi-builder-workspace/.derivedData/Build/Intermediates.noindex/GLTFSceneKit.build/Debug-watchos/GLTFSceneKit.build/DerivedSources-normal/armv7k -Xcc -I/Users/admin/builder/spi-builder-workspace/.derivedData/Build/Intermediates.noindex/GLTFSceneKit.build/Debug-watchos/GLTFSceneKit.build/DerivedSources/armv7k -Xcc -I/Users/admin/builder/spi-builder-workspace/.derivedData/Build/Intermediates.noindex/GLTFSceneKit.build/Debug-watchos/GLTFSceneKit.build/DerivedSources -Xcc -DSWIFT_PACKAGE -Xcc -DDEBUG\=1 -emit-objc-header -emit-objc-header-path /Users/admin/builder/spi-builder-workspace/.derivedData/Build/Intermediates.noindex/GLTFSceneKit.build/Debug-watchos/GLTFSceneKit.build/Objects-normal/armv7k/GLTFSceneKit-Swift.h -working-directory /Users/admin/builder/spi-builder-workspace/.swiftpm/xcode -experimental-emit-module-separately -disable-cmo
SwiftEmitModule normal arm64_32 Emitting\ module\ for\ DisplayLink (in target 'DisplayLink' from project 'DisplayLink')
EmitSwiftModule normal arm64_32 (in target 'DisplayLink' from project 'DisplayLink')
cd /Users/admin/builder/spi-builder-workspace/.swiftpm/xcode
SwiftCompile normal arm64_32 Compiling\ OnFrame.swift /Users/admin/builder/spi-builder-workspace/.dependencies/checkouts/DisplayLink/Sources/DisplayLink/OnFrame.swift (in target 'DisplayLink' from project 'DisplayLink')
SwiftCompile normal arm64_32 /Users/admin/builder/spi-builder-workspace/.dependencies/checkouts/DisplayLink/Sources/DisplayLink/OnFrame.swift (in target 'DisplayLink' from project 'DisplayLink')
cd /Users/admin/builder/spi-builder-workspace/.swiftpm/xcode
SwiftCompile normal armv7k Compiling\ DisplayLink.swift /Users/admin/builder/spi-builder-workspace/.dependencies/checkouts/DisplayLink/Sources/DisplayLink/DisplayLink.swift (in target 'DisplayLink' from project 'DisplayLink')
SwiftCompile normal armv7k /Users/admin/builder/spi-builder-workspace/.dependencies/checkouts/DisplayLink/Sources/DisplayLink/DisplayLink.swift (in target 'DisplayLink' from project 'DisplayLink')
cd /Users/admin/builder/spi-builder-workspace/.swiftpm/xcode
SwiftEmitModule normal arm64 Emitting\ module\ for\ DisplayLink (in target 'DisplayLink' from project 'DisplayLink')
EmitSwiftModule normal arm64 (in target 'DisplayLink' from project 'DisplayLink')
cd /Users/admin/builder/spi-builder-workspace/.swiftpm/xcode
SwiftEmitModule normal armv7k Emitting\ module\ for\ DisplayLink (in target 'DisplayLink' from project 'DisplayLink')
EmitSwiftModule normal armv7k (in target 'DisplayLink' from project 'DisplayLink')
cd /Users/admin/builder/spi-builder-workspace/.swiftpm/xcode
SwiftCompile normal armv7k Compiling\ OnFrame.swift /Users/admin/builder/spi-builder-workspace/.dependencies/checkouts/DisplayLink/Sources/DisplayLink/OnFrame.swift (in target 'DisplayLink' from project 'DisplayLink')
SwiftCompile normal armv7k /Users/admin/builder/spi-builder-workspace/.dependencies/checkouts/DisplayLink/Sources/DisplayLink/OnFrame.swift (in target 'DisplayLink' from project 'DisplayLink')
cd /Users/admin/builder/spi-builder-workspace/.swiftpm/xcode
SwiftCompile normal arm64_32 Compiling\ DisplayLink.swift /Users/admin/builder/spi-builder-workspace/.dependencies/checkouts/DisplayLink/Sources/DisplayLink/DisplayLink.swift (in target 'DisplayLink' from project 'DisplayLink')
SwiftCompile normal arm64_32 /Users/admin/builder/spi-builder-workspace/.dependencies/checkouts/DisplayLink/Sources/DisplayLink/DisplayLink.swift (in target 'DisplayLink' from project 'DisplayLink')
cd /Users/admin/builder/spi-builder-workspace/.swiftpm/xcode
SwiftCompile normal arm64 Compiling\ OnFrame.swift /Users/admin/builder/spi-builder-workspace/.dependencies/checkouts/DisplayLink/Sources/DisplayLink/OnFrame.swift (in target 'DisplayLink' from project 'DisplayLink')
SwiftCompile normal arm64 /Users/admin/builder/spi-builder-workspace/.dependencies/checkouts/DisplayLink/Sources/DisplayLink/OnFrame.swift (in target 'DisplayLink' from project 'DisplayLink')
cd /Users/admin/builder/spi-builder-workspace/.swiftpm/xcode
SwiftCompile normal arm64 Compiling\ DisplayLink.swift /Users/admin/builder/spi-builder-workspace/.dependencies/checkouts/DisplayLink/Sources/DisplayLink/DisplayLink.swift (in target 'DisplayLink' from project 'DisplayLink')
SwiftCompile normal arm64 /Users/admin/builder/spi-builder-workspace/.dependencies/checkouts/DisplayLink/Sources/DisplayLink/DisplayLink.swift (in target 'DisplayLink' from project 'DisplayLink')
cd /Users/admin/builder/spi-builder-workspace/.swiftpm/xcode
SwiftEmitModule normal arm64_32 Emitting\ module\ for\ GLTFSceneKit (in target 'GLTFSceneKit' from project 'GLTFSceneKit')
EmitSwiftModule normal arm64_32 (in target 'GLTFSceneKit' from project 'GLTFSceneKit')
cd /Users/admin/builder/spi-builder-workspace/.swiftpm/xcode
SwiftEmitModule normal armv7k Emitting\ module\ for\ GLTFSceneKit (in target 'GLTFSceneKit' from project 'GLTFSceneKit')
EmitSwiftModule normal armv7k (in target 'GLTFSceneKit' from project 'GLTFSceneKit')
cd /Users/admin/builder/spi-builder-workspace/.swiftpm/xcode
SwiftEmitModule normal arm64 Emitting\ module\ for\ GLTFSceneKit (in target 'GLTFSceneKit' from project 'GLTFSceneKit')
Failed frontend command:
/Applications/Xcode-16.3.0.app/Contents/Developer/Toolchains/XcodeDefault.xctoolchain/usr/bin/swift-frontend -frontend -emit-module -experimental-skip-non-inlinable-function-bodies-without-types /Users/admin/builder/spi-builder-workspace/.derivedData/Build/Intermediates.noindex/GLTFSceneKit.build/Debug-watchos/GLTFSceneKit.build/DerivedSources/resource_bundle_accessor.swift /Users/admin/builder/spi-builder-workspace/.dependencies/checkouts/GLTFSceneKit/Sources/GLTFSceneKit/GLTFErrors.swift /Users/admin/builder/spi-builder-workspace/.dependencies/checkouts/GLTFSceneKit/Sources/GLTFSceneKit/GLTFFunctions.swift /Users/admin/builder/spi-builder-workspace/.dependencies/checkouts/GLTFSceneKit/Sources/GLTFSceneKit/GLTFSceneKit+BundleFinder.swift /Users/admin/builder/spi-builder-workspace/.dependencies/checkouts/GLTFSceneKit/Sources/GLTFSceneKit/GLTFSceneSource.swift /Users/admin/builder/spi-builder-workspace/.dependencies/checkouts/GLTFSceneKit/Sources/GLTFSceneKit/GLTFTypes.swift /Users/admin/builder/spi-builder-workspace/.dependencies/checkouts/GLTFSceneKit/Sources/GLTFSceneKit/GLTFUnarchiver.swift /Users/admin/builder/spi-builder-workspace/.dependencies/checkouts/GLTFSceneKit/Sources/GLTFSceneKit/schema/GLTFAccessor.swift /Users/admin/builder/spi-builder-workspace/.dependencies/checkouts/GLTFSceneKit/Sources/GLTFSceneKit/schema/GLTFAccessorSparse.swift /Users/admin/builder/spi-builder-workspace/.dependencies/checkouts/GLTFSceneKit/Sources/GLTFSceneKit/schema/GLTFAccessorSparseIndices.swift /Users/admin/builder/spi-builder-workspace/.dependencies/checkouts/GLTFSceneKit/Sources/GLTFSceneKit/schema/GLTFAccessorSparseValues.swift /Users/admin/builder/spi-builder-workspace/.dependencies/checkouts/GLTFSceneKit/Sources/GLTFSceneKit/schema/GLTFAnimation.swift /Users/admin/builder/spi-builder-workspace/.dependencies/checkouts/GLTFSceneKit/Sources/GLTFSceneKit/schema/GLTFAnimationChannel.swift /Users/admin/builder/spi-builder-workspace/.dependencies/checkouts/GLTFSceneKit/Sources/GLTFSceneKit/schema/GLTFAnimationChannelTarget.swift /Users/admin/builder/spi-builder-workspace/.dependencies/checkouts/GLTFSceneKit/Sources/GLTFSceneKit/schema/GLTFAnimationSampler.swift /Users/admin/builder/spi-builder-workspace/.dependencies/checkouts/GLTFSceneKit/Sources/GLTFSceneKit/schema/GLTFAsset.swift /Users/admin/builder/spi-builder-workspace/.dependencies/checkouts/GLTFSceneKit/Sources/GLTFSceneKit/schema/GLTFBuffer.swift /Users/admin/builder/spi-builder-workspace/.dependencies/checkouts/GLTFSceneKit/Sources/GLTFSceneKit/schema/GLTFBufferView.swift /Users/admin/builder/spi-builder-workspace/.dependencies/checkouts/GLTFSceneKit/Sources/GLTFSceneKit/schema/GLTFCamera.swift /Users/admin/builder/spi-builder-workspace/.dependencies/checkouts/GLTFSceneKit/Sources/GLTFSceneKit/schema/GLTFCameraOrthographic.swift /Users/admin/builder/spi-builder-workspace/.dependencies/checkouts/GLTFSceneKit/Sources/GLTFSceneKit/schema/GLTFCameraPerspective.swift /Users/admin/builder/spi-builder-workspace/.dependencies/checkouts/GLTFSceneKit/Sources/GLTFSceneKit/schema/GLTFExtension.swift /Users/admin/builder/spi-builder-workspace/.dependencies/checkouts/GLTFSceneKit/Sources/GLTFSceneKit/schema/GLTFExtras.swift /Users/admin/builder/spi-builder-workspace/.dependencies/checkouts/GLTFSceneKit/Sources/GLTFSceneKit/schema/GLTFExtrasTargetNames.swift /Users/admin/builder/spi-builder-workspace/.dependencies/checkouts/GLTFSceneKit/Sources/GLTFSceneKit/schema/GLTFGlTF.swift /Users/admin/builder/spi-builder-workspace/.dependencies/checkouts/GLTFSceneKit/Sources/GLTFSceneKit/schema/GLTFGlTFChildOfRootProperty.swift /Users/admin/builder/spi-builder-workspace/.dependencies/checkouts/GLTFSceneKit/Sources/GLTFSceneKit/schema/GLTFGlTFProperty.swift /Users/admin/builder/spi-builder-workspace/.dependencies/checkouts/GLTFSceneKit/Sources/GLTFSceneKit/schema/GLTFGlTFid.swift /Users/admin/builder/spi-builder-workspace/.dependencies/checkouts/GLTFSceneKit/Sources/GLTFSceneKit/schema/GLTFImage.swift /Users/admin/builder/spi-builder-workspace/.dependencies/checkouts/GLTFSceneKit/Sources/GLTFSceneKit/schema/GLTFMaterial.swift /Users/admin/builder/spi-builder-workspace/.dependencies/checkouts/GLTFSceneKit/Sources/GLTFSceneKit/schema/GLTFMaterialNormalTextureInfo.swift /Users/admin/builder/spi-builder-workspace/.dependencies/checkouts/GLTFSceneKit/Sources/GLTFSceneKit/schema/GLTFMaterialOcclusionTextureInfo.swift /Users/admin/builder/spi-builder-workspace/.dependencies/checkouts/GLTFSceneKit/Sources/GLTFSceneKit/schema/GLTFMaterialPbrMetallicRoughness.swift /Users/admin/builder/spi-builder-workspace/.dependencies/checkouts/GLTFSceneKit/Sources/GLTFSceneKit/schema/GLTFMesh.swift /Users/admin/builder/spi-builder-workspace/.dependencies/checkouts/GLTFSceneKit/Sources/GLTFSceneKit/schema/GLTFMeshPrimitive.swift /Users/admin/builder/spi-builder-workspace/.dependencies/checkouts/GLTFSceneKit/Sources/GLTFSceneKit/schema/GLTFNode.swift /Users/admin/builder/spi-builder-workspace/.dependencies/checkouts/GLTFSceneKit/Sources/GLTFSceneKit/schema/GLTFSampler.swift /Users/admin/builder/spi-builder-workspace/.dependencies/checkouts/GLTFSceneKit/Sources/GLTFSceneKit/schema/GLTFScene.swift /Users/admin/builder/spi-builder-workspace/.dependencies/checkouts/GLTFSceneKit/Sources/GLTFSceneKit/schema/GLTFSkin.swift /Users/admin/builder/spi-builder-workspace/.dependencies/checkouts/GLTFSceneKit/Sources/GLTFSceneKit/schema/GLTFTexture.swift /Users/admin/builder/spi-builder-workspace/.dependencies/checkouts/GLTFSceneKit/Sources/GLTFSceneKit/schema/GLTFTextureInfo.swift /Users/admin/builder/spi-builder-workspace/.dependencies/checkouts/GLTFSceneKit/Sources/GLTFSceneKit/schema/extensions/ExtensionList.swift /Users/admin/builder/spi-builder-workspace/.dependencies/checkouts/GLTFSceneKit/Sources/GLTFSceneKit/schema/extensions/KHR_materials_common/GLTFKHRMaterialsCommon_GLTFKHRMaterialsCommon.swift /Users/admin/builder/spi-builder-workspace/.dependencies/checkouts/GLTFSceneKit/Sources/GLTFSceneKit/schema/extensions/KHR_materials_pbrSpecularGlossiness/GLTFKHRMaterialsPbrSpecularGlossiness_GLTFKHRMaterialsPbrSpecularGlossiness.swift /Users/admin/builder/spi-builder-workspace/.dependencies/checkouts/GLTFSceneKit/Sources/GLTFSceneKit/schema/extensions/VRM/GLTFVRM_VRM.swift /Users/admin/builder/spi-builder-workspace/.dependencies/checkouts/GLTFSceneKit/Sources/GLTFSceneKit/schema/extensions/VRM/GLTFVRM_VRMSpringBone.swift /Users/admin/builder/spi-builder-workspace/.dependencies/checkouts/GLTFSceneKit/Sources/GLTFSceneKit/schema/extensions/VRM/GLTFVRM_VRMSpringBoneLogic.swift /Users/admin/builder/spi-builder-workspace/.dependencies/checkouts/GLTFSceneKit/Sources/GLTFSceneKit/schema/extensions/VRM/GLTFVRM_VRMState.swift /Users/admin/builder/spi-builder-workspace/.dependencies/checkouts/GLTFSceneKit/Sources/GLTFSceneKit/schema/extensions/VRM/GLTFVRM_VRMTypes.swift -target arm64-apple-watchos5.0 -Xllvm -aarch64-use-tbi -enable-objc-interop -sdk /Applications/Xcode-16.3.0.app/Contents/Developer/Platforms/WatchOS.platform/Developer/SDKs/WatchOS11.4.sdk -I /Users/admin/builder/spi-builder-workspace/.derivedData/Build/Products/Debug-watchos -I /Applications/Xcode-16.3.0.app/Contents/Developer/Platforms/WatchOS.platform/Developer/usr/lib -F /Users/admin/builder/spi-builder-workspace/.derivedData/Build/Products/Debug-watchos -F /Applications/Xcode-16.3.0.app/Contents/Developer/Platforms/WatchOS.platform/Developer/Library/Frameworks -F /Applications/Xcode-16.3.0.app/Contents/Developer/Platforms/WatchOS.platform/Developer/SDKs/WatchOS11.4.sdk/Developer/Library/Frameworks -no-color-diagnostics -enable-testing -g -debug-info-format\=dwarf -dwarf-version\=4 -module-cache-path /Users/admin/builder/spi-builder-workspace/.derivedData/ModuleCache.noindex -suppress-warnings -profile-generate -profile-coverage-mapping -swift-version 5 -enforce-exclusivity\=checked -Onone -D SWIFT_PACKAGE -D DEBUG -D Xcode -serialize-debugging-options -const-gather-protocols-file /Users/admin/builder/spi-builder-workspace/.derivedData/Build/Intermediates.noindex/GLTFSceneKit.build/Debug-watchos/GLTFSceneKit.build/Objects-normal/arm64/GLTFSceneKit_const_extract_protocols.json -enable-experimental-feature DebugDescriptionMacro -empty-abi-descriptor -plugin-path /Applications/Xcode-16.3.0.app/Contents/Developer/Toolchains/XcodeDefault.xctoolchain/usr/lib/swift/host/plugins/testing -validate-clang-modules-once -clang-build-session-file /Users/admin/builder/spi-builder-workspace/.derivedData/ModuleCache.noindex/Session.modulevalidation -Xcc -working-directory -Xcc /Users/admin/builder/spi-builder-workspace/.swiftpm/xcode -resource-dir /Applications/Xcode-16.3.0.app/Contents/Developer/Toolchains/XcodeDefault.xctoolchain/usr/lib/swift -enable-anonymous-context-mangled-names -file-compilation-dir /Users/admin/builder/spi-builder-workspace/.swiftpm/xcode -Xcc -ivfsstatcache -Xcc /Users/admin/builder/spi-builder-workspace/.derivedData/SDKStatCaches.noindex/watchos11.4-22T246-43efb940ff07ba2497b70ec94253f576.sdkstatcache -Xcc -I/Users/admin/builder/spi-builder-workspace/.derivedData/Build/Intermediates.noindex/GLTFSceneKit.build/Debug-watchos/GLTFSceneKit.build/swift-overrides.hmap -Xcc -I/Users/admin/builder/spi-builder-workspace/.derivedData/Build/Products/Debug-watchos/include -Xcc -I/Users/admin/builder/spi-builder-workspace/.derivedData/Build/Intermediates.noindex/GLTFSceneKit.build/Debug-watchos/GLTFSceneKit.build/DerivedSources-normal/arm64 -Xcc -I/Users/admin/builder/spi-builder-workspace/.derivedData/Build/Intermediates.noindex/GLTFSceneKit.build/Debug-watchos/GLTFSceneKit.build/DerivedSources/arm64 -Xcc -I/Users/admin/builder/spi-builder-workspace/.derivedData/Build/Intermediates.noindex/GLTFSceneKit.build/Debug-watchos/GLTFSceneKit.build/DerivedSources -Xcc -DSWIFT_PACKAGE -Xcc -DDEBUG\=1 -module-name GLTFSceneKit -frontend-parseable-output -disable-clang-spi -target-sdk-version 11.4 -target-sdk-name watchos11.4 -external-plugin-path /Applications/Xcode-16.3.0.app/Contents/Developer/Platforms/WatchOS.platform/Developer/usr/lib/swift/host/plugins\#/Applications/Xcode-16.3.0.app/Contents/Developer/Platforms/WatchOS.platform/Developer/usr/bin/swift-plugin-server -external-plugin-path /Applications/Xcode-16.3.0.app/Contents/Developer/Platforms/WatchOS.platform/Developer/usr/local/lib/swift/host/plugins\#/Applications/Xcode-16.3.0.app/Contents/Developer/Platforms/WatchOS.platform/Developer/usr/bin/swift-plugin-server -in-process-plugin-server-path /Applications/Xcode-16.3.0.app/Contents/Developer/Toolchains/XcodeDefault.xctoolchain/usr/lib/swift/host/libSwiftInProcPluginServer.dylib -plugin-path /Applications/Xcode-16.3.0.app/Contents/Developer/Toolchains/XcodeDefault.xctoolchain/usr/lib/swift/host/plugins -plugin-path /Applications/Xcode-16.3.0.app/Contents/Developer/Toolchains/XcodeDefault.xctoolchain/usr/local/lib/swift/host/plugins -emit-module-doc-path /Users/admin/builder/spi-builder-workspace/.derivedData/Build/Intermediates.noindex/GLTFSceneKit.build/Debug-watchos/GLTFSceneKit.build/Objects-normal/arm64/GLTFSceneKit.swiftdoc -emit-module-source-info-path /Users/admin/builder/spi-builder-workspace/.derivedData/Build/Intermediates.noindex/GLTFSceneKit.build/Debug-watchos/GLTFSceneKit.build/Objects-normal/arm64/GLTFSceneKit.swiftsourceinfo -emit-objc-header-path /Users/admin/builder/spi-builder-workspace/.derivedData/Build/Intermediates.noindex/GLTFSceneKit.build/Debug-watchos/GLTFSceneKit.build/Objects-normal/arm64/GLTFSceneKit-Swift.h -serialize-diagnostics-path /Users/admin/builder/spi-builder-workspace/.derivedData/Build/Intermediates.noindex/GLTFSceneKit.build/Debug-watchos/GLTFSceneKit.build/Objects-normal/arm64/GLTFSceneKit-master-emit-module.dia -emit-dependencies-path /Users/admin/builder/spi-builder-workspace/.derivedData/Build/Intermediates.noindex/GLTFSceneKit.build/Debug-watchos/GLTFSceneKit.build/Objects-normal/arm64/GLTFSceneKit-master-emit-module.d -o /Users/admin/builder/spi-builder-workspace/.derivedData/Build/Intermediates.noindex/GLTFSceneKit.build/Debug-watchos/GLTFSceneKit.build/Objects-normal/arm64/GLTFSceneKit.swiftmodule -emit-abi-descriptor-path /Users/admin/builder/spi-builder-workspace/.derivedData/Build/Intermediates.noindex/GLTFSceneKit.build/Debug-watchos/GLTFSceneKit.build/Objects-normal/arm64/GLTFSceneKit.abi.json
EmitSwiftModule normal arm64 (in target 'GLTFSceneKit' from project 'GLTFSceneKit')
cd /Users/admin/builder/spi-builder-workspace/.swiftpm/xcode
/Users/admin/builder/spi-builder-workspace/.dependencies/checkouts/GLTFSceneKit/Sources/GLTFSceneKit/GLTFTypes.swift:112:23: error: cannot find type 'UIImage' in scope
typealias Image = UIImage
^~~~~~~
/Users/admin/builder/spi-builder-workspace/.dependencies/checkouts/GLTFSceneKit/Sources/GLTFSceneKit/GLTFTypes.swift:26:21: error: cannot find 'GL_BYTE' in scope
let GLTF_BYTE = Int(GL_BYTE)
^~~~~~~
/Users/admin/builder/spi-builder-workspace/.dependencies/checkouts/GLTFSceneKit/Sources/GLTFSceneKit/GLTFTypes.swift:27:30: error: cannot find 'GL_UNSIGNED_BYTE' in scope
let GLTF_UNSIGNED_BYTE = Int(GL_UNSIGNED_BYTE)
^~~~~~~~~~~~~~~~
/Users/admin/builder/spi-builder-workspace/.dependencies/checkouts/GLTFSceneKit/Sources/GLTFSceneKit/GLTFTypes.swift:28:22: error: cannot find 'GL_SHORT' in scope
let GLTF_SHORT = Int(GL_SHORT)
^~~~~~~~
/Users/admin/builder/spi-builder-workspace/.dependencies/checkouts/GLTFSceneKit/Sources/GLTFSceneKit/GLTFTypes.swift:29:31: error: cannot find 'GL_UNSIGNED_SHORT' in scope
let GLTF_UNSIGNED_SHORT = Int(GL_UNSIGNED_SHORT)
^~~~~~~~~~~~~~~~~
/Users/admin/builder/spi-builder-workspace/.dependencies/checkouts/GLTFSceneKit/Sources/GLTFSceneKit/GLTFTypes.swift:30:29: error: cannot find 'GL_UNSIGNED_INT' in scope
let GLTF_UNSIGNED_INT = Int(GL_UNSIGNED_INT)
^~~~~~~~~~~~~~~
/Users/admin/builder/spi-builder-workspace/.dependencies/checkouts/GLTFSceneKit/Sources/GLTFSceneKit/GLTFTypes.swift:31:22: error: cannot find 'GL_FLOAT' in scope
let GLTF_FLOAT = Int(GL_FLOAT)
^~~~~~~~
/Users/admin/builder/spi-builder-workspace/.dependencies/checkouts/GLTFSceneKit/Sources/GLTFSceneKit/GLTFTypes.swift:33:29: error: cannot find 'GL_ARRAY_BUFFER' in scope
let GLTF_ARRAY_BUFFER = Int(GL_ARRAY_BUFFER)
^~~~~~~~~~~~~~~
/Users/admin/builder/spi-builder-workspace/.dependencies/checkouts/GLTFSceneKit/Sources/GLTFSceneKit/GLTFTypes.swift:34:37: error: cannot find 'GL_ELEMENT_ARRAY_BUFFER' in scope
let GLTF_ELEMENT_ARRAY_BUFFER = Int(GL_ELEMENT_ARRAY_BUFFER)
^~~~~~~~~~~~~~~~~~~~~~~
/Users/admin/builder/spi-builder-workspace/.dependencies/checkouts/GLTFSceneKit/Sources/GLTFSceneKit/GLTFTypes.swift:36:23: error: cannot find 'GL_POINTS' in scope
let GLTF_POINTS = Int(GL_POINTS)
^~~~~~~~~
/Users/admin/builder/spi-builder-workspace/.dependencies/checkouts/GLTFSceneKit/Sources/GLTFSceneKit/GLTFTypes.swift:37:22: error: cannot find 'GL_LINES' in scope
let GLTF_LINES = Int(GL_LINES)
^~~~~~~~
/Users/admin/builder/spi-builder-workspace/.dependencies/checkouts/GLTFSceneKit/Sources/GLTFSceneKit/GLTFTypes.swift:38:26: error: cannot find 'GL_LINE_LOOP' in scope
let GLTF_LINE_LOOP = Int(GL_LINE_LOOP)
^~~~~~~~~~~~
/Users/admin/builder/spi-builder-workspace/.dependencies/checkouts/GLTFSceneKit/Sources/GLTFSceneKit/GLTFTypes.swift:39:27: error: cannot find 'GL_LINE_STRIP' in scope
let GLTF_LINE_STRIP = Int(GL_LINE_STRIP)
^~~~~~~~~~~~~
/Users/admin/builder/spi-builder-workspace/.dependencies/checkouts/GLTFSceneKit/Sources/GLTFSceneKit/GLTFTypes.swift:40:26: error: cannot find 'GL_TRIANGLES' in scope
let GLTF_TRIANGLES = Int(GL_TRIANGLES)
^~~~~~~~~~~~
/Users/admin/builder/spi-builder-workspace/.dependencies/checkouts/GLTFSceneKit/Sources/GLTFSceneKit/GLTFTypes.swift:41:31: error: cannot find 'GL_TRIANGLE_STRIP' in scope
let GLTF_TRIANGLE_STRIP = Int(GL_TRIANGLE_STRIP)
^~~~~~~~~~~~~~~~~
/Users/admin/builder/spi-builder-workspace/.dependencies/checkouts/GLTFSceneKit/Sources/GLTFSceneKit/GLTFTypes.swift:42:29: error: cannot find 'GL_TRIANGLE_FAN' in scope
let GLTF_TRIANGLE_FAN = Int(GL_TRIANGLE_FAN)
^~~~~~~~~~~~~~~
/Users/admin/builder/spi-builder-workspace/.dependencies/checkouts/GLTFSceneKit/Sources/GLTFSceneKit/GLTFTypes.swift:44:24: error: cannot find 'GL_NEAREST' in scope
let GLTF_NEAREST = Int(GL_NEAREST)
^~~~~~~~~~
/Users/admin/builder/spi-builder-workspace/.dependencies/checkouts/GLTFSceneKit/Sources/GLTFSceneKit/GLTFTypes.swift:45:23: error: cannot find 'GL_LINEAR' in scope
let GLTF_LINEAR = Int(GL_LINEAR)
^~~~~~~~~
/Users/admin/builder/spi-builder-workspace/.dependencies/checkouts/GLTFSceneKit/Sources/GLTFSceneKit/GLTFTypes.swift:46:39: error: cannot find 'GL_NEAREST_MIPMAP_NEAREST' in scope
let GLTF_NEAREST_MIPMAP_NEAREST = Int(GL_NEAREST_MIPMAP_NEAREST)
^~~~~~~~~~~~~~~~~~~~~~~~~
/Users/admin/builder/spi-builder-workspace/.dependencies/checkouts/GLTFSceneKit/Sources/GLTFSceneKit/GLTFTypes.swift:47:38: error: cannot find 'GL_LINEAR_MIPMAP_NEAREST' in scope
let GLTF_LINEAR_MIPMAP_NEAREST = Int(GL_LINEAR_MIPMAP_NEAREST)
^~~~~~~~~~~~~~~~~~~~~~~~
/Users/admin/builder/spi-builder-workspace/.dependencies/checkouts/GLTFSceneKit/Sources/GLTFSceneKit/GLTFTypes.swift:48:38: error: cannot find 'GL_NEAREST_MIPMAP_LINEAR' in scope
let GLTF_NEAREST_MIPMAP_LINEAR = Int(GL_NEAREST_MIPMAP_LINEAR)
^~~~~~~~~~~~~~~~~~~~~~~~
/Users/admin/builder/spi-builder-workspace/.dependencies/checkouts/GLTFSceneKit/Sources/GLTFSceneKit/GLTFTypes.swift:49:37: error: cannot find 'GL_LINEAR_MIPMAP_LINEAR' in scope
let GLTF_LINEAR_MIPMAP_LINEAR = Int(GL_LINEAR_MIPMAP_LINEAR)
^~~~~~~~~~~~~~~~~~~~~~~
/Users/admin/builder/spi-builder-workspace/.dependencies/checkouts/GLTFSceneKit/Sources/GLTFSceneKit/GLTFTypes.swift:51:30: error: cannot find 'GL_CLAMP_TO_EDGE' in scope
let GLTF_CLAMP_TO_EDGE = Int(GL_CLAMP_TO_EDGE)
^~~~~~~~~~~~~~~~
/Users/admin/builder/spi-builder-workspace/.dependencies/checkouts/GLTFSceneKit/Sources/GLTFSceneKit/GLTFTypes.swift:52:32: error: cannot find 'GL_MIRRORED_REPEAT' in scope
let GLTF_MIRRORED_REPEAT = Int(GL_MIRRORED_REPEAT)
^~~~~~~~~~~~~~~~~~
/Users/admin/builder/spi-builder-workspace/.dependencies/checkouts/GLTFSceneKit/Sources/GLTFSceneKit/GLTFTypes.swift:53:23: error: cannot find 'GL_REPEAT' in scope
let GLTF_REPEAT = Int(GL_REPEAT)
^~~~~~~~~
/Users/admin/builder/spi-builder-workspace/.dependencies/checkouts/GLTFSceneKit/Sources/GLTFSceneKit/GLTFTypes.swift:113:23: error: cannot find type 'UIColor' in scope
typealias Color = UIColor
^~~~~~~
/Users/admin/builder/spi-builder-workspace/.dependencies/checkouts/GLTFSceneKit/Sources/GLTFSceneKit/GLTFUnarchiver.swift:30:39: error: 'CAAnimation' is unavailable in watchOS
internal var animationChannels: [[CAAnimation?]?] = []
^~~~~~~~~~~
/Applications/Xcode-16.3.0.app/Contents/Developer/Platforms/WatchOS.platform/Developer/SDKs/WatchOS11.4.sdk/System/Library/Frameworks/QuartzCore.framework/Headers/CAAnimation.h:25:12: note: 'CAAnimation' has been explicitly marked unavailable here
@interface CAAnimation : NSObject
^
/Users/admin/builder/spi-builder-workspace/.dependencies/checkouts/GLTFSceneKit/Sources/GLTFSceneKit/GLTFUnarchiver.swift:31:39: error: 'CAAnimation' is unavailable in watchOS
internal var animationSamplers: [[CAAnimation?]?] = []
^~~~~~~~~~~
/Applications/Xcode-16.3.0.app/Contents/Developer/Platforms/WatchOS.platform/Developer/SDKs/WatchOS11.4.sdk/System/Library/Frameworks/QuartzCore.framework/Headers/CAAnimation.h:25:12: note: 'CAAnimation' has been explicitly marked unavailable here
@interface CAAnimation : NSObject
^
/Users/admin/builder/spi-builder-workspace/.dependencies/checkouts/GLTFSceneKit/Sources/GLTFSceneKit/GLTFUnarchiver.swift:1214:96: error: 'CAAnimationGroup' is unavailable in watchOS
private func loadAnimationSampler(index: Int, sampler: Int, flipW: Bool = false) throws -> CAAnimationGroup {
^~~~~~~~~~~~~~~~
/Applications/Xcode-16.3.0.app/Contents/Developer/Platforms/WatchOS.platform/Developer/SDKs/WatchOS11.4.sdk/System/Library/Frameworks/QuartzCore.framework/Headers/CAAnimation.h:384:12: note: 'CAAnimationGroup' has been explicitly marked unavailable here
@interface CAAnimationGroup : CAAnimation
^
/Users/admin/builder/spi-builder-workspace/.dependencies/checkouts/GLTFSceneKit/Sources/GLTFSceneKit/GLTFUnarchiver.swift:1266:99: error: 'CAAnimationGroup' is unavailable in watchOS
private func loadWeightAnimationsSampler(index: Int, sampler: Int, paths: [String]) throws -> CAAnimationGroup {
^~~~~~~~~~~~~~~~
/Applications/Xcode-16.3.0.app/Contents/Developer/Platforms/WatchOS.platform/Developer/SDKs/WatchOS11.4.sdk/System/Library/Frameworks/QuartzCore.framework/Headers/CAAnimation.h:384:12: note: 'CAAnimationGroup' has been explicitly marked unavailable here
@interface CAAnimationGroup : CAAnimation
^
/Users/admin/builder/spi-builder-workspace/.dependencies/checkouts/GLTFSceneKit/Sources/GLTFSceneKit/GLTFUnarchiver.swift:1331:92: error: 'CAAnimation' is unavailable in watchOS
private func loadAnimation(index: Int, channel: Int, weightPaths: [String]?) throws -> CAAnimation {
^~~~~~~~~~~
/Applications/Xcode-16.3.0.app/Contents/Developer/Platforms/WatchOS.platform/Developer/SDKs/WatchOS11.4.sdk/System/Library/Frameworks/QuartzCore.framework/Headers/CAAnimation.h:25:12: note: 'CAAnimation' has been explicitly marked unavailable here
@interface CAAnimation : NSObject
^
SwiftDriverJobDiscovery normal armv7k Emitting module for DisplayLink (in target 'DisplayLink' from project 'DisplayLink')
SwiftDriverJobDiscovery normal arm64 Emitting module for DisplayLink (in target 'DisplayLink' from project 'DisplayLink')
SwiftDriver\ Compilation\ Requirements DisplayLink normal armv7k com.apple.xcode.tools.swift.compiler (in target 'DisplayLink' from project 'DisplayLink')
cd /Users/admin/builder/spi-builder-workspace/.swiftpm/xcode
builtin-Swift-Compilation-Requirements -- /Applications/Xcode-16.3.0.app/Contents/Developer/Toolchains/XcodeDefault.xctoolchain/usr/bin/swiftc -module-name DisplayLink -Onone -enforce-exclusivity\=checked @/Users/admin/builder/spi-builder-workspace/.derivedData/Build/Intermediates.noindex/DisplayLink.build/Debug-watchos/DisplayLink.build/Objects-normal/armv7k/DisplayLink.SwiftFileList -DSWIFT_PACKAGE -DDEBUG -DXcode -plugin-path /Applications/Xcode-16.3.0.app/Contents/Developer/Toolchains/XcodeDefault.xctoolchain/usr/lib/swift/host/plugins/testing -enable-experimental-feature DebugDescriptionMacro -sdk /Applications/Xcode-16.3.0.app/Contents/Developer/Platforms/WatchOS.platform/Developer/SDKs/WatchOS11.4.sdk -target armv7k-apple-watchos6.0 -g -module-cache-path /Users/admin/builder/spi-builder-workspace/.derivedData/ModuleCache.noindex -Xfrontend -serialize-debugging-options -profile-coverage-mapping -profile-generate -enable-testing -suppress-warnings -index-store-path /Users/admin/builder/spi-builder-workspace/.derivedData/Index.noindex/DataStore -swift-version 5 -I /Users/admin/builder/spi-builder-workspace/.derivedData/Build/Products/Debug-watchos -I /Applications/Xcode-16.3.0.app/Contents/Developer/Platforms/WatchOS.platform/Developer/usr/lib -F /Users/admin/builder/spi-builder-workspace/.derivedData/Build/Products/Debug-watchos -F /Applications/Xcode-16.3.0.app/Contents/Developer/Platforms/WatchOS.platform/Developer/Library/Frameworks -F /Applications/Xcode-16.3.0.app/Contents/Developer/Platforms/WatchOS.platform/Developer/SDKs/WatchOS11.4.sdk/Developer/Library/Frameworks -c -j10 -enable-batch-mode -incremental -Xcc -ivfsstatcache -Xcc /Users/admin/builder/spi-builder-workspace/.derivedData/SDKStatCaches.noindex/watchos11.4-22T246-43efb940ff07ba2497b70ec94253f576.sdkstatcache -output-file-map /Users/admin/builder/spi-builder-workspace/.derivedData/Build/Intermediates.noindex/DisplayLink.build/Debug-watchos/DisplayLink.build/Objects-normal/armv7k/DisplayLink-OutputFileMap.json -use-frontend-parseable-output -save-temps -no-color-diagnostics -serialize-diagnostics -emit-dependencies -emit-module -emit-module-path /Users/admin/builder/spi-builder-workspace/.derivedData/Build/Intermediates.noindex/DisplayLink.build/Debug-watchos/DisplayLink.build/Objects-normal/armv7k/DisplayLink.swiftmodule -validate-clang-modules-once -clang-build-session-file /Users/admin/builder/spi-builder-workspace/.derivedData/ModuleCache.noindex/Session.modulevalidation -Xcc -I/Users/admin/builder/spi-builder-workspace/.derivedData/Build/Intermediates.noindex/DisplayLink.build/Debug-watchos/DisplayLink.build/swift-overrides.hmap -emit-const-values -Xfrontend -const-gather-protocols-file -Xfrontend /Users/admin/builder/spi-builder-workspace/.derivedData/Build/Intermediates.noindex/DisplayLink.build/Debug-watchos/DisplayLink.build/Objects-normal/armv7k/DisplayLink_const_extract_protocols.json -Xcc -I/Users/admin/builder/spi-builder-workspace/.derivedData/Build/Products/Debug-watchos/include -Xcc -I/Users/admin/builder/spi-builder-workspace/.derivedData/Build/Intermediates.noindex/DisplayLink.build/Debug-watchos/DisplayLink.build/DerivedSources-normal/armv7k -Xcc -I/Users/admin/builder/spi-builder-workspace/.derivedData/Build/Intermediates.noindex/DisplayLink.build/Debug-watchos/DisplayLink.build/DerivedSources/armv7k -Xcc -I/Users/admin/builder/spi-builder-workspace/.derivedData/Build/Intermediates.noindex/DisplayLink.build/Debug-watchos/DisplayLink.build/DerivedSources -Xcc -DSWIFT_PACKAGE -Xcc -DDEBUG\=1 -emit-objc-header -emit-objc-header-path /Users/admin/builder/spi-builder-workspace/.derivedData/Build/Intermediates.noindex/DisplayLink.build/Debug-watchos/DisplayLink.build/Objects-normal/armv7k/DisplayLink-Swift.h -working-directory /Users/admin/builder/spi-builder-workspace/.swiftpm/xcode -experimental-emit-module-separately -disable-cmo
SwiftDriverJobDiscovery normal arm64_32 Emitting module for DisplayLink (in target 'DisplayLink' from project 'DisplayLink')
SwiftDriver\ Compilation\ Requirements DisplayLink normal arm64_32 com.apple.xcode.tools.swift.compiler (in target 'DisplayLink' from project 'DisplayLink')
cd /Users/admin/builder/spi-builder-workspace/.swiftpm/xcode
builtin-Swift-Compilation-Requirements -- /Applications/Xcode-16.3.0.app/Contents/Developer/Toolchains/XcodeDefault.xctoolchain/usr/bin/swiftc -module-name DisplayLink -Onone -enforce-exclusivity\=checked @/Users/admin/builder/spi-builder-workspace/.derivedData/Build/Intermediates.noindex/DisplayLink.build/Debug-watchos/DisplayLink.build/Objects-normal/arm64_32/DisplayLink.SwiftFileList -DSWIFT_PACKAGE -DDEBUG -DXcode -plugin-path /Applications/Xcode-16.3.0.app/Contents/Developer/Toolchains/XcodeDefault.xctoolchain/usr/lib/swift/host/plugins/testing -enable-experimental-feature DebugDescriptionMacro -sdk /Applications/Xcode-16.3.0.app/Contents/Developer/Platforms/WatchOS.platform/Developer/SDKs/WatchOS11.4.sdk -target arm64_32-apple-watchos6.0 -g -module-cache-path /Users/admin/builder/spi-builder-workspace/.derivedData/ModuleCache.noindex -Xfrontend -serialize-debugging-options -profile-coverage-mapping -profile-generate -enable-testing -suppress-warnings -index-store-path /Users/admin/builder/spi-builder-workspace/.derivedData/Index.noindex/DataStore -swift-version 5 -I /Users/admin/builder/spi-builder-workspace/.derivedData/Build/Products/Debug-watchos -I /Applications/Xcode-16.3.0.app/Contents/Developer/Platforms/WatchOS.platform/Developer/usr/lib -F /Users/admin/builder/spi-builder-workspace/.derivedData/Build/Products/Debug-watchos -F /Applications/Xcode-16.3.0.app/Contents/Developer/Platforms/WatchOS.platform/Developer/Library/Frameworks -F /Applications/Xcode-16.3.0.app/Contents/Developer/Platforms/WatchOS.platform/Developer/SDKs/WatchOS11.4.sdk/Developer/Library/Frameworks -c -j10 -enable-batch-mode -incremental -Xcc -ivfsstatcache -Xcc /Users/admin/builder/spi-builder-workspace/.derivedData/SDKStatCaches.noindex/watchos11.4-22T246-43efb940ff07ba2497b70ec94253f576.sdkstatcache -output-file-map /Users/admin/builder/spi-builder-workspace/.derivedData/Build/Intermediates.noindex/DisplayLink.build/Debug-watchos/DisplayLink.build/Objects-normal/arm64_32/DisplayLink-OutputFileMap.json -use-frontend-parseable-output -save-temps -no-color-diagnostics -serialize-diagnostics -emit-dependencies -emit-module -emit-module-path /Users/admin/builder/spi-builder-workspace/.derivedData/Build/Intermediates.noindex/DisplayLink.build/Debug-watchos/DisplayLink.build/Objects-normal/arm64_32/DisplayLink.swiftmodule -validate-clang-modules-once -clang-build-session-file /Users/admin/builder/spi-builder-workspace/.derivedData/ModuleCache.noindex/Session.modulevalidation -Xcc -I/Users/admin/builder/spi-builder-workspace/.derivedData/Build/Intermediates.noindex/DisplayLink.build/Debug-watchos/DisplayLink.build/swift-overrides.hmap -emit-const-values -Xfrontend -const-gather-protocols-file -Xfrontend /Users/admin/builder/spi-builder-workspace/.derivedData/Build/Intermediates.noindex/DisplayLink.build/Debug-watchos/DisplayLink.build/Objects-normal/arm64_32/DisplayLink_const_extract_protocols.json -Xcc -I/Users/admin/builder/spi-builder-workspace/.derivedData/Build/Products/Debug-watchos/include -Xcc -I/Users/admin/builder/spi-builder-workspace/.derivedData/Build/Intermediates.noindex/DisplayLink.build/Debug-watchos/DisplayLink.build/DerivedSources-normal/arm64_32 -Xcc -I/Users/admin/builder/spi-builder-workspace/.derivedData/Build/Intermediates.noindex/DisplayLink.build/Debug-watchos/DisplayLink.build/DerivedSources/arm64_32 -Xcc -I/Users/admin/builder/spi-builder-workspace/.derivedData/Build/Intermediates.noindex/DisplayLink.build/Debug-watchos/DisplayLink.build/DerivedSources -Xcc -DSWIFT_PACKAGE -Xcc -DDEBUG\=1 -emit-objc-header -emit-objc-header-path /Users/admin/builder/spi-builder-workspace/.derivedData/Build/Intermediates.noindex/DisplayLink.build/Debug-watchos/DisplayLink.build/Objects-normal/arm64_32/DisplayLink-Swift.h -working-directory /Users/admin/builder/spi-builder-workspace/.swiftpm/xcode -experimental-emit-module-separately -disable-cmo
SwiftDriver\ Compilation\ Requirements DisplayLink normal arm64 com.apple.xcode.tools.swift.compiler (in target 'DisplayLink' from project 'DisplayLink')
cd /Users/admin/builder/spi-builder-workspace/.swiftpm/xcode
builtin-Swift-Compilation-Requirements -- /Applications/Xcode-16.3.0.app/Contents/Developer/Toolchains/XcodeDefault.xctoolchain/usr/bin/swiftc -module-name DisplayLink -Onone -enforce-exclusivity\=checked @/Users/admin/builder/spi-builder-workspace/.derivedData/Build/Intermediates.noindex/DisplayLink.build/Debug-watchos/DisplayLink.build/Objects-normal/arm64/DisplayLink.SwiftFileList -DSWIFT_PACKAGE -DDEBUG -DXcode -plugin-path /Applications/Xcode-16.3.0.app/Contents/Developer/Toolchains/XcodeDefault.xctoolchain/usr/lib/swift/host/plugins/testing -enable-experimental-feature DebugDescriptionMacro -sdk /Applications/Xcode-16.3.0.app/Contents/Developer/Platforms/WatchOS.platform/Developer/SDKs/WatchOS11.4.sdk -target arm64-apple-watchos6.0 -g -module-cache-path /Users/admin/builder/spi-builder-workspace/.derivedData/ModuleCache.noindex -Xfrontend -serialize-debugging-options -profile-coverage-mapping -profile-generate -enable-testing -suppress-warnings -index-store-path /Users/admin/builder/spi-builder-workspace/.derivedData/Index.noindex/DataStore -swift-version 5 -I /Users/admin/builder/spi-builder-workspace/.derivedData/Build/Products/Debug-watchos -I /Applications/Xcode-16.3.0.app/Contents/Developer/Platforms/WatchOS.platform/Developer/usr/lib -F /Users/admin/builder/spi-builder-workspace/.derivedData/Build/Products/Debug-watchos -F /Applications/Xcode-16.3.0.app/Contents/Developer/Platforms/WatchOS.platform/Developer/Library/Frameworks -F /Applications/Xcode-16.3.0.app/Contents/Developer/Platforms/WatchOS.platform/Developer/SDKs/WatchOS11.4.sdk/Developer/Library/Frameworks -c -j10 -enable-batch-mode -incremental -Xcc -ivfsstatcache -Xcc /Users/admin/builder/spi-builder-workspace/.derivedData/SDKStatCaches.noindex/watchos11.4-22T246-43efb940ff07ba2497b70ec94253f576.sdkstatcache -output-file-map /Users/admin/builder/spi-builder-workspace/.derivedData/Build/Intermediates.noindex/DisplayLink.build/Debug-watchos/DisplayLink.build/Objects-normal/arm64/DisplayLink-OutputFileMap.json -use-frontend-parseable-output -save-temps -no-color-diagnostics -serialize-diagnostics -emit-dependencies -emit-module -emit-module-path /Users/admin/builder/spi-builder-workspace/.derivedData/Build/Intermediates.noindex/DisplayLink.build/Debug-watchos/DisplayLink.build/Objects-normal/arm64/DisplayLink.swiftmodule -validate-clang-modules-once -clang-build-session-file /Users/admin/builder/spi-builder-workspace/.derivedData/ModuleCache.noindex/Session.modulevalidation -Xcc -I/Users/admin/builder/spi-builder-workspace/.derivedData/Build/Intermediates.noindex/DisplayLink.build/Debug-watchos/DisplayLink.build/swift-overrides.hmap -emit-const-values -Xfrontend -const-gather-protocols-file -Xfrontend /Users/admin/builder/spi-builder-workspace/.derivedData/Build/Intermediates.noindex/DisplayLink.build/Debug-watchos/DisplayLink.build/Objects-normal/arm64/DisplayLink_const_extract_protocols.json -Xcc -I/Users/admin/builder/spi-builder-workspace/.derivedData/Build/Products/Debug-watchos/include -Xcc -I/Users/admin/builder/spi-builder-workspace/.derivedData/Build/Intermediates.noindex/DisplayLink.build/Debug-watchos/DisplayLink.build/DerivedSources-normal/arm64 -Xcc -I/Users/admin/builder/spi-builder-workspace/.derivedData/Build/Intermediates.noindex/DisplayLink.build/Debug-watchos/DisplayLink.build/DerivedSources/arm64 -Xcc -I/Users/admin/builder/spi-builder-workspace/.derivedData/Build/Intermediates.noindex/DisplayLink.build/Debug-watchos/DisplayLink.build/DerivedSources -Xcc -DSWIFT_PACKAGE -Xcc -DDEBUG\=1 -emit-objc-header -emit-objc-header-path /Users/admin/builder/spi-builder-workspace/.derivedData/Build/Intermediates.noindex/DisplayLink.build/Debug-watchos/DisplayLink.build/Objects-normal/arm64/DisplayLink-Swift.h -working-directory /Users/admin/builder/spi-builder-workspace/.swiftpm/xcode -experimental-emit-module-separately -disable-cmo
SwiftCompile normal armv7k Compiling\ GLTFMaterialNormalTextureInfo.swift,\ GLTFMaterialOcclusionTextureInfo.swift,\ GLTFMaterialPbrMetallicRoughness.swift,\ GLTFMesh.swift,\ GLTFMeshPrimitive.swift /Users/admin/builder/spi-builder-workspace/.dependencies/checkouts/GLTFSceneKit/Sources/GLTFSceneKit/schema/GLTFMaterialNormalTextureInfo.swift /Users/admin/builder/spi-builder-workspace/.dependencies/checkouts/GLTFSceneKit/Sources/GLTFSceneKit/schema/GLTFMaterialOcclusionTextureInfo.swift /Users/admin/builder/spi-builder-workspace/.dependencies/checkouts/GLTFSceneKit/Sources/GLTFSceneKit/schema/GLTFMaterialPbrMetallicRoughness.swift /Users/admin/builder/spi-builder-workspace/.dependencies/checkouts/GLTFSceneKit/Sources/GLTFSceneKit/schema/GLTFMesh.swift /Users/admin/builder/spi-builder-workspace/.dependencies/checkouts/GLTFSceneKit/Sources/GLTFSceneKit/schema/GLTFMeshPrimitive.swift (in target 'GLTFSceneKit' from project 'GLTFSceneKit')
SwiftCompile normal armv7k /Users/admin/builder/spi-builder-workspace/.dependencies/checkouts/GLTFSceneKit/Sources/GLTFSceneKit/schema/GLTFMaterialNormalTextureInfo.swift (in target 'GLTFSceneKit' from project 'GLTFSceneKit')
cd /Users/admin/builder/spi-builder-workspace/.swiftpm/xcode
SwiftCompile normal armv7k /Users/admin/builder/spi-builder-workspace/.dependencies/checkouts/GLTFSceneKit/Sources/GLTFSceneKit/schema/GLTFMaterialOcclusionTextureInfo.swift (in target 'GLTFSceneKit' from project 'GLTFSceneKit')
cd /Users/admin/builder/spi-builder-workspace/.swiftpm/xcode
SwiftCompile normal armv7k /Users/admin/builder/spi-builder-workspace/.dependencies/checkouts/GLTFSceneKit/Sources/GLTFSceneKit/schema/GLTFMaterialPbrMetallicRoughness.swift (in target 'GLTFSceneKit' from project 'GLTFSceneKit')
cd /Users/admin/builder/spi-builder-workspace/.swiftpm/xcode
SwiftCompile normal armv7k /Users/admin/builder/spi-builder-workspace/.dependencies/checkouts/GLTFSceneKit/Sources/GLTFSceneKit/schema/GLTFMesh.swift (in target 'GLTFSceneKit' from project 'GLTFSceneKit')
cd /Users/admin/builder/spi-builder-workspace/.swiftpm/xcode
SwiftCompile normal armv7k /Users/admin/builder/spi-builder-workspace/.dependencies/checkouts/GLTFSceneKit/Sources/GLTFSceneKit/schema/GLTFMeshPrimitive.swift (in target 'GLTFSceneKit' from project 'GLTFSceneKit')
cd /Users/admin/builder/spi-builder-workspace/.swiftpm/xcode
SwiftMergeGeneratedHeaders /Users/admin/builder/spi-builder-workspace/.derivedData/Build/Intermediates.noindex/GeneratedModuleMaps-watchos/DisplayLink-Swift.h /Users/admin/builder/spi-builder-workspace/.derivedData/Build/Intermediates.noindex/DisplayLink.build/Debug-watchos/DisplayLink.build/Objects-normal/arm64/DisplayLink-Swift.h /Users/admin/builder/spi-builder-workspace/.derivedData/Build/Intermediates.noindex/DisplayLink.build/Debug-watchos/DisplayLink.build/Objects-normal/arm64_32/DisplayLink-Swift.h /Users/admin/builder/spi-builder-workspace/.derivedData/Build/Intermediates.noindex/DisplayLink.build/Debug-watchos/DisplayLink.build/Objects-normal/armv7k/DisplayLink-Swift.h (in target 'DisplayLink' from project 'DisplayLink')
cd /Users/admin/builder/spi-builder-workspace/.dependencies/checkouts/DisplayLink
builtin-swiftHeaderTool -arch arm64 /Users/admin/builder/spi-builder-workspace/.derivedData/Build/Intermediates.noindex/DisplayLink.build/Debug-watchos/DisplayLink.build/Objects-normal/arm64/DisplayLink-Swift.h -arch arm64_32 /Users/admin/builder/spi-builder-workspace/.derivedData/Build/Intermediates.noindex/DisplayLink.build/Debug-watchos/DisplayLink.build/Objects-normal/arm64_32/DisplayLink-Swift.h -arch armv7k /Users/admin/builder/spi-builder-workspace/.derivedData/Build/Intermediates.noindex/DisplayLink.build/Debug-watchos/DisplayLink.build/Objects-normal/armv7k/DisplayLink-Swift.h -o /Users/admin/builder/spi-builder-workspace/.derivedData/Build/Intermediates.noindex/GeneratedModuleMaps-watchos/DisplayLink-Swift.h
** BUILD FAILED **
The following build commands failed:
SwiftEmitModule normal arm64 Emitting\ module\ for\ GLTFSceneKit (in target 'GLTFSceneKit' from project 'GLTFSceneKit')
EmitSwiftModule normal arm64 (in target 'GLTFSceneKit' from project 'GLTFSceneKit')
Building workspace spi-builder-workspace with scheme Model3DView
(3 failures)
BUILD FAILURE 6.1 watchOS