Build Information
Failed to build CopilotForXcodeKit with Swift 5.9 for watchOS using Xcode 15.2.
Build Command
env DEVELOPER_DIR=/Applications/Xcode-15.2.0.app xcrun xcodebuild -IDEClonedSourcePackagesDirPathOverride=$workDir/.dependencies -skipMacroValidation -skipPackagePluginValidation -derivedDataPath $workDir/.derivedData build -scheme CopilotForXcodeKit-Package -destination generic/platform=watchOS
Build Log
SwiftCompile normal arm64 /Users/builder/builds/TDmZkXJm/3/finestructure/swiftpackageindex-builder/spi-builder-workspace/.dependencies/checkouts/CodableWrappers/Sources/CodableWrappers/StaticCoders/FloatingPointCoding.swift (in target 'CodableWrappers' from project 'CodableWrappers')
cd /Users/builder/builds/TDmZkXJm/3/finestructure/swiftpackageindex-builder/spi-builder-workspace/.dependencies/checkouts/CodableWrappers
/Applications/Xcode-15.2.0.app/Contents/Developer/Toolchains/XcodeDefault.xctoolchain/usr/bin/swift-frontend -c /Users/builder/builds/TDmZkXJm/3/finestructure/swiftpackageindex-builder/spi-builder-workspace/.dependencies/checkouts/CodableWrappers/Sources/CodableWrappers/Convenience/ConveienceAdherence.swift /Users/builder/builds/TDmZkXJm/3/finestructure/swiftpackageindex-builder/spi-builder-workspace/.dependencies/checkouts/CodableWrappers/Sources/CodableWrappers/Convenience/CustomWrappers.swift /Users/builder/builds/TDmZkXJm/3/finestructure/swiftpackageindex-builder/spi-builder-workspace/.dependencies/checkouts/CodableWrappers/Sources/CodableWrappers/Convenience/EmptyDefaults.swift /Users/builder/builds/TDmZkXJm/3/finestructure/swiftpackageindex-builder/spi-builder-workspace/.dependencies/checkouts/CodableWrappers/Sources/CodableWrappers/Core/FallbackCoding.swift /Users/builder/builds/TDmZkXJm/3/finestructure/swiftpackageindex-builder/spi-builder-workspace/.dependencies/checkouts/CodableWrappers/Sources/CodableWrappers/Core/ImmutableWrapper.swift /Users/builder/builds/TDmZkXJm/3/finestructure/swiftpackageindex-builder/spi-builder-workspace/.dependencies/checkouts/CodableWrappers/Sources/CodableWrappers/Core/OmitCodingWrappers.swift /Users/builder/builds/TDmZkXJm/3/finestructure/swiftpackageindex-builder/spi-builder-workspace/.dependencies/checkouts/CodableWrappers/Sources/CodableWrappers/Core/OptionalWrappers.swift /Users/builder/builds/TDmZkXJm/3/finestructure/swiftpackageindex-builder/spi-builder-workspace/.dependencies/checkouts/CodableWrappers/Sources/CodableWrappers/Core/StaticCodingWrappers.swift /Users/builder/builds/TDmZkXJm/3/finestructure/swiftpackageindex-builder/spi-builder-workspace/.dependencies/checkouts/CodableWrappers/Sources/CodableWrappers/Core/TransientCoding.swift /Users/builder/builds/TDmZkXJm/3/finestructure/swiftpackageindex-builder/spi-builder-workspace/.dependencies/checkouts/CodableWrappers/Sources/CodableWrappers/Deprecated/Old.swift /Users/builder/builds/TDmZkXJm/3/finestructure/swiftpackageindex-builder/spi-builder-workspace/.dependencies/checkouts/CodableWrappers/Sources/CodableWrappers/StaticCoders/BoolCoding.swift /Users/builder/builds/TDmZkXJm/3/finestructure/swiftpackageindex-builder/spi-builder-workspace/.dependencies/checkouts/CodableWrappers/Sources/CodableWrappers/StaticCoders/DataCoding.swift /Users/builder/builds/TDmZkXJm/3/finestructure/swiftpackageindex-builder/spi-builder-workspace/.dependencies/checkouts/CodableWrappers/Sources/CodableWrappers/StaticCoders/DateCoding.swift -primary-file /Users/builder/builds/TDmZkXJm/3/finestructure/swiftpackageindex-builder/spi-builder-workspace/.dependencies/checkouts/CodableWrappers/Sources/CodableWrappers/StaticCoders/FloatingPointCoding.swift -primary-file /Users/builder/builds/TDmZkXJm/3/finestructure/swiftpackageindex-builder/spi-builder-workspace/.dependencies/checkouts/CodableWrappers/Sources/CodableWrappers/StaticCoders/NilFiltering.swift /Users/builder/builds/TDmZkXJm/3/finestructure/swiftpackageindex-builder/spi-builder-workspace/.dependencies/checkouts/CodableWrappers/Sources/CodableWrappers/StaticCoders/NullEncoding.swift /Users/builder/builds/TDmZkXJm/3/finestructure/swiftpackageindex-builder/spi-builder-workspace/.dependencies/checkouts/CodableWrappers/Sources/CodableWrappers/StaticCoders/StaticCoding.swift -emit-dependencies-path /Users/builder/builds/TDmZkXJm/3/finestructure/swiftpackageindex-builder/spi-builder-workspace/.derivedData/Build/Intermediates.noindex/CodableWrappers.build/Debug-watchos/CodableWrappers.build/Objects-normal/arm64/FloatingPointCoding.d -emit-const-values-path /Users/builder/builds/TDmZkXJm/3/finestructure/swiftpackageindex-builder/spi-builder-workspace/.derivedData/Build/Intermediates.noindex/CodableWrappers.build/Debug-watchos/CodableWrappers.build/Objects-normal/arm64/FloatingPointCoding.swiftconstvalues -emit-reference-dependencies-path /Users/builder/builds/TDmZkXJm/3/finestructure/swiftpackageindex-builder/spi-builder-workspace/.derivedData/Build/Intermediates.noindex/CodableWrappers.build/Debug-watchos/CodableWrappers.build/Objects-normal/arm64/FloatingPointCoding.swiftdeps -serialize-diagnostics-path /Users/builder/builds/TDmZkXJm/3/finestructure/swiftpackageindex-builder/spi-builder-workspace/.derivedData/Build/Intermediates.noindex/CodableWrappers.build/Debug-watchos/CodableWrappers.build/Objects-normal/arm64/FloatingPointCoding.dia -emit-dependencies-path /Users/builder/builds/TDmZkXJm/3/finestructure/swiftpackageindex-builder/spi-builder-workspace/.derivedData/Build/Intermediates.noindex/CodableWrappers.build/Debug-watchos/CodableWrappers.build/Objects-normal/arm64/NilFiltering.d -emit-const-values-path /Users/builder/builds/TDmZkXJm/3/finestructure/swiftpackageindex-builder/spi-builder-workspace/.derivedData/Build/Intermediates.noindex/CodableWrappers.build/Debug-watchos/CodableWrappers.build/Objects-normal/arm64/NilFiltering.swiftconstvalues -emit-reference-dependencies-path /Users/builder/builds/TDmZkXJm/3/finestructure/swiftpackageindex-builder/spi-builder-workspace/.derivedData/Build/Intermediates.noindex/CodableWrappers.build/Debug-watchos/CodableWrappers.build/Objects-normal/arm64/NilFiltering.swiftdeps -serialize-diagnostics-path /Users/builder/builds/TDmZkXJm/3/finestructure/swiftpackageindex-builder/spi-builder-workspace/.derivedData/Build/Intermediates.noindex/CodableWrappers.build/Debug-watchos/CodableWrappers.build/Objects-normal/arm64/NilFiltering.dia -target arm64-apple-watchos5.0 -Xllvm -aarch64-use-tbi -enable-objc-interop -sdk /Applications/Xcode-15.2.0.app/Contents/Developer/Platforms/WatchOS.platform/Developer/SDKs/WatchOS10.2.sdk -I /Users/builder/builds/TDmZkXJm/3/finestructure/swiftpackageindex-builder/spi-builder-workspace/.derivedData/Build/Products/Debug-watchos -I /Applications/Xcode-15.2.0.app/Contents/Developer/Platforms/WatchOS.platform/Developer/usr/lib -F /Users/builder/builds/TDmZkXJm/3/finestructure/swiftpackageindex-builder/spi-builder-workspace/.derivedData/Build/Products/Debug-watchos -F /Applications/Xcode-15.2.0.app/Contents/Developer/Platforms/WatchOS.platform/Developer/Library/Frameworks -F /Applications/Xcode-15.2.0.app/Contents/Developer/Platforms/WatchOS.platform/Developer/SDKs/WatchOS10.2.sdk/Developer/Library/Frameworks -no-color-diagnostics -suppress-warnings -enable-testing -g -module-cache-path /Users/builder/builds/TDmZkXJm/3/finestructure/swiftpackageindex-builder/spi-builder-workspace/.derivedData/ModuleCache.noindex -profile-generate -profile-coverage-mapping -swift-version 5 -enforce-exclusivity\=checked -Onone -D SWIFT_PACKAGE -D DEBUG -D Xcode -serialize-debugging-options -const-gather-protocols-file /Users/builder/builds/TDmZkXJm/3/finestructure/swiftpackageindex-builder/spi-builder-workspace/.derivedData/Build/Intermediates.noindex/CodableWrappers.build/Debug-watchos/CodableWrappers.build/Objects-normal/arm64/CodableWrappers_const_extract_protocols.json -empty-abi-descriptor -validate-clang-modules-once -clang-build-session-file /Users/builder/builds/TDmZkXJm/3/finestructure/swiftpackageindex-builder/spi-builder-workspace/.derivedData/ModuleCache.noindex/Session.modulevalidation -Xcc -working-directory -Xcc /Users/builder/builds/TDmZkXJm/3/finestructure/swiftpackageindex-builder/spi-builder-workspace/.dependencies/checkouts/CodableWrappers -resource-dir /Applications/Xcode-15.2.0.app/Contents/Developer/Toolchains/XcodeDefault.xctoolchain/usr/lib/swift -enable-anonymous-context-mangled-names -Xcc -ivfsstatcache -Xcc /Users/builder/builds/TDmZkXJm/3/finestructure/swiftpackageindex-builder/spi-builder-workspace/.derivedData/SDKStatCaches.noindex/watchos10.2-21S355-1a03c8d25fc3596eb74c01d649b42752.sdkstatcache -Xcc -I/Users/builder/builds/TDmZkXJm/3/finestructure/swiftpackageindex-builder/spi-builder-workspace/.derivedData/Build/Intermediates.noindex/CodableWrappers.build/Debug-watchos/CodableWrappers.build/swift-overrides.hmap -Xcc -I/Users/builder/builds/TDmZkXJm/3/finestructure/swiftpackageindex-builder/spi-builder-workspace/.derivedData/Build/Products/Debug-watchos/include -Xcc -I/Users/builder/builds/TDmZkXJm/3/finestructure/swiftpackageindex-builder/spi-builder-workspace/.derivedData/Build/Intermediates.noindex/CodableWrappers.build/Debug-watchos/CodableWrappers.build/DerivedSources-normal/arm64 -Xcc -I/Users/builder/builds/TDmZkXJm/3/finestructure/swiftpackageindex-builder/spi-builder-workspace/.derivedData/Build/Intermediates.noindex/CodableWrappers.build/Debug-watchos/CodableWrappers.build/DerivedSources/arm64 -Xcc -I/Users/builder/builds/TDmZkXJm/3/finestructure/swiftpackageindex-builder/spi-builder-workspace/.derivedData/Build/Intermediates.noindex/CodableWrappers.build/Debug-watchos/CodableWrappers.build/DerivedSources -Xcc -DSWIFT_PACKAGE -Xcc -DDEBUG\=1 -module-name CodableWrappers -frontend-parseable-output -disable-clang-spi -target-sdk-version 10.2 -target-sdk-name watchos10.2 -external-plugin-path /Applications/Xcode-15.2.0.app/Contents/Developer/Platforms/WatchOS.platform/Developer/SDKs/WatchOS10.2.sdk/usr/lib/swift/host/plugins\#/Applications/Xcode-15.2.0.app/Contents/Developer/Platforms/WatchOS.platform/Developer/SDKs/WatchOS10.2.sdk/usr/bin/swift-plugin-server -external-plugin-path /Applications/Xcode-15.2.0.app/Contents/Developer/Platforms/WatchOS.platform/Developer/SDKs/WatchOS10.2.sdk/usr/local/lib/swift/host/plugins\#/Applications/Xcode-15.2.0.app/Contents/Developer/Platforms/WatchOS.platform/Developer/SDKs/WatchOS10.2.sdk/usr/bin/swift-plugin-server -external-plugin-path /Applications/Xcode-15.2.0.app/Contents/Developer/Platforms/WatchOS.platform/Developer/usr/lib/swift/host/plugins\#/Applications/Xcode-15.2.0.app/Contents/Developer/Platforms/WatchOS.platform/Developer/usr/bin/swift-plugin-server -external-plugin-path /Applications/Xcode-15.2.0.app/Contents/Developer/Platforms/WatchOS.platform/Developer/usr/local/lib/swift/host/plugins\#/Applications/Xcode-15.2.0.app/Contents/Developer/Platforms/WatchOS.platform/Developer/usr/bin/swift-plugin-server -plugin-path /Applications/Xcode-15.2.0.app/Contents/Developer/Toolchains/XcodeDefault.xctoolchain/usr/lib/swift/host/plugins -plugin-path /Applications/Xcode-15.2.0.app/Contents/Developer/Toolchains/XcodeDefault.xctoolchain/usr/local/lib/swift/host/plugins -o /Users/builder/builds/TDmZkXJm/3/finestructure/swiftpackageindex-builder/spi-builder-workspace/.derivedData/Build/Intermediates.noindex/CodableWrappers.build/Debug-watchos/CodableWrappers.build/Objects-normal/arm64/FloatingPointCoding.o -o /Users/builder/builds/TDmZkXJm/3/finestructure/swiftpackageindex-builder/spi-builder-workspace/.derivedData/Build/Intermediates.noindex/CodableWrappers.build/Debug-watchos/CodableWrappers.build/Objects-normal/arm64/NilFiltering.o -index-unit-output-path /CodableWrappers.build/Debug-watchos/CodableWrappers.build/Objects-normal/arm64/FloatingPointCoding.o -index-unit-output-path /CodableWrappers.build/Debug-watchos/CodableWrappers.build/Objects-normal/arm64/NilFiltering.o -index-store-path /Users/builder/builds/TDmZkXJm/3/finestructure/swiftpackageindex-builder/spi-builder-workspace/.derivedData/Index.noindex/DataStore -index-system-modules
SwiftCompile normal arm64 /Users/builder/builds/TDmZkXJm/3/finestructure/swiftpackageindex-builder/spi-builder-workspace/.dependencies/checkouts/CodableWrappers/Sources/CodableWrappers/StaticCoders/NilFiltering.swift (in target 'CodableWrappers' from project 'CodableWrappers')
cd /Users/builder/builds/TDmZkXJm/3/finestructure/swiftpackageindex-builder/spi-builder-workspace/.dependencies/checkouts/CodableWrappers
/Applications/Xcode-15.2.0.app/Contents/Developer/Toolchains/XcodeDefault.xctoolchain/usr/bin/swift-frontend -c /Users/builder/builds/TDmZkXJm/3/finestructure/swiftpackageindex-builder/spi-builder-workspace/.dependencies/checkouts/CodableWrappers/Sources/CodableWrappers/Convenience/ConveienceAdherence.swift /Users/builder/builds/TDmZkXJm/3/finestructure/swiftpackageindex-builder/spi-builder-workspace/.dependencies/checkouts/CodableWrappers/Sources/CodableWrappers/Convenience/CustomWrappers.swift /Users/builder/builds/TDmZkXJm/3/finestructure/swiftpackageindex-builder/spi-builder-workspace/.dependencies/checkouts/CodableWrappers/Sources/CodableWrappers/Convenience/EmptyDefaults.swift /Users/builder/builds/TDmZkXJm/3/finestructure/swiftpackageindex-builder/spi-builder-workspace/.dependencies/checkouts/CodableWrappers/Sources/CodableWrappers/Core/FallbackCoding.swift /Users/builder/builds/TDmZkXJm/3/finestructure/swiftpackageindex-builder/spi-builder-workspace/.dependencies/checkouts/CodableWrappers/Sources/CodableWrappers/Core/ImmutableWrapper.swift /Users/builder/builds/TDmZkXJm/3/finestructure/swiftpackageindex-builder/spi-builder-workspace/.dependencies/checkouts/CodableWrappers/Sources/CodableWrappers/Core/OmitCodingWrappers.swift /Users/builder/builds/TDmZkXJm/3/finestructure/swiftpackageindex-builder/spi-builder-workspace/.dependencies/checkouts/CodableWrappers/Sources/CodableWrappers/Core/OptionalWrappers.swift /Users/builder/builds/TDmZkXJm/3/finestructure/swiftpackageindex-builder/spi-builder-workspace/.dependencies/checkouts/CodableWrappers/Sources/CodableWrappers/Core/StaticCodingWrappers.swift /Users/builder/builds/TDmZkXJm/3/finestructure/swiftpackageindex-builder/spi-builder-workspace/.dependencies/checkouts/CodableWrappers/Sources/CodableWrappers/Core/TransientCoding.swift /Users/builder/builds/TDmZkXJm/3/finestructure/swiftpackageindex-builder/spi-builder-workspace/.dependencies/checkouts/CodableWrappers/Sources/CodableWrappers/Deprecated/Old.swift /Users/builder/builds/TDmZkXJm/3/finestructure/swiftpackageindex-builder/spi-builder-workspace/.dependencies/checkouts/CodableWrappers/Sources/CodableWrappers/StaticCoders/BoolCoding.swift /Users/builder/builds/TDmZkXJm/3/finestructure/swiftpackageindex-builder/spi-builder-workspace/.dependencies/checkouts/CodableWrappers/Sources/CodableWrappers/StaticCoders/DataCoding.swift /Users/builder/builds/TDmZkXJm/3/finestructure/swiftpackageindex-builder/spi-builder-workspace/.dependencies/checkouts/CodableWrappers/Sources/CodableWrappers/StaticCoders/DateCoding.swift -primary-file /Users/builder/builds/TDmZkXJm/3/finestructure/swiftpackageindex-builder/spi-builder-workspace/.dependencies/checkouts/CodableWrappers/Sources/CodableWrappers/StaticCoders/FloatingPointCoding.swift -primary-file /Users/builder/builds/TDmZkXJm/3/finestructure/swiftpackageindex-builder/spi-builder-workspace/.dependencies/checkouts/CodableWrappers/Sources/CodableWrappers/StaticCoders/NilFiltering.swift /Users/builder/builds/TDmZkXJm/3/finestructure/swiftpackageindex-builder/spi-builder-workspace/.dependencies/checkouts/CodableWrappers/Sources/CodableWrappers/StaticCoders/NullEncoding.swift /Users/builder/builds/TDmZkXJm/3/finestructure/swiftpackageindex-builder/spi-builder-workspace/.dependencies/checkouts/CodableWrappers/Sources/CodableWrappers/StaticCoders/StaticCoding.swift -emit-dependencies-path /Users/builder/builds/TDmZkXJm/3/finestructure/swiftpackageindex-builder/spi-builder-workspace/.derivedData/Build/Intermediates.noindex/CodableWrappers.build/Debug-watchos/CodableWrappers.build/Objects-normal/arm64/FloatingPointCoding.d -emit-const-values-path /Users/builder/builds/TDmZkXJm/3/finestructure/swiftpackageindex-builder/spi-builder-workspace/.derivedData/Build/Intermediates.noindex/CodableWrappers.build/Debug-watchos/CodableWrappers.build/Objects-normal/arm64/FloatingPointCoding.swiftconstvalues -emit-reference-dependencies-path /Users/builder/builds/TDmZkXJm/3/finestructure/swiftpackageindex-builder/spi-builder-workspace/.derivedData/Build/Intermediates.noindex/CodableWrappers.build/Debug-watchos/CodableWrappers.build/Objects-normal/arm64/FloatingPointCoding.swiftdeps -serialize-diagnostics-path /Users/builder/builds/TDmZkXJm/3/finestructure/swiftpackageindex-builder/spi-builder-workspace/.derivedData/Build/Intermediates.noindex/CodableWrappers.build/Debug-watchos/CodableWrappers.build/Objects-normal/arm64/FloatingPointCoding.dia -emit-dependencies-path /Users/builder/builds/TDmZkXJm/3/finestructure/swiftpackageindex-builder/spi-builder-workspace/.derivedData/Build/Intermediates.noindex/CodableWrappers.build/Debug-watchos/CodableWrappers.build/Objects-normal/arm64/NilFiltering.d -emit-const-values-path /Users/builder/builds/TDmZkXJm/3/finestructure/swiftpackageindex-builder/spi-builder-workspace/.derivedData/Build/Intermediates.noindex/CodableWrappers.build/Debug-watchos/CodableWrappers.build/Objects-normal/arm64/NilFiltering.swiftconstvalues -emit-reference-dependencies-path /Users/builder/builds/TDmZkXJm/3/finestructure/swiftpackageindex-builder/spi-builder-workspace/.derivedData/Build/Intermediates.noindex/CodableWrappers.build/Debug-watchos/CodableWrappers.build/Objects-normal/arm64/NilFiltering.swiftdeps -serialize-diagnostics-path /Users/builder/builds/TDmZkXJm/3/finestructure/swiftpackageindex-builder/spi-builder-workspace/.derivedData/Build/Intermediates.noindex/CodableWrappers.build/Debug-watchos/CodableWrappers.build/Objects-normal/arm64/NilFiltering.dia -target arm64-apple-watchos5.0 -Xllvm -aarch64-use-tbi -enable-objc-interop -sdk /Applications/Xcode-15.2.0.app/Contents/Developer/Platforms/WatchOS.platform/Developer/SDKs/WatchOS10.2.sdk -I /Users/builder/builds/TDmZkXJm/3/finestructure/swiftpackageindex-builder/spi-builder-workspace/.derivedData/Build/Products/Debug-watchos -I /Applications/Xcode-15.2.0.app/Contents/Developer/Platforms/WatchOS.platform/Developer/usr/lib -F /Users/builder/builds/TDmZkXJm/3/finestructure/swiftpackageindex-builder/spi-builder-workspace/.derivedData/Build/Products/Debug-watchos -F /Applications/Xcode-15.2.0.app/Contents/Developer/Platforms/WatchOS.platform/Developer/Library/Frameworks -F /Applications/Xcode-15.2.0.app/Contents/Developer/Platforms/WatchOS.platform/Developer/SDKs/WatchOS10.2.sdk/Developer/Library/Frameworks -no-color-diagnostics -suppress-warnings -enable-testing -g -module-cache-path /Users/builder/builds/TDmZkXJm/3/finestructure/swiftpackageindex-builder/spi-builder-workspace/.derivedData/ModuleCache.noindex -profile-generate -profile-coverage-mapping -swift-version 5 -enforce-exclusivity\=checked -Onone -D SWIFT_PACKAGE -D DEBUG -D Xcode -serialize-debugging-options -const-gather-protocols-file /Users/builder/builds/TDmZkXJm/3/finestructure/swiftpackageindex-builder/spi-builder-workspace/.derivedData/Build/Intermediates.noindex/CodableWrappers.build/Debug-watchos/CodableWrappers.build/Objects-normal/arm64/CodableWrappers_const_extract_protocols.json -empty-abi-descriptor -validate-clang-modules-once -clang-build-session-file /Users/builder/builds/TDmZkXJm/3/finestructure/swiftpackageindex-builder/spi-builder-workspace/.derivedData/ModuleCache.noindex/Session.modulevalidation -Xcc -working-directory -Xcc /Users/builder/builds/TDmZkXJm/3/finestructure/swiftpackageindex-builder/spi-builder-workspace/.dependencies/checkouts/CodableWrappers -resource-dir /Applications/Xcode-15.2.0.app/Contents/Developer/Toolchains/XcodeDefault.xctoolchain/usr/lib/swift -enable-anonymous-context-mangled-names -Xcc -ivfsstatcache -Xcc /Users/builder/builds/TDmZkXJm/3/finestructure/swiftpackageindex-builder/spi-builder-workspace/.derivedData/SDKStatCaches.noindex/watchos10.2-21S355-1a03c8d25fc3596eb74c01d649b42752.sdkstatcache -Xcc -I/Users/builder/builds/TDmZkXJm/3/finestructure/swiftpackageindex-builder/spi-builder-workspace/.derivedData/Build/Intermediates.noindex/CodableWrappers.build/Debug-watchos/CodableWrappers.build/swift-overrides.hmap -Xcc -I/Users/builder/builds/TDmZkXJm/3/finestructure/swiftpackageindex-builder/spi-builder-workspace/.derivedData/Build/Products/Debug-watchos/include -Xcc -I/Users/builder/builds/TDmZkXJm/3/finestructure/swiftpackageindex-builder/spi-builder-workspace/.derivedData/Build/Intermediates.noindex/CodableWrappers.build/Debug-watchos/CodableWrappers.build/DerivedSources-normal/arm64 -Xcc -I/Users/builder/builds/TDmZkXJm/3/finestructure/swiftpackageindex-builder/spi-builder-workspace/.derivedData/Build/Intermediates.noindex/CodableWrappers.build/Debug-watchos/CodableWrappers.build/DerivedSources/arm64 -Xcc -I/Users/builder/builds/TDmZkXJm/3/finestructure/swiftpackageindex-builder/spi-builder-workspace/.derivedData/Build/Intermediates.noindex/CodableWrappers.build/Debug-watchos/CodableWrappers.build/DerivedSources -Xcc -DSWIFT_PACKAGE -Xcc -DDEBUG\=1 -module-name CodableWrappers -frontend-parseable-output -disable-clang-spi -target-sdk-version 10.2 -target-sdk-name watchos10.2 -external-plugin-path /Applications/Xcode-15.2.0.app/Contents/Developer/Platforms/WatchOS.platform/Developer/SDKs/WatchOS10.2.sdk/usr/lib/swift/host/plugins\#/Applications/Xcode-15.2.0.app/Contents/Developer/Platforms/WatchOS.platform/Developer/SDKs/WatchOS10.2.sdk/usr/bin/swift-plugin-server -external-plugin-path /Applications/Xcode-15.2.0.app/Contents/Developer/Platforms/WatchOS.platform/Developer/SDKs/WatchOS10.2.sdk/usr/local/lib/swift/host/plugins\#/Applications/Xcode-15.2.0.app/Contents/Developer/Platforms/WatchOS.platform/Developer/SDKs/WatchOS10.2.sdk/usr/bin/swift-plugin-server -external-plugin-path /Applications/Xcode-15.2.0.app/Contents/Developer/Platforms/WatchOS.platform/Developer/usr/lib/swift/host/plugins\#/Applications/Xcode-15.2.0.app/Contents/Developer/Platforms/WatchOS.platform/Developer/usr/bin/swift-plugin-server -external-plugin-path /Applications/Xcode-15.2.0.app/Contents/Developer/Platforms/WatchOS.platform/Developer/usr/local/lib/swift/host/plugins\#/Applications/Xcode-15.2.0.app/Contents/Developer/Platforms/WatchOS.platform/Developer/usr/bin/swift-plugin-server -plugin-path /Applications/Xcode-15.2.0.app/Contents/Developer/Toolchains/XcodeDefault.xctoolchain/usr/lib/swift/host/plugins -plugin-path /Applications/Xcode-15.2.0.app/Contents/Developer/Toolchains/XcodeDefault.xctoolchain/usr/local/lib/swift/host/plugins -o /Users/builder/builds/TDmZkXJm/3/finestructure/swiftpackageindex-builder/spi-builder-workspace/.derivedData/Build/Intermediates.noindex/CodableWrappers.build/Debug-watchos/CodableWrappers.build/Objects-normal/arm64/FloatingPointCoding.o -o /Users/builder/builds/TDmZkXJm/3/finestructure/swiftpackageindex-builder/spi-builder-workspace/.derivedData/Build/Intermediates.noindex/CodableWrappers.build/Debug-watchos/CodableWrappers.build/Objects-normal/arm64/NilFiltering.o -index-unit-output-path /CodableWrappers.build/Debug-watchos/CodableWrappers.build/Objects-normal/arm64/FloatingPointCoding.o -index-unit-output-path /CodableWrappers.build/Debug-watchos/CodableWrappers.build/Objects-normal/arm64/NilFiltering.o -index-store-path /Users/builder/builds/TDmZkXJm/3/finestructure/swiftpackageindex-builder/spi-builder-workspace/.derivedData/Index.noindex/DataStore -index-system-modules
SwiftCompile normal arm64 Compiling\ NullEncoding.swift,\ StaticCoding.swift /Users/builder/builds/TDmZkXJm/3/finestructure/swiftpackageindex-builder/spi-builder-workspace/.dependencies/checkouts/CodableWrappers/Sources/CodableWrappers/StaticCoders/NullEncoding.swift /Users/builder/builds/TDmZkXJm/3/finestructure/swiftpackageindex-builder/spi-builder-workspace/.dependencies/checkouts/CodableWrappers/Sources/CodableWrappers/StaticCoders/StaticCoding.swift (in target 'CodableWrappers' from project 'CodableWrappers')
cd /Users/builder/builds/TDmZkXJm/3/finestructure/swiftpackageindex-builder/spi-builder-workspace/.dependencies/checkouts/CodableWrappers
builtin-swiftTaskExecution -- /Applications/Xcode-15.2.0.app/Contents/Developer/Toolchains/XcodeDefault.xctoolchain/usr/bin/swift-frontend -frontend -c /Users/builder/builds/TDmZkXJm/3/finestructure/swiftpackageindex-builder/spi-builder-workspace/.dependencies/checkouts/CodableWrappers/Sources/CodableWrappers/Convenience/ConveienceAdherence.swift /Users/builder/builds/TDmZkXJm/3/finestructure/swiftpackageindex-builder/spi-builder-workspace/.dependencies/checkouts/CodableWrappers/Sources/CodableWrappers/Convenience/CustomWrappers.swift /Users/builder/builds/TDmZkXJm/3/finestructure/swiftpackageindex-builder/spi-builder-workspace/.dependencies/checkouts/CodableWrappers/Sources/CodableWrappers/Convenience/EmptyDefaults.swift /Users/builder/builds/TDmZkXJm/3/finestructure/swiftpackageindex-builder/spi-builder-workspace/.dependencies/checkouts/CodableWrappers/Sources/CodableWrappers/Core/FallbackCoding.swift /Users/builder/builds/TDmZkXJm/3/finestructure/swiftpackageindex-builder/spi-builder-workspace/.dependencies/checkouts/CodableWrappers/Sources/CodableWrappers/Core/ImmutableWrapper.swift /Users/builder/builds/TDmZkXJm/3/finestructure/swiftpackageindex-builder/spi-builder-workspace/.dependencies/checkouts/CodableWrappers/Sources/CodableWrappers/Core/OmitCodingWrappers.swift /Users/builder/builds/TDmZkXJm/3/finestructure/swiftpackageindex-builder/spi-builder-workspace/.dependencies/checkouts/CodableWrappers/Sources/CodableWrappers/Core/OptionalWrappers.swift /Users/builder/builds/TDmZkXJm/3/finestructure/swiftpackageindex-builder/spi-builder-workspace/.dependencies/checkouts/CodableWrappers/Sources/CodableWrappers/Core/StaticCodingWrappers.swift /Users/builder/builds/TDmZkXJm/3/finestructure/swiftpackageindex-builder/spi-builder-workspace/.dependencies/checkouts/CodableWrappers/Sources/CodableWrappers/Core/TransientCoding.swift /Users/builder/builds/TDmZkXJm/3/finestructure/swiftpackageindex-builder/spi-builder-workspace/.dependencies/checkouts/CodableWrappers/Sources/CodableWrappers/Deprecated/Old.swift /Users/builder/builds/TDmZkXJm/3/finestructure/swiftpackageindex-builder/spi-builder-workspace/.dependencies/checkouts/CodableWrappers/Sources/CodableWrappers/StaticCoders/BoolCoding.swift /Users/builder/builds/TDmZkXJm/3/finestructure/swiftpackageindex-builder/spi-builder-workspace/.dependencies/checkouts/CodableWrappers/Sources/CodableWrappers/StaticCoders/DataCoding.swift /Users/builder/builds/TDmZkXJm/3/finestructure/swiftpackageindex-builder/spi-builder-workspace/.dependencies/checkouts/CodableWrappers/Sources/CodableWrappers/StaticCoders/DateCoding.swift /Users/builder/builds/TDmZkXJm/3/finestructure/swiftpackageindex-builder/spi-builder-workspace/.dependencies/checkouts/CodableWrappers/Sources/CodableWrappers/StaticCoders/FloatingPointCoding.swift /Users/builder/builds/TDmZkXJm/3/finestructure/swiftpackageindex-builder/spi-builder-workspace/.dependencies/checkouts/CodableWrappers/Sources/CodableWrappers/StaticCoders/NilFiltering.swift -primary-file /Users/builder/builds/TDmZkXJm/3/finestructure/swiftpackageindex-builder/spi-builder-workspace/.dependencies/checkouts/CodableWrappers/Sources/CodableWrappers/StaticCoders/NullEncoding.swift -primary-file /Users/builder/builds/TDmZkXJm/3/finestructure/swiftpackageindex-builder/spi-builder-workspace/.dependencies/checkouts/CodableWrappers/Sources/CodableWrappers/StaticCoders/StaticCoding.swift -emit-dependencies-path /Users/builder/builds/TDmZkXJm/3/finestructure/swiftpackageindex-builder/spi-builder-workspace/.derivedData/Build/Intermediates.noindex/CodableWrappers.build/Debug-watchos/CodableWrappers.build/Objects-normal/arm64/NullEncoding.d -emit-const-values-path /Users/builder/builds/TDmZkXJm/3/finestructure/swiftpackageindex-builder/spi-builder-workspace/.derivedData/Build/Intermediates.noindex/CodableWrappers.build/Debug-watchos/CodableWrappers.build/Objects-normal/arm64/NullEncoding.swiftconstvalues -emit-reference-dependencies-path /Users/builder/builds/TDmZkXJm/3/finestructure/swiftpackageindex-builder/spi-builder-workspace/.derivedData/Build/Intermediates.noindex/CodableWrappers.build/Debug-watchos/CodableWrappers.build/Objects-normal/arm64/NullEncoding.swiftdeps -serialize-diagnostics-path /Users/builder/builds/TDmZkXJm/3/finestructure/swiftpackageindex-builder/spi-builder-workspace/.derivedData/Build/Intermediates.noindex/CodableWrappers.build/Debug-watchos/CodableWrappers.build/Objects-normal/arm64/NullEncoding.dia -emit-dependencies-path /Users/builder/builds/TDmZkXJm/3/finestructure/swiftpackageindex-builder/spi-builder-workspace/.derivedData/Build/Intermediates.noindex/CodableWrappers.build/Debug-watchos/CodableWrappers.build/Objects-normal/arm64/StaticCoding.d -emit-const-values-path /Users/builder/builds/TDmZkXJm/3/finestructure/swiftpackageindex-builder/spi-builder-workspace/.derivedData/Build/Intermediates.noindex/CodableWrappers.build/Debug-watchos/CodableWrappers.build/Objects-normal/arm64/StaticCoding.swiftconstvalues -emit-reference-dependencies-path /Users/builder/builds/TDmZkXJm/3/finestructure/swiftpackageindex-builder/spi-builder-workspace/.derivedData/Build/Intermediates.noindex/CodableWrappers.build/Debug-watchos/CodableWrappers.build/Objects-normal/arm64/StaticCoding.swiftdeps -serialize-diagnostics-path /Users/builder/builds/TDmZkXJm/3/finestructure/swiftpackageindex-builder/spi-builder-workspace/.derivedData/Build/Intermediates.noindex/CodableWrappers.build/Debug-watchos/CodableWrappers.build/Objects-normal/arm64/StaticCoding.dia -target arm64-apple-watchos5.0 -Xllvm -aarch64-use-tbi -enable-objc-interop -sdk /Applications/Xcode-15.2.0.app/Contents/Developer/Platforms/WatchOS.platform/Developer/SDKs/WatchOS10.2.sdk -I /Users/builder/builds/TDmZkXJm/3/finestructure/swiftpackageindex-builder/spi-builder-workspace/.derivedData/Build/Products/Debug-watchos -I /Applications/Xcode-15.2.0.app/Contents/Developer/Platforms/WatchOS.platform/Developer/usr/lib -F /Users/builder/builds/TDmZkXJm/3/finestructure/swiftpackageindex-builder/spi-builder-workspace/.derivedData/Build/Products/Debug-watchos -F /Applications/Xcode-15.2.0.app/Contents/Developer/Platforms/WatchOS.platform/Developer/Library/Frameworks -F /Applications/Xcode-15.2.0.app/Contents/Developer/Platforms/WatchOS.platform/Developer/SDKs/WatchOS10.2.sdk/Developer/Library/Frameworks -no-color-diagnostics -suppress-warnings -enable-testing -g -module-cache-path /Users/builder/builds/TDmZkXJm/3/finestructure/swiftpackageindex-builder/spi-builder-workspace/.derivedData/ModuleCache.noindex -profile-generate -profile-coverage-mapping -swift-version 5 -enforce-exclusivity\=checked -Onone -D SWIFT_PACKAGE -D DEBUG -D Xcode -serialize-debugging-options -const-gather-protocols-file /Users/builder/builds/TDmZkXJm/3/finestructure/swiftpackageindex-builder/spi-builder-workspace/.derivedData/Build/Intermediates.noindex/CodableWrappers.build/Debug-watchos/CodableWrappers.build/Objects-normal/arm64/CodableWrappers_const_extract_protocols.json -empty-abi-descriptor -validate-clang-modules-once -clang-build-session-file /Users/builder/builds/TDmZkXJm/3/finestructure/swiftpackageindex-builder/spi-builder-workspace/.derivedData/ModuleCache.noindex/Session.modulevalidation -Xcc -working-directory -Xcc /Users/builder/builds/TDmZkXJm/3/finestructure/swiftpackageindex-builder/spi-builder-workspace/.dependencies/checkouts/CodableWrappers -resource-dir /Applications/Xcode-15.2.0.app/Contents/Developer/Toolchains/XcodeDefault.xctoolchain/usr/lib/swift -enable-anonymous-context-mangled-names -Xcc -ivfsstatcache -Xcc /Users/builder/builds/TDmZkXJm/3/finestructure/swiftpackageindex-builder/spi-builder-workspace/.derivedData/SDKStatCaches.noindex/watchos10.2-21S355-1a03c8d25fc3596eb74c01d649b42752.sdkstatcache -Xcc -I/Users/builder/builds/TDmZkXJm/3/finestructure/swiftpackageindex-builder/spi-builder-workspace/.derivedData/Build/Intermediates.noindex/CodableWrappers.build/Debug-watchos/CodableWrappers.build/swift-overrides.hmap -Xcc -I/Users/builder/builds/TDmZkXJm/3/finestructure/swiftpackageindex-builder/spi-builder-workspace/.derivedData/Build/Products/Debug-watchos/include -Xcc -I/Users/builder/builds/TDmZkXJm/3/finestructure/swiftpackageindex-builder/spi-builder-workspace/.derivedData/Build/Intermediates.noindex/CodableWrappers.build/Debug-watchos/CodableWrappers.build/DerivedSources-normal/arm64 -Xcc -I/Users/builder/builds/TDmZkXJm/3/finestructure/swiftpackageindex-builder/spi-builder-workspace/.derivedData/Build/Intermediates.noindex/CodableWrappers.build/Debug-watchos/CodableWrappers.build/DerivedSources/arm64 -Xcc -I/Users/builder/builds/TDmZkXJm/3/finestructure/swiftpackageindex-builder/spi-builder-workspace/.derivedData/Build/Intermediates.noindex/CodableWrappers.build/Debug-watchos/CodableWrappers.build/DerivedSources -Xcc -DSWIFT_PACKAGE -Xcc -DDEBUG\=1 -module-name CodableWrappers -frontend-parseable-output -disable-clang-spi -target-sdk-version 10.2 -target-sdk-name watchos10.2 -external-plugin-path /Applications/Xcode-15.2.0.app/Contents/Developer/Platforms/WatchOS.platform/Developer/SDKs/WatchOS10.2.sdk/usr/lib/swift/host/plugins\#/Applications/Xcode-15.2.0.app/Contents/Developer/Platforms/WatchOS.platform/Developer/SDKs/WatchOS10.2.sdk/usr/bin/swift-plugin-server -external-plugin-path /Applications/Xcode-15.2.0.app/Contents/Developer/Platforms/WatchOS.platform/Developer/SDKs/WatchOS10.2.sdk/usr/local/lib/swift/host/plugins\#/Applications/Xcode-15.2.0.app/Contents/Developer/Platforms/WatchOS.platform/Developer/SDKs/WatchOS10.2.sdk/usr/bin/swift-plugin-server -external-plugin-path /Applications/Xcode-15.2.0.app/Contents/Developer/Platforms/WatchOS.platform/Developer/usr/lib/swift/host/plugins\#/Applications/Xcode-15.2.0.app/Contents/Developer/Platforms/WatchOS.platform/Developer/usr/bin/swift-plugin-server -external-plugin-path /Applications/Xcode-15.2.0.app/Contents/Developer/Platforms/WatchOS.platform/Developer/usr/local/lib/swift/host/plugins\#/Applications/Xcode-15.2.0.app/Contents/Developer/Platforms/WatchOS.platform/Developer/usr/bin/swift-plugin-server -plugin-path /Applications/Xcode-15.2.0.app/Contents/Developer/Toolchains/XcodeDefault.xctoolchain/usr/lib/swift/host/plugins -plugin-path /Applications/Xcode-15.2.0.app/Contents/Developer/Toolchains/XcodeDefault.xctoolchain/usr/local/lib/swift/host/plugins -o /Users/builder/builds/TDmZkXJm/3/finestructure/swiftpackageindex-builder/spi-builder-workspace/.derivedData/Build/Intermediates.noindex/CodableWrappers.build/Debug-watchos/CodableWrappers.build/Objects-normal/arm64/NullEncoding.o -o /Users/builder/builds/TDmZkXJm/3/finestructure/swiftpackageindex-builder/spi-builder-workspace/.derivedData/Build/Intermediates.noindex/CodableWrappers.build/Debug-watchos/CodableWrappers.build/Objects-normal/arm64/StaticCoding.o -index-unit-output-path /CodableWrappers.build/Debug-watchos/CodableWrappers.build/Objects-normal/arm64/NullEncoding.o -index-unit-output-path /CodableWrappers.build/Debug-watchos/CodableWrappers.build/Objects-normal/arm64/StaticCoding.o -index-store-path /Users/builder/builds/TDmZkXJm/3/finestructure/swiftpackageindex-builder/spi-builder-workspace/.derivedData/Index.noindex/DataStore -index-system-modules
SwiftCompile normal arm64 /Users/builder/builds/TDmZkXJm/3/finestructure/swiftpackageindex-builder/spi-builder-workspace/.dependencies/checkouts/CodableWrappers/Sources/CodableWrappers/StaticCoders/NullEncoding.swift (in target 'CodableWrappers' from project 'CodableWrappers')
cd /Users/builder/builds/TDmZkXJm/3/finestructure/swiftpackageindex-builder/spi-builder-workspace/.dependencies/checkouts/CodableWrappers
/Applications/Xcode-15.2.0.app/Contents/Developer/Toolchains/XcodeDefault.xctoolchain/usr/bin/swift-frontend -c /Users/builder/builds/TDmZkXJm/3/finestructure/swiftpackageindex-builder/spi-builder-workspace/.dependencies/checkouts/CodableWrappers/Sources/CodableWrappers/Convenience/ConveienceAdherence.swift /Users/builder/builds/TDmZkXJm/3/finestructure/swiftpackageindex-builder/spi-builder-workspace/.dependencies/checkouts/CodableWrappers/Sources/CodableWrappers/Convenience/CustomWrappers.swift /Users/builder/builds/TDmZkXJm/3/finestructure/swiftpackageindex-builder/spi-builder-workspace/.dependencies/checkouts/CodableWrappers/Sources/CodableWrappers/Convenience/EmptyDefaults.swift /Users/builder/builds/TDmZkXJm/3/finestructure/swiftpackageindex-builder/spi-builder-workspace/.dependencies/checkouts/CodableWrappers/Sources/CodableWrappers/Core/FallbackCoding.swift /Users/builder/builds/TDmZkXJm/3/finestructure/swiftpackageindex-builder/spi-builder-workspace/.dependencies/checkouts/CodableWrappers/Sources/CodableWrappers/Core/ImmutableWrapper.swift /Users/builder/builds/TDmZkXJm/3/finestructure/swiftpackageindex-builder/spi-builder-workspace/.dependencies/checkouts/CodableWrappers/Sources/CodableWrappers/Core/OmitCodingWrappers.swift /Users/builder/builds/TDmZkXJm/3/finestructure/swiftpackageindex-builder/spi-builder-workspace/.dependencies/checkouts/CodableWrappers/Sources/CodableWrappers/Core/OptionalWrappers.swift /Users/builder/builds/TDmZkXJm/3/finestructure/swiftpackageindex-builder/spi-builder-workspace/.dependencies/checkouts/CodableWrappers/Sources/CodableWrappers/Core/StaticCodingWrappers.swift /Users/builder/builds/TDmZkXJm/3/finestructure/swiftpackageindex-builder/spi-builder-workspace/.dependencies/checkouts/CodableWrappers/Sources/CodableWrappers/Core/TransientCoding.swift /Users/builder/builds/TDmZkXJm/3/finestructure/swiftpackageindex-builder/spi-builder-workspace/.dependencies/checkouts/CodableWrappers/Sources/CodableWrappers/Deprecated/Old.swift /Users/builder/builds/TDmZkXJm/3/finestructure/swiftpackageindex-builder/spi-builder-workspace/.dependencies/checkouts/CodableWrappers/Sources/CodableWrappers/StaticCoders/BoolCoding.swift /Users/builder/builds/TDmZkXJm/3/finestructure/swiftpackageindex-builder/spi-builder-workspace/.dependencies/checkouts/CodableWrappers/Sources/CodableWrappers/StaticCoders/DataCoding.swift /Users/builder/builds/TDmZkXJm/3/finestructure/swiftpackageindex-builder/spi-builder-workspace/.dependencies/checkouts/CodableWrappers/Sources/CodableWrappers/StaticCoders/DateCoding.swift /Users/builder/builds/TDmZkXJm/3/finestructure/swiftpackageindex-builder/spi-builder-workspace/.dependencies/checkouts/CodableWrappers/Sources/CodableWrappers/StaticCoders/FloatingPointCoding.swift /Users/builder/builds/TDmZkXJm/3/finestructure/swiftpackageindex-builder/spi-builder-workspace/.dependencies/checkouts/CodableWrappers/Sources/CodableWrappers/StaticCoders/NilFiltering.swift -primary-file /Users/builder/builds/TDmZkXJm/3/finestructure/swiftpackageindex-builder/spi-builder-workspace/.dependencies/checkouts/CodableWrappers/Sources/CodableWrappers/StaticCoders/NullEncoding.swift -primary-file /Users/builder/builds/TDmZkXJm/3/finestructure/swiftpackageindex-builder/spi-builder-workspace/.dependencies/checkouts/CodableWrappers/Sources/CodableWrappers/StaticCoders/StaticCoding.swift -emit-dependencies-path /Users/builder/builds/TDmZkXJm/3/finestructure/swiftpackageindex-builder/spi-builder-workspace/.derivedData/Build/Intermediates.noindex/CodableWrappers.build/Debug-watchos/CodableWrappers.build/Objects-normal/arm64/NullEncoding.d -emit-const-values-path /Users/builder/builds/TDmZkXJm/3/finestructure/swiftpackageindex-builder/spi-builder-workspace/.derivedData/Build/Intermediates.noindex/CodableWrappers.build/Debug-watchos/CodableWrappers.build/Objects-normal/arm64/NullEncoding.swiftconstvalues -emit-reference-dependencies-path /Users/builder/builds/TDmZkXJm/3/finestructure/swiftpackageindex-builder/spi-builder-workspace/.derivedData/Build/Intermediates.noindex/CodableWrappers.build/Debug-watchos/CodableWrappers.build/Objects-normal/arm64/NullEncoding.swiftdeps -serialize-diagnostics-path /Users/builder/builds/TDmZkXJm/3/finestructure/swiftpackageindex-builder/spi-builder-workspace/.derivedData/Build/Intermediates.noindex/CodableWrappers.build/Debug-watchos/CodableWrappers.build/Objects-normal/arm64/NullEncoding.dia -emit-dependencies-path /Users/builder/builds/TDmZkXJm/3/finestructure/swiftpackageindex-builder/spi-builder-workspace/.derivedData/Build/Intermediates.noindex/CodableWrappers.build/Debug-watchos/CodableWrappers.build/Objects-normal/arm64/StaticCoding.d -emit-const-values-path /Users/builder/builds/TDmZkXJm/3/finestructure/swiftpackageindex-builder/spi-builder-workspace/.derivedData/Build/Intermediates.noindex/CodableWrappers.build/Debug-watchos/CodableWrappers.build/Objects-normal/arm64/StaticCoding.swiftconstvalues -emit-reference-dependencies-path /Users/builder/builds/TDmZkXJm/3/finestructure/swiftpackageindex-builder/spi-builder-workspace/.derivedData/Build/Intermediates.noindex/CodableWrappers.build/Debug-watchos/CodableWrappers.build/Objects-normal/arm64/StaticCoding.swiftdeps -serialize-diagnostics-path /Users/builder/builds/TDmZkXJm/3/finestructure/swiftpackageindex-builder/spi-builder-workspace/.derivedData/Build/Intermediates.noindex/CodableWrappers.build/Debug-watchos/CodableWrappers.build/Objects-normal/arm64/StaticCoding.dia -target arm64-apple-watchos5.0 -Xllvm -aarch64-use-tbi -enable-objc-interop -sdk /Applications/Xcode-15.2.0.app/Contents/Developer/Platforms/WatchOS.platform/Developer/SDKs/WatchOS10.2.sdk -I /Users/builder/builds/TDmZkXJm/3/finestructure/swiftpackageindex-builder/spi-builder-workspace/.derivedData/Build/Products/Debug-watchos -I /Applications/Xcode-15.2.0.app/Contents/Developer/Platforms/WatchOS.platform/Developer/usr/lib -F /Users/builder/builds/TDmZkXJm/3/finestructure/swiftpackageindex-builder/spi-builder-workspace/.derivedData/Build/Products/Debug-watchos -F /Applications/Xcode-15.2.0.app/Contents/Developer/Platforms/WatchOS.platform/Developer/Library/Frameworks -F /Applications/Xcode-15.2.0.app/Contents/Developer/Platforms/WatchOS.platform/Developer/SDKs/WatchOS10.2.sdk/Developer/Library/Frameworks -no-color-diagnostics -suppress-warnings -enable-testing -g -module-cache-path /Users/builder/builds/TDmZkXJm/3/finestructure/swiftpackageindex-builder/spi-builder-workspace/.derivedData/ModuleCache.noindex -profile-generate -profile-coverage-mapping -swift-version 5 -enforce-exclusivity\=checked -Onone -D SWIFT_PACKAGE -D DEBUG -D Xcode -serialize-debugging-options -const-gather-protocols-file /Users/builder/builds/TDmZkXJm/3/finestructure/swiftpackageindex-builder/spi-builder-workspace/.derivedData/Build/Intermediates.noindex/CodableWrappers.build/Debug-watchos/CodableWrappers.build/Objects-normal/arm64/CodableWrappers_const_extract_protocols.json -empty-abi-descriptor -validate-clang-modules-once -clang-build-session-file /Users/builder/builds/TDmZkXJm/3/finestructure/swiftpackageindex-builder/spi-builder-workspace/.derivedData/ModuleCache.noindex/Session.modulevalidation -Xcc -working-directory -Xcc /Users/builder/builds/TDmZkXJm/3/finestructure/swiftpackageindex-builder/spi-builder-workspace/.dependencies/checkouts/CodableWrappers -resource-dir /Applications/Xcode-15.2.0.app/Contents/Developer/Toolchains/XcodeDefault.xctoolchain/usr/lib/swift -enable-anonymous-context-mangled-names -Xcc -ivfsstatcache -Xcc /Users/builder/builds/TDmZkXJm/3/finestructure/swiftpackageindex-builder/spi-builder-workspace/.derivedData/SDKStatCaches.noindex/watchos10.2-21S355-1a03c8d25fc3596eb74c01d649b42752.sdkstatcache -Xcc -I/Users/builder/builds/TDmZkXJm/3/finestructure/swiftpackageindex-builder/spi-builder-workspace/.derivedData/Build/Intermediates.noindex/CodableWrappers.build/Debug-watchos/CodableWrappers.build/swift-overrides.hmap -Xcc -I/Users/builder/builds/TDmZkXJm/3/finestructure/swiftpackageindex-builder/spi-builder-workspace/.derivedData/Build/Products/Debug-watchos/include -Xcc -I/Users/builder/builds/TDmZkXJm/3/finestructure/swiftpackageindex-builder/spi-builder-workspace/.derivedData/Build/Intermediates.noindex/CodableWrappers.build/Debug-watchos/CodableWrappers.build/DerivedSources-normal/arm64 -Xcc -I/Users/builder/builds/TDmZkXJm/3/finestructure/swiftpackageindex-builder/spi-builder-workspace/.derivedData/Build/Intermediates.noindex/CodableWrappers.build/Debug-watchos/CodableWrappers.build/DerivedSources/arm64 -Xcc -I/Users/builder/builds/TDmZkXJm/3/finestructure/swiftpackageindex-builder/spi-builder-workspace/.derivedData/Build/Intermediates.noindex/CodableWrappers.build/Debug-watchos/CodableWrappers.build/DerivedSources -Xcc -DSWIFT_PACKAGE -Xcc -DDEBUG\=1 -module-name CodableWrappers -frontend-parseable-output -disable-clang-spi -target-sdk-version 10.2 -target-sdk-name watchos10.2 -external-plugin-path /Applications/Xcode-15.2.0.app/Contents/Developer/Platforms/WatchOS.platform/Developer/SDKs/WatchOS10.2.sdk/usr/lib/swift/host/plugins\#/Applications/Xcode-15.2.0.app/Contents/Developer/Platforms/WatchOS.platform/Developer/SDKs/WatchOS10.2.sdk/usr/bin/swift-plugin-server -external-plugin-path /Applications/Xcode-15.2.0.app/Contents/Developer/Platforms/WatchOS.platform/Developer/SDKs/WatchOS10.2.sdk/usr/local/lib/swift/host/plugins\#/Applications/Xcode-15.2.0.app/Contents/Developer/Platforms/WatchOS.platform/Developer/SDKs/WatchOS10.2.sdk/usr/bin/swift-plugin-server -external-plugin-path /Applications/Xcode-15.2.0.app/Contents/Developer/Platforms/WatchOS.platform/Developer/usr/lib/swift/host/plugins\#/Applications/Xcode-15.2.0.app/Contents/Developer/Platforms/WatchOS.platform/Developer/usr/bin/swift-plugin-server -external-plugin-path /Applications/Xcode-15.2.0.app/Contents/Developer/Platforms/WatchOS.platform/Developer/usr/local/lib/swift/host/plugins\#/Applications/Xcode-15.2.0.app/Contents/Developer/Platforms/WatchOS.platform/Developer/usr/bin/swift-plugin-server -plugin-path /Applications/Xcode-15.2.0.app/Contents/Developer/Toolchains/XcodeDefault.xctoolchain/usr/lib/swift/host/plugins -plugin-path /Applications/Xcode-15.2.0.app/Contents/Developer/Toolchains/XcodeDefault.xctoolchain/usr/local/lib/swift/host/plugins -o /Users/builder/builds/TDmZkXJm/3/finestructure/swiftpackageindex-builder/spi-builder-workspace/.derivedData/Build/Intermediates.noindex/CodableWrappers.build/Debug-watchos/CodableWrappers.build/Objects-normal/arm64/NullEncoding.o -o /Users/builder/builds/TDmZkXJm/3/finestructure/swiftpackageindex-builder/spi-builder-workspace/.derivedData/Build/Intermediates.noindex/CodableWrappers.build/Debug-watchos/CodableWrappers.build/Objects-normal/arm64/StaticCoding.o -index-unit-output-path /CodableWrappers.build/Debug-watchos/CodableWrappers.build/Objects-normal/arm64/NullEncoding.o -index-unit-output-path /CodableWrappers.build/Debug-watchos/CodableWrappers.build/Objects-normal/arm64/StaticCoding.o -index-store-path /Users/builder/builds/TDmZkXJm/3/finestructure/swiftpackageindex-builder/spi-builder-workspace/.derivedData/Index.noindex/DataStore -index-system-modules
SwiftCompile normal arm64 /Users/builder/builds/TDmZkXJm/3/finestructure/swiftpackageindex-builder/spi-builder-workspace/.dependencies/checkouts/CodableWrappers/Sources/CodableWrappers/StaticCoders/StaticCoding.swift (in target 'CodableWrappers' from project 'CodableWrappers')
cd /Users/builder/builds/TDmZkXJm/3/finestructure/swiftpackageindex-builder/spi-builder-workspace/.dependencies/checkouts/CodableWrappers
/Applications/Xcode-15.2.0.app/Contents/Developer/Toolchains/XcodeDefault.xctoolchain/usr/bin/swift-frontend -c /Users/builder/builds/TDmZkXJm/3/finestructure/swiftpackageindex-builder/spi-builder-workspace/.dependencies/checkouts/CodableWrappers/Sources/CodableWrappers/Convenience/ConveienceAdherence.swift /Users/builder/builds/TDmZkXJm/3/finestructure/swiftpackageindex-builder/spi-builder-workspace/.dependencies/checkouts/CodableWrappers/Sources/CodableWrappers/Convenience/CustomWrappers.swift /Users/builder/builds/TDmZkXJm/3/finestructure/swiftpackageindex-builder/spi-builder-workspace/.dependencies/checkouts/CodableWrappers/Sources/CodableWrappers/Convenience/EmptyDefaults.swift /Users/builder/builds/TDmZkXJm/3/finestructure/swiftpackageindex-builder/spi-builder-workspace/.dependencies/checkouts/CodableWrappers/Sources/CodableWrappers/Core/FallbackCoding.swift /Users/builder/builds/TDmZkXJm/3/finestructure/swiftpackageindex-builder/spi-builder-workspace/.dependencies/checkouts/CodableWrappers/Sources/CodableWrappers/Core/ImmutableWrapper.swift /Users/builder/builds/TDmZkXJm/3/finestructure/swiftpackageindex-builder/spi-builder-workspace/.dependencies/checkouts/CodableWrappers/Sources/CodableWrappers/Core/OmitCodingWrappers.swift /Users/builder/builds/TDmZkXJm/3/finestructure/swiftpackageindex-builder/spi-builder-workspace/.dependencies/checkouts/CodableWrappers/Sources/CodableWrappers/Core/OptionalWrappers.swift /Users/builder/builds/TDmZkXJm/3/finestructure/swiftpackageindex-builder/spi-builder-workspace/.dependencies/checkouts/CodableWrappers/Sources/CodableWrappers/Core/StaticCodingWrappers.swift /Users/builder/builds/TDmZkXJm/3/finestructure/swiftpackageindex-builder/spi-builder-workspace/.dependencies/checkouts/CodableWrappers/Sources/CodableWrappers/Core/TransientCoding.swift /Users/builder/builds/TDmZkXJm/3/finestructure/swiftpackageindex-builder/spi-builder-workspace/.dependencies/checkouts/CodableWrappers/Sources/CodableWrappers/Deprecated/Old.swift /Users/builder/builds/TDmZkXJm/3/finestructure/swiftpackageindex-builder/spi-builder-workspace/.dependencies/checkouts/CodableWrappers/Sources/CodableWrappers/StaticCoders/BoolCoding.swift /Users/builder/builds/TDmZkXJm/3/finestructure/swiftpackageindex-builder/spi-builder-workspace/.dependencies/checkouts/CodableWrappers/Sources/CodableWrappers/StaticCoders/DataCoding.swift /Users/builder/builds/TDmZkXJm/3/finestructure/swiftpackageindex-builder/spi-builder-workspace/.dependencies/checkouts/CodableWrappers/Sources/CodableWrappers/StaticCoders/DateCoding.swift /Users/builder/builds/TDmZkXJm/3/finestructure/swiftpackageindex-builder/spi-builder-workspace/.dependencies/checkouts/CodableWrappers/Sources/CodableWrappers/StaticCoders/FloatingPointCoding.swift /Users/builder/builds/TDmZkXJm/3/finestructure/swiftpackageindex-builder/spi-builder-workspace/.dependencies/checkouts/CodableWrappers/Sources/CodableWrappers/StaticCoders/NilFiltering.swift -primary-file /Users/builder/builds/TDmZkXJm/3/finestructure/swiftpackageindex-builder/spi-builder-workspace/.dependencies/checkouts/CodableWrappers/Sources/CodableWrappers/StaticCoders/NullEncoding.swift -primary-file /Users/builder/builds/TDmZkXJm/3/finestructure/swiftpackageindex-builder/spi-builder-workspace/.dependencies/checkouts/CodableWrappers/Sources/CodableWrappers/StaticCoders/StaticCoding.swift -emit-dependencies-path /Users/builder/builds/TDmZkXJm/3/finestructure/swiftpackageindex-builder/spi-builder-workspace/.derivedData/Build/Intermediates.noindex/CodableWrappers.build/Debug-watchos/CodableWrappers.build/Objects-normal/arm64/NullEncoding.d -emit-const-values-path /Users/builder/builds/TDmZkXJm/3/finestructure/swiftpackageindex-builder/spi-builder-workspace/.derivedData/Build/Intermediates.noindex/CodableWrappers.build/Debug-watchos/CodableWrappers.build/Objects-normal/arm64/NullEncoding.swiftconstvalues -emit-reference-dependencies-path /Users/builder/builds/TDmZkXJm/3/finestructure/swiftpackageindex-builder/spi-builder-workspace/.derivedData/Build/Intermediates.noindex/CodableWrappers.build/Debug-watchos/CodableWrappers.build/Objects-normal/arm64/NullEncoding.swiftdeps -serialize-diagnostics-path /Users/builder/builds/TDmZkXJm/3/finestructure/swiftpackageindex-builder/spi-builder-workspace/.derivedData/Build/Intermediates.noindex/CodableWrappers.build/Debug-watchos/CodableWrappers.build/Objects-normal/arm64/NullEncoding.dia -emit-dependencies-path /Users/builder/builds/TDmZkXJm/3/finestructure/swiftpackageindex-builder/spi-builder-workspace/.derivedData/Build/Intermediates.noindex/CodableWrappers.build/Debug-watchos/CodableWrappers.build/Objects-normal/arm64/StaticCoding.d -emit-const-values-path /Users/builder/builds/TDmZkXJm/3/finestructure/swiftpackageindex-builder/spi-builder-workspace/.derivedData/Build/Intermediates.noindex/CodableWrappers.build/Debug-watchos/CodableWrappers.build/Objects-normal/arm64/StaticCoding.swiftconstvalues -emit-reference-dependencies-path /Users/builder/builds/TDmZkXJm/3/finestructure/swiftpackageindex-builder/spi-builder-workspace/.derivedData/Build/Intermediates.noindex/CodableWrappers.build/Debug-watchos/CodableWrappers.build/Objects-normal/arm64/StaticCoding.swiftdeps -serialize-diagnostics-path /Users/builder/builds/TDmZkXJm/3/finestructure/swiftpackageindex-builder/spi-builder-workspace/.derivedData/Build/Intermediates.noindex/CodableWrappers.build/Debug-watchos/CodableWrappers.build/Objects-normal/arm64/StaticCoding.dia -target arm64-apple-watchos5.0 -Xllvm -aarch64-use-tbi -enable-objc-interop -sdk /Applications/Xcode-15.2.0.app/Contents/Developer/Platforms/WatchOS.platform/Developer/SDKs/WatchOS10.2.sdk -I /Users/builder/builds/TDmZkXJm/3/finestructure/swiftpackageindex-builder/spi-builder-workspace/.derivedData/Build/Products/Debug-watchos -I /Applications/Xcode-15.2.0.app/Contents/Developer/Platforms/WatchOS.platform/Developer/usr/lib -F /Users/builder/builds/TDmZkXJm/3/finestructure/swiftpackageindex-builder/spi-builder-workspace/.derivedData/Build/Products/Debug-watchos -F /Applications/Xcode-15.2.0.app/Contents/Developer/Platforms/WatchOS.platform/Developer/Library/Frameworks -F /Applications/Xcode-15.2.0.app/Contents/Developer/Platforms/WatchOS.platform/Developer/SDKs/WatchOS10.2.sdk/Developer/Library/Frameworks -no-color-diagnostics -suppress-warnings -enable-testing -g -module-cache-path /Users/builder/builds/TDmZkXJm/3/finestructure/swiftpackageindex-builder/spi-builder-workspace/.derivedData/ModuleCache.noindex -profile-generate -profile-coverage-mapping -swift-version 5 -enforce-exclusivity\=checked -Onone -D SWIFT_PACKAGE -D DEBUG -D Xcode -serialize-debugging-options -const-gather-protocols-file /Users/builder/builds/TDmZkXJm/3/finestructure/swiftpackageindex-builder/spi-builder-workspace/.derivedData/Build/Intermediates.noindex/CodableWrappers.build/Debug-watchos/CodableWrappers.build/Objects-normal/arm64/CodableWrappers_const_extract_protocols.json -empty-abi-descriptor -validate-clang-modules-once -clang-build-session-file /Users/builder/builds/TDmZkXJm/3/finestructure/swiftpackageindex-builder/spi-builder-workspace/.derivedData/ModuleCache.noindex/Session.modulevalidation -Xcc -working-directory -Xcc /Users/builder/builds/TDmZkXJm/3/finestructure/swiftpackageindex-builder/spi-builder-workspace/.dependencies/checkouts/CodableWrappers -resource-dir /Applications/Xcode-15.2.0.app/Contents/Developer/Toolchains/XcodeDefault.xctoolchain/usr/lib/swift -enable-anonymous-context-mangled-names -Xcc -ivfsstatcache -Xcc /Users/builder/builds/TDmZkXJm/3/finestructure/swiftpackageindex-builder/spi-builder-workspace/.derivedData/SDKStatCaches.noindex/watchos10.2-21S355-1a03c8d25fc3596eb74c01d649b42752.sdkstatcache -Xcc -I/Users/builder/builds/TDmZkXJm/3/finestructure/swiftpackageindex-builder/spi-builder-workspace/.derivedData/Build/Intermediates.noindex/CodableWrappers.build/Debug-watchos/CodableWrappers.build/swift-overrides.hmap -Xcc -I/Users/builder/builds/TDmZkXJm/3/finestructure/swiftpackageindex-builder/spi-builder-workspace/.derivedData/Build/Products/Debug-watchos/include -Xcc -I/Users/builder/builds/TDmZkXJm/3/finestructure/swiftpackageindex-builder/spi-builder-workspace/.derivedData/Build/Intermediates.noindex/CodableWrappers.build/Debug-watchos/CodableWrappers.build/DerivedSources-normal/arm64 -Xcc -I/Users/builder/builds/TDmZkXJm/3/finestructure/swiftpackageindex-builder/spi-builder-workspace/.derivedData/Build/Intermediates.noindex/CodableWrappers.build/Debug-watchos/CodableWrappers.build/DerivedSources/arm64 -Xcc -I/Users/builder/builds/TDmZkXJm/3/finestructure/swiftpackageindex-builder/spi-builder-workspace/.derivedData/Build/Intermediates.noindex/CodableWrappers.build/Debug-watchos/CodableWrappers.build/DerivedSources -Xcc -DSWIFT_PACKAGE -Xcc -DDEBUG\=1 -module-name CodableWrappers -frontend-parseable-output -disable-clang-spi -target-sdk-version 10.2 -target-sdk-name watchos10.2 -external-plugin-path /Applications/Xcode-15.2.0.app/Contents/Developer/Platforms/WatchOS.platform/Developer/SDKs/WatchOS10.2.sdk/usr/lib/swift/host/plugins\#/Applications/Xcode-15.2.0.app/Contents/Developer/Platforms/WatchOS.platform/Developer/SDKs/WatchOS10.2.sdk/usr/bin/swift-plugin-server -external-plugin-path /Applications/Xcode-15.2.0.app/Contents/Developer/Platforms/WatchOS.platform/Developer/SDKs/WatchOS10.2.sdk/usr/local/lib/swift/host/plugins\#/Applications/Xcode-15.2.0.app/Contents/Developer/Platforms/WatchOS.platform/Developer/SDKs/WatchOS10.2.sdk/usr/bin/swift-plugin-server -external-plugin-path /Applications/Xcode-15.2.0.app/Contents/Developer/Platforms/WatchOS.platform/Developer/usr/lib/swift/host/plugins\#/Applications/Xcode-15.2.0.app/Contents/Developer/Platforms/WatchOS.platform/Developer/usr/bin/swift-plugin-server -external-plugin-path /Applications/Xcode-15.2.0.app/Contents/Developer/Platforms/WatchOS.platform/Developer/usr/local/lib/swift/host/plugins\#/Applications/Xcode-15.2.0.app/Contents/Developer/Platforms/WatchOS.platform/Developer/usr/bin/swift-plugin-server -plugin-path /Applications/Xcode-15.2.0.app/Contents/Developer/Toolchains/XcodeDefault.xctoolchain/usr/lib/swift/host/plugins -plugin-path /Applications/Xcode-15.2.0.app/Contents/Developer/Toolchains/XcodeDefault.xctoolchain/usr/local/lib/swift/host/plugins -o /Users/builder/builds/TDmZkXJm/3/finestructure/swiftpackageindex-builder/spi-builder-workspace/.derivedData/Build/Intermediates.noindex/CodableWrappers.build/Debug-watchos/CodableWrappers.build/Objects-normal/arm64/NullEncoding.o -o /Users/builder/builds/TDmZkXJm/3/finestructure/swiftpackageindex-builder/spi-builder-workspace/.derivedData/Build/Intermediates.noindex/CodableWrappers.build/Debug-watchos/CodableWrappers.build/Objects-normal/arm64/StaticCoding.o -index-unit-output-path /CodableWrappers.build/Debug-watchos/CodableWrappers.build/Objects-normal/arm64/NullEncoding.o -index-unit-output-path /CodableWrappers.build/Debug-watchos/CodableWrappers.build/Objects-normal/arm64/StaticCoding.o -index-store-path /Users/builder/builds/TDmZkXJm/3/finestructure/swiftpackageindex-builder/spi-builder-workspace/.derivedData/Index.noindex/DataStore -index-system-modules
SwiftEmitModule normal armv7k Emitting\ module\ for\ CodableWrappers (in target 'CodableWrappers' from project 'CodableWrappers')
cd /Users/builder/builds/TDmZkXJm/3/finestructure/swiftpackageindex-builder/spi-builder-workspace/.dependencies/checkouts/CodableWrappers
builtin-swiftTaskExecution -- /Applications/Xcode-15.2.0.app/Contents/Developer/Toolchains/XcodeDefault.xctoolchain/usr/bin/swift-frontend -frontend -emit-module -experimental-skip-non-inlinable-function-bodies-without-types /Users/builder/builds/TDmZkXJm/3/finestructure/swiftpackageindex-builder/spi-builder-workspace/.dependencies/checkouts/CodableWrappers/Sources/CodableWrappers/Convenience/ConveienceAdherence.swift /Users/builder/builds/TDmZkXJm/3/finestructure/swiftpackageindex-builder/spi-builder-workspace/.dependencies/checkouts/CodableWrappers/Sources/CodableWrappers/Convenience/CustomWrappers.swift /Users/builder/builds/TDmZkXJm/3/finestructure/swiftpackageindex-builder/spi-builder-workspace/.dependencies/checkouts/CodableWrappers/Sources/CodableWrappers/Convenience/EmptyDefaults.swift /Users/builder/builds/TDmZkXJm/3/finestructure/swiftpackageindex-builder/spi-builder-workspace/.dependencies/checkouts/CodableWrappers/Sources/CodableWrappers/Core/FallbackCoding.swift /Users/builder/builds/TDmZkXJm/3/finestructure/swiftpackageindex-builder/spi-builder-workspace/.dependencies/checkouts/CodableWrappers/Sources/CodableWrappers/Core/ImmutableWrapper.swift /Users/builder/builds/TDmZkXJm/3/finestructure/swiftpackageindex-builder/spi-builder-workspace/.dependencies/checkouts/CodableWrappers/Sources/CodableWrappers/Core/OmitCodingWrappers.swift /Users/builder/builds/TDmZkXJm/3/finestructure/swiftpackageindex-builder/spi-builder-workspace/.dependencies/checkouts/CodableWrappers/Sources/CodableWrappers/Core/OptionalWrappers.swift /Users/builder/builds/TDmZkXJm/3/finestructure/swiftpackageindex-builder/spi-builder-workspace/.dependencies/checkouts/CodableWrappers/Sources/CodableWrappers/Core/StaticCodingWrappers.swift /Users/builder/builds/TDmZkXJm/3/finestructure/swiftpackageindex-builder/spi-builder-workspace/.dependencies/checkouts/CodableWrappers/Sources/CodableWrappers/Core/TransientCoding.swift /Users/builder/builds/TDmZkXJm/3/finestructure/swiftpackageindex-builder/spi-builder-workspace/.dependencies/checkouts/CodableWrappers/Sources/CodableWrappers/Deprecated/Old.swift /Users/builder/builds/TDmZkXJm/3/finestructure/swiftpackageindex-builder/spi-builder-workspace/.dependencies/checkouts/CodableWrappers/Sources/CodableWrappers/StaticCoders/BoolCoding.swift /Users/builder/builds/TDmZkXJm/3/finestructure/swiftpackageindex-builder/spi-builder-workspace/.dependencies/checkouts/CodableWrappers/Sources/CodableWrappers/StaticCoders/DataCoding.swift /Users/builder/builds/TDmZkXJm/3/finestructure/swiftpackageindex-builder/spi-builder-workspace/.dependencies/checkouts/CodableWrappers/Sources/CodableWrappers/StaticCoders/DateCoding.swift /Users/builder/builds/TDmZkXJm/3/finestructure/swiftpackageindex-builder/spi-builder-workspace/.dependencies/checkouts/CodableWrappers/Sources/CodableWrappers/StaticCoders/FloatingPointCoding.swift /Users/builder/builds/TDmZkXJm/3/finestructure/swiftpackageindex-builder/spi-builder-workspace/.dependencies/checkouts/CodableWrappers/Sources/CodableWrappers/StaticCoders/NilFiltering.swift /Users/builder/builds/TDmZkXJm/3/finestructure/swiftpackageindex-builder/spi-builder-workspace/.dependencies/checkouts/CodableWrappers/Sources/CodableWrappers/StaticCoders/NullEncoding.swift /Users/builder/builds/TDmZkXJm/3/finestructure/swiftpackageindex-builder/spi-builder-workspace/.dependencies/checkouts/CodableWrappers/Sources/CodableWrappers/StaticCoders/StaticCoding.swift -target armv7k-apple-watchos5.0 -enable-objc-interop -sdk /Applications/Xcode-15.2.0.app/Contents/Developer/Platforms/WatchOS.platform/Developer/SDKs/WatchOS10.2.sdk -I /Users/builder/builds/TDmZkXJm/3/finestructure/swiftpackageindex-builder/spi-builder-workspace/.derivedData/Build/Products/Debug-watchos -I /Applications/Xcode-15.2.0.app/Contents/Developer/Platforms/WatchOS.platform/Developer/usr/lib -F /Users/builder/builds/TDmZkXJm/3/finestructure/swiftpackageindex-builder/spi-builder-workspace/.derivedData/Build/Products/Debug-watchos -F /Applications/Xcode-15.2.0.app/Contents/Developer/Platforms/WatchOS.platform/Developer/Library/Frameworks -F /Applications/Xcode-15.2.0.app/Contents/Developer/Platforms/WatchOS.platform/Developer/SDKs/WatchOS10.2.sdk/Developer/Library/Frameworks -no-color-diagnostics -suppress-warnings -enable-testing -g -module-cache-path /Users/builder/builds/TDmZkXJm/3/finestructure/swiftpackageindex-builder/spi-builder-workspace/.derivedData/ModuleCache.noindex -profile-generate -profile-coverage-mapping -swift-version 5 -enforce-exclusivity\=checked -Onone -D SWIFT_PACKAGE -D DEBUG -D Xcode -serialize-debugging-options -const-gather-protocols-file /Users/builder/builds/TDmZkXJm/3/finestructure/swiftpackageindex-builder/spi-builder-workspace/.derivedData/Build/Intermediates.noindex/CodableWrappers.build/Debug-watchos/CodableWrappers.build/Objects-normal/armv7k/CodableWrappers_const_extract_protocols.json -empty-abi-descriptor -validate-clang-modules-once -clang-build-session-file /Users/builder/builds/TDmZkXJm/3/finestructure/swiftpackageindex-builder/spi-builder-workspace/.derivedData/ModuleCache.noindex/Session.modulevalidation -Xcc -working-directory -Xcc /Users/builder/builds/TDmZkXJm/3/finestructure/swiftpackageindex-builder/spi-builder-workspace/.dependencies/checkouts/CodableWrappers -resource-dir /Applications/Xcode-15.2.0.app/Contents/Developer/Toolchains/XcodeDefault.xctoolchain/usr/lib/swift -enable-anonymous-context-mangled-names -Xcc -ivfsstatcache -Xcc /Users/builder/builds/TDmZkXJm/3/finestructure/swiftpackageindex-builder/spi-builder-workspace/.derivedData/SDKStatCaches.noindex/watchos10.2-21S355-1a03c8d25fc3596eb74c01d649b42752.sdkstatcache -Xcc -I/Users/builder/builds/TDmZkXJm/3/finestructure/swiftpackageindex-builder/spi-builder-workspace/.derivedData/Build/Intermediates.noindex/CodableWrappers.build/Debug-watchos/CodableWrappers.build/swift-overrides.hmap -Xcc -I/Users/builder/builds/TDmZkXJm/3/finestructure/swiftpackageindex-builder/spi-builder-workspace/.derivedData/Build/Products/Debug-watchos/include -Xcc -I/Users/builder/builds/TDmZkXJm/3/finestructure/swiftpackageindex-builder/spi-builder-workspace/.derivedData/Build/Intermediates.noindex/CodableWrappers.build/Debug-watchos/CodableWrappers.build/DerivedSources-normal/armv7k -Xcc -I/Users/builder/builds/TDmZkXJm/3/finestructure/swiftpackageindex-builder/spi-builder-workspace/.derivedData/Build/Intermediates.noindex/CodableWrappers.build/Debug-watchos/CodableWrappers.build/DerivedSources/armv7k -Xcc -I/Users/builder/builds/TDmZkXJm/3/finestructure/swiftpackageindex-builder/spi-builder-workspace/.derivedData/Build/Intermediates.noindex/CodableWrappers.build/Debug-watchos/CodableWrappers.build/DerivedSources -Xcc -DSWIFT_PACKAGE -Xcc -DDEBUG\=1 -module-name CodableWrappers -disable-clang-spi -target-sdk-version 10.2 -target-sdk-name watchos10.2 -external-plugin-path /Applications/Xcode-15.2.0.app/Contents/Developer/Platforms/WatchOS.platform/Developer/SDKs/WatchOS10.2.sdk/usr/lib/swift/host/plugins\#/Applications/Xcode-15.2.0.app/Contents/Developer/Platforms/WatchOS.platform/Developer/SDKs/WatchOS10.2.sdk/usr/bin/swift-plugin-server -external-plugin-path /Applications/Xcode-15.2.0.app/Contents/Developer/Platforms/WatchOS.platform/Developer/SDKs/WatchOS10.2.sdk/usr/local/lib/swift/host/plugins\#/Applications/Xcode-15.2.0.app/Contents/Developer/Platforms/WatchOS.platform/Developer/SDKs/WatchOS10.2.sdk/usr/bin/swift-plugin-server -external-plugin-path /Applications/Xcode-15.2.0.app/Contents/Developer/Platforms/WatchOS.platform/Developer/usr/lib/swift/host/plugins\#/Applications/Xcode-15.2.0.app/Contents/Developer/Platforms/WatchOS.platform/Developer/usr/bin/swift-plugin-server -external-plugin-path /Applications/Xcode-15.2.0.app/Contents/Developer/Platforms/WatchOS.platform/Developer/usr/local/lib/swift/host/plugins\#/Applications/Xcode-15.2.0.app/Contents/Developer/Platforms/WatchOS.platform/Developer/usr/bin/swift-plugin-server -plugin-path /Applications/Xcode-15.2.0.app/Contents/Developer/Toolchains/XcodeDefault.xctoolchain/usr/lib/swift/host/plugins -plugin-path /Applications/Xcode-15.2.0.app/Contents/Developer/Toolchains/XcodeDefault.xctoolchain/usr/local/lib/swift/host/plugins -emit-module-doc-path /Users/builder/builds/TDmZkXJm/3/finestructure/swiftpackageindex-builder/spi-builder-workspace/.derivedData/Build/Intermediates.noindex/CodableWrappers.build/Debug-watchos/CodableWrappers.build/Objects-normal/armv7k/CodableWrappers.swiftdoc -emit-module-source-info-path /Users/builder/builds/TDmZkXJm/3/finestructure/swiftpackageindex-builder/spi-builder-workspace/.derivedData/Build/Intermediates.noindex/CodableWrappers.build/Debug-watchos/CodableWrappers.build/Objects-normal/armv7k/CodableWrappers.swiftsourceinfo -emit-objc-header-path /Users/builder/builds/TDmZkXJm/3/finestructure/swiftpackageindex-builder/spi-builder-workspace/.derivedData/Build/Intermediates.noindex/CodableWrappers.build/Debug-watchos/CodableWrappers.build/Objects-normal/armv7k/CodableWrappers-Swift.h -serialize-diagnostics-path /Users/builder/builds/TDmZkXJm/3/finestructure/swiftpackageindex-builder/spi-builder-workspace/.derivedData/Build/Intermediates.noindex/CodableWrappers.build/Debug-watchos/CodableWrappers.build/Objects-normal/armv7k/CodableWrappers-master-emit-module.dia -emit-dependencies-path /Users/builder/builds/TDmZkXJm/3/finestructure/swiftpackageindex-builder/spi-builder-workspace/.derivedData/Build/Intermediates.noindex/CodableWrappers.build/Debug-watchos/CodableWrappers.build/Objects-normal/armv7k/CodableWrappers-master-emit-module.d -o /Users/builder/builds/TDmZkXJm/3/finestructure/swiftpackageindex-builder/spi-builder-workspace/.derivedData/Build/Intermediates.noindex/CodableWrappers.build/Debug-watchos/CodableWrappers.build/Objects-normal/armv7k/CodableWrappers.swiftmodule -emit-abi-descriptor-path /Users/builder/builds/TDmZkXJm/3/finestructure/swiftpackageindex-builder/spi-builder-workspace/.derivedData/Build/Intermediates.noindex/CodableWrappers.build/Debug-watchos/CodableWrappers.build/Objects-normal/armv7k/CodableWrappers.abi.json
SwiftDriver\ Compilation\ Requirements XPCConcurrency normal armv7k com.apple.xcode.tools.swift.compiler (in target 'XPCConcurrency' from project 'CopilotForXcodeKit')
cd /Users/builder/builds/TDmZkXJm/3/finestructure/swiftpackageindex-builder/spi-builder-workspace
builtin-Swift-Compilation-Requirements -- /Applications/Xcode-15.2.0.app/Contents/Developer/Toolchains/XcodeDefault.xctoolchain/usr/bin/swiftc -module-name XPCConcurrency -Onone -enforce-exclusivity\=checked @/Users/builder/builds/TDmZkXJm/3/finestructure/swiftpackageindex-builder/spi-builder-workspace/.derivedData/Build/Intermediates.noindex/CopilotForXcodeKit.build/Debug-watchos/XPCConcurrency.build/Objects-normal/armv7k/XPCConcurrency.SwiftFileList -DSWIFT_PACKAGE -DDEBUG -DXcode -sdk /Applications/Xcode-15.2.0.app/Contents/Developer/Platforms/WatchOS.platform/Developer/SDKs/WatchOS10.2.sdk -target armv7k-apple-watchos5.0 -g -module-cache-path /Users/builder/builds/TDmZkXJm/3/finestructure/swiftpackageindex-builder/spi-builder-workspace/.derivedData/ModuleCache.noindex -Xfrontend -serialize-debugging-options -profile-coverage-mapping -profile-generate -enable-testing -index-store-path /Users/builder/builds/TDmZkXJm/3/finestructure/swiftpackageindex-builder/spi-builder-workspace/.derivedData/Index.noindex/DataStore -swift-version 5 -I /Users/builder/builds/TDmZkXJm/3/finestructure/swiftpackageindex-builder/spi-builder-workspace/.derivedData/Build/Products/Debug-watchos -I /Applications/Xcode-15.2.0.app/Contents/Developer/Platforms/WatchOS.platform/Developer/usr/lib -F /Users/builder/builds/TDmZkXJm/3/finestructure/swiftpackageindex-builder/spi-builder-workspace/.derivedData/Build/Products/Debug-watchos -F /Applications/Xcode-15.2.0.app/Contents/Developer/Platforms/WatchOS.platform/Developer/Library/Frameworks -F /Applications/Xcode-15.2.0.app/Contents/Developer/Platforms/WatchOS.platform/Developer/SDKs/WatchOS10.2.sdk/Developer/Library/Frameworks -parse-as-library -c -j8 -enable-batch-mode -incremental -Xcc -ivfsstatcache -Xcc /Users/builder/builds/TDmZkXJm/3/finestructure/swiftpackageindex-builder/spi-builder-workspace/.derivedData/SDKStatCaches.noindex/watchos10.2-21S355-1a03c8d25fc3596eb74c01d649b42752.sdkstatcache -output-file-map /Users/builder/builds/TDmZkXJm/3/finestructure/swiftpackageindex-builder/spi-builder-workspace/.derivedData/Build/Intermediates.noindex/CopilotForXcodeKit.build/Debug-watchos/XPCConcurrency.build/Objects-normal/armv7k/XPCConcurrency-OutputFileMap.json -use-frontend-parseable-output -save-temps -no-color-diagnostics -serialize-diagnostics -emit-dependencies -emit-module -emit-module-path /Users/builder/builds/TDmZkXJm/3/finestructure/swiftpackageindex-builder/spi-builder-workspace/.derivedData/Build/Intermediates.noindex/CopilotForXcodeKit.build/Debug-watchos/XPCConcurrency.build/Objects-normal/armv7k/XPCConcurrency.swiftmodule -validate-clang-modules-once -clang-build-session-file /Users/builder/builds/TDmZkXJm/3/finestructure/swiftpackageindex-builder/spi-builder-workspace/.derivedData/ModuleCache.noindex/Session.modulevalidation -Xfrontend -package-name -Xfrontend spi_builder_workspace -Xcc -I/Users/builder/builds/TDmZkXJm/3/finestructure/swiftpackageindex-builder/spi-builder-workspace/.derivedData/Build/Intermediates.noindex/CopilotForXcodeKit.build/Debug-watchos/XPCConcurrency.build/swift-overrides.hmap -emit-const-values -Xfrontend -const-gather-protocols-file -Xfrontend /Users/builder/builds/TDmZkXJm/3/finestructure/swiftpackageindex-builder/spi-builder-workspace/.derivedData/Build/Intermediates.noindex/CopilotForXcodeKit.build/Debug-watchos/XPCConcurrency.build/Objects-normal/armv7k/XPCConcurrency_const_extract_protocols.json -Xcc -I/Users/builder/builds/TDmZkXJm/3/finestructure/swiftpackageindex-builder/spi-builder-workspace/.derivedData/Build/Products/Debug-watchos/include -Xcc -I/Users/builder/builds/TDmZkXJm/3/finestructure/swiftpackageindex-builder/spi-builder-workspace/.derivedData/Build/Intermediates.noindex/CopilotForXcodeKit.build/Debug-watchos/XPCConcurrency.build/DerivedSources-normal/armv7k -Xcc -I/Users/builder/builds/TDmZkXJm/3/finestructure/swiftpackageindex-builder/spi-builder-workspace/.derivedData/Build/Intermediates.noindex/CopilotForXcodeKit.build/Debug-watchos/XPCConcurrency.build/DerivedSources/armv7k -Xcc -I/Users/builder/builds/TDmZkXJm/3/finestructure/swiftpackageindex-builder/spi-builder-workspace/.derivedData/Build/Intermediates.noindex/CopilotForXcodeKit.build/Debug-watchos/XPCConcurrency.build/DerivedSources -Xcc -DSWIFT_PACKAGE -Xcc -DDEBUG\=1 -emit-objc-header -emit-objc-header-path /Users/builder/builds/TDmZkXJm/3/finestructure/swiftpackageindex-builder/spi-builder-workspace/.derivedData/Build/Intermediates.noindex/CopilotForXcodeKit.build/Debug-watchos/XPCConcurrency.build/Objects-normal/armv7k/XPCConcurrency-Swift.h -working-directory /Users/builder/builds/TDmZkXJm/3/finestructure/swiftpackageindex-builder/spi-builder-workspace -experimental-emit-module-separately -disable-cmo
** BUILD FAILED **
The following build commands failed:
SwiftEmitModule normal armv7k Emitting\ module\ for\ XPCConcurrency (in target 'XPCConcurrency' from project 'CopilotForXcodeKit')
SwiftEmitModule normal arm64_32 Emitting\ module\ for\ XPCConcurrency (in target 'XPCConcurrency' from project 'CopilotForXcodeKit')
SwiftEmitModule normal arm64 Emitting\ module\ for\ XPCConcurrency (in target 'XPCConcurrency' from project 'CopilotForXcodeKit')
(3 failures)
Command line invocation:
/Applications/Xcode-15.2.0.app/Contents/Developer/usr/bin/xcodebuild -IDEClonedSourcePackagesDirPathOverride=/Users/builder/builds/TDmZkXJm/3/finestructure/swiftpackageindex-builder/spi-builder-workspace/.dependencies -skipMacroValidation -skipPackagePluginValidation -derivedDataPath /Users/builder/builds/TDmZkXJm/3/finestructure/swiftpackageindex-builder/spi-builder-workspace/.derivedData build -scheme CopilotForXcodeKit-Package -destination generic/platform=watchOS
User defaults from command line:
IDEClonedSourcePackagesDirPathOverride = /Users/builder/builds/TDmZkXJm/3/finestructure/swiftpackageindex-builder/spi-builder-workspace/.dependencies
IDEDerivedDataPathOverride = /Users/builder/builds/TDmZkXJm/3/finestructure/swiftpackageindex-builder/spi-builder-workspace/.derivedData
IDEPackageSupportUseBuiltinSCM = YES
Resolve Package Graph
Resolved source packages:
CodableWrappers: https://github.com/GottaGetSwifty/CodableWrappers.git @ 2.0.7
CopilotForXcodeKit: /Users/builder/builds/TDmZkXJm/3/finestructure/swiftpackageindex-builder/spi-builder-workspace
Prepare packages
ComputeTargetDependencyGraph
note: Building targets in dependency order
note: Target dependency graph (7 targets)
Target 'CopilotForXcodeKitTests' in project 'CopilotForXcodeKit'
➜ Explicit dependency on target 'XPCConcurrency' in project 'CopilotForXcodeKit'
➜ Explicit dependency on target 'CopilotForXcodeKit' in project 'CopilotForXcodeKit'
➜ Explicit dependency on target 'CodableWrappers' in project 'CodableWrappers'
Target 'XPCConcurrency' in project 'CopilotForXcodeKit'
➜ Explicit dependency on target 'XPCConcurrency' in project 'CopilotForXcodeKit'
Target 'CopilotForXcodeKit' in project 'CopilotForXcodeKit'
➜ Explicit dependency on target 'CopilotForXcodeKit' in project 'CopilotForXcodeKit'
➜ Explicit dependency on target 'XPCConcurrency' in project 'CopilotForXcodeKit'
➜ Explicit dependency on target 'CodableWrappers' in project 'CodableWrappers'
Target 'CopilotForXcodeKit' in project 'CopilotForXcodeKit'
➜ Explicit dependency on target 'XPCConcurrency' in project 'CopilotForXcodeKit'
➜ Explicit dependency on target 'CodableWrappers' in project 'CodableWrappers'
Target 'CodableWrappers' in project 'CodableWrappers'
➜ Explicit dependency on target 'CodableWrappers' in project 'CodableWrappers'
Target 'CodableWrappers' in project 'CodableWrappers' (no dependencies)
Target 'XPCConcurrency' in project 'CopilotForXcodeKit' (no dependencies)
GatherProvisioningInputs
CreateBuildDescription
ClangStatCache /Applications/Xcode-15.2.0.app/Contents/Developer/Toolchains/XcodeDefault.xctoolchain/usr/bin/clang-stat-cache /Applications/Xcode-15.2.0.app/Contents/Developer/Platforms/WatchOS.platform/Developer/SDKs/WatchOS10.2.sdk /Users/builder/builds/TDmZkXJm/3/finestructure/swiftpackageindex-builder/spi-builder-workspace/.derivedData/SDKStatCaches.noindex/watchos10.2-21S355-1a03c8d25fc3596eb74c01d649b42752.sdkstatcache
cd /Users/builder/builds/TDmZkXJm/3/finestructure/swiftpackageindex-builder/spi-builder-workspace/.swiftpm/xcode
/Applications/Xcode-15.2.0.app/Contents/Developer/Toolchains/XcodeDefault.xctoolchain/usr/bin/clang-stat-cache /Applications/Xcode-15.2.0.app/Contents/Developer/Platforms/WatchOS.platform/Developer/SDKs/WatchOS10.2.sdk -o /Users/builder/builds/TDmZkXJm/3/finestructure/swiftpackageindex-builder/spi-builder-workspace/.derivedData/SDKStatCaches.noindex/watchos10.2-21S355-1a03c8d25fc3596eb74c01d649b42752.sdkstatcache
SwiftDriver XPCConcurrency normal armv7k com.apple.xcode.tools.swift.compiler (in target 'XPCConcurrency' from project 'CopilotForXcodeKit')
cd /Users/builder/builds/TDmZkXJm/3/finestructure/swiftpackageindex-builder/spi-builder-workspace
builtin-SwiftDriver -- /Applications/Xcode-15.2.0.app/Contents/Developer/Toolchains/XcodeDefault.xctoolchain/usr/bin/swiftc -module-name XPCConcurrency -Onone -enforce-exclusivity\=checked @/Users/builder/builds/TDmZkXJm/3/finestructure/swiftpackageindex-builder/spi-builder-workspace/.derivedData/Build/Intermediates.noindex/CopilotForXcodeKit.build/Debug-watchos/XPCConcurrency.build/Objects-normal/armv7k/XPCConcurrency.SwiftFileList -DSWIFT_PACKAGE -DDEBUG -DXcode -sdk /Applications/Xcode-15.2.0.app/Contents/Developer/Platforms/WatchOS.platform/Developer/SDKs/WatchOS10.2.sdk -target armv7k-apple-watchos5.0 -g -module-cache-path /Users/builder/builds/TDmZkXJm/3/finestructure/swiftpackageindex-builder/spi-builder-workspace/.derivedData/ModuleCache.noindex -Xfrontend -serialize-debugging-options -profile-coverage-mapping -profile-generate -enable-testing -index-store-path /Users/builder/builds/TDmZkXJm/3/finestructure/swiftpackageindex-builder/spi-builder-workspace/.derivedData/Index.noindex/DataStore -swift-version 5 -I /Users/builder/builds/TDmZkXJm/3/finestructure/swiftpackageindex-builder/spi-builder-workspace/.derivedData/Build/Products/Debug-watchos -I /Applications/Xcode-15.2.0.app/Contents/Developer/Platforms/WatchOS.platform/Developer/usr/lib -F /Users/builder/builds/TDmZkXJm/3/finestructure/swiftpackageindex-builder/spi-builder-workspace/.derivedData/Build/Products/Debug-watchos -F /Applications/Xcode-15.2.0.app/Contents/Developer/Platforms/WatchOS.platform/Developer/Library/Frameworks -F /Applications/Xcode-15.2.0.app/Contents/Developer/Platforms/WatchOS.platform/Developer/SDKs/WatchOS10.2.sdk/Developer/Library/Frameworks -parse-as-library -c -j8 -enable-batch-mode -incremental -Xcc -ivfsstatcache -Xcc /Users/builder/builds/TDmZkXJm/3/finestructure/swiftpackageindex-builder/spi-builder-workspace/.derivedData/SDKStatCaches.noindex/watchos10.2-21S355-1a03c8d25fc3596eb74c01d649b42752.sdkstatcache -output-file-map /Users/builder/builds/TDmZkXJm/3/finestructure/swiftpackageindex-builder/spi-builder-workspace/.derivedData/Build/Intermediates.noindex/CopilotForXcodeKit.build/Debug-watchos/XPCConcurrency.build/Objects-normal/armv7k/XPCConcurrency-OutputFileMap.json -use-frontend-parseable-output -save-temps -no-color-diagnostics -serialize-diagnostics -emit-dependencies -emit-module -emit-module-path /Users/builder/builds/TDmZkXJm/3/finestructure/swiftpackageindex-builder/spi-builder-workspace/.derivedData/Build/Intermediates.noindex/CopilotForXcodeKit.build/Debug-watchos/XPCConcurrency.build/Objects-normal/armv7k/XPCConcurrency.swiftmodule -validate-clang-modules-once -clang-build-session-file /Users/builder/builds/TDmZkXJm/3/finestructure/swiftpackageindex-builder/spi-builder-workspace/.derivedData/ModuleCache.noindex/Session.modulevalidation -Xfrontend -package-name -Xfrontend spi_builder_workspace -Xcc -I/Users/builder/builds/TDmZkXJm/3/finestructure/swiftpackageindex-builder/spi-builder-workspace/.derivedData/Build/Intermediates.noindex/CopilotForXcodeKit.build/Debug-watchos/XPCConcurrency.build/swift-overrides.hmap -emit-const-values -Xfrontend -const-gather-protocols-file -Xfrontend /Users/builder/builds/TDmZkXJm/3/finestructure/swiftpackageindex-builder/spi-builder-workspace/.derivedData/Build/Intermediates.noindex/CopilotForXcodeKit.build/Debug-watchos/XPCConcurrency.build/Objects-normal/armv7k/XPCConcurrency_const_extract_protocols.json -Xcc -I/Users/builder/builds/TDmZkXJm/3/finestructure/swiftpackageindex-builder/spi-builder-workspace/.derivedData/Build/Products/Debug-watchos/include -Xcc -I/Users/builder/builds/TDmZkXJm/3/finestructure/swiftpackageindex-builder/spi-builder-workspace/.derivedData/Build/Intermediates.noindex/CopilotForXcodeKit.build/Debug-watchos/XPCConcurrency.build/DerivedSources-normal/armv7k -Xcc -I/Users/builder/builds/TDmZkXJm/3/finestructure/swiftpackageindex-builder/spi-builder-workspace/.derivedData/Build/Intermediates.noindex/CopilotForXcodeKit.build/Debug-watchos/XPCConcurrency.build/DerivedSources/armv7k -Xcc -I/Users/builder/builds/TDmZkXJm/3/finestructure/swiftpackageindex-builder/spi-builder-workspace/.derivedData/Build/Intermediates.noindex/CopilotForXcodeKit.build/Debug-watchos/XPCConcurrency.build/DerivedSources -Xcc -DSWIFT_PACKAGE -Xcc -DDEBUG\=1 -emit-objc-header -emit-objc-header-path /Users/builder/builds/TDmZkXJm/3/finestructure/swiftpackageindex-builder/spi-builder-workspace/.derivedData/Build/Intermediates.noindex/CopilotForXcodeKit.build/Debug-watchos/XPCConcurrency.build/Objects-normal/armv7k/XPCConcurrency-Swift.h -working-directory /Users/builder/builds/TDmZkXJm/3/finestructure/swiftpackageindex-builder/spi-builder-workspace -experimental-emit-module-separately -disable-cmo
SwiftDriver CodableWrappers normal armv7k com.apple.xcode.tools.swift.compiler (in target 'CodableWrappers' from project 'CodableWrappers')
cd /Users/builder/builds/TDmZkXJm/3/finestructure/swiftpackageindex-builder/spi-builder-workspace/.dependencies/checkouts/CodableWrappers
builtin-SwiftDriver -- /Applications/Xcode-15.2.0.app/Contents/Developer/Toolchains/XcodeDefault.xctoolchain/usr/bin/swiftc -module-name CodableWrappers -Onone -enforce-exclusivity\=checked @/Users/builder/builds/TDmZkXJm/3/finestructure/swiftpackageindex-builder/spi-builder-workspace/.derivedData/Build/Intermediates.noindex/CodableWrappers.build/Debug-watchos/CodableWrappers.build/Objects-normal/armv7k/CodableWrappers.SwiftFileList -DSWIFT_PACKAGE -DDEBUG -DXcode -sdk /Applications/Xcode-15.2.0.app/Contents/Developer/Platforms/WatchOS.platform/Developer/SDKs/WatchOS10.2.sdk -target armv7k-apple-watchos5.0 -g -module-cache-path /Users/builder/builds/TDmZkXJm/3/finestructure/swiftpackageindex-builder/spi-builder-workspace/.derivedData/ModuleCache.noindex -Xfrontend -serialize-debugging-options -profile-coverage-mapping -profile-generate -enable-testing -suppress-warnings -index-store-path /Users/builder/builds/TDmZkXJm/3/finestructure/swiftpackageindex-builder/spi-builder-workspace/.derivedData/Index.noindex/DataStore -swift-version 5 -I /Users/builder/builds/TDmZkXJm/3/finestructure/swiftpackageindex-builder/spi-builder-workspace/.derivedData/Build/Products/Debug-watchos -I /Applications/Xcode-15.2.0.app/Contents/Developer/Platforms/WatchOS.platform/Developer/usr/lib -F /Users/builder/builds/TDmZkXJm/3/finestructure/swiftpackageindex-builder/spi-builder-workspace/.derivedData/Build/Products/Debug-watchos -F /Applications/Xcode-15.2.0.app/Contents/Developer/Platforms/WatchOS.platform/Developer/Library/Frameworks -F /Applications/Xcode-15.2.0.app/Contents/Developer/Platforms/WatchOS.platform/Developer/SDKs/WatchOS10.2.sdk/Developer/Library/Frameworks -c -j8 -enable-batch-mode -incremental -Xcc -ivfsstatcache -Xcc /Users/builder/builds/TDmZkXJm/3/finestructure/swiftpackageindex-builder/spi-builder-workspace/.derivedData/SDKStatCaches.noindex/watchos10.2-21S355-1a03c8d25fc3596eb74c01d649b42752.sdkstatcache -output-file-map /Users/builder/builds/TDmZkXJm/3/finestructure/swiftpackageindex-builder/spi-builder-workspace/.derivedData/Build/Intermediates.noindex/CodableWrappers.build/Debug-watchos/CodableWrappers.build/Objects-normal/armv7k/CodableWrappers-OutputFileMap.json -use-frontend-parseable-output -save-temps -no-color-diagnostics -serialize-diagnostics -emit-dependencies -emit-module -emit-module-path /Users/builder/builds/TDmZkXJm/3/finestructure/swiftpackageindex-builder/spi-builder-workspace/.derivedData/Build/Intermediates.noindex/CodableWrappers.build/Debug-watchos/CodableWrappers.build/Objects-normal/armv7k/CodableWrappers.swiftmodule -validate-clang-modules-once -clang-build-session-file /Users/builder/builds/TDmZkXJm/3/finestructure/swiftpackageindex-builder/spi-builder-workspace/.derivedData/ModuleCache.noindex/Session.modulevalidation -Xcc -I/Users/builder/builds/TDmZkXJm/3/finestructure/swiftpackageindex-builder/spi-builder-workspace/.derivedData/Build/Intermediates.noindex/CodableWrappers.build/Debug-watchos/CodableWrappers.build/swift-overrides.hmap -emit-const-values -Xfrontend -const-gather-protocols-file -Xfrontend /Users/builder/builds/TDmZkXJm/3/finestructure/swiftpackageindex-builder/spi-builder-workspace/.derivedData/Build/Intermediates.noindex/CodableWrappers.build/Debug-watchos/CodableWrappers.build/Objects-normal/armv7k/CodableWrappers_const_extract_protocols.json -Xcc -I/Users/builder/builds/TDmZkXJm/3/finestructure/swiftpackageindex-builder/spi-builder-workspace/.derivedData/Build/Products/Debug-watchos/include -Xcc -I/Users/builder/builds/TDmZkXJm/3/finestructure/swiftpackageindex-builder/spi-builder-workspace/.derivedData/Build/Intermediates.noindex/CodableWrappers.build/Debug-watchos/CodableWrappers.build/DerivedSources-normal/armv7k -Xcc -I/Users/builder/builds/TDmZkXJm/3/finestructure/swiftpackageindex-builder/spi-builder-workspace/.derivedData/Build/Intermediates.noindex/CodableWrappers.build/Debug-watchos/CodableWrappers.build/DerivedSources/armv7k -Xcc -I/Users/builder/builds/TDmZkXJm/3/finestructure/swiftpackageindex-builder/spi-builder-workspace/.derivedData/Build/Intermediates.noindex/CodableWrappers.build/Debug-watchos/CodableWrappers.build/DerivedSources -Xcc -DSWIFT_PACKAGE -Xcc -DDEBUG\=1 -emit-objc-header -emit-objc-header-path /Users/builder/builds/TDmZkXJm/3/finestructure/swiftpackageindex-builder/spi-builder-workspace/.derivedData/Build/Intermediates.noindex/CodableWrappers.build/Debug-watchos/CodableWrappers.build/Objects-normal/armv7k/CodableWrappers-Swift.h -working-directory /Users/builder/builds/TDmZkXJm/3/finestructure/swiftpackageindex-builder/spi-builder-workspace/.dependencies/checkouts/CodableWrappers -experimental-emit-module-separately -disable-cmo
SwiftDriver XPCConcurrency normal arm64 com.apple.xcode.tools.swift.compiler (in target 'XPCConcurrency' from project 'CopilotForXcodeKit')
cd /Users/builder/builds/TDmZkXJm/3/finestructure/swiftpackageindex-builder/spi-builder-workspace
builtin-SwiftDriver -- /Applications/Xcode-15.2.0.app/Contents/Developer/Toolchains/XcodeDefault.xctoolchain/usr/bin/swiftc -module-name XPCConcurrency -Onone -enforce-exclusivity\=checked @/Users/builder/builds/TDmZkXJm/3/finestructure/swiftpackageindex-builder/spi-builder-workspace/.derivedData/Build/Intermediates.noindex/CopilotForXcodeKit.build/Debug-watchos/XPCConcurrency.build/Objects-normal/arm64/XPCConcurrency.SwiftFileList -DSWIFT_PACKAGE -DDEBUG -DXcode -sdk /Applications/Xcode-15.2.0.app/Contents/Developer/Platforms/WatchOS.platform/Developer/SDKs/WatchOS10.2.sdk -target arm64-apple-watchos5.0 -g -module-cache-path /Users/builder/builds/TDmZkXJm/3/finestructure/swiftpackageindex-builder/spi-builder-workspace/.derivedData/ModuleCache.noindex -Xfrontend -serialize-debugging-options -profile-coverage-mapping -profile-generate -enable-testing -index-store-path /Users/builder/builds/TDmZkXJm/3/finestructure/swiftpackageindex-builder/spi-builder-workspace/.derivedData/Index.noindex/DataStore -swift-version 5 -I /Users/builder/builds/TDmZkXJm/3/finestructure/swiftpackageindex-builder/spi-builder-workspace/.derivedData/Build/Products/Debug-watchos -I /Applications/Xcode-15.2.0.app/Contents/Developer/Platforms/WatchOS.platform/Developer/usr/lib -F /Users/builder/builds/TDmZkXJm/3/finestructure/swiftpackageindex-builder/spi-builder-workspace/.derivedData/Build/Products/Debug-watchos -F /Applications/Xcode-15.2.0.app/Contents/Developer/Platforms/WatchOS.platform/Developer/Library/Frameworks -F /Applications/Xcode-15.2.0.app/Contents/Developer/Platforms/WatchOS.platform/Developer/SDKs/WatchOS10.2.sdk/Developer/Library/Frameworks -parse-as-library -c -j8 -enable-batch-mode -incremental -Xcc -ivfsstatcache -Xcc /Users/builder/builds/TDmZkXJm/3/finestructure/swiftpackageindex-builder/spi-builder-workspace/.derivedData/SDKStatCaches.noindex/watchos10.2-21S355-1a03c8d25fc3596eb74c01d649b42752.sdkstatcache -output-file-map /Users/builder/builds/TDmZkXJm/3/finestructure/swiftpackageindex-builder/spi-builder-workspace/.derivedData/Build/Intermediates.noindex/CopilotForXcodeKit.build/Debug-watchos/XPCConcurrency.build/Objects-normal/arm64/XPCConcurrency-OutputFileMap.json -use-frontend-parseable-output -save-temps -no-color-diagnostics -serialize-diagnostics -emit-dependencies -emit-module -emit-module-path /Users/builder/builds/TDmZkXJm/3/finestructure/swiftpackageindex-builder/spi-builder-workspace/.derivedData/Build/Intermediates.noindex/CopilotForXcodeKit.build/Debug-watchos/XPCConcurrency.build/Objects-normal/arm64/XPCConcurrency.swiftmodule -validate-clang-modules-once -clang-build-session-file /Users/builder/builds/TDmZkXJm/3/finestructure/swiftpackageindex-builder/spi-builder-workspace/.derivedData/ModuleCache.noindex/Session.modulevalidation -Xfrontend -package-name -Xfrontend spi_builder_workspace -Xcc -I/Users/builder/builds/TDmZkXJm/3/finestructure/swiftpackageindex-builder/spi-builder-workspace/.derivedData/Build/Intermediates.noindex/CopilotForXcodeKit.build/Debug-watchos/XPCConcurrency.build/swift-overrides.hmap -emit-const-values -Xfrontend -const-gather-protocols-file -Xfrontend /Users/builder/builds/TDmZkXJm/3/finestructure/swiftpackageindex-builder/spi-builder-workspace/.derivedData/Build/Intermediates.noindex/CopilotForXcodeKit.build/Debug-watchos/XPCConcurrency.build/Objects-normal/arm64/XPCConcurrency_const_extract_protocols.json -Xcc -I/Users/builder/builds/TDmZkXJm/3/finestructure/swiftpackageindex-builder/spi-builder-workspace/.derivedData/Build/Products/Debug-watchos/include -Xcc -I/Users/builder/builds/TDmZkXJm/3/finestructure/swiftpackageindex-builder/spi-builder-workspace/.derivedData/Build/Intermediates.noindex/CopilotForXcodeKit.build/Debug-watchos/XPCConcurrency.build/DerivedSources-normal/arm64 -Xcc -I/Users/builder/builds/TDmZkXJm/3/finestructure/swiftpackageindex-builder/spi-builder-workspace/.derivedData/Build/Intermediates.noindex/CopilotForXcodeKit.build/Debug-watchos/XPCConcurrency.build/DerivedSources/arm64 -Xcc -I/Users/builder/builds/TDmZkXJm/3/finestructure/swiftpackageindex-builder/spi-builder-workspace/.derivedData/Build/Intermediates.noindex/CopilotForXcodeKit.build/Debug-watchos/XPCConcurrency.build/DerivedSources -Xcc -DSWIFT_PACKAGE -Xcc -DDEBUG\=1 -emit-objc-header -emit-objc-header-path /Users/builder/builds/TDmZkXJm/3/finestructure/swiftpackageindex-builder/spi-builder-workspace/.derivedData/Build/Intermediates.noindex/CopilotForXcodeKit.build/Debug-watchos/XPCConcurrency.build/Objects-normal/arm64/XPCConcurrency-Swift.h -working-directory /Users/builder/builds/TDmZkXJm/3/finestructure/swiftpackageindex-builder/spi-builder-workspace -experimental-emit-module-separately -disable-cmo
SwiftDriver CodableWrappers normal arm64 com.apple.xcode.tools.swift.compiler (in target 'CodableWrappers' from project 'CodableWrappers')
cd /Users/builder/builds/TDmZkXJm/3/finestructure/swiftpackageindex-builder/spi-builder-workspace/.dependencies/checkouts/CodableWrappers
builtin-SwiftDriver -- /Applications/Xcode-15.2.0.app/Contents/Developer/Toolchains/XcodeDefault.xctoolchain/usr/bin/swiftc -module-name CodableWrappers -Onone -enforce-exclusivity\=checked @/Users/builder/builds/TDmZkXJm/3/finestructure/swiftpackageindex-builder/spi-builder-workspace/.derivedData/Build/Intermediates.noindex/CodableWrappers.build/Debug-watchos/CodableWrappers.build/Objects-normal/arm64/CodableWrappers.SwiftFileList -DSWIFT_PACKAGE -DDEBUG -DXcode -sdk /Applications/Xcode-15.2.0.app/Contents/Developer/Platforms/WatchOS.platform/Developer/SDKs/WatchOS10.2.sdk -target arm64-apple-watchos5.0 -g -module-cache-path /Users/builder/builds/TDmZkXJm/3/finestructure/swiftpackageindex-builder/spi-builder-workspace/.derivedData/ModuleCache.noindex -Xfrontend -serialize-debugging-options -profile-coverage-mapping -profile-generate -enable-testing -suppress-warnings -index-store-path /Users/builder/builds/TDmZkXJm/3/finestructure/swiftpackageindex-builder/spi-builder-workspace/.derivedData/Index.noindex/DataStore -swift-version 5 -I /Users/builder/builds/TDmZkXJm/3/finestructure/swiftpackageindex-builder/spi-builder-workspace/.derivedData/Build/Products/Debug-watchos -I /Applications/Xcode-15.2.0.app/Contents/Developer/Platforms/WatchOS.platform/Developer/usr/lib -F /Users/builder/builds/TDmZkXJm/3/finestructure/swiftpackageindex-builder/spi-builder-workspace/.derivedData/Build/Products/Debug-watchos -F /Applications/Xcode-15.2.0.app/Contents/Developer/Platforms/WatchOS.platform/Developer/Library/Frameworks -F /Applications/Xcode-15.2.0.app/Contents/Developer/Platforms/WatchOS.platform/Developer/SDKs/WatchOS10.2.sdk/Developer/Library/Frameworks -c -j8 -enable-batch-mode -incremental -Xcc -ivfsstatcache -Xcc /Users/builder/builds/TDmZkXJm/3/finestructure/swiftpackageindex-builder/spi-builder-workspace/.derivedData/SDKStatCaches.noindex/watchos10.2-21S355-1a03c8d25fc3596eb74c01d649b42752.sdkstatcache -output-file-map /Users/builder/builds/TDmZkXJm/3/finestructure/swiftpackageindex-builder/spi-builder-workspace/.derivedData/Build/Intermediates.noindex/CodableWrappers.build/Debug-watchos/CodableWrappers.build/Objects-normal/arm64/CodableWrappers-OutputFileMap.json -use-frontend-parseable-output -save-temps -no-color-diagnostics -serialize-diagnostics -emit-dependencies -emit-module -emit-module-path /Users/builder/builds/TDmZkXJm/3/finestructure/swiftpackageindex-builder/spi-builder-workspace/.derivedData/Build/Intermediates.noindex/CodableWrappers.build/Debug-watchos/CodableWrappers.build/Objects-normal/arm64/CodableWrappers.swiftmodule -validate-clang-modules-once -clang-build-session-file /Users/builder/builds/TDmZkXJm/3/finestructure/swiftpackageindex-builder/spi-builder-workspace/.derivedData/ModuleCache.noindex/Session.modulevalidation -Xcc -I/Users/builder/builds/TDmZkXJm/3/finestructure/swiftpackageindex-builder/spi-builder-workspace/.derivedData/Build/Intermediates.noindex/CodableWrappers.build/Debug-watchos/CodableWrappers.build/swift-overrides.hmap -emit-const-values -Xfrontend -const-gather-protocols-file -Xfrontend /Users/builder/builds/TDmZkXJm/3/finestructure/swiftpackageindex-builder/spi-builder-workspace/.derivedData/Build/Intermediates.noindex/CodableWrappers.build/Debug-watchos/CodableWrappers.build/Objects-normal/arm64/CodableWrappers_const_extract_protocols.json -Xcc -I/Users/builder/builds/TDmZkXJm/3/finestructure/swiftpackageindex-builder/spi-builder-workspace/.derivedData/Build/Products/Debug-watchos/include -Xcc -I/Users/builder/builds/TDmZkXJm/3/finestructure/swiftpackageindex-builder/spi-builder-workspace/.derivedData/Build/Intermediates.noindex/CodableWrappers.build/Debug-watchos/CodableWrappers.build/DerivedSources-normal/arm64 -Xcc -I/Users/builder/builds/TDmZkXJm/3/finestructure/swiftpackageindex-builder/spi-builder-workspace/.derivedData/Build/Intermediates.noindex/CodableWrappers.build/Debug-watchos/CodableWrappers.build/DerivedSources/arm64 -Xcc -I/Users/builder/builds/TDmZkXJm/3/finestructure/swiftpackageindex-builder/spi-builder-workspace/.derivedData/Build/Intermediates.noindex/CodableWrappers.build/Debug-watchos/CodableWrappers.build/DerivedSources -Xcc -DSWIFT_PACKAGE -Xcc -DDEBUG\=1 -emit-objc-header -emit-objc-header-path /Users/builder/builds/TDmZkXJm/3/finestructure/swiftpackageindex-builder/spi-builder-workspace/.derivedData/Build/Intermediates.noindex/CodableWrappers.build/Debug-watchos/CodableWrappers.build/Objects-normal/arm64/CodableWrappers-Swift.h -working-directory /Users/builder/builds/TDmZkXJm/3/finestructure/swiftpackageindex-builder/spi-builder-workspace/.dependencies/checkouts/CodableWrappers -experimental-emit-module-separately -disable-cmo
SwiftDriver XPCConcurrency normal arm64_32 com.apple.xcode.tools.swift.compiler (in target 'XPCConcurrency' from project 'CopilotForXcodeKit')
cd /Users/builder/builds/TDmZkXJm/3/finestructure/swiftpackageindex-builder/spi-builder-workspace
builtin-SwiftDriver -- /Applications/Xcode-15.2.0.app/Contents/Developer/Toolchains/XcodeDefault.xctoolchain/usr/bin/swiftc -module-name XPCConcurrency -Onone -enforce-exclusivity\=checked @/Users/builder/builds/TDmZkXJm/3/finestructure/swiftpackageindex-builder/spi-builder-workspace/.derivedData/Build/Intermediates.noindex/CopilotForXcodeKit.build/Debug-watchos/XPCConcurrency.build/Objects-normal/arm64_32/XPCConcurrency.SwiftFileList -DSWIFT_PACKAGE -DDEBUG -DXcode -sdk /Applications/Xcode-15.2.0.app/Contents/Developer/Platforms/WatchOS.platform/Developer/SDKs/WatchOS10.2.sdk -target arm64_32-apple-watchos5.0 -g -module-cache-path /Users/builder/builds/TDmZkXJm/3/finestructure/swiftpackageindex-builder/spi-builder-workspace/.derivedData/ModuleCache.noindex -Xfrontend -serialize-debugging-options -profile-coverage-mapping -profile-generate -enable-testing -index-store-path /Users/builder/builds/TDmZkXJm/3/finestructure/swiftpackageindex-builder/spi-builder-workspace/.derivedData/Index.noindex/DataStore -swift-version 5 -I /Users/builder/builds/TDmZkXJm/3/finestructure/swiftpackageindex-builder/spi-builder-workspace/.derivedData/Build/Products/Debug-watchos -I /Applications/Xcode-15.2.0.app/Contents/Developer/Platforms/WatchOS.platform/Developer/usr/lib -F /Users/builder/builds/TDmZkXJm/3/finestructure/swiftpackageindex-builder/spi-builder-workspace/.derivedData/Build/Products/Debug-watchos -F /Applications/Xcode-15.2.0.app/Contents/Developer/Platforms/WatchOS.platform/Developer/Library/Frameworks -F /Applications/Xcode-15.2.0.app/Contents/Developer/Platforms/WatchOS.platform/Developer/SDKs/WatchOS10.2.sdk/Developer/Library/Frameworks -parse-as-library -c -j8 -enable-batch-mode -incremental -Xcc -ivfsstatcache -Xcc /Users/builder/builds/TDmZkXJm/3/finestructure/swiftpackageindex-builder/spi-builder-workspace/.derivedData/SDKStatCaches.noindex/watchos10.2-21S355-1a03c8d25fc3596eb74c01d649b42752.sdkstatcache -output-file-map /Users/builder/builds/TDmZkXJm/3/finestructure/swiftpackageindex-builder/spi-builder-workspace/.derivedData/Build/Intermediates.noindex/CopilotForXcodeKit.build/Debug-watchos/XPCConcurrency.build/Objects-normal/arm64_32/XPCConcurrency-OutputFileMap.json -use-frontend-parseable-output -save-temps -no-color-diagnostics -serialize-diagnostics -emit-dependencies -emit-module -emit-module-path /Users/builder/builds/TDmZkXJm/3/finestructure/swiftpackageindex-builder/spi-builder-workspace/.derivedData/Build/Intermediates.noindex/CopilotForXcodeKit.build/Debug-watchos/XPCConcurrency.build/Objects-normal/arm64_32/XPCConcurrency.swiftmodule -validate-clang-modules-once -clang-build-session-file /Users/builder/builds/TDmZkXJm/3/finestructure/swiftpackageindex-builder/spi-builder-workspace/.derivedData/ModuleCache.noindex/Session.modulevalidation -Xfrontend -package-name -Xfrontend spi_builder_workspace -Xcc -I/Users/builder/builds/TDmZkXJm/3/finestructure/swiftpackageindex-builder/spi-builder-workspace/.derivedData/Build/Intermediates.noindex/CopilotForXcodeKit.build/Debug-watchos/XPCConcurrency.build/swift-overrides.hmap -emit-const-values -Xfrontend -const-gather-protocols-file -Xfrontend /Users/builder/builds/TDmZkXJm/3/finestructure/swiftpackageindex-builder/spi-builder-workspace/.derivedData/Build/Intermediates.noindex/CopilotForXcodeKit.build/Debug-watchos/XPCConcurrency.build/Objects-normal/arm64_32/XPCConcurrency_const_extract_protocols.json -Xcc -I/Users/builder/builds/TDmZkXJm/3/finestructure/swiftpackageindex-builder/spi-builder-workspace/.derivedData/Build/Products/Debug-watchos/include -Xcc -I/Users/builder/builds/TDmZkXJm/3/finestructure/swiftpackageindex-builder/spi-builder-workspace/.derivedData/Build/Intermediates.noindex/CopilotForXcodeKit.build/Debug-watchos/XPCConcurrency.build/DerivedSources-normal/arm64_32 -Xcc -I/Users/builder/builds/TDmZkXJm/3/finestructure/swiftpackageindex-builder/spi-builder-workspace/.derivedData/Build/Intermediates.noindex/CopilotForXcodeKit.build/Debug-watchos/XPCConcurrency.build/DerivedSources/arm64_32 -Xcc -I/Users/builder/builds/TDmZkXJm/3/finestructure/swiftpackageindex-builder/spi-builder-workspace/.derivedData/Build/Intermediates.noindex/CopilotForXcodeKit.build/Debug-watchos/XPCConcurrency.build/DerivedSources -Xcc -DSWIFT_PACKAGE -Xcc -DDEBUG\=1 -emit-objc-header -emit-objc-header-path /Users/builder/builds/TDmZkXJm/3/finestructure/swiftpackageindex-builder/spi-builder-workspace/.derivedData/Build/Intermediates.noindex/CopilotForXcodeKit.build/Debug-watchos/XPCConcurrency.build/Objects-normal/arm64_32/XPCConcurrency-Swift.h -working-directory /Users/builder/builds/TDmZkXJm/3/finestructure/swiftpackageindex-builder/spi-builder-workspace -experimental-emit-module-separately -disable-cmo
SwiftDriver CodableWrappers normal arm64_32 com.apple.xcode.tools.swift.compiler (in target 'CodableWrappers' from project 'CodableWrappers')
cd /Users/builder/builds/TDmZkXJm/3/finestructure/swiftpackageindex-builder/spi-builder-workspace/.dependencies/checkouts/CodableWrappers
builtin-SwiftDriver -- /Applications/Xcode-15.2.0.app/Contents/Developer/Toolchains/XcodeDefault.xctoolchain/usr/bin/swiftc -module-name CodableWrappers -Onone -enforce-exclusivity\=checked @/Users/builder/builds/TDmZkXJm/3/finestructure/swiftpackageindex-builder/spi-builder-workspace/.derivedData/Build/Intermediates.noindex/CodableWrappers.build/Debug-watchos/CodableWrappers.build/Objects-normal/arm64_32/CodableWrappers.SwiftFileList -DSWIFT_PACKAGE -DDEBUG -DXcode -sdk /Applications/Xcode-15.2.0.app/Contents/Developer/Platforms/WatchOS.platform/Developer/SDKs/WatchOS10.2.sdk -target arm64_32-apple-watchos5.0 -g -module-cache-path /Users/builder/builds/TDmZkXJm/3/finestructure/swiftpackageindex-builder/spi-builder-workspace/.derivedData/ModuleCache.noindex -Xfrontend -serialize-debugging-options -profile-coverage-mapping -profile-generate -enable-testing -suppress-warnings -index-store-path /Users/builder/builds/TDmZkXJm/3/finestructure/swiftpackageindex-builder/spi-builder-workspace/.derivedData/Index.noindex/DataStore -swift-version 5 -I /Users/builder/builds/TDmZkXJm/3/finestructure/swiftpackageindex-builder/spi-builder-workspace/.derivedData/Build/Products/Debug-watchos -I /Applications/Xcode-15.2.0.app/Contents/Developer/Platforms/WatchOS.platform/Developer/usr/lib -F /Users/builder/builds/TDmZkXJm/3/finestructure/swiftpackageindex-builder/spi-builder-workspace/.derivedData/Build/Products/Debug-watchos -F /Applications/Xcode-15.2.0.app/Contents/Developer/Platforms/WatchOS.platform/Developer/Library/Frameworks -F /Applications/Xcode-15.2.0.app/Contents/Developer/Platforms/WatchOS.platform/Developer/SDKs/WatchOS10.2.sdk/Developer/Library/Frameworks -c -j8 -enable-batch-mode -incremental -Xcc -ivfsstatcache -Xcc /Users/builder/builds/TDmZkXJm/3/finestructure/swiftpackageindex-builder/spi-builder-workspace/.derivedData/SDKStatCaches.noindex/watchos10.2-21S355-1a03c8d25fc3596eb74c01d649b42752.sdkstatcache -output-file-map /Users/builder/builds/TDmZkXJm/3/finestructure/swiftpackageindex-builder/spi-builder-workspace/.derivedData/Build/Intermediates.noindex/CodableWrappers.build/Debug-watchos/CodableWrappers.build/Objects-normal/arm64_32/CodableWrappers-OutputFileMap.json -use-frontend-parseable-output -save-temps -no-color-diagnostics -serialize-diagnostics -emit-dependencies -emit-module -emit-module-path /Users/builder/builds/TDmZkXJm/3/finestructure/swiftpackageindex-builder/spi-builder-workspace/.derivedData/Build/Intermediates.noindex/CodableWrappers.build/Debug-watchos/CodableWrappers.build/Objects-normal/arm64_32/CodableWrappers.swiftmodule -validate-clang-modules-once -clang-build-session-file /Users/builder/builds/TDmZkXJm/3/finestructure/swiftpackageindex-builder/spi-builder-workspace/.derivedData/ModuleCache.noindex/Session.modulevalidation -Xcc -I/Users/builder/builds/TDmZkXJm/3/finestructure/swiftpackageindex-builder/spi-builder-workspace/.derivedData/Build/Intermediates.noindex/CodableWrappers.build/Debug-watchos/CodableWrappers.build/swift-overrides.hmap -emit-const-values -Xfrontend -const-gather-protocols-file -Xfrontend /Users/builder/builds/TDmZkXJm/3/finestructure/swiftpackageindex-builder/spi-builder-workspace/.derivedData/Build/Intermediates.noindex/CodableWrappers.build/Debug-watchos/CodableWrappers.build/Objects-normal/arm64_32/CodableWrappers_const_extract_protocols.json -Xcc -I/Users/builder/builds/TDmZkXJm/3/finestructure/swiftpackageindex-builder/spi-builder-workspace/.derivedData/Build/Products/Debug-watchos/include -Xcc -I/Users/builder/builds/TDmZkXJm/3/finestructure/swiftpackageindex-builder/spi-builder-workspace/.derivedData/Build/Intermediates.noindex/CodableWrappers.build/Debug-watchos/CodableWrappers.build/DerivedSources-normal/arm64_32 -Xcc -I/Users/builder/builds/TDmZkXJm/3/finestructure/swiftpackageindex-builder/spi-builder-workspace/.derivedData/Build/Intermediates.noindex/CodableWrappers.build/Debug-watchos/CodableWrappers.build/DerivedSources/arm64_32 -Xcc -I/Users/builder/builds/TDmZkXJm/3/finestructure/swiftpackageindex-builder/spi-builder-workspace/.derivedData/Build/Intermediates.noindex/CodableWrappers.build/Debug-watchos/CodableWrappers.build/DerivedSources -Xcc -DSWIFT_PACKAGE -Xcc -DDEBUG\=1 -emit-objc-header -emit-objc-header-path /Users/builder/builds/TDmZkXJm/3/finestructure/swiftpackageindex-builder/spi-builder-workspace/.derivedData/Build/Intermediates.noindex/CodableWrappers.build/Debug-watchos/CodableWrappers.build/Objects-normal/arm64_32/CodableWrappers-Swift.h -working-directory /Users/builder/builds/TDmZkXJm/3/finestructure/swiftpackageindex-builder/spi-builder-workspace/.dependencies/checkouts/CodableWrappers -experimental-emit-module-separately -disable-cmo
SwiftEmitModule normal arm64_32 Emitting\ module\ for\ XPCConcurrency (in target 'XPCConcurrency' from project 'CopilotForXcodeKit')
cd /Users/builder/builds/TDmZkXJm/3/finestructure/swiftpackageindex-builder/spi-builder-workspace
builtin-swiftTaskExecution -- /Applications/Xcode-15.2.0.app/Contents/Developer/Toolchains/XcodeDefault.xctoolchain/usr/bin/swift-frontend -frontend -emit-module -experimental-skip-non-inlinable-function-bodies-without-types /Users/builder/builds/TDmZkXJm/3/finestructure/swiftpackageindex-builder/spi-builder-workspace/Sources/XPCConcurrency/XPCConnection+Concurrency.swift -target arm64_32-apple-watchos5.0 -enable-objc-interop -sdk /Applications/Xcode-15.2.0.app/Contents/Developer/Platforms/WatchOS.platform/Developer/SDKs/WatchOS10.2.sdk -I /Users/builder/builds/TDmZkXJm/3/finestructure/swiftpackageindex-builder/spi-builder-workspace/.derivedData/Build/Products/Debug-watchos -I /Applications/Xcode-15.2.0.app/Contents/Developer/Platforms/WatchOS.platform/Developer/usr/lib -F /Users/builder/builds/TDmZkXJm/3/finestructure/swiftpackageindex-builder/spi-builder-workspace/.derivedData/Build/Products/Debug-watchos -F /Applications/Xcode-15.2.0.app/Contents/Developer/Platforms/WatchOS.platform/Developer/Library/Frameworks -F /Applications/Xcode-15.2.0.app/Contents/Developer/Platforms/WatchOS.platform/Developer/SDKs/WatchOS10.2.sdk/Developer/Library/Frameworks -no-color-diagnostics -enable-testing -g -module-cache-path /Users/builder/builds/TDmZkXJm/3/finestructure/swiftpackageindex-builder/spi-builder-workspace/.derivedData/ModuleCache.noindex -profile-generate -profile-coverage-mapping -swift-version 5 -enforce-exclusivity\=checked -Onone -D SWIFT_PACKAGE -D DEBUG -D Xcode -serialize-debugging-options -package-name spi_builder_workspace -const-gather-protocols-file /Users/builder/builds/TDmZkXJm/3/finestructure/swiftpackageindex-builder/spi-builder-workspace/.derivedData/Build/Intermediates.noindex/CopilotForXcodeKit.build/Debug-watchos/XPCConcurrency.build/Objects-normal/arm64_32/XPCConcurrency_const_extract_protocols.json -empty-abi-descriptor -validate-clang-modules-once -clang-build-session-file /Users/builder/builds/TDmZkXJm/3/finestructure/swiftpackageindex-builder/spi-builder-workspace/.derivedData/ModuleCache.noindex/Session.modulevalidation -Xcc -working-directory -Xcc /Users/builder/builds/TDmZkXJm/3/finestructure/swiftpackageindex-builder/spi-builder-workspace -resource-dir /Applications/Xcode-15.2.0.app/Contents/Developer/Toolchains/XcodeDefault.xctoolchain/usr/lib/swift -enable-anonymous-context-mangled-names -Xcc -ivfsstatcache -Xcc /Users/builder/builds/TDmZkXJm/3/finestructure/swiftpackageindex-builder/spi-builder-workspace/.derivedData/SDKStatCaches.noindex/watchos10.2-21S355-1a03c8d25fc3596eb74c01d649b42752.sdkstatcache -Xcc -I/Users/builder/builds/TDmZkXJm/3/finestructure/swiftpackageindex-builder/spi-builder-workspace/.derivedData/Build/Intermediates.noindex/CopilotForXcodeKit.build/Debug-watchos/XPCConcurrency.build/swift-overrides.hmap -Xcc -I/Users/builder/builds/TDmZkXJm/3/finestructure/swiftpackageindex-builder/spi-builder-workspace/.derivedData/Build/Products/Debug-watchos/include -Xcc -I/Users/builder/builds/TDmZkXJm/3/finestructure/swiftpackageindex-builder/spi-builder-workspace/.derivedData/Build/Intermediates.noindex/CopilotForXcodeKit.build/Debug-watchos/XPCConcurrency.build/DerivedSources-normal/arm64_32 -Xcc -I/Users/builder/builds/TDmZkXJm/3/finestructure/swiftpackageindex-builder/spi-builder-workspace/.derivedData/Build/Intermediates.noindex/CopilotForXcodeKit.build/Debug-watchos/XPCConcurrency.build/DerivedSources/arm64_32 -Xcc -I/Users/builder/builds/TDmZkXJm/3/finestructure/swiftpackageindex-builder/spi-builder-workspace/.derivedData/Build/Intermediates.noindex/CopilotForXcodeKit.build/Debug-watchos/XPCConcurrency.build/DerivedSources -Xcc -DSWIFT_PACKAGE -Xcc -DDEBUG\=1 -module-name XPCConcurrency -disable-clang-spi -target-sdk-version 10.2 -target-sdk-name watchos10.2 -external-plugin-path /Applications/Xcode-15.2.0.app/Contents/Developer/Platforms/WatchOS.platform/Developer/SDKs/WatchOS10.2.sdk/usr/lib/swift/host/plugins\#/Applications/Xcode-15.2.0.app/Contents/Developer/Platforms/WatchOS.platform/Developer/SDKs/WatchOS10.2.sdk/usr/bin/swift-plugin-server -external-plugin-path /Applications/Xcode-15.2.0.app/Contents/Developer/Platforms/WatchOS.platform/Developer/SDKs/WatchOS10.2.sdk/usr/local/lib/swift/host/plugins\#/Applications/Xcode-15.2.0.app/Contents/Developer/Platforms/WatchOS.platform/Developer/SDKs/WatchOS10.2.sdk/usr/bin/swift-plugin-server -external-plugin-path /Applications/Xcode-15.2.0.app/Contents/Developer/Platforms/WatchOS.platform/Developer/usr/lib/swift/host/plugins\#/Applications/Xcode-15.2.0.app/Contents/Developer/Platforms/WatchOS.platform/Developer/usr/bin/swift-plugin-server -external-plugin-path /Applications/Xcode-15.2.0.app/Contents/Developer/Platforms/WatchOS.platform/Developer/usr/local/lib/swift/host/plugins\#/Applications/Xcode-15.2.0.app/Contents/Developer/Platforms/WatchOS.platform/Developer/usr/bin/swift-plugin-server -plugin-path /Applications/Xcode-15.2.0.app/Contents/Developer/Toolchains/XcodeDefault.xctoolchain/usr/lib/swift/host/plugins -plugin-path /Applications/Xcode-15.2.0.app/Contents/Developer/Toolchains/XcodeDefault.xctoolchain/usr/local/lib/swift/host/plugins -emit-module-doc-path /Users/builder/builds/TDmZkXJm/3/finestructure/swiftpackageindex-builder/spi-builder-workspace/.derivedData/Build/Intermediates.noindex/CopilotForXcodeKit.build/Debug-watchos/XPCConcurrency.build/Objects-normal/arm64_32/XPCConcurrency.swiftdoc -emit-module-source-info-path /Users/builder/builds/TDmZkXJm/3/finestructure/swiftpackageindex-builder/spi-builder-workspace/.derivedData/Build/Intermediates.noindex/CopilotForXcodeKit.build/Debug-watchos/XPCConcurrency.build/Objects-normal/arm64_32/XPCConcurrency.swiftsourceinfo -emit-objc-header-path /Users/builder/builds/TDmZkXJm/3/finestructure/swiftpackageindex-builder/spi-builder-workspace/.derivedData/Build/Intermediates.noindex/CopilotForXcodeKit.build/Debug-watchos/XPCConcurrency.build/Objects-normal/arm64_32/XPCConcurrency-Swift.h -serialize-diagnostics-path /Users/builder/builds/TDmZkXJm/3/finestructure/swiftpackageindex-builder/spi-builder-workspace/.derivedData/Build/Intermediates.noindex/CopilotForXcodeKit.build/Debug-watchos/XPCConcurrency.build/Objects-normal/arm64_32/XPCConcurrency-master-emit-module.dia -emit-dependencies-path /Users/builder/builds/TDmZkXJm/3/finestructure/swiftpackageindex-builder/spi-builder-workspace/.derivedData/Build/Intermediates.noindex/CopilotForXcodeKit.build/Debug-watchos/XPCConcurrency.build/Objects-normal/arm64_32/XPCConcurrency-master-emit-module.d -parse-as-library -o /Users/builder/builds/TDmZkXJm/3/finestructure/swiftpackageindex-builder/spi-builder-workspace/.derivedData/Build/Intermediates.noindex/CopilotForXcodeKit.build/Debug-watchos/XPCConcurrency.build/Objects-normal/arm64_32/XPCConcurrency.swiftmodule -emit-abi-descriptor-path /Users/builder/builds/TDmZkXJm/3/finestructure/swiftpackageindex-builder/spi-builder-workspace/.derivedData/Build/Intermediates.noindex/CopilotForXcodeKit.build/Debug-watchos/XPCConcurrency.build/Objects-normal/arm64_32/XPCConcurrency.abi.json
/Users/builder/builds/TDmZkXJm/3/finestructure/swiftpackageindex-builder/spi-builder-workspace/Sources/XPCConcurrency/XPCConnection+Concurrency.swift:5:23: error: 'AsyncThrowingStream' is only available in watchOS 6.0 or newer
var continuation: AsyncThrowingStream<T, Error>.Continuation
^
/Users/builder/builds/TDmZkXJm/3/finestructure/swiftpackageindex-builder/spi-builder-workspace/Sources/XPCConcurrency/XPCConnection+Concurrency.swift:4:20: note: add @available attribute to enclosing generic class
public final class XPCServiceConnectionContinuation<T> {
^
/Users/builder/builds/TDmZkXJm/3/finestructure/swiftpackageindex-builder/spi-builder-workspace/Sources/XPCConcurrency/XPCConnection+Concurrency.swift:12:33: error: 'AsyncThrowingStream' is only available in watchOS 6.0 or newer
public init(_ continuation: AsyncThrowingStream<T, Error>.Continuation) {
^
/Users/builder/builds/TDmZkXJm/3/finestructure/swiftpackageindex-builder/spi-builder-workspace/Sources/XPCConcurrency/XPCConnection+Concurrency.swift:12:12: note: add @available attribute to enclosing initializer
public init(_ continuation: AsyncThrowingStream<T, Error>.Continuation) {
^
/Users/builder/builds/TDmZkXJm/3/finestructure/swiftpackageindex-builder/spi-builder-workspace/Sources/XPCConcurrency/XPCConnection+Concurrency.swift:4:20: note: add @available attribute to enclosing generic class
public final class XPCServiceConnectionContinuation<T> {
^
/Users/builder/builds/TDmZkXJm/3/finestructure/swiftpackageindex-builder/spi-builder-workspace/Sources/XPCConcurrency/XPCConnection+Concurrency.swift:45:3: error: concurrency is only available in watchOS 6.0.0 or newer
) async throws -> T {
^
/Users/builder/builds/TDmZkXJm/3/finestructure/swiftpackageindex-builder/spi-builder-workspace/Sources/XPCConcurrency/XPCConnection+Concurrency.swift:41:13: note: add @available attribute to enclosing global function
public func withXPCServiceConnected<T, P>(
^
SwiftEmitModule normal arm64 Emitting\ module\ for\ XPCConcurrency (in target 'XPCConcurrency' from project 'CopilotForXcodeKit')
cd /Users/builder/builds/TDmZkXJm/3/finestructure/swiftpackageindex-builder/spi-builder-workspace
builtin-swiftTaskExecution -- /Applications/Xcode-15.2.0.app/Contents/Developer/Toolchains/XcodeDefault.xctoolchain/usr/bin/swift-frontend -frontend -emit-module -experimental-skip-non-inlinable-function-bodies-without-types /Users/builder/builds/TDmZkXJm/3/finestructure/swiftpackageindex-builder/spi-builder-workspace/Sources/XPCConcurrency/XPCConnection+Concurrency.swift -target arm64-apple-watchos5.0 -Xllvm -aarch64-use-tbi -enable-objc-interop -sdk /Applications/Xcode-15.2.0.app/Contents/Developer/Platforms/WatchOS.platform/Developer/SDKs/WatchOS10.2.sdk -I /Users/builder/builds/TDmZkXJm/3/finestructure/swiftpackageindex-builder/spi-builder-workspace/.derivedData/Build/Products/Debug-watchos -I /Applications/Xcode-15.2.0.app/Contents/Developer/Platforms/WatchOS.platform/Developer/usr/lib -F /Users/builder/builds/TDmZkXJm/3/finestructure/swiftpackageindex-builder/spi-builder-workspace/.derivedData/Build/Products/Debug-watchos -F /Applications/Xcode-15.2.0.app/Contents/Developer/Platforms/WatchOS.platform/Developer/Library/Frameworks -F /Applications/Xcode-15.2.0.app/Contents/Developer/Platforms/WatchOS.platform/Developer/SDKs/WatchOS10.2.sdk/Developer/Library/Frameworks -no-color-diagnostics -enable-testing -g -module-cache-path /Users/builder/builds/TDmZkXJm/3/finestructure/swiftpackageindex-builder/spi-builder-workspace/.derivedData/ModuleCache.noindex -profile-generate -profile-coverage-mapping -swift-version 5 -enforce-exclusivity\=checked -Onone -D SWIFT_PACKAGE -D DEBUG -D Xcode -serialize-debugging-options -package-name spi_builder_workspace -const-gather-protocols-file /Users/builder/builds/TDmZkXJm/3/finestructure/swiftpackageindex-builder/spi-builder-workspace/.derivedData/Build/Intermediates.noindex/CopilotForXcodeKit.build/Debug-watchos/XPCConcurrency.build/Objects-normal/arm64/XPCConcurrency_const_extract_protocols.json -empty-abi-descriptor -validate-clang-modules-once -clang-build-session-file /Users/builder/builds/TDmZkXJm/3/finestructure/swiftpackageindex-builder/spi-builder-workspace/.derivedData/ModuleCache.noindex/Session.modulevalidation -Xcc -working-directory -Xcc /Users/builder/builds/TDmZkXJm/3/finestructure/swiftpackageindex-builder/spi-builder-workspace -resource-dir /Applications/Xcode-15.2.0.app/Contents/Developer/Toolchains/XcodeDefault.xctoolchain/usr/lib/swift -enable-anonymous-context-mangled-names -Xcc -ivfsstatcache -Xcc /Users/builder/builds/TDmZkXJm/3/finestructure/swiftpackageindex-builder/spi-builder-workspace/.derivedData/SDKStatCaches.noindex/watchos10.2-21S355-1a03c8d25fc3596eb74c01d649b42752.sdkstatcache -Xcc -I/Users/builder/builds/TDmZkXJm/3/finestructure/swiftpackageindex-builder/spi-builder-workspace/.derivedData/Build/Intermediates.noindex/CopilotForXcodeKit.build/Debug-watchos/XPCConcurrency.build/swift-overrides.hmap -Xcc -I/Users/builder/builds/TDmZkXJm/3/finestructure/swiftpackageindex-builder/spi-builder-workspace/.derivedData/Build/Products/Debug-watchos/include -Xcc -I/Users/builder/builds/TDmZkXJm/3/finestructure/swiftpackageindex-builder/spi-builder-workspace/.derivedData/Build/Intermediates.noindex/CopilotForXcodeKit.build/Debug-watchos/XPCConcurrency.build/DerivedSources-normal/arm64 -Xcc -I/Users/builder/builds/TDmZkXJm/3/finestructure/swiftpackageindex-builder/spi-builder-workspace/.derivedData/Build/Intermediates.noindex/CopilotForXcodeKit.build/Debug-watchos/XPCConcurrency.build/DerivedSources/arm64 -Xcc -I/Users/builder/builds/TDmZkXJm/3/finestructure/swiftpackageindex-builder/spi-builder-workspace/.derivedData/Build/Intermediates.noindex/CopilotForXcodeKit.build/Debug-watchos/XPCConcurrency.build/DerivedSources -Xcc -DSWIFT_PACKAGE -Xcc -DDEBUG\=1 -module-name XPCConcurrency -disable-clang-spi -target-sdk-version 10.2 -target-sdk-name watchos10.2 -external-plugin-path /Applications/Xcode-15.2.0.app/Contents/Developer/Platforms/WatchOS.platform/Developer/SDKs/WatchOS10.2.sdk/usr/lib/swift/host/plugins\#/Applications/Xcode-15.2.0.app/Contents/Developer/Platforms/WatchOS.platform/Developer/SDKs/WatchOS10.2.sdk/usr/bin/swift-plugin-server -external-plugin-path /Applications/Xcode-15.2.0.app/Contents/Developer/Platforms/WatchOS.platform/Developer/SDKs/WatchOS10.2.sdk/usr/local/lib/swift/host/plugins\#/Applications/Xcode-15.2.0.app/Contents/Developer/Platforms/WatchOS.platform/Developer/SDKs/WatchOS10.2.sdk/usr/bin/swift-plugin-server -external-plugin-path /Applications/Xcode-15.2.0.app/Contents/Developer/Platforms/WatchOS.platform/Developer/usr/lib/swift/host/plugins\#/Applications/Xcode-15.2.0.app/Contents/Developer/Platforms/WatchOS.platform/Developer/usr/bin/swift-plugin-server -external-plugin-path /Applications/Xcode-15.2.0.app/Contents/Developer/Platforms/WatchOS.platform/Developer/usr/local/lib/swift/host/plugins\#/Applications/Xcode-15.2.0.app/Contents/Developer/Platforms/WatchOS.platform/Developer/usr/bin/swift-plugin-server -plugin-path /Applications/Xcode-15.2.0.app/Contents/Developer/Toolchains/XcodeDefault.xctoolchain/usr/lib/swift/host/plugins -plugin-path /Applications/Xcode-15.2.0.app/Contents/Developer/Toolchains/XcodeDefault.xctoolchain/usr/local/lib/swift/host/plugins -emit-module-doc-path /Users/builder/builds/TDmZkXJm/3/finestructure/swiftpackageindex-builder/spi-builder-workspace/.derivedData/Build/Intermediates.noindex/CopilotForXcodeKit.build/Debug-watchos/XPCConcurrency.build/Objects-normal/arm64/XPCConcurrency.swiftdoc -emit-module-source-info-path /Users/builder/builds/TDmZkXJm/3/finestructure/swiftpackageindex-builder/spi-builder-workspace/.derivedData/Build/Intermediates.noindex/CopilotForXcodeKit.build/Debug-watchos/XPCConcurrency.build/Objects-normal/arm64/XPCConcurrency.swiftsourceinfo -emit-objc-header-path /Users/builder/builds/TDmZkXJm/3/finestructure/swiftpackageindex-builder/spi-builder-workspace/.derivedData/Build/Intermediates.noindex/CopilotForXcodeKit.build/Debug-watchos/XPCConcurrency.build/Objects-normal/arm64/XPCConcurrency-Swift.h -serialize-diagnostics-path /Users/builder/builds/TDmZkXJm/3/finestructure/swiftpackageindex-builder/spi-builder-workspace/.derivedData/Build/Intermediates.noindex/CopilotForXcodeKit.build/Debug-watchos/XPCConcurrency.build/Objects-normal/arm64/XPCConcurrency-master-emit-module.dia -emit-dependencies-path /Users/builder/builds/TDmZkXJm/3/finestructure/swiftpackageindex-builder/spi-builder-workspace/.derivedData/Build/Intermediates.noindex/CopilotForXcodeKit.build/Debug-watchos/XPCConcurrency.build/Objects-normal/arm64/XPCConcurrency-master-emit-module.d -parse-as-library -o /Users/builder/builds/TDmZkXJm/3/finestructure/swiftpackageindex-builder/spi-builder-workspace/.derivedData/Build/Intermediates.noindex/CopilotForXcodeKit.build/Debug-watchos/XPCConcurrency.build/Objects-normal/arm64/XPCConcurrency.swiftmodule -emit-abi-descriptor-path /Users/builder/builds/TDmZkXJm/3/finestructure/swiftpackageindex-builder/spi-builder-workspace/.derivedData/Build/Intermediates.noindex/CopilotForXcodeKit.build/Debug-watchos/XPCConcurrency.build/Objects-normal/arm64/XPCConcurrency.abi.json
/Users/builder/builds/TDmZkXJm/3/finestructure/swiftpackageindex-builder/spi-builder-workspace/Sources/XPCConcurrency/XPCConnection+Concurrency.swift:5:23: error: 'AsyncThrowingStream' is only available in watchOS 6.0 or newer
var continuation: AsyncThrowingStream<T, Error>.Continuation
^
/Users/builder/builds/TDmZkXJm/3/finestructure/swiftpackageindex-builder/spi-builder-workspace/Sources/XPCConcurrency/XPCConnection+Concurrency.swift:4:20: note: add @available attribute to enclosing generic class
public final class XPCServiceConnectionContinuation<T> {
^
/Users/builder/builds/TDmZkXJm/3/finestructure/swiftpackageindex-builder/spi-builder-workspace/Sources/XPCConcurrency/XPCConnection+Concurrency.swift:12:33: error: 'AsyncThrowingStream' is only available in watchOS 6.0 or newer
public init(_ continuation: AsyncThrowingStream<T, Error>.Continuation) {
^
/Users/builder/builds/TDmZkXJm/3/finestructure/swiftpackageindex-builder/spi-builder-workspace/Sources/XPCConcurrency/XPCConnection+Concurrency.swift:12:12: note: add @available attribute to enclosing initializer
public init(_ continuation: AsyncThrowingStream<T, Error>.Continuation) {
^
/Users/builder/builds/TDmZkXJm/3/finestructure/swiftpackageindex-builder/spi-builder-workspace/Sources/XPCConcurrency/XPCConnection+Concurrency.swift:4:20: note: add @available attribute to enclosing generic class
public final class XPCServiceConnectionContinuation<T> {
^
SwiftEmitModule normal armv7k Emitting\ module\ for\ XPCConcurrency (in target 'XPCConcurrency' from project 'CopilotForXcodeKit')
cd /Users/builder/builds/TDmZkXJm/3/finestructure/swiftpackageindex-builder/spi-builder-workspace
builtin-swiftTaskExecution -- /Applications/Xcode-15.2.0.app/Contents/Developer/Toolchains/XcodeDefault.xctoolchain/usr/bin/swift-frontend -frontend -emit-module -experimental-skip-non-inlinable-function-bodies-without-types /Users/builder/builds/TDmZkXJm/3/finestructure/swiftpackageindex-builder/spi-builder-workspace/Sources/XPCConcurrency/XPCConnection+Concurrency.swift -target armv7k-apple-watchos5.0 -enable-objc-interop -sdk /Applications/Xcode-15.2.0.app/Contents/Developer/Platforms/WatchOS.platform/Developer/SDKs/WatchOS10.2.sdk -I /Users/builder/builds/TDmZkXJm/3/finestructure/swiftpackageindex-builder/spi-builder-workspace/.derivedData/Build/Products/Debug-watchos -I /Applications/Xcode-15.2.0.app/Contents/Developer/Platforms/WatchOS.platform/Developer/usr/lib -F /Users/builder/builds/TDmZkXJm/3/finestructure/swiftpackageindex-builder/spi-builder-workspace/.derivedData/Build/Products/Debug-watchos -F /Applications/Xcode-15.2.0.app/Contents/Developer/Platforms/WatchOS.platform/Developer/Library/Frameworks -F /Applications/Xcode-15.2.0.app/Contents/Developer/Platforms/WatchOS.platform/Developer/SDKs/WatchOS10.2.sdk/Developer/Library/Frameworks -no-color-diagnostics -enable-testing -g -module-cache-path /Users/builder/builds/TDmZkXJm/3/finestructure/swiftpackageindex-builder/spi-builder-workspace/.derivedData/ModuleCache.noindex -profile-generate -profile-coverage-mapping -swift-version 5 -enforce-exclusivity\=checked -Onone -D SWIFT_PACKAGE -D DEBUG -D Xcode -serialize-debugging-options -package-name spi_builder_workspace -const-gather-protocols-file /Users/builder/builds/TDmZkXJm/3/finestructure/swiftpackageindex-builder/spi-builder-workspace/.derivedData/Build/Intermediates.noindex/CopilotForXcodeKit.build/Debug-watchos/XPCConcurrency.build/Objects-normal/armv7k/XPCConcurrency_const_extract_protocols.json -empty-abi-descriptor -validate-clang-modules-once -clang-build-session-file /Users/builder/builds/TDmZkXJm/3/finestructure/swiftpackageindex-builder/spi-builder-workspace/.derivedData/ModuleCache.noindex/Session.modulevalidation -Xcc -working-directory -Xcc /Users/builder/builds/TDmZkXJm/3/finestructure/swiftpackageindex-builder/spi-builder-workspace -resource-dir /Applications/Xcode-15.2.0.app/Contents/Developer/Toolchains/XcodeDefault.xctoolchain/usr/lib/swift -enable-anonymous-context-mangled-names -Xcc -ivfsstatcache -Xcc /Users/builder/builds/TDmZkXJm/3/finestructure/swiftpackageindex-builder/spi-builder-workspace/.derivedData/SDKStatCaches.noindex/watchos10.2-21S355-1a03c8d25fc3596eb74c01d649b42752.sdkstatcache -Xcc -I/Users/builder/builds/TDmZkXJm/3/finestructure/swiftpackageindex-builder/spi-builder-workspace/.derivedData/Build/Intermediates.noindex/CopilotForXcodeKit.build/Debug-watchos/XPCConcurrency.build/swift-overrides.hmap -Xcc -I/Users/builder/builds/TDmZkXJm/3/finestructure/swiftpackageindex-builder/spi-builder-workspace/.derivedData/Build/Products/Debug-watchos/include -Xcc -I/Users/builder/builds/TDmZkXJm/3/finestructure/swiftpackageindex-builder/spi-builder-workspace/.derivedData/Build/Intermediates.noindex/CopilotForXcodeKit.build/Debug-watchos/XPCConcurrency.build/DerivedSources-normal/armv7k -Xcc -I/Users/builder/builds/TDmZkXJm/3/finestructure/swiftpackageindex-builder/spi-builder-workspace/.derivedData/Build/Intermediates.noindex/CopilotForXcodeKit.build/Debug-watchos/XPCConcurrency.build/DerivedSources/armv7k -Xcc -I/Users/builder/builds/TDmZkXJm/3/finestructure/swiftpackageindex-builder/spi-builder-workspace/.derivedData/Build/Intermediates.noindex/CopilotForXcodeKit.build/Debug-watchos/XPCConcurrency.build/DerivedSources -Xcc -DSWIFT_PACKAGE -Xcc -DDEBUG\=1 -module-name XPCConcurrency -disable-clang-spi -target-sdk-version 10.2 -target-sdk-name watchos10.2 -external-plugin-path /Applications/Xcode-15.2.0.app/Contents/Developer/Platforms/WatchOS.platform/Developer/SDKs/WatchOS10.2.sdk/usr/lib/swift/host/plugins\#/Applications/Xcode-15.2.0.app/Contents/Developer/Platforms/WatchOS.platform/Developer/SDKs/WatchOS10.2.sdk/usr/bin/swift-plugin-server -external-plugin-path /Applications/Xcode-15.2.0.app/Contents/Developer/Platforms/WatchOS.platform/Developer/SDKs/WatchOS10.2.sdk/usr/local/lib/swift/host/plugins\#/Applications/Xcode-15.2.0.app/Contents/Developer/Platforms/WatchOS.platform/Developer/SDKs/WatchOS10.2.sdk/usr/bin/swift-plugin-server -external-plugin-path /Applications/Xcode-15.2.0.app/Contents/Developer/Platforms/WatchOS.platform/Developer/usr/lib/swift/host/plugins\#/Applications/Xcode-15.2.0.app/Contents/Developer/Platforms/WatchOS.platform/Developer/usr/bin/swift-plugin-server -external-plugin-path /Applications/Xcode-15.2.0.app/Contents/Developer/Platforms/WatchOS.platform/Developer/usr/local/lib/swift/host/plugins\#/Applications/Xcode-15.2.0.app/Contents/Developer/Platforms/WatchOS.platform/Developer/usr/bin/swift-plugin-server -plugin-path /Applications/Xcode-15.2.0.app/Contents/Developer/Toolchains/XcodeDefault.xctoolchain/usr/lib/swift/host/plugins -plugin-path /Applications/Xcode-15.2.0.app/Contents/Developer/Toolchains/XcodeDefault.xctoolchain/usr/local/lib/swift/host/plugins -emit-module-doc-path /Users/builder/builds/TDmZkXJm/3/finestructure/swiftpackageindex-builder/spi-builder-workspace/.derivedData/Build/Intermediates.noindex/CopilotForXcodeKit.build/Debug-watchos/XPCConcurrency.build/Objects-normal/armv7k/XPCConcurrency.swiftdoc -emit-module-source-info-path /Users/builder/builds/TDmZkXJm/3/finestructure/swiftpackageindex-builder/spi-builder-workspace/.derivedData/Build/Intermediates.noindex/CopilotForXcodeKit.build/Debug-watchos/XPCConcurrency.build/Objects-normal/armv7k/XPCConcurrency.swiftsourceinfo -emit-objc-header-path /Users/builder/builds/TDmZkXJm/3/finestructure/swiftpackageindex-builder/spi-builder-workspace/.derivedData/Build/Intermediates.noindex/CopilotForXcodeKit.build/Debug-watchos/XPCConcurrency.build/Objects-normal/armv7k/XPCConcurrency-Swift.h -serialize-diagnostics-path /Users/builder/builds/TDmZkXJm/3/finestructure/swiftpackageindex-builder/spi-builder-workspace/.derivedData/Build/Intermediates.noindex/CopilotForXcodeKit.build/Debug-watchos/XPCConcurrency.build/Objects-normal/armv7k/XPCConcurrency-master-emit-module.dia -emit-dependencies-path /Users/builder/builds/TDmZkXJm/3/finestructure/swiftpackageindex-builder/spi-builder-workspace/.derivedData/Build/Intermediates.noindex/CopilotForXcodeKit.build/Debug-watchos/XPCConcurrency.build/Objects-normal/armv7k/XPCConcurrency-master-emit-module.d -parse-as-library -o /Users/builder/builds/TDmZkXJm/3/finestructure/swiftpackageindex-builder/spi-builder-workspace/.derivedData/Build/Intermediates.noindex/CopilotForXcodeKit.build/Debug-watchos/XPCConcurrency.build/Objects-normal/armv7k/XPCConcurrency.swiftmodule -emit-abi-descriptor-path /Users/builder/builds/TDmZkXJm/3/finestructure/swiftpackageindex-builder/spi-builder-workspace/.derivedData/Build/Intermediates.noindex/CopilotForXcodeKit.build/Debug-watchos/XPCConcurrency.build/Objects-normal/armv7k/XPCConcurrency.abi.json
/Users/builder/builds/TDmZkXJm/3/finestructure/swiftpackageindex-builder/spi-builder-workspace/Sources/XPCConcurrency/XPCConnection+Concurrency.swift:5:23: error: 'AsyncThrowingStream' is only available in watchOS 6.0 or newer
var continuation: AsyncThrowingStream<T, Error>.Continuation
^
/Users/builder/builds/TDmZkXJm/3/finestructure/swiftpackageindex-builder/spi-builder-workspace/Sources/XPCConcurrency/XPCConnection+Concurrency.swift:4:20: note: add @available attribute to enclosing generic class
public final class XPCServiceConnectionContinuation<T> {
^
/Users/builder/builds/TDmZkXJm/3/finestructure/swiftpackageindex-builder/spi-builder-workspace/Sources/XPCConcurrency/XPCConnection+Concurrency.swift:12:33: error: 'AsyncThrowingStream' is only available in watchOS 6.0 or newer
public init(_ continuation: AsyncThrowingStream<T, Error>.Continuation) {
^
/Users/builder/builds/TDmZkXJm/3/finestructure/swiftpackageindex-builder/spi-builder-workspace/Sources/XPCConcurrency/XPCConnection+Concurrency.swift:12:12: note: add @available attribute to enclosing initializer
public init(_ continuation: AsyncThrowingStream<T, Error>.Continuation) {
^
/Users/builder/builds/TDmZkXJm/3/finestructure/swiftpackageindex-builder/spi-builder-workspace/Sources/XPCConcurrency/XPCConnection+Concurrency.swift:4:20: note: add @available attribute to enclosing generic class
public final class XPCServiceConnectionContinuation<T> {
^
/Users/builder/builds/TDmZkXJm/3/finestructure/swiftpackageindex-builder/spi-builder-workspace/Sources/XPCConcurrency/XPCConnection+Concurrency.swift:45:3: error: concurrency is only available in watchOS 6.0.0 or newer
) async throws -> T {
^
/Users/builder/builds/TDmZkXJm/3/finestructure/swiftpackageindex-builder/spi-builder-workspace/Sources/XPCConcurrency/XPCConnection+Concurrency.swift:41:13: note: add @available attribute to enclosing global function
public func withXPCServiceConnected<T, P>(
^
SwiftCompile normal arm64 Compiling\ XPCConnection+Concurrency.swift /Users/builder/builds/TDmZkXJm/3/finestructure/swiftpackageindex-builder/spi-builder-workspace/Sources/XPCConcurrency/XPCConnection+Concurrency.swift (in target 'XPCConcurrency' from project 'CopilotForXcodeKit')
cd /Users/builder/builds/TDmZkXJm/3/finestructure/swiftpackageindex-builder/spi-builder-workspace
builtin-swiftTaskExecution -- /Applications/Xcode-15.2.0.app/Contents/Developer/Toolchains/XcodeDefault.xctoolchain/usr/bin/swift-frontend -frontend -c -primary-file /Users/builder/builds/TDmZkXJm/3/finestructure/swiftpackageindex-builder/spi-builder-workspace/Sources/XPCConcurrency/XPCConnection+Concurrency.swift -emit-dependencies-path /Users/builder/builds/TDmZkXJm/3/finestructure/swiftpackageindex-builder/spi-builder-workspace/.derivedData/Build/Intermediates.noindex/CopilotForXcodeKit.build/Debug-watchos/XPCConcurrency.build/Objects-normal/arm64/XPCConnection+Concurrency.d -emit-const-values-path /Users/builder/builds/TDmZkXJm/3/finestructure/swiftpackageindex-builder/spi-builder-workspace/.derivedData/Build/Intermediates.noindex/CopilotForXcodeKit.build/Debug-watchos/XPCConcurrency.build/Objects-normal/arm64/XPCConnection+Concurrency.swiftconstvalues -emit-reference-dependencies-path /Users/builder/builds/TDmZkXJm/3/finestructure/swiftpackageindex-builder/spi-builder-workspace/.derivedData/Build/Intermediates.noindex/CopilotForXcodeKit.build/Debug-watchos/XPCConcurrency.build/Objects-normal/arm64/XPCConnection+Concurrency.swiftdeps -serialize-diagnostics-path /Users/builder/builds/TDmZkXJm/3/finestructure/swiftpackageindex-builder/spi-builder-workspace/.derivedData/Build/Intermediates.noindex/CopilotForXcodeKit.build/Debug-watchos/XPCConcurrency.build/Objects-normal/arm64/XPCConnection+Concurrency.dia -target arm64-apple-watchos5.0 -Xllvm -aarch64-use-tbi -enable-objc-interop -sdk /Applications/Xcode-15.2.0.app/Contents/Developer/Platforms/WatchOS.platform/Developer/SDKs/WatchOS10.2.sdk -I /Users/builder/builds/TDmZkXJm/3/finestructure/swiftpackageindex-builder/spi-builder-workspace/.derivedData/Build/Products/Debug-watchos -I /Applications/Xcode-15.2.0.app/Contents/Developer/Platforms/WatchOS.platform/Developer/usr/lib -F /Users/builder/builds/TDmZkXJm/3/finestructure/swiftpackageindex-builder/spi-builder-workspace/.derivedData/Build/Products/Debug-watchos -F /Applications/Xcode-15.2.0.app/Contents/Developer/Platforms/WatchOS.platform/Developer/Library/Frameworks -F /Applications/Xcode-15.2.0.app/Contents/Developer/Platforms/WatchOS.platform/Developer/SDKs/WatchOS10.2.sdk/Developer/Library/Frameworks -no-color-diagnostics -enable-testing -g -module-cache-path /Users/builder/builds/TDmZkXJm/3/finestructure/swiftpackageindex-builder/spi-builder-workspace/.derivedData/ModuleCache.noindex -profile-generate -profile-coverage-mapping -swift-version 5 -enforce-exclusivity\=checked -Onone -D SWIFT_PACKAGE -D DEBUG -D Xcode -serialize-debugging-options -package-name spi_builder_workspace -const-gather-protocols-file /Users/builder/builds/TDmZkXJm/3/finestructure/swiftpackageindex-builder/spi-builder-workspace/.derivedData/Build/Intermediates.noindex/CopilotForXcodeKit.build/Debug-watchos/XPCConcurrency.build/Objects-normal/arm64/XPCConcurrency_const_extract_protocols.json -empty-abi-descriptor -validate-clang-modules-once -clang-build-session-file /Users/builder/builds/TDmZkXJm/3/finestructure/swiftpackageindex-builder/spi-builder-workspace/.derivedData/ModuleCache.noindex/Session.modulevalidation -Xcc -working-directory -Xcc /Users/builder/builds/TDmZkXJm/3/finestructure/swiftpackageindex-builder/spi-builder-workspace -resource-dir /Applications/Xcode-15.2.0.app/Contents/Developer/Toolchains/XcodeDefault.xctoolchain/usr/lib/swift -enable-anonymous-context-mangled-names -Xcc -ivfsstatcache -Xcc /Users/builder/builds/TDmZkXJm/3/finestructure/swiftpackageindex-builder/spi-builder-workspace/.derivedData/SDKStatCaches.noindex/watchos10.2-21S355-1a03c8d25fc3596eb74c01d649b42752.sdkstatcache -Xcc -I/Users/builder/builds/TDmZkXJm/3/finestructure/swiftpackageindex-builder/spi-builder-workspace/.derivedData/Build/Intermediates.noindex/CopilotForXcodeKit.build/Debug-watchos/XPCConcurrency.build/swift-overrides.hmap -Xcc -I/Users/builder/builds/TDmZkXJm/3/finestructure/swiftpackageindex-builder/spi-builder-workspace/.derivedData/Build/Products/Debug-watchos/include -Xcc -I/Users/builder/builds/TDmZkXJm/3/finestructure/swiftpackageindex-builder/spi-builder-workspace/.derivedData/Build/Intermediates.noindex/CopilotForXcodeKit.build/Debug-watchos/XPCConcurrency.build/DerivedSources-normal/arm64 -Xcc -I/Users/builder/builds/TDmZkXJm/3/finestructure/swiftpackageindex-builder/spi-builder-workspace/.derivedData/Build/Intermediates.noindex/CopilotForXcodeKit.build/Debug-watchos/XPCConcurrency.build/DerivedSources/arm64 -Xcc -I/Users/builder/builds/TDmZkXJm/3/finestructure/swiftpackageindex-builder/spi-builder-workspace/.derivedData/Build/Intermediates.noindex/CopilotForXcodeKit.build/Debug-watchos/XPCConcurrency.build/DerivedSources -Xcc -DSWIFT_PACKAGE -Xcc -DDEBUG\=1 -module-name XPCConcurrency -frontend-parseable-output -disable-clang-spi -target-sdk-version 10.2 -target-sdk-name watchos10.2 -external-plugin-path /Applications/Xcode-15.2.0.app/Contents/Developer/Platforms/WatchOS.platform/Developer/SDKs/WatchOS10.2.sdk/usr/lib/swift/host/plugins\#/Applications/Xcode-15.2.0.app/Contents/Developer/Platforms/WatchOS.platform/Developer/SDKs/WatchOS10.2.sdk/usr/bin/swift-plugin-server -external-plugin-path /Applications/Xcode-15.2.0.app/Contents/Developer/Platforms/WatchOS.platform/Developer/SDKs/WatchOS10.2.sdk/usr/local/lib/swift/host/plugins\#/Applications/Xcode-15.2.0.app/Contents/Developer/Platforms/WatchOS.platform/Developer/SDKs/WatchOS10.2.sdk/usr/bin/swift-plugin-server -external-plugin-path /Applications/Xcode-15.2.0.app/Contents/Developer/Platforms/WatchOS.platform/Developer/usr/lib/swift/host/plugins\#/Applications/Xcode-15.2.0.app/Contents/Developer/Platforms/WatchOS.platform/Developer/usr/bin/swift-plugin-server -external-plugin-path /Applications/Xcode-15.2.0.app/Contents/Developer/Platforms/WatchOS.platform/Developer/usr/local/lib/swift/host/plugins\#/Applications/Xcode-15.2.0.app/Contents/Developer/Platforms/WatchOS.platform/Developer/usr/bin/swift-plugin-server -plugin-path /Applications/Xcode-15.2.0.app/Contents/Developer/Toolchains/XcodeDefault.xctoolchain/usr/lib/swift/host/plugins -plugin-path /Applications/Xcode-15.2.0.app/Contents/Developer/Toolchains/XcodeDefault.xctoolchain/usr/local/lib/swift/host/plugins -parse-as-library -o /Users/builder/builds/TDmZkXJm/3/finestructure/swiftpackageindex-builder/spi-builder-workspace/.derivedData/Build/Intermediates.noindex/CopilotForXcodeKit.build/Debug-watchos/XPCConcurrency.build/Objects-normal/arm64/XPCConnection+Concurrency.o -index-unit-output-path /CopilotForXcodeKit.build/Debug-watchos/XPCConcurrency.build/Objects-normal/arm64/XPCConnection+Concurrency.o -index-store-path /Users/builder/builds/TDmZkXJm/3/finestructure/swiftpackageindex-builder/spi-builder-workspace/.derivedData/Index.noindex/DataStore -index-system-modules
SwiftCompile normal arm64 /Users/builder/builds/TDmZkXJm/3/finestructure/swiftpackageindex-builder/spi-builder-workspace/Sources/XPCConcurrency/XPCConnection+Concurrency.swift (in target 'XPCConcurrency' from project 'CopilotForXcodeKit')
cd /Users/builder/builds/TDmZkXJm/3/finestructure/swiftpackageindex-builder/spi-builder-workspace
/Applications/Xcode-15.2.0.app/Contents/Developer/Toolchains/XcodeDefault.xctoolchain/usr/bin/swift-frontend -c -primary-file /Users/builder/builds/TDmZkXJm/3/finestructure/swiftpackageindex-builder/spi-builder-workspace/Sources/XPCConcurrency/XPCConnection+Concurrency.swift -emit-dependencies-path /Users/builder/builds/TDmZkXJm/3/finestructure/swiftpackageindex-builder/spi-builder-workspace/.derivedData/Build/Intermediates.noindex/CopilotForXcodeKit.build/Debug-watchos/XPCConcurrency.build/Objects-normal/arm64/XPCConnection+Concurrency.d -emit-const-values-path /Users/builder/builds/TDmZkXJm/3/finestructure/swiftpackageindex-builder/spi-builder-workspace/.derivedData/Build/Intermediates.noindex/CopilotForXcodeKit.build/Debug-watchos/XPCConcurrency.build/Objects-normal/arm64/XPCConnection+Concurrency.swiftconstvalues -emit-reference-dependencies-path /Users/builder/builds/TDmZkXJm/3/finestructure/swiftpackageindex-builder/spi-builder-workspace/.derivedData/Build/Intermediates.noindex/CopilotForXcodeKit.build/Debug-watchos/XPCConcurrency.build/Objects-normal/arm64/XPCConnection+Concurrency.swiftdeps -serialize-diagnostics-path /Users/builder/builds/TDmZkXJm/3/finestructure/swiftpackageindex-builder/spi-builder-workspace/.derivedData/Build/Intermediates.noindex/CopilotForXcodeKit.build/Debug-watchos/XPCConcurrency.build/Objects-normal/arm64/XPCConnection+Concurrency.dia -target arm64-apple-watchos5.0 -Xllvm -aarch64-use-tbi -enable-objc-interop -sdk /Applications/Xcode-15.2.0.app/Contents/Developer/Platforms/WatchOS.platform/Developer/SDKs/WatchOS10.2.sdk -I /Users/builder/builds/TDmZkXJm/3/finestructure/swiftpackageindex-builder/spi-builder-workspace/.derivedData/Build/Products/Debug-watchos -I /Applications/Xcode-15.2.0.app/Contents/Developer/Platforms/WatchOS.platform/Developer/usr/lib -F /Users/builder/builds/TDmZkXJm/3/finestructure/swiftpackageindex-builder/spi-builder-workspace/.derivedData/Build/Products/Debug-watchos -F /Applications/Xcode-15.2.0.app/Contents/Developer/Platforms/WatchOS.platform/Developer/Library/Frameworks -F /Applications/Xcode-15.2.0.app/Contents/Developer/Platforms/WatchOS.platform/Developer/SDKs/WatchOS10.2.sdk/Developer/Library/Frameworks -no-color-diagnostics -enable-testing -g -module-cache-path /Users/builder/builds/TDmZkXJm/3/finestructure/swiftpackageindex-builder/spi-builder-workspace/.derivedData/ModuleCache.noindex -profile-generate -profile-coverage-mapping -swift-version 5 -enforce-exclusivity\=checked -Onone -D SWIFT_PACKAGE -D DEBUG -D Xcode -serialize-debugging-options -package-name spi_builder_workspace -const-gather-protocols-file /Users/builder/builds/TDmZkXJm/3/finestructure/swiftpackageindex-builder/spi-builder-workspace/.derivedData/Build/Intermediates.noindex/CopilotForXcodeKit.build/Debug-watchos/XPCConcurrency.build/Objects-normal/arm64/XPCConcurrency_const_extract_protocols.json -empty-abi-descriptor -validate-clang-modules-once -clang-build-session-file /Users/builder/builds/TDmZkXJm/3/finestructure/swiftpackageindex-builder/spi-builder-workspace/.derivedData/ModuleCache.noindex/Session.modulevalidation -Xcc -working-directory -Xcc /Users/builder/builds/TDmZkXJm/3/finestructure/swiftpackageindex-builder/spi-builder-workspace -resource-dir /Applications/Xcode-15.2.0.app/Contents/Developer/Toolchains/XcodeDefault.xctoolchain/usr/lib/swift -enable-anonymous-context-mangled-names -Xcc -ivfsstatcache -Xcc /Users/builder/builds/TDmZkXJm/3/finestructure/swiftpackageindex-builder/spi-builder-workspace/.derivedData/SDKStatCaches.noindex/watchos10.2-21S355-1a03c8d25fc3596eb74c01d649b42752.sdkstatcache -Xcc -I/Users/builder/builds/TDmZkXJm/3/finestructure/swiftpackageindex-builder/spi-builder-workspace/.derivedData/Build/Intermediates.noindex/CopilotForXcodeKit.build/Debug-watchos/XPCConcurrency.build/swift-overrides.hmap -Xcc -I/Users/builder/builds/TDmZkXJm/3/finestructure/swiftpackageindex-builder/spi-builder-workspace/.derivedData/Build/Products/Debug-watchos/include -Xcc -I/Users/builder/builds/TDmZkXJm/3/finestructure/swiftpackageindex-builder/spi-builder-workspace/.derivedData/Build/Intermediates.noindex/CopilotForXcodeKit.build/Debug-watchos/XPCConcurrency.build/DerivedSources-normal/arm64 -Xcc -I/Users/builder/builds/TDmZkXJm/3/finestructure/swiftpackageindex-builder/spi-builder-workspace/.derivedData/Build/Intermediates.noindex/CopilotForXcodeKit.build/Debug-watchos/XPCConcurrency.build/DerivedSources/arm64 -Xcc -I/Users/builder/builds/TDmZkXJm/3/finestructure/swiftpackageindex-builder/spi-builder-workspace/.derivedData/Build/Intermediates.noindex/CopilotForXcodeKit.build/Debug-watchos/XPCConcurrency.build/DerivedSources -Xcc -DSWIFT_PACKAGE -Xcc -DDEBUG\=1 -module-name XPCConcurrency -frontend-parseable-output -disable-clang-spi -target-sdk-version 10.2 -target-sdk-name watchos10.2 -external-plugin-path /Applications/Xcode-15.2.0.app/Contents/Developer/Platforms/WatchOS.platform/Developer/SDKs/WatchOS10.2.sdk/usr/lib/swift/host/plugins\#/Applications/Xcode-15.2.0.app/Contents/Developer/Platforms/WatchOS.platform/Developer/SDKs/WatchOS10.2.sdk/usr/bin/swift-plugin-server -external-plugin-path /Applications/Xcode-15.2.0.app/Contents/Developer/Platforms/WatchOS.platform/Developer/SDKs/WatchOS10.2.sdk/usr/local/lib/swift/host/plugins\#/Applications/Xcode-15.2.0.app/Contents/Developer/Platforms/WatchOS.platform/Developer/SDKs/WatchOS10.2.sdk/usr/bin/swift-plugin-server -external-plugin-path /Applications/Xcode-15.2.0.app/Contents/Developer/Platforms/WatchOS.platform/Developer/usr/lib/swift/host/plugins\#/Applications/Xcode-15.2.0.app/Contents/Developer/Platforms/WatchOS.platform/Developer/usr/bin/swift-plugin-server -external-plugin-path /Applications/Xcode-15.2.0.app/Contents/Developer/Platforms/WatchOS.platform/Developer/usr/local/lib/swift/host/plugins\#/Applications/Xcode-15.2.0.app/Contents/Developer/Platforms/WatchOS.platform/Developer/usr/bin/swift-plugin-server -plugin-path /Applications/Xcode-15.2.0.app/Contents/Developer/Toolchains/XcodeDefault.xctoolchain/usr/lib/swift/host/plugins -plugin-path /Applications/Xcode-15.2.0.app/Contents/Developer/Toolchains/XcodeDefault.xctoolchain/usr/local/lib/swift/host/plugins -parse-as-library -o /Users/builder/builds/TDmZkXJm/3/finestructure/swiftpackageindex-builder/spi-builder-workspace/.derivedData/Build/Intermediates.noindex/CopilotForXcodeKit.build/Debug-watchos/XPCConcurrency.build/Objects-normal/arm64/XPCConnection+Concurrency.o -index-unit-output-path /CopilotForXcodeKit.build/Debug-watchos/XPCConcurrency.build/Objects-normal/arm64/XPCConnection+Concurrency.o -index-store-path /Users/builder/builds/TDmZkXJm/3/finestructure/swiftpackageindex-builder/spi-builder-workspace/.derivedData/Index.noindex/DataStore -index-system-modules
SwiftCompile normal arm64_32 Compiling\ XPCConnection+Concurrency.swift /Users/builder/builds/TDmZkXJm/3/finestructure/swiftpackageindex-builder/spi-builder-workspace/Sources/XPCConcurrency/XPCConnection+Concurrency.swift (in target 'XPCConcurrency' from project 'CopilotForXcodeKit')
cd /Users/builder/builds/TDmZkXJm/3/finestructure/swiftpackageindex-builder/spi-builder-workspace
builtin-swiftTaskExecution -- /Applications/Xcode-15.2.0.app/Contents/Developer/Toolchains/XcodeDefault.xctoolchain/usr/bin/swift-frontend -frontend -c -primary-file /Users/builder/builds/TDmZkXJm/3/finestructure/swiftpackageindex-builder/spi-builder-workspace/Sources/XPCConcurrency/XPCConnection+Concurrency.swift -emit-dependencies-path /Users/builder/builds/TDmZkXJm/3/finestructure/swiftpackageindex-builder/spi-builder-workspace/.derivedData/Build/Intermediates.noindex/CopilotForXcodeKit.build/Debug-watchos/XPCConcurrency.build/Objects-normal/arm64_32/XPCConnection+Concurrency.d -emit-const-values-path /Users/builder/builds/TDmZkXJm/3/finestructure/swiftpackageindex-builder/spi-builder-workspace/.derivedData/Build/Intermediates.noindex/CopilotForXcodeKit.build/Debug-watchos/XPCConcurrency.build/Objects-normal/arm64_32/XPCConnection+Concurrency.swiftconstvalues -emit-reference-dependencies-path /Users/builder/builds/TDmZkXJm/3/finestructure/swiftpackageindex-builder/spi-builder-workspace/.derivedData/Build/Intermediates.noindex/CopilotForXcodeKit.build/Debug-watchos/XPCConcurrency.build/Objects-normal/arm64_32/XPCConnection+Concurrency.swiftdeps -serialize-diagnostics-path /Users/builder/builds/TDmZkXJm/3/finestructure/swiftpackageindex-builder/spi-builder-workspace/.derivedData/Build/Intermediates.noindex/CopilotForXcodeKit.build/Debug-watchos/XPCConcurrency.build/Objects-normal/arm64_32/XPCConnection+Concurrency.dia -target arm64_32-apple-watchos5.0 -enable-objc-interop -sdk /Applications/Xcode-15.2.0.app/Contents/Developer/Platforms/WatchOS.platform/Developer/SDKs/WatchOS10.2.sdk -I /Users/builder/builds/TDmZkXJm/3/finestructure/swiftpackageindex-builder/spi-builder-workspace/.derivedData/Build/Products/Debug-watchos -I /Applications/Xcode-15.2.0.app/Contents/Developer/Platforms/WatchOS.platform/Developer/usr/lib -F /Users/builder/builds/TDmZkXJm/3/finestructure/swiftpackageindex-builder/spi-builder-workspace/.derivedData/Build/Products/Debug-watchos -F /Applications/Xcode-15.2.0.app/Contents/Developer/Platforms/WatchOS.platform/Developer/Library/Frameworks -F /Applications/Xcode-15.2.0.app/Contents/Developer/Platforms/WatchOS.platform/Developer/SDKs/WatchOS10.2.sdk/Developer/Library/Frameworks -no-color-diagnostics -enable-testing -g -module-cache-path /Users/builder/builds/TDmZkXJm/3/finestructure/swiftpackageindex-builder/spi-builder-workspace/.derivedData/ModuleCache.noindex -profile-generate -profile-coverage-mapping -swift-version 5 -enforce-exclusivity\=checked -Onone -D SWIFT_PACKAGE -D DEBUG -D Xcode -serialize-debugging-options -package-name spi_builder_workspace -const-gather-protocols-file /Users/builder/builds/TDmZkXJm/3/finestructure/swiftpackageindex-builder/spi-builder-workspace/.derivedData/Build/Intermediates.noindex/CopilotForXcodeKit.build/Debug-watchos/XPCConcurrency.build/Objects-normal/arm64_32/XPCConcurrency_const_extract_protocols.json -empty-abi-descriptor -validate-clang-modules-once -clang-build-session-file /Users/builder/builds/TDmZkXJm/3/finestructure/swiftpackageindex-builder/spi-builder-workspace/.derivedData/ModuleCache.noindex/Session.modulevalidation -Xcc -working-directory -Xcc /Users/builder/builds/TDmZkXJm/3/finestructure/swiftpackageindex-builder/spi-builder-workspace -resource-dir /Applications/Xcode-15.2.0.app/Contents/Developer/Toolchains/XcodeDefault.xctoolchain/usr/lib/swift -enable-anonymous-context-mangled-names -Xcc -ivfsstatcache -Xcc /Users/builder/builds/TDmZkXJm/3/finestructure/swiftpackageindex-builder/spi-builder-workspace/.derivedData/SDKStatCaches.noindex/watchos10.2-21S355-1a03c8d25fc3596eb74c01d649b42752.sdkstatcache -Xcc -I/Users/builder/builds/TDmZkXJm/3/finestructure/swiftpackageindex-builder/spi-builder-workspace/.derivedData/Build/Intermediates.noindex/CopilotForXcodeKit.build/Debug-watchos/XPCConcurrency.build/swift-overrides.hmap -Xcc -I/Users/builder/builds/TDmZkXJm/3/finestructure/swiftpackageindex-builder/spi-builder-workspace/.derivedData/Build/Products/Debug-watchos/include -Xcc -I/Users/builder/builds/TDmZkXJm/3/finestructure/swiftpackageindex-builder/spi-builder-workspace/.derivedData/Build/Intermediates.noindex/CopilotForXcodeKit.build/Debug-watchos/XPCConcurrency.build/DerivedSources-normal/arm64_32 -Xcc -I/Users/builder/builds/TDmZkXJm/3/finestructure/swiftpackageindex-builder/spi-builder-workspace/.derivedData/Build/Intermediates.noindex/CopilotForXcodeKit.build/Debug-watchos/XPCConcurrency.build/DerivedSources/arm64_32 -Xcc -I/Users/builder/builds/TDmZkXJm/3/finestructure/swiftpackageindex-builder/spi-builder-workspace/.derivedData/Build/Intermediates.noindex/CopilotForXcodeKit.build/Debug-watchos/XPCConcurrency.build/DerivedSources -Xcc -DSWIFT_PACKAGE -Xcc -DDEBUG\=1 -module-name XPCConcurrency -frontend-parseable-output -disable-clang-spi -target-sdk-version 10.2 -target-sdk-name watchos10.2 -external-plugin-path /Applications/Xcode-15.2.0.app/Contents/Developer/Platforms/WatchOS.platform/Developer/SDKs/WatchOS10.2.sdk/usr/lib/swift/host/plugins\#/Applications/Xcode-15.2.0.app/Contents/Developer/Platforms/WatchOS.platform/Developer/SDKs/WatchOS10.2.sdk/usr/bin/swift-plugin-server -external-plugin-path /Applications/Xcode-15.2.0.app/Contents/Developer/Platforms/WatchOS.platform/Developer/SDKs/WatchOS10.2.sdk/usr/local/lib/swift/host/plugins\#/Applications/Xcode-15.2.0.app/Contents/Developer/Platforms/WatchOS.platform/Developer/SDKs/WatchOS10.2.sdk/usr/bin/swift-plugin-server -external-plugin-path /Applications/Xcode-15.2.0.app/Contents/Developer/Platforms/WatchOS.platform/Developer/usr/lib/swift/host/plugins\#/Applications/Xcode-15.2.0.app/Contents/Developer/Platforms/WatchOS.platform/Developer/usr/bin/swift-plugin-server -external-plugin-path /Applications/Xcode-15.2.0.app/Contents/Developer/Platforms/WatchOS.platform/Developer/usr/local/lib/swift/host/plugins\#/Applications/Xcode-15.2.0.app/Contents/Developer/Platforms/WatchOS.platform/Developer/usr/bin/swift-plugin-server -plugin-path /Applications/Xcode-15.2.0.app/Contents/Developer/Toolchains/XcodeDefault.xctoolchain/usr/lib/swift/host/plugins -plugin-path /Applications/Xcode-15.2.0.app/Contents/Developer/Toolchains/XcodeDefault.xctoolchain/usr/local/lib/swift/host/plugins -parse-as-library -o /Users/builder/builds/TDmZkXJm/3/finestructure/swiftpackageindex-builder/spi-builder-workspace/.derivedData/Build/Intermediates.noindex/CopilotForXcodeKit.build/Debug-watchos/XPCConcurrency.build/Objects-normal/arm64_32/XPCConnection+Concurrency.o -index-unit-output-path /CopilotForXcodeKit.build/Debug-watchos/XPCConcurrency.build/Objects-normal/arm64_32/XPCConnection+Concurrency.o -index-store-path /Users/builder/builds/TDmZkXJm/3/finestructure/swiftpackageindex-builder/spi-builder-workspace/.derivedData/Index.noindex/DataStore -index-system-modules
SwiftCompile normal armv7k Compiling\ XPCConnection+Concurrency.swift /Users/builder/builds/TDmZkXJm/3/finestructure/swiftpackageindex-builder/spi-builder-workspace/Sources/XPCConcurrency/XPCConnection+Concurrency.swift (in target 'XPCConcurrency' from project 'CopilotForXcodeKit')
cd /Users/builder/builds/TDmZkXJm/3/finestructure/swiftpackageindex-builder/spi-builder-workspace
builtin-swiftTaskExecution -- /Applications/Xcode-15.2.0.app/Contents/Developer/Toolchains/XcodeDefault.xctoolchain/usr/bin/swift-frontend -frontend -c -primary-file /Users/builder/builds/TDmZkXJm/3/finestructure/swiftpackageindex-builder/spi-builder-workspace/Sources/XPCConcurrency/XPCConnection+Concurrency.swift -emit-dependencies-path /Users/builder/builds/TDmZkXJm/3/finestructure/swiftpackageindex-builder/spi-builder-workspace/.derivedData/Build/Intermediates.noindex/CopilotForXcodeKit.build/Debug-watchos/XPCConcurrency.build/Objects-normal/armv7k/XPCConnection+Concurrency.d -emit-const-values-path /Users/builder/builds/TDmZkXJm/3/finestructure/swiftpackageindex-builder/spi-builder-workspace/.derivedData/Build/Intermediates.noindex/CopilotForXcodeKit.build/Debug-watchos/XPCConcurrency.build/Objects-normal/armv7k/XPCConnection+Concurrency.swiftconstvalues -emit-reference-dependencies-path /Users/builder/builds/TDmZkXJm/3/finestructure/swiftpackageindex-builder/spi-builder-workspace/.derivedData/Build/Intermediates.noindex/CopilotForXcodeKit.build/Debug-watchos/XPCConcurrency.build/Objects-normal/armv7k/XPCConnection+Concurrency.swiftdeps -serialize-diagnostics-path /Users/builder/builds/TDmZkXJm/3/finestructure/swiftpackageindex-builder/spi-builder-workspace/.derivedData/Build/Intermediates.noindex/CopilotForXcodeKit.build/Debug-watchos/XPCConcurrency.build/Objects-normal/armv7k/XPCConnection+Concurrency.dia -target armv7k-apple-watchos5.0 -enable-objc-interop -sdk /Applications/Xcode-15.2.0.app/Contents/Developer/Platforms/WatchOS.platform/Developer/SDKs/WatchOS10.2.sdk -I /Users/builder/builds/TDmZkXJm/3/finestructure/swiftpackageindex-builder/spi-builder-workspace/.derivedData/Build/Products/Debug-watchos -I /Applications/Xcode-15.2.0.app/Contents/Developer/Platforms/WatchOS.platform/Developer/usr/lib -F /Users/builder/builds/TDmZkXJm/3/finestructure/swiftpackageindex-builder/spi-builder-workspace/.derivedData/Build/Products/Debug-watchos -F /Applications/Xcode-15.2.0.app/Contents/Developer/Platforms/WatchOS.platform/Developer/Library/Frameworks -F /Applications/Xcode-15.2.0.app/Contents/Developer/Platforms/WatchOS.platform/Developer/SDKs/WatchOS10.2.sdk/Developer/Library/Frameworks -no-color-diagnostics -enable-testing -g -module-cache-path /Users/builder/builds/TDmZkXJm/3/finestructure/swiftpackageindex-builder/spi-builder-workspace/.derivedData/ModuleCache.noindex -profile-generate -profile-coverage-mapping -swift-version 5 -enforce-exclusivity\=checked -Onone -D SWIFT_PACKAGE -D DEBUG -D Xcode -serialize-debugging-options -package-name spi_builder_workspace -const-gather-protocols-file /Users/builder/builds/TDmZkXJm/3/finestructure/swiftpackageindex-builder/spi-builder-workspace/.derivedData/Build/Intermediates.noindex/CopilotForXcodeKit.build/Debug-watchos/XPCConcurrency.build/Objects-normal/armv7k/XPCConcurrency_const_extract_protocols.json -empty-abi-descriptor -validate-clang-modules-once -clang-build-session-file /Users/builder/builds/TDmZkXJm/3/finestructure/swiftpackageindex-builder/spi-builder-workspace/.derivedData/ModuleCache.noindex/Session.modulevalidation -Xcc -working-directory -Xcc /Users/builder/builds/TDmZkXJm/3/finestructure/swiftpackageindex-builder/spi-builder-workspace -resource-dir /Applications/Xcode-15.2.0.app/Contents/Developer/Toolchains/XcodeDefault.xctoolchain/usr/lib/swift -enable-anonymous-context-mangled-names -Xcc -ivfsstatcache -Xcc /Users/builder/builds/TDmZkXJm/3/finestructure/swiftpackageindex-builder/spi-builder-workspace/.derivedData/SDKStatCaches.noindex/watchos10.2-21S355-1a03c8d25fc3596eb74c01d649b42752.sdkstatcache -Xcc -I/Users/builder/builds/TDmZkXJm/3/finestructure/swiftpackageindex-builder/spi-builder-workspace/.derivedData/Build/Intermediates.noindex/CopilotForXcodeKit.build/Debug-watchos/XPCConcurrency.build/swift-overrides.hmap -Xcc -I/Users/builder/builds/TDmZkXJm/3/finestructure/swiftpackageindex-builder/spi-builder-workspace/.derivedData/Build/Products/Debug-watchos/include -Xcc -I/Users/builder/builds/TDmZkXJm/3/finestructure/swiftpackageindex-builder/spi-builder-workspace/.derivedData/Build/Intermediates.noindex/CopilotForXcodeKit.build/Debug-watchos/XPCConcurrency.build/DerivedSources-normal/armv7k -Xcc -I/Users/builder/builds/TDmZkXJm/3/finestructure/swiftpackageindex-builder/spi-builder-workspace/.derivedData/Build/Intermediates.noindex/CopilotForXcodeKit.build/Debug-watchos/XPCConcurrency.build/DerivedSources/armv7k -Xcc -I/Users/builder/builds/TDmZkXJm/3/finestructure/swiftpackageindex-builder/spi-builder-workspace/.derivedData/Build/Intermediates.noindex/CopilotForXcodeKit.build/Debug-watchos/XPCConcurrency.build/DerivedSources -Xcc -DSWIFT_PACKAGE -Xcc -DDEBUG\=1 -module-name XPCConcurrency -frontend-parseable-output -disable-clang-spi -target-sdk-version 10.2 -target-sdk-name watchos10.2 -external-plugin-path /Applications/Xcode-15.2.0.app/Contents/Developer/Platforms/WatchOS.platform/Developer/SDKs/WatchOS10.2.sdk/usr/lib/swift/host/plugins\#/Applications/Xcode-15.2.0.app/Contents/Developer/Platforms/WatchOS.platform/Developer/SDKs/WatchOS10.2.sdk/usr/bin/swift-plugin-server -external-plugin-path /Applications/Xcode-15.2.0.app/Contents/Developer/Platforms/WatchOS.platform/Developer/SDKs/WatchOS10.2.sdk/usr/local/lib/swift/host/plugins\#/Applications/Xcode-15.2.0.app/Contents/Developer/Platforms/WatchOS.platform/Developer/SDKs/WatchOS10.2.sdk/usr/bin/swift-plugin-server -external-plugin-path /Applications/Xcode-15.2.0.app/Contents/Developer/Platforms/WatchOS.platform/Developer/usr/lib/swift/host/plugins\#/Applications/Xcode-15.2.0.app/Contents/Developer/Platforms/WatchOS.platform/Developer/usr/bin/swift-plugin-server -external-plugin-path /Applications/Xcode-15.2.0.app/Contents/Developer/Platforms/WatchOS.platform/Developer/usr/local/lib/swift/host/plugins\#/Applications/Xcode-15.2.0.app/Contents/Developer/Platforms/WatchOS.platform/Developer/usr/bin/swift-plugin-server -plugin-path /Applications/Xcode-15.2.0.app/Contents/Developer/Toolchains/XcodeDefault.xctoolchain/usr/lib/swift/host/plugins -plugin-path /Applications/Xcode-15.2.0.app/Contents/Developer/Toolchains/XcodeDefault.xctoolchain/usr/local/lib/swift/host/plugins -parse-as-library -o /Users/builder/builds/TDmZkXJm/3/finestructure/swiftpackageindex-builder/spi-builder-workspace/.derivedData/Build/Intermediates.noindex/CopilotForXcodeKit.build/Debug-watchos/XPCConcurrency.build/Objects-normal/armv7k/XPCConnection+Concurrency.o -index-unit-output-path /CopilotForXcodeKit.build/Debug-watchos/XPCConcurrency.build/Objects-normal/armv7k/XPCConnection+Concurrency.o -index-store-path /Users/builder/builds/TDmZkXJm/3/finestructure/swiftpackageindex-builder/spi-builder-workspace/.derivedData/Index.noindex/DataStore -index-system-modules
SwiftEmitModule normal armv7k Emitting\ module\ for\ CodableWrappers (in target 'CodableWrappers' from project 'CodableWrappers')
cd /Users/builder/builds/TDmZkXJm/3/finestructure/swiftpackageindex-builder/spi-builder-workspace/.dependencies/checkouts/CodableWrappers
builtin-swiftTaskExecution -- /Applications/Xcode-15.2.0.app/Contents/Developer/Toolchains/XcodeDefault.xctoolchain/usr/bin/swift-frontend -frontend -emit-module -experimental-skip-non-inlinable-function-bodies-without-types /Users/builder/builds/TDmZkXJm/3/finestructure/swiftpackageindex-builder/spi-builder-workspace/.dependencies/checkouts/CodableWrappers/Sources/CodableWrappers/Convenience/ConveienceAdherence.swift /Users/builder/builds/TDmZkXJm/3/finestructure/swiftpackageindex-builder/spi-builder-workspace/.dependencies/checkouts/CodableWrappers/Sources/CodableWrappers/Convenience/CustomWrappers.swift /Users/builder/builds/TDmZkXJm/3/finestructure/swiftpackageindex-builder/spi-builder-workspace/.dependencies/checkouts/CodableWrappers/Sources/CodableWrappers/Convenience/EmptyDefaults.swift /Users/builder/builds/TDmZkXJm/3/finestructure/swiftpackageindex-builder/spi-builder-workspace/.dependencies/checkouts/CodableWrappers/Sources/CodableWrappers/Core/FallbackCoding.swift /Users/builder/builds/TDmZkXJm/3/finestructure/swiftpackageindex-builder/spi-builder-workspace/.dependencies/checkouts/CodableWrappers/Sources/CodableWrappers/Core/ImmutableWrapper.swift /Users/builder/builds/TDmZkXJm/3/finestructure/swiftpackageindex-builder/spi-builder-workspace/.dependencies/checkouts/CodableWrappers/Sources/CodableWrappers/Core/OmitCodingWrappers.swift /Users/builder/builds/TDmZkXJm/3/finestructure/swiftpackageindex-builder/spi-builder-workspace/.dependencies/checkouts/CodableWrappers/Sources/CodableWrappers/Core/OptionalWrappers.swift /Users/builder/builds/TDmZkXJm/3/finestructure/swiftpackageindex-builder/spi-builder-workspace/.dependencies/checkouts/CodableWrappers/Sources/CodableWrappers/Core/StaticCodingWrappers.swift /Users/builder/builds/TDmZkXJm/3/finestructure/swiftpackageindex-builder/spi-builder-workspace/.dependencies/checkouts/CodableWrappers/Sources/CodableWrappers/Core/TransientCoding.swift /Users/builder/builds/TDmZkXJm/3/finestructure/swiftpackageindex-builder/spi-builder-workspace/.dependencies/checkouts/CodableWrappers/Sources/CodableWrappers/Deprecated/Old.swift /Users/builder/builds/TDmZkXJm/3/finestructure/swiftpackageindex-builder/spi-builder-workspace/.dependencies/checkouts/CodableWrappers/Sources/CodableWrappers/StaticCoders/BoolCoding.swift /Users/builder/builds/TDmZkXJm/3/finestructure/swiftpackageindex-builder/spi-builder-workspace/.dependencies/checkouts/CodableWrappers/Sources/CodableWrappers/StaticCoders/DataCoding.swift /Users/builder/builds/TDmZkXJm/3/finestructure/swiftpackageindex-builder/spi-builder-workspace/.dependencies/checkouts/CodableWrappers/Sources/CodableWrappers/StaticCoders/DateCoding.swift /Users/builder/builds/TDmZkXJm/3/finestructure/swiftpackageindex-builder/spi-builder-workspace/.dependencies/checkouts/CodableWrappers/Sources/CodableWrappers/StaticCoders/FloatingPointCoding.swift /Users/builder/builds/TDmZkXJm/3/finestructure/swiftpackageindex-builder/spi-builder-workspace/.dependencies/checkouts/CodableWrappers/Sources/CodableWrappers/StaticCoders/NilFiltering.swift /Users/builder/builds/TDmZkXJm/3/finestructure/swiftpackageindex-builder/spi-builder-workspace/.dependencies/checkouts/CodableWrappers/Sources/CodableWrappers/StaticCoders/NullEncoding.swift /Users/builder/builds/TDmZkXJm/3/finestructure/swiftpackageindex-builder/spi-builder-workspace/.dependencies/checkouts/CodableWrappers/Sources/CodableWrappers/StaticCoders/StaticCoding.swift -target armv7k-apple-watchos5.0 -enable-objc-interop -sdk /Applications/Xcode-15.2.0.app/Contents/Developer/Platforms/WatchOS.platform/Developer/SDKs/WatchOS10.2.sdk -I /Users/builder/builds/TDmZkXJm/3/finestructure/swiftpackageindex-builder/spi-builder-workspace/.derivedData/Build/Products/Debug-watchos -I /Applications/Xcode-15.2.0.app/Contents/Developer/Platforms/WatchOS.platform/Developer/usr/lib -F /Users/builder/builds/TDmZkXJm/3/finestructure/swiftpackageindex-builder/spi-builder-workspace/.derivedData/Build/Products/Debug-watchos -F /Applications/Xcode-15.2.0.app/Contents/Developer/Platforms/WatchOS.platform/Developer/Library/Frameworks -F /Applications/Xcode-15.2.0.app/Contents/Developer/Platforms/WatchOS.platform/Developer/SDKs/WatchOS10.2.sdk/Developer/Library/Frameworks -no-color-diagnostics -suppress-warnings -enable-testing -g -module-cache-path /Users/builder/builds/TDmZkXJm/3/finestructure/swiftpackageindex-builder/spi-builder-workspace/.derivedData/ModuleCache.noindex -profile-generate -profile-coverage-mapping -swift-version 5 -enforce-exclusivity\=checked -Onone -D SWIFT_PACKAGE -D DEBUG -D Xcode -serialize-debugging-options -const-gather-protocols-file /Users/builder/builds/TDmZkXJm/3/finestructure/swiftpackageindex-builder/spi-builder-workspace/.derivedData/Build/Intermediates.noindex/CodableWrappers.build/Debug-watchos/CodableWrappers.build/Objects-normal/armv7k/CodableWrappers_const_extract_protocols.json -empty-abi-descriptor -validate-clang-modules-once -clang-build-session-file /Users/builder/builds/TDmZkXJm/3/finestructure/swiftpackageindex-builder/spi-builder-workspace/.derivedData/ModuleCache.noindex/Session.modulevalidation -Xcc -working-directory -Xcc /Users/builder/builds/TDmZkXJm/3/finestructure/swiftpackageindex-builder/spi-builder-workspace/.dependencies/checkouts/CodableWrappers -resource-dir /Applications/Xcode-15.2.0.app/Contents/Developer/Toolchains/XcodeDefault.xctoolchain/usr/lib/swift -enable-anonymous-context-mangled-names -Xcc -ivfsstatcache -Xcc /Users/builder/builds/TDmZkXJm/3/finestructure/swiftpackageindex-builder/spi-builder-workspace/.derivedData/SDKStatCaches.noindex/watchos10.2-21S355-1a03c8d25fc3596eb74c01d649b42752.sdkstatcache -Xcc -I/Users/builder/builds/TDmZkXJm/3/finestructure/swiftpackageindex-builder/spi-builder-workspace/.derivedData/Build/Intermediates.noindex/CodableWrappers.build/Debug-watchos/CodableWrappers.build/swift-overrides.hmap -Xcc -I/Users/builder/builds/TDmZkXJm/3/finestructure/swiftpackageindex-builder/spi-builder-workspace/.derivedData/Build/Products/Debug-watchos/include -Xcc -I/Users/builder/builds/TDmZkXJm/3/finestructure/swiftpackageindex-builder/spi-builder-workspace/.derivedData/Build/Intermediates.noindex/CodableWrappers.build/Debug-watchos/CodableWrappers.build/DerivedSources-normal/armv7k -Xcc -I/Users/builder/builds/TDmZkXJm/3/finestructure/swiftpackageindex-builder/spi-builder-workspace/.derivedData/Build/Intermediates.noindex/CodableWrappers.build/Debug-watchos/CodableWrappers.build/DerivedSources/armv7k -Xcc -I/Users/builder/builds/TDmZkXJm/3/finestructure/swiftpackageindex-builder/spi-builder-workspace/.derivedData/Build/Intermediates.noindex/CodableWrappers.build/Debug-watchos/CodableWrappers.build/DerivedSources -Xcc -DSWIFT_PACKAGE -Xcc -DDEBUG\=1 -module-name CodableWrappers -disable-clang-spi -target-sdk-version 10.2 -target-sdk-name watchos10.2 -external-plugin-path /Applications/Xcode-15.2.0.app/Contents/Developer/Platforms/WatchOS.platform/Developer/SDKs/WatchOS10.2.sdk/usr/lib/swift/host/plugins\#/Applications/Xcode-15.2.0.app/Contents/Developer/Platforms/WatchOS.platform/Developer/SDKs/WatchOS10.2.sdk/usr/bin/swift-plugin-server -external-plugin-path /Applications/Xcode-15.2.0.app/Contents/Developer/Platforms/WatchOS.platform/Developer/SDKs/WatchOS10.2.sdk/usr/local/lib/swift/host/plugins\#/Applications/Xcode-15.2.0.app/Contents/Developer/Platforms/WatchOS.platform/Developer/SDKs/WatchOS10.2.sdk/usr/bin/swift-plugin-server -external-plugin-path /Applications/Xcode-15.2.0.app/Contents/Developer/Platforms/WatchOS.platform/Developer/usr/lib/swift/host/plugins\#/Applications/Xcode-15.2.0.app/Contents/Developer/Platforms/WatchOS.platform/Developer/usr/bin/swift-plugin-server -external-plugin-path /Applications/Xcode-15.2.0.app/Contents/Developer/Platforms/WatchOS.platform/Developer/usr/local/lib/swift/host/plugins\#/Applications/Xcode-15.2.0.app/Contents/Developer/Platforms/WatchOS.platform/Developer/usr/bin/swift-plugin-server -plugin-path /Applications/Xcode-15.2.0.app/Contents/Developer/Toolchains/XcodeDefault.xctoolchain/usr/lib/swift/host/plugins -plugin-path /Applications/Xcode-15.2.0.app/Contents/Developer/Toolchains/XcodeDefault.xctoolchain/usr/local/lib/swift/host/plugins -emit-module-doc-path /Users/builder/builds/TDmZkXJm/3/finestructure/swiftpackageindex-builder/spi-builder-workspace/.derivedData/Build/Intermediates.noindex/CodableWrappers.build/Debug-watchos/CodableWrappers.build/Objects-normal/armv7k/CodableWrappers.swiftdoc -emit-module-source-info-path /Users/builder/builds/TDmZkXJm/3/finestructure/swiftpackageindex-builder/spi-builder-workspace/.derivedData/Build/Intermediates.noindex/CodableWrappers.build/Debug-watchos/CodableWrappers.build/Objects-normal/armv7k/CodableWrappers.swiftsourceinfo -emit-objc-header-path /Users/builder/builds/TDmZkXJm/3/finestructure/swiftpackageindex-builder/spi-builder-workspace/.derivedData/Build/Intermediates.noindex/CodableWrappers.build/Debug-watchos/CodableWrappers.build/Objects-normal/armv7k/CodableWrappers-Swift.h -serialize-diagnostics-path /Users/builder/builds/TDmZkXJm/3/finestructure/swiftpackageindex-builder/spi-builder-workspace/.derivedData/Build/Intermediates.noindex/CodableWrappers.build/Debug-watchos/CodableWrappers.build/Objects-normal/armv7k/CodableWrappers-master-emit-module.dia -emit-dependencies-path /Users/builder/builds/TDmZkXJm/3/finestructure/swiftpackageindex-builder/spi-builder-workspace/.derivedData/Build/Intermediates.noindex/CodableWrappers.build/Debug-watchos/CodableWrappers.build/Objects-normal/armv7k/CodableWrappers-master-emit-module.d -o /Users/builder/builds/TDmZkXJm/3/finestructure/swiftpackageindex-builder/spi-builder-workspace/.derivedData/Build/Intermediates.noindex/CodableWrappers.build/Debug-watchos/CodableWrappers.build/Objects-normal/armv7k/CodableWrappers.swiftmodule -emit-abi-descriptor-path /Users/builder/builds/TDmZkXJm/3/finestructure/swiftpackageindex-builder/spi-builder-workspace/.derivedData/Build/Intermediates.noindex/CodableWrappers.build/Debug-watchos/CodableWrappers.build/Objects-normal/armv7k/CodableWrappers.abi.json
SwiftCompile normal armv7k Compiling\ FloatingPointCoding.swift,\ NilFiltering.swift /Users/builder/builds/TDmZkXJm/3/finestructure/swiftpackageindex-builder/spi-builder-workspace/.dependencies/checkouts/CodableWrappers/Sources/CodableWrappers/StaticCoders/FloatingPointCoding.swift /Users/builder/builds/TDmZkXJm/3/finestructure/swiftpackageindex-builder/spi-builder-workspace/.dependencies/checkouts/CodableWrappers/Sources/CodableWrappers/StaticCoders/NilFiltering.swift (in target 'CodableWrappers' from project 'CodableWrappers')
cd /Users/builder/builds/TDmZkXJm/3/finestructure/swiftpackageindex-builder/spi-builder-workspace/.dependencies/checkouts/CodableWrappers
builtin-swiftTaskExecution -- /Applications/Xcode-15.2.0.app/Contents/Developer/Toolchains/XcodeDefault.xctoolchain/usr/bin/swift-frontend -frontend -c /Users/builder/builds/TDmZkXJm/3/finestructure/swiftpackageindex-builder/spi-builder-workspace/.dependencies/checkouts/CodableWrappers/Sources/CodableWrappers/Convenience/ConveienceAdherence.swift /Users/builder/builds/TDmZkXJm/3/finestructure/swiftpackageindex-builder/spi-builder-workspace/.dependencies/checkouts/CodableWrappers/Sources/CodableWrappers/Convenience/CustomWrappers.swift /Users/builder/builds/TDmZkXJm/3/finestructure/swiftpackageindex-builder/spi-builder-workspace/.dependencies/checkouts/CodableWrappers/Sources/CodableWrappers/Convenience/EmptyDefaults.swift /Users/builder/builds/TDmZkXJm/3/finestructure/swiftpackageindex-builder/spi-builder-workspace/.dependencies/checkouts/CodableWrappers/Sources/CodableWrappers/Core/FallbackCoding.swift /Users/builder/builds/TDmZkXJm/3/finestructure/swiftpackageindex-builder/spi-builder-workspace/.dependencies/checkouts/CodableWrappers/Sources/CodableWrappers/Core/ImmutableWrapper.swift /Users/builder/builds/TDmZkXJm/3/finestructure/swiftpackageindex-builder/spi-builder-workspace/.dependencies/checkouts/CodableWrappers/Sources/CodableWrappers/Core/OmitCodingWrappers.swift /Users/builder/builds/TDmZkXJm/3/finestructure/swiftpackageindex-builder/spi-builder-workspace/.dependencies/checkouts/CodableWrappers/Sources/CodableWrappers/Core/OptionalWrappers.swift /Users/builder/builds/TDmZkXJm/3/finestructure/swiftpackageindex-builder/spi-builder-workspace/.dependencies/checkouts/CodableWrappers/Sources/CodableWrappers/Core/StaticCodingWrappers.swift /Users/builder/builds/TDmZkXJm/3/finestructure/swiftpackageindex-builder/spi-builder-workspace/.dependencies/checkouts/CodableWrappers/Sources/CodableWrappers/Core/TransientCoding.swift /Users/builder/builds/TDmZkXJm/3/finestructure/swiftpackageindex-builder/spi-builder-workspace/.dependencies/checkouts/CodableWrappers/Sources/CodableWrappers/Deprecated/Old.swift /Users/builder/builds/TDmZkXJm/3/finestructure/swiftpackageindex-builder/spi-builder-workspace/.dependencies/checkouts/CodableWrappers/Sources/CodableWrappers/StaticCoders/BoolCoding.swift /Users/builder/builds/TDmZkXJm/3/finestructure/swiftpackageindex-builder/spi-builder-workspace/.dependencies/checkouts/CodableWrappers/Sources/CodableWrappers/StaticCoders/DataCoding.swift /Users/builder/builds/TDmZkXJm/3/finestructure/swiftpackageindex-builder/spi-builder-workspace/.dependencies/checkouts/CodableWrappers/Sources/CodableWrappers/StaticCoders/DateCoding.swift -primary-file /Users/builder/builds/TDmZkXJm/3/finestructure/swiftpackageindex-builder/spi-builder-workspace/.dependencies/checkouts/CodableWrappers/Sources/CodableWrappers/StaticCoders/FloatingPointCoding.swift -primary-file /Users/builder/builds/TDmZkXJm/3/finestructure/swiftpackageindex-builder/spi-builder-workspace/.dependencies/checkouts/CodableWrappers/Sources/CodableWrappers/StaticCoders/NilFiltering.swift /Users/builder/builds/TDmZkXJm/3/finestructure/swiftpackageindex-builder/spi-builder-workspace/.dependencies/checkouts/CodableWrappers/Sources/CodableWrappers/StaticCoders/NullEncoding.swift /Users/builder/builds/TDmZkXJm/3/finestructure/swiftpackageindex-builder/spi-builder-workspace/.dependencies/checkouts/CodableWrappers/Sources/CodableWrappers/StaticCoders/StaticCoding.swift -emit-dependencies-path /Users/builder/builds/TDmZkXJm/3/finestructure/swiftpackageindex-builder/spi-builder-workspace/.derivedData/Build/Intermediates.noindex/CodableWrappers.build/Debug-watchos/CodableWrappers.build/Objects-normal/armv7k/FloatingPointCoding.d -emit-const-values-path /Users/builder/builds/TDmZkXJm/3/finestructure/swiftpackageindex-builder/spi-builder-workspace/.derivedData/Build/Intermediates.noindex/CodableWrappers.build/Debug-watchos/CodableWrappers.build/Objects-normal/armv7k/FloatingPointCoding.swiftconstvalues -emit-reference-dependencies-path /Users/builder/builds/TDmZkXJm/3/finestructure/swiftpackageindex-builder/spi-builder-workspace/.derivedData/Build/Intermediates.noindex/CodableWrappers.build/Debug-watchos/CodableWrappers.build/Objects-normal/armv7k/FloatingPointCoding.swiftdeps -serialize-diagnostics-path /Users/builder/builds/TDmZkXJm/3/finestructure/swiftpackageindex-builder/spi-builder-workspace/.derivedData/Build/Intermediates.noindex/CodableWrappers.build/Debug-watchos/CodableWrappers.build/Objects-normal/armv7k/FloatingPointCoding.dia -emit-dependencies-path /Users/builder/builds/TDmZkXJm/3/finestructure/swiftpackageindex-builder/spi-builder-workspace/.derivedData/Build/Intermediates.noindex/CodableWrappers.build/Debug-watchos/CodableWrappers.build/Objects-normal/armv7k/NilFiltering.d -emit-const-values-path /Users/builder/builds/TDmZkXJm/3/finestructure/swiftpackageindex-builder/spi-builder-workspace/.derivedData/Build/Intermediates.noindex/CodableWrappers.build/Debug-watchos/CodableWrappers.build/Objects-normal/armv7k/NilFiltering.swiftconstvalues -emit-reference-dependencies-path /Users/builder/builds/TDmZkXJm/3/finestructure/swiftpackageindex-builder/spi-builder-workspace/.derivedData/Build/Intermediates.noindex/CodableWrappers.build/Debug-watchos/CodableWrappers.build/Objects-normal/armv7k/NilFiltering.swiftdeps -serialize-diagnostics-path /Users/builder/builds/TDmZkXJm/3/finestructure/swiftpackageindex-builder/spi-builder-workspace/.derivedData/Build/Intermediates.noindex/CodableWrappers.build/Debug-watchos/CodableWrappers.build/Objects-normal/armv7k/NilFiltering.dia -target armv7k-apple-watchos5.0 -enable-objc-interop -sdk /Applications/Xcode-15.2.0.app/Contents/Developer/Platforms/WatchOS.platform/Developer/SDKs/WatchOS10.2.sdk -I /Users/builder/builds/TDmZkXJm/3/finestructure/swiftpackageindex-builder/spi-builder-workspace/.derivedData/Build/Products/Debug-watchos -I /Applications/Xcode-15.2.0.app/Contents/Developer/Platforms/WatchOS.platform/Developer/usr/lib -F /Users/builder/builds/TDmZkXJm/3/finestructure/swiftpackageindex-builder/spi-builder-workspace/.derivedData/Build/Products/Debug-watchos -F /Applications/Xcode-15.2.0.app/Contents/Developer/Platforms/WatchOS.platform/Developer/Library/Frameworks -F /Applications/Xcode-15.2.0.app/Contents/Developer/Platforms/WatchOS.platform/Developer/SDKs/WatchOS10.2.sdk/Developer/Library/Frameworks -no-color-diagnostics -suppress-warnings -enable-testing -g -module-cache-path /Users/builder/builds/TDmZkXJm/3/finestructure/swiftpackageindex-builder/spi-builder-workspace/.derivedData/ModuleCache.noindex -profile-generate -profile-coverage-mapping -swift-version 5 -enforce-exclusivity\=checked -Onone -D SWIFT_PACKAGE -D DEBUG -D Xcode -serialize-debugging-options -const-gather-protocols-file /Users/builder/builds/TDmZkXJm/3/finestructure/swiftpackageindex-builder/spi-builder-workspace/.derivedData/Build/Intermediates.noindex/CodableWrappers.build/Debug-watchos/CodableWrappers.build/Objects-normal/armv7k/CodableWrappers_const_extract_protocols.json -empty-abi-descriptor -validate-clang-modules-once -clang-build-session-file /Users/builder/builds/TDmZkXJm/3/finestructure/swiftpackageindex-builder/spi-builder-workspace/.derivedData/ModuleCache.noindex/Session.modulevalidation -Xcc -working-directory -Xcc /Users/builder/builds/TDmZkXJm/3/finestructure/swiftpackageindex-builder/spi-builder-workspace/.dependencies/checkouts/CodableWrappers -resource-dir /Applications/Xcode-15.2.0.app/Contents/Developer/Toolchains/XcodeDefault.xctoolchain/usr/lib/swift -enable-anonymous-context-mangled-names -Xcc -ivfsstatcache -Xcc /Users/builder/builds/TDmZkXJm/3/finestructure/swiftpackageindex-builder/spi-builder-workspace/.derivedData/SDKStatCaches.noindex/watchos10.2-21S355-1a03c8d25fc3596eb74c01d649b42752.sdkstatcache -Xcc -I/Users/builder/builds/TDmZkXJm/3/finestructure/swiftpackageindex-builder/spi-builder-workspace/.derivedData/Build/Intermediates.noindex/CodableWrappers.build/Debug-watchos/CodableWrappers.build/swift-overrides.hmap -Xcc -I/Users/builder/builds/TDmZkXJm/3/finestructure/swiftpackageindex-builder/spi-builder-workspace/.derivedData/Build/Products/Debug-watchos/include -Xcc -I/Users/builder/builds/TDmZkXJm/3/finestructure/swiftpackageindex-builder/spi-builder-workspace/.derivedData/Build/Intermediates.noindex/CodableWrappers.build/Debug-watchos/CodableWrappers.build/DerivedSources-normal/armv7k -Xcc -I/Users/builder/builds/TDmZkXJm/3/finestructure/swiftpackageindex-builder/spi-builder-workspace/.derivedData/Build/Intermediates.noindex/CodableWrappers.build/Debug-watchos/CodableWrappers.build/DerivedSources/armv7k -Xcc -I/Users/builder/builds/TDmZkXJm/3/finestructure/swiftpackageindex-builder/spi-builder-workspace/.derivedData/Build/Intermediates.noindex/CodableWrappers.build/Debug-watchos/CodableWrappers.build/DerivedSources -Xcc -DSWIFT_PACKAGE -Xcc -DDEBUG\=1 -module-name CodableWrappers -frontend-parseable-output -disable-clang-spi -target-sdk-version 10.2 -target-sdk-name watchos10.2 -external-plugin-path /Applications/Xcode-15.2.0.app/Contents/Developer/Platforms/WatchOS.platform/Developer/SDKs/WatchOS10.2.sdk/usr/lib/swift/host/plugins\#/Applications/Xcode-15.2.0.app/Contents/Developer/Platforms/WatchOS.platform/Developer/SDKs/WatchOS10.2.sdk/usr/bin/swift-plugin-server -external-plugin-path /Applications/Xcode-15.2.0.app/Contents/Developer/Platforms/WatchOS.platform/Developer/SDKs/WatchOS10.2.sdk/usr/local/lib/swift/host/plugins\#/Applications/Xcode-15.2.0.app/Contents/Developer/Platforms/WatchOS.platform/Developer/SDKs/WatchOS10.2.sdk/usr/bin/swift-plugin-server -external-plugin-path /Applications/Xcode-15.2.0.app/Contents/Developer/Platforms/WatchOS.platform/Developer/usr/lib/swift/host/plugins\#/Applications/Xcode-15.2.0.app/Contents/Developer/Platforms/WatchOS.platform/Developer/usr/bin/swift-plugin-server -external-plugin-path /Applications/Xcode-15.2.0.app/Contents/Developer/Platforms/WatchOS.platform/Developer/usr/local/lib/swift/host/plugins\#/Applications/Xcode-15.2.0.app/Contents/Developer/Platforms/WatchOS.platform/Developer/usr/bin/swift-plugin-server -plugin-path /Applications/Xcode-15.2.0.app/Contents/Developer/Toolchains/XcodeDefault.xctoolchain/usr/lib/swift/host/plugins -plugin-path /Applications/Xcode-15.2.0.app/Contents/Developer/Toolchains/XcodeDefault.xctoolchain/usr/local/lib/swift/host/plugins -o /Users/builder/builds/TDmZkXJm/3/finestructure/swiftpackageindex-builder/spi-builder-workspace/.derivedData/Build/Intermediates.noindex/CodableWrappers.build/Debug-watchos/CodableWrappers.build/Objects-normal/armv7k/FloatingPointCoding.o -o /Users/builder/builds/TDmZkXJm/3/finestructure/swiftpackageindex-builder/spi-builder-workspace/.derivedData/Build/Intermediates.noindex/CodableWrappers.build/Debug-watchos/CodableWrappers.build/Objects-normal/armv7k/NilFiltering.o -index-unit-output-path /CodableWrappers.build/Debug-watchos/CodableWrappers.build/Objects-normal/armv7k/FloatingPointCoding.o -index-unit-output-path /CodableWrappers.build/Debug-watchos/CodableWrappers.build/Objects-normal/armv7k/NilFiltering.o -index-store-path /Users/builder/builds/TDmZkXJm/3/finestructure/swiftpackageindex-builder/spi-builder-workspace/.derivedData/Index.noindex/DataStore -index-system-modules
SwiftCompile normal armv7k Compiling\ Old.swift,\ BoolCoding.swift /Users/builder/builds/TDmZkXJm/3/finestructure/swiftpackageindex-builder/spi-builder-workspace/.dependencies/checkouts/CodableWrappers/Sources/CodableWrappers/Deprecated/Old.swift /Users/builder/builds/TDmZkXJm/3/finestructure/swiftpackageindex-builder/spi-builder-workspace/.dependencies/checkouts/CodableWrappers/Sources/CodableWrappers/StaticCoders/BoolCoding.swift (in target 'CodableWrappers' from project 'CodableWrappers')
cd /Users/builder/builds/TDmZkXJm/3/finestructure/swiftpackageindex-builder/spi-builder-workspace/.dependencies/checkouts/CodableWrappers
builtin-swiftTaskExecution -- /Applications/Xcode-15.2.0.app/Contents/Developer/Toolchains/XcodeDefault.xctoolchain/usr/bin/swift-frontend -frontend -c /Users/builder/builds/TDmZkXJm/3/finestructure/swiftpackageindex-builder/spi-builder-workspace/.dependencies/checkouts/CodableWrappers/Sources/CodableWrappers/Convenience/ConveienceAdherence.swift /Users/builder/builds/TDmZkXJm/3/finestructure/swiftpackageindex-builder/spi-builder-workspace/.dependencies/checkouts/CodableWrappers/Sources/CodableWrappers/Convenience/CustomWrappers.swift /Users/builder/builds/TDmZkXJm/3/finestructure/swiftpackageindex-builder/spi-builder-workspace/.dependencies/checkouts/CodableWrappers/Sources/CodableWrappers/Convenience/EmptyDefaults.swift /Users/builder/builds/TDmZkXJm/3/finestructure/swiftpackageindex-builder/spi-builder-workspace/.dependencies/checkouts/CodableWrappers/Sources/CodableWrappers/Core/FallbackCoding.swift /Users/builder/builds/TDmZkXJm/3/finestructure/swiftpackageindex-builder/spi-builder-workspace/.dependencies/checkouts/CodableWrappers/Sources/CodableWrappers/Core/ImmutableWrapper.swift /Users/builder/builds/TDmZkXJm/3/finestructure/swiftpackageindex-builder/spi-builder-workspace/.dependencies/checkouts/CodableWrappers/Sources/CodableWrappers/Core/OmitCodingWrappers.swift /Users/builder/builds/TDmZkXJm/3/finestructure/swiftpackageindex-builder/spi-builder-workspace/.dependencies/checkouts/CodableWrappers/Sources/CodableWrappers/Core/OptionalWrappers.swift /Users/builder/builds/TDmZkXJm/3/finestructure/swiftpackageindex-builder/spi-builder-workspace/.dependencies/checkouts/CodableWrappers/Sources/CodableWrappers/Core/StaticCodingWrappers.swift /Users/builder/builds/TDmZkXJm/3/finestructure/swiftpackageindex-builder/spi-builder-workspace/.dependencies/checkouts/CodableWrappers/Sources/CodableWrappers/Core/TransientCoding.swift -primary-file /Users/builder/builds/TDmZkXJm/3/finestructure/swiftpackageindex-builder/spi-builder-workspace/.dependencies/checkouts/CodableWrappers/Sources/CodableWrappers/Deprecated/Old.swift -primary-file /Users/builder/builds/TDmZkXJm/3/finestructure/swiftpackageindex-builder/spi-builder-workspace/.dependencies/checkouts/CodableWrappers/Sources/CodableWrappers/StaticCoders/BoolCoding.swift /Users/builder/builds/TDmZkXJm/3/finestructure/swiftpackageindex-builder/spi-builder-workspace/.dependencies/checkouts/CodableWrappers/Sources/CodableWrappers/StaticCoders/DataCoding.swift /Users/builder/builds/TDmZkXJm/3/finestructure/swiftpackageindex-builder/spi-builder-workspace/.dependencies/checkouts/CodableWrappers/Sources/CodableWrappers/StaticCoders/DateCoding.swift /Users/builder/builds/TDmZkXJm/3/finestructure/swiftpackageindex-builder/spi-builder-workspace/.dependencies/checkouts/CodableWrappers/Sources/CodableWrappers/StaticCoders/FloatingPointCoding.swift /Users/builder/builds/TDmZkXJm/3/finestructure/swiftpackageindex-builder/spi-builder-workspace/.dependencies/checkouts/CodableWrappers/Sources/CodableWrappers/StaticCoders/NilFiltering.swift /Users/builder/builds/TDmZkXJm/3/finestructure/swiftpackageindex-builder/spi-builder-workspace/.dependencies/checkouts/CodableWrappers/Sources/CodableWrappers/StaticCoders/NullEncoding.swift /Users/builder/builds/TDmZkXJm/3/finestructure/swiftpackageindex-builder/spi-builder-workspace/.dependencies/checkouts/CodableWrappers/Sources/CodableWrappers/StaticCoders/StaticCoding.swift -emit-dependencies-path /Users/builder/builds/TDmZkXJm/3/finestructure/swiftpackageindex-builder/spi-builder-workspace/.derivedData/Build/Intermediates.noindex/CodableWrappers.build/Debug-watchos/CodableWrappers.build/Objects-normal/armv7k/Old.d -emit-const-values-path /Users/builder/builds/TDmZkXJm/3/finestructure/swiftpackageindex-builder/spi-builder-workspace/.derivedData/Build/Intermediates.noindex/CodableWrappers.build/Debug-watchos/CodableWrappers.build/Objects-normal/armv7k/Old.swiftconstvalues -emit-reference-dependencies-path /Users/builder/builds/TDmZkXJm/3/finestructure/swiftpackageindex-builder/spi-builder-workspace/.derivedData/Build/Intermediates.noindex/CodableWrappers.build/Debug-watchos/CodableWrappers.build/Objects-normal/armv7k/Old.swiftdeps -serialize-diagnostics-path /Users/builder/builds/TDmZkXJm/3/finestructure/swiftpackageindex-builder/spi-builder-workspace/.derivedData/Build/Intermediates.noindex/CodableWrappers.build/Debug-watchos/CodableWrappers.build/Objects-normal/armv7k/Old.dia -emit-dependencies-path /Users/builder/builds/TDmZkXJm/3/finestructure/swiftpackageindex-builder/spi-builder-workspace/.derivedData/Build/Intermediates.noindex/CodableWrappers.build/Debug-watchos/CodableWrappers.build/Objects-normal/armv7k/BoolCoding.d -emit-const-values-path /Users/builder/builds/TDmZkXJm/3/finestructure/swiftpackageindex-builder/spi-builder-workspace/.derivedData/Build/Intermediates.noindex/CodableWrappers.build/Debug-watchos/CodableWrappers.build/Objects-normal/armv7k/BoolCoding.swiftconstvalues -emit-reference-dependencies-path /Users/builder/builds/TDmZkXJm/3/finestructure/swiftpackageindex-builder/spi-builder-workspace/.derivedData/Build/Intermediates.noindex/CodableWrappers.build/Debug-watchos/CodableWrappers.build/Objects-normal/armv7k/BoolCoding.swiftdeps -serialize-diagnostics-path /Users/builder/builds/TDmZkXJm/3/finestructure/swiftpackageindex-builder/spi-builder-workspace/.derivedData/Build/Intermediates.noindex/CodableWrappers.build/Debug-watchos/CodableWrappers.build/Objects-normal/armv7k/BoolCoding.dia -target armv7k-apple-watchos5.0 -enable-objc-interop -sdk /Applications/Xcode-15.2.0.app/Contents/Developer/Platforms/WatchOS.platform/Developer/SDKs/WatchOS10.2.sdk -I /Users/builder/builds/TDmZkXJm/3/finestructure/swiftpackageindex-builder/spi-builder-workspace/.derivedData/Build/Products/Debug-watchos -I /Applications/Xcode-15.2.0.app/Contents/Developer/Platforms/WatchOS.platform/Developer/usr/lib -F /Users/builder/builds/TDmZkXJm/3/finestructure/swiftpackageindex-builder/spi-builder-workspace/.derivedData/Build/Products/Debug-watchos -F /Applications/Xcode-15.2.0.app/Contents/Developer/Platforms/WatchOS.platform/Developer/Library/Frameworks -F /Applications/Xcode-15.2.0.app/Contents/Developer/Platforms/WatchOS.platform/Developer/SDKs/WatchOS10.2.sdk/Developer/Library/Frameworks -no-color-diagnostics -suppress-warnings -enable-testing -g -module-cache-path /Users/builder/builds/TDmZkXJm/3/finestructure/swiftpackageindex-builder/spi-builder-workspace/.derivedData/ModuleCache.noindex -profile-generate -profile-coverage-mapping -swift-version 5 -enforce-exclusivity\=checked -Onone -D SWIFT_PACKAGE -D DEBUG -D Xcode -serialize-debugging-options -const-gather-protocols-file /Users/builder/builds/TDmZkXJm/3/finestructure/swiftpackageindex-builder/spi-builder-workspace/.derivedData/Build/Intermediates.noindex/CodableWrappers.build/Debug-watchos/CodableWrappers.build/Objects-normal/armv7k/CodableWrappers_const_extract_protocols.json -empty-abi-descriptor -validate-clang-modules-once -clang-build-session-file /Users/builder/builds/TDmZkXJm/3/finestructure/swiftpackageindex-builder/spi-builder-workspace/.derivedData/ModuleCache.noindex/Session.modulevalidation -Xcc -working-directory -Xcc /Users/builder/builds/TDmZkXJm/3/finestructure/swiftpackageindex-builder/spi-builder-workspace/.dependencies/checkouts/CodableWrappers -resource-dir /Applications/Xcode-15.2.0.app/Contents/Developer/Toolchains/XcodeDefault.xctoolchain/usr/lib/swift -enable-anonymous-context-mangled-names -Xcc -ivfsstatcache -Xcc /Users/builder/builds/TDmZkXJm/3/finestructure/swiftpackageindex-builder/spi-builder-workspace/.derivedData/SDKStatCaches.noindex/watchos10.2-21S355-1a03c8d25fc3596eb74c01d649b42752.sdkstatcache -Xcc -I/Users/builder/builds/TDmZkXJm/3/finestructure/swiftpackageindex-builder/spi-builder-workspace/.derivedData/Build/Intermediates.noindex/CodableWrappers.build/Debug-watchos/CodableWrappers.build/swift-overrides.hmap -Xcc -I/Users/builder/builds/TDmZkXJm/3/finestructure/swiftpackageindex-builder/spi-builder-workspace/.derivedData/Build/Products/Debug-watchos/include -Xcc -I/Users/builder/builds/TDmZkXJm/3/finestructure/swiftpackageindex-builder/spi-builder-workspace/.derivedData/Build/Intermediates.noindex/CodableWrappers.build/Debug-watchos/CodableWrappers.build/DerivedSources-normal/armv7k -Xcc -I/Users/builder/builds/TDmZkXJm/3/finestructure/swiftpackageindex-builder/spi-builder-workspace/.derivedData/Build/Intermediates.noindex/CodableWrappers.build/Debug-watchos/CodableWrappers.build/DerivedSources/armv7k -Xcc -I/Users/builder/builds/TDmZkXJm/3/finestructure/swiftpackageindex-builder/spi-builder-workspace/.derivedData/Build/Intermediates.noindex/CodableWrappers.build/Debug-watchos/CodableWrappers.build/DerivedSources -Xcc -DSWIFT_PACKAGE -Xcc -DDEBUG\=1 -module-name CodableWrappers -frontend-parseable-output -disable-clang-spi -target-sdk-version 10.2 -target-sdk-name watchos10.2 -external-plugin-path /Applications/Xcode-15.2.0.app/Contents/Developer/Platforms/WatchOS.platform/Developer/SDKs/WatchOS10.2.sdk/usr/lib/swift/host/plugins\#/Applications/Xcode-15.2.0.app/Contents/Developer/Platforms/WatchOS.platform/Developer/SDKs/WatchOS10.2.sdk/usr/bin/swift-plugin-server -external-plugin-path /Applications/Xcode-15.2.0.app/Contents/Developer/Platforms/WatchOS.platform/Developer/SDKs/WatchOS10.2.sdk/usr/local/lib/swift/host/plugins\#/Applications/Xcode-15.2.0.app/Contents/Developer/Platforms/WatchOS.platform/Developer/SDKs/WatchOS10.2.sdk/usr/bin/swift-plugin-server -external-plugin-path /Applications/Xcode-15.2.0.app/Contents/Developer/Platforms/WatchOS.platform/Developer/usr/lib/swift/host/plugins\#/Applications/Xcode-15.2.0.app/Contents/Developer/Platforms/WatchOS.platform/Developer/usr/bin/swift-plugin-server -external-plugin-path /Applications/Xcode-15.2.0.app/Contents/Developer/Platforms/WatchOS.platform/Developer/usr/local/lib/swift/host/plugins\#/Applications/Xcode-15.2.0.app/Contents/Developer/Platforms/WatchOS.platform/Developer/usr/bin/swift-plugin-server -plugin-path /Applications/Xcode-15.2.0.app/Contents/Developer/Toolchains/XcodeDefault.xctoolchain/usr/lib/swift/host/plugins -plugin-path /Applications/Xcode-15.2.0.app/Contents/Developer/Toolchains/XcodeDefault.xctoolchain/usr/local/lib/swift/host/plugins -o /Users/builder/builds/TDmZkXJm/3/finestructure/swiftpackageindex-builder/spi-builder-workspace/.derivedData/Build/Intermediates.noindex/CodableWrappers.build/Debug-watchos/CodableWrappers.build/Objects-normal/armv7k/Old.o -o /Users/builder/builds/TDmZkXJm/3/finestructure/swiftpackageindex-builder/spi-builder-workspace/.derivedData/Build/Intermediates.noindex/CodableWrappers.build/Debug-watchos/CodableWrappers.build/Objects-normal/armv7k/BoolCoding.o -index-unit-output-path /CodableWrappers.build/Debug-watchos/CodableWrappers.build/Objects-normal/armv7k/Old.o -index-unit-output-path /CodableWrappers.build/Debug-watchos/CodableWrappers.build/Objects-normal/armv7k/BoolCoding.o -index-store-path /Users/builder/builds/TDmZkXJm/3/finestructure/swiftpackageindex-builder/spi-builder-workspace/.derivedData/Index.noindex/DataStore -index-system-modules
Command SwiftCompile failed with a nonzero exit code
** BUILD FAILED **
The following build commands failed:
SwiftEmitModule normal arm64_32 Emitting\ module\ for\ XPCConcurrency (in target 'XPCConcurrency' from project 'CopilotForXcodeKit')
SwiftEmitModule normal arm64 Emitting\ module\ for\ XPCConcurrency (in target 'XPCConcurrency' from project 'CopilotForXcodeKit')
SwiftEmitModule normal armv7k Emitting\ module\ for\ XPCConcurrency (in target 'XPCConcurrency' from project 'CopilotForXcodeKit')
SwiftCompile normal armv7k Compiling\ Old.swift,\ BoolCoding.swift /Users/builder/builds/TDmZkXJm/3/finestructure/swiftpackageindex-builder/spi-builder-workspace/.dependencies/checkouts/CodableWrappers/Sources/CodableWrappers/Deprecated/Old.swift /Users/builder/builds/TDmZkXJm/3/finestructure/swiftpackageindex-builder/spi-builder-workspace/.dependencies/checkouts/CodableWrappers/Sources/CodableWrappers/StaticCoders/BoolCoding.swift (in target 'CodableWrappers' from project 'CodableWrappers')
(4 failures)
BUILD FAILURE 5.9 watchOS