The Swift Package Index logo.Swift Package Index

Track the adoption of Swift 6 strict concurrency checks for data race safety. How many packages are Ready for Swift 6?

Build Information

Failed to build Model3DView, reference main (de7995), with Swift 6.0 for Linux on 30 Nov 2024 06:33:17 UTC.

Build Command

bash -c docker run --pull=always --rm -v "checkouts-4609320-0":/host -w "$PWD" registry.gitlab.com/finestructure/spi-images:basic-6.0-latest swift build --triple x86_64-unknown-linux-gnu -Xswiftc -Xfrontend -Xswiftc -stats-output-dir -Xswiftc -Xfrontend -Xswiftc .stats -Xswiftc -strict-concurrency=complete -Xswiftc -enable-upcoming-feature -Xswiftc StrictConcurrency -Xswiftc -enable-upcoming-feature -Xswiftc DisableOutwardActorInference -Xswiftc -enable-upcoming-feature -Xswiftc GlobalActorIsolatedTypesUsability -Xswiftc -enable-upcoming-feature -Xswiftc InferSendableFromCaptures 2>&1

Build Log

========================================
RunAll
========================================
Builder version: 4.58.1
Interrupt handler set up.
========================================
Checkout
========================================
Clone URL: https://github.com/frzi/swiftui-model3dview.git
Reference: main
Initialized empty Git repository in /host/spi-builder-workspace/.git/
hint: Using 'master' as the name for the initial branch. This default branch name
hint: is subject to change. To configure the initial branch name to use in all
hint: of your new repositories, which will suppress this warning, call:
hint:
hint: 	git config --global init.defaultBranch <name>
hint:
hint: Names commonly chosen instead of 'master' are 'main', 'trunk' and
hint: 'development'. The just-created branch can be renamed via this command:
hint:
hint: 	git branch -m <name>
From https://github.com/frzi/swiftui-model3dview
 * branch            main       -> FETCH_HEAD
 * [new branch]      main       -> origin/main
HEAD is now at de79951 Update Math.swift
Cloned https://github.com/frzi/swiftui-model3dview.git
Revision (git rev-parse @):
de79951f2ee1ad888a7c61fcce57e13e5a6581f2
SUCCESS checkout https://github.com/frzi/swiftui-model3dview.git at main
========================================
Build
========================================
Selected platform:         linux
Swift version:             6.0
Building package at path:  $PWD
https://github.com/frzi/swiftui-model3dview.git
Running build ...
bash -c docker run --pull=always --rm -v "checkouts-4609320-0":/host -w "$PWD" registry.gitlab.com/finestructure/spi-images:basic-6.0-latest swift build --triple x86_64-unknown-linux-gnu -Xswiftc -Xfrontend -Xswiftc -stats-output-dir -Xswiftc -Xfrontend -Xswiftc .stats -Xswiftc -strict-concurrency=complete -Xswiftc -enable-upcoming-feature -Xswiftc StrictConcurrency -Xswiftc -enable-upcoming-feature -Xswiftc DisableOutwardActorInference -Xswiftc -enable-upcoming-feature -Xswiftc GlobalActorIsolatedTypesUsability -Xswiftc -enable-upcoming-feature -Xswiftc InferSendableFromCaptures 2>&1
basic-6.0-latest: Pulling from finestructure/spi-images
Digest: sha256:47d26c99ca4f1ac0a332c85fd5b13ff4390e72115219984a57a68fe9d1063a05
Status: Image is up to date for registry.gitlab.com/finestructure/spi-images:basic-6.0-latest
Fetching https://github.com/timdonnelly/DisplayLink
Fetching https://github.com/frzi/GLTFSceneKit
[1/39] Fetching displaylink
[40/1127] Fetching displaylink, gltfscenekit
Fetched https://github.com/timdonnelly/DisplayLink from cache (0.17s)
[218/1088] Fetching gltfscenekit
Fetched https://github.com/frzi/GLTFSceneKit from cache (0.34s)
Computing version for https://github.com/timdonnelly/DisplayLink
Computed https://github.com/timdonnelly/DisplayLink at 0.2.0 (0.43s)
Computing version for https://github.com/frzi/GLTFSceneKit
Computed https://github.com/frzi/GLTFSceneKit at 0.4.1 (0.42s)
Creating working copy for https://github.com/timdonnelly/DisplayLink
Working copy of https://github.com/timdonnelly/DisplayLink resolved at 0.2.0
Creating working copy for https://github.com/frzi/GLTFSceneKit
Working copy of https://github.com/frzi/GLTFSceneKit resolved at 0.4.1
Building for debugging...
[0/14] Write sources
[0/14] Copying GLTFShaderModifierSurface_pbrSpecularGlossiness_doubleSidedWorkaround.shader
[0/14] Copying GLTFShaderModifierSurface.shader
[0/14] Copying GLTFShaderModifierSurface_doubleSidedWorkaround.shader
[0/14] Copying GLTFShaderModifierSurface_pbrSpecularGlossiness_texture_doubleSidedWorkaround.shader
[0/14] Copying GLTFShaderModifierFragment_VRMUnlitTexture_Cutoff.shader
[0/14] Copying GLTFShaderModifierFragment_alphaCutoff.shader
[0/14] Copying GLTFShaderModifierFragment_VRMUnlitTexture.shader
[0/14] Write sources
[0/14] Copying GLTFShaderModifierSurface_alphaModeBlend.shader
[5/14] Write sources
[11/14] Copying GLTFShaderModifierSurface_VRMMToon.shader
[11/14] Copying GLTFShaderModifierSurface_pbrSpecularGlossiness.shader
[13/14] Write swift-version-24593BA9C3E375BF.txt
error: emit-module command failed with exit code 1 (use -v to see invocation)
[15/61] Emitting module GLTFSceneKit
/host/spi-builder-workspace/.build/checkouts/GLTFSceneKit/Sources/GLTFSceneKit/GLTFFunctions.swift:10:8: error: no such module 'SceneKit'
  8 | //
  9 |
 10 | import SceneKit
    |        `- error: no such module 'SceneKit'
 11 | import SpriteKit
 12 | import CoreGraphics
[16/67] Compiling DisplayLink OnFrame.swift
/host/spi-builder-workspace/.build/checkouts/DisplayLink/Sources/DisplayLink/DisplayLink.swift:2:8: error: no such module 'QuartzCore'
  1 | import Foundation
  2 | import QuartzCore
    |        `- error: no such module 'QuartzCore'
  3 | import Combine
  4 |
[17/67] Compiling GLTFSceneKit GLTFSkin.swift
/host/spi-builder-workspace/.build/checkouts/GLTFSceneKit/Sources/GLTFSceneKit/GLTFFunctions.swift:10:8: error: no such module 'SceneKit'
  8 | //
  9 |
 10 | import SceneKit
    |        `- error: no such module 'SceneKit'
 11 | import SpriteKit
 12 | import CoreGraphics
[18/67] Compiling GLTFSceneKit GLTFTexture.swift
/host/spi-builder-workspace/.build/checkouts/GLTFSceneKit/Sources/GLTFSceneKit/GLTFFunctions.swift:10:8: error: no such module 'SceneKit'
  8 | //
  9 |
 10 | import SceneKit
    |        `- error: no such module 'SceneKit'
 11 | import SpriteKit
 12 | import CoreGraphics
[19/67] Compiling GLTFSceneKit GLTFTextureInfo.swift
/host/spi-builder-workspace/.build/checkouts/GLTFSceneKit/Sources/GLTFSceneKit/GLTFFunctions.swift:10:8: error: no such module 'SceneKit'
  8 | //
  9 |
 10 | import SceneKit
    |        `- error: no such module 'SceneKit'
 11 | import SpriteKit
 12 | import CoreGraphics
[20/67] Compiling GLTFSceneKit ExtensionList.swift
/host/spi-builder-workspace/.build/checkouts/GLTFSceneKit/Sources/GLTFSceneKit/GLTFFunctions.swift:10:8: error: no such module 'SceneKit'
  8 | //
  9 |
 10 | import SceneKit
    |        `- error: no such module 'SceneKit'
 11 | import SpriteKit
 12 | import CoreGraphics
[21/67] Compiling GLTFSceneKit GLTFKHRMaterialsCommon_GLTFKHRMaterialsCommon.swift
/host/spi-builder-workspace/.build/checkouts/GLTFSceneKit/Sources/GLTFSceneKit/GLTFFunctions.swift:10:8: error: no such module 'SceneKit'
  8 | //
  9 |
 10 | import SceneKit
    |        `- error: no such module 'SceneKit'
 11 | import SpriteKit
 12 | import CoreGraphics
[22/67] Compiling GLTFSceneKit GLTFKHRMaterialsPbrSpecularGlossiness_GLTFKHRMaterialsPbrSpecularGlossiness.swift
/host/spi-builder-workspace/.build/checkouts/GLTFSceneKit/Sources/GLTFSceneKit/GLTFFunctions.swift:10:8: error: no such module 'SceneKit'
  8 | //
  9 |
 10 | import SceneKit
    |        `- error: no such module 'SceneKit'
 11 | import SpriteKit
 12 | import CoreGraphics
error: emit-module command failed with exit code 1 (use -v to see invocation)
[23/67] Emitting module DisplayLink
/host/spi-builder-workspace/.build/checkouts/DisplayLink/Sources/DisplayLink/DisplayLink.swift:2:8: error: no such module 'QuartzCore'
  1 | import Foundation
  2 | import QuartzCore
    |        `- error: no such module 'QuartzCore'
  3 | import Combine
  4 |
[24/67] Compiling DisplayLink DisplayLink.swift
/host/spi-builder-workspace/.build/checkouts/DisplayLink/Sources/DisplayLink/DisplayLink.swift:2:8: error: no such module 'QuartzCore'
  1 | import Foundation
  2 | import QuartzCore
    |        `- error: no such module 'QuartzCore'
  3 | import Combine
  4 |
[25/67] Compiling GLTFSceneKit GLTFGlTFProperty.swift
/host/spi-builder-workspace/.build/checkouts/GLTFSceneKit/Sources/GLTFSceneKit/GLTFFunctions.swift:10:8: error: no such module 'SceneKit'
  8 | //
  9 |
 10 | import SceneKit
    |        `- error: no such module 'SceneKit'
 11 | import SpriteKit
 12 | import CoreGraphics
[26/67] Compiling GLTFSceneKit GLTFGlTFid.swift
/host/spi-builder-workspace/.build/checkouts/GLTFSceneKit/Sources/GLTFSceneKit/GLTFFunctions.swift:10:8: error: no such module 'SceneKit'
  8 | //
  9 |
 10 | import SceneKit
    |        `- error: no such module 'SceneKit'
 11 | import SpriteKit
 12 | import CoreGraphics
[27/67] Compiling GLTFSceneKit GLTFImage.swift
/host/spi-builder-workspace/.build/checkouts/GLTFSceneKit/Sources/GLTFSceneKit/GLTFFunctions.swift:10:8: error: no such module 'SceneKit'
  8 | //
  9 |
 10 | import SceneKit
    |        `- error: no such module 'SceneKit'
 11 | import SpriteKit
 12 | import CoreGraphics
[28/67] Compiling GLTFSceneKit GLTFMaterial.swift
/host/spi-builder-workspace/.build/checkouts/GLTFSceneKit/Sources/GLTFSceneKit/GLTFFunctions.swift:10:8: error: no such module 'SceneKit'
  8 | //
  9 |
 10 | import SceneKit
    |        `- error: no such module 'SceneKit'
 11 | import SpriteKit
 12 | import CoreGraphics
[29/67] Compiling GLTFSceneKit GLTFMaterialNormalTextureInfo.swift
/host/spi-builder-workspace/.build/checkouts/GLTFSceneKit/Sources/GLTFSceneKit/GLTFFunctions.swift:10:8: error: no such module 'SceneKit'
  8 | //
  9 |
 10 | import SceneKit
    |        `- error: no such module 'SceneKit'
 11 | import SpriteKit
 12 | import CoreGraphics
[30/67] Compiling GLTFSceneKit GLTFMaterialOcclusionTextureInfo.swift
/host/spi-builder-workspace/.build/checkouts/GLTFSceneKit/Sources/GLTFSceneKit/GLTFFunctions.swift:10:8: error: no such module 'SceneKit'
  8 | //
  9 |
 10 | import SceneKit
    |        `- error: no such module 'SceneKit'
 11 | import SpriteKit
 12 | import CoreGraphics
[31/67] Compiling GLTFSceneKit GLTFAccessorSparse.swift
/host/spi-builder-workspace/.build/checkouts/GLTFSceneKit/Sources/GLTFSceneKit/GLTFFunctions.swift:10:8: error: no such module 'SceneKit'
  8 | //
  9 |
 10 | import SceneKit
    |        `- error: no such module 'SceneKit'
 11 | import SpriteKit
 12 | import CoreGraphics
[32/67] Compiling GLTFSceneKit GLTFAccessorSparseIndices.swift
/host/spi-builder-workspace/.build/checkouts/GLTFSceneKit/Sources/GLTFSceneKit/GLTFFunctions.swift:10:8: error: no such module 'SceneKit'
  8 | //
  9 |
 10 | import SceneKit
    |        `- error: no such module 'SceneKit'
 11 | import SpriteKit
 12 | import CoreGraphics
[33/67] Compiling GLTFSceneKit GLTFAccessorSparseValues.swift
/host/spi-builder-workspace/.build/checkouts/GLTFSceneKit/Sources/GLTFSceneKit/GLTFFunctions.swift:10:8: error: no such module 'SceneKit'
  8 | //
  9 |
 10 | import SceneKit
    |        `- error: no such module 'SceneKit'
 11 | import SpriteKit
 12 | import CoreGraphics
[34/67] Compiling GLTFSceneKit GLTFAnimation.swift
/host/spi-builder-workspace/.build/checkouts/GLTFSceneKit/Sources/GLTFSceneKit/GLTFFunctions.swift:10:8: error: no such module 'SceneKit'
  8 | //
  9 |
 10 | import SceneKit
    |        `- error: no such module 'SceneKit'
 11 | import SpriteKit
 12 | import CoreGraphics
[35/67] Compiling GLTFSceneKit GLTFAnimationChannel.swift
/host/spi-builder-workspace/.build/checkouts/GLTFSceneKit/Sources/GLTFSceneKit/GLTFFunctions.swift:10:8: error: no such module 'SceneKit'
  8 | //
  9 |
 10 | import SceneKit
    |        `- error: no such module 'SceneKit'
 11 | import SpriteKit
 12 | import CoreGraphics
[36/67] Compiling GLTFSceneKit GLTFAnimationChannelTarget.swift
/host/spi-builder-workspace/.build/checkouts/GLTFSceneKit/Sources/GLTFSceneKit/GLTFFunctions.swift:10:8: error: no such module 'SceneKit'
  8 | //
  9 |
 10 | import SceneKit
    |        `- error: no such module 'SceneKit'
 11 | import SpriteKit
 12 | import CoreGraphics
[37/67] Compiling GLTFSceneKit GLTFCameraPerspective.swift
/host/spi-builder-workspace/.build/checkouts/GLTFSceneKit/Sources/GLTFSceneKit/GLTFFunctions.swift:10:8: error: no such module 'SceneKit'
  8 | //
  9 |
 10 | import SceneKit
    |        `- error: no such module 'SceneKit'
 11 | import SpriteKit
 12 | import CoreGraphics
[38/67] Compiling GLTFSceneKit GLTFExtension.swift
/host/spi-builder-workspace/.build/checkouts/GLTFSceneKit/Sources/GLTFSceneKit/GLTFFunctions.swift:10:8: error: no such module 'SceneKit'
  8 | //
  9 |
 10 | import SceneKit
    |        `- error: no such module 'SceneKit'
 11 | import SpriteKit
 12 | import CoreGraphics
[39/67] Compiling GLTFSceneKit GLTFExtras.swift
/host/spi-builder-workspace/.build/checkouts/GLTFSceneKit/Sources/GLTFSceneKit/GLTFFunctions.swift:10:8: error: no such module 'SceneKit'
  8 | //
  9 |
 10 | import SceneKit
    |        `- error: no such module 'SceneKit'
 11 | import SpriteKit
 12 | import CoreGraphics
[40/67] Compiling GLTFSceneKit GLTFExtrasTargetNames.swift
/host/spi-builder-workspace/.build/checkouts/GLTFSceneKit/Sources/GLTFSceneKit/GLTFFunctions.swift:10:8: error: no such module 'SceneKit'
  8 | //
  9 |
 10 | import SceneKit
    |        `- error: no such module 'SceneKit'
 11 | import SpriteKit
 12 | import CoreGraphics
[41/67] Compiling GLTFSceneKit GLTFGlTF.swift
/host/spi-builder-workspace/.build/checkouts/GLTFSceneKit/Sources/GLTFSceneKit/GLTFFunctions.swift:10:8: error: no such module 'SceneKit'
  8 | //
  9 |
 10 | import SceneKit
    |        `- error: no such module 'SceneKit'
 11 | import SpriteKit
 12 | import CoreGraphics
[42/67] Compiling GLTFSceneKit GLTFGlTFChildOfRootProperty.swift
/host/spi-builder-workspace/.build/checkouts/GLTFSceneKit/Sources/GLTFSceneKit/GLTFFunctions.swift:10:8: error: no such module 'SceneKit'
  8 | //
  9 |
 10 | import SceneKit
    |        `- error: no such module 'SceneKit'
 11 | import SpriteKit
 12 | import CoreGraphics
[43/67] Compiling GLTFSceneKit GLTFAnimationSampler.swift
/host/spi-builder-workspace/.build/checkouts/GLTFSceneKit/Sources/GLTFSceneKit/GLTFFunctions.swift:10:8: error: no such module 'SceneKit'
  8 | //
  9 |
 10 | import SceneKit
    |        `- error: no such module 'SceneKit'
 11 | import SpriteKit
 12 | import CoreGraphics
[44/67] Compiling GLTFSceneKit GLTFAsset.swift
/host/spi-builder-workspace/.build/checkouts/GLTFSceneKit/Sources/GLTFSceneKit/GLTFFunctions.swift:10:8: error: no such module 'SceneKit'
  8 | //
  9 |
 10 | import SceneKit
    |        `- error: no such module 'SceneKit'
 11 | import SpriteKit
 12 | import CoreGraphics
[45/67] Compiling GLTFSceneKit GLTFBuffer.swift
/host/spi-builder-workspace/.build/checkouts/GLTFSceneKit/Sources/GLTFSceneKit/GLTFFunctions.swift:10:8: error: no such module 'SceneKit'
  8 | //
  9 |
 10 | import SceneKit
    |        `- error: no such module 'SceneKit'
 11 | import SpriteKit
 12 | import CoreGraphics
[46/67] Compiling GLTFSceneKit GLTFBufferView.swift
/host/spi-builder-workspace/.build/checkouts/GLTFSceneKit/Sources/GLTFSceneKit/GLTFFunctions.swift:10:8: error: no such module 'SceneKit'
  8 | //
  9 |
 10 | import SceneKit
    |        `- error: no such module 'SceneKit'
 11 | import SpriteKit
 12 | import CoreGraphics
[47/67] Compiling GLTFSceneKit GLTFCamera.swift
/host/spi-builder-workspace/.build/checkouts/GLTFSceneKit/Sources/GLTFSceneKit/GLTFFunctions.swift:10:8: error: no such module 'SceneKit'
  8 | //
  9 |
 10 | import SceneKit
    |        `- error: no such module 'SceneKit'
 11 | import SpriteKit
 12 | import CoreGraphics
[48/67] Compiling GLTFSceneKit GLTFCameraOrthographic.swift
/host/spi-builder-workspace/.build/checkouts/GLTFSceneKit/Sources/GLTFSceneKit/GLTFFunctions.swift:10:8: error: no such module 'SceneKit'
  8 | //
  9 |
 10 | import SceneKit
    |        `- error: no such module 'SceneKit'
 11 | import SpriteKit
 12 | import CoreGraphics
[49/67] Compiling GLTFSceneKit GLTFMaterialPbrMetallicRoughness.swift
/host/spi-builder-workspace/.build/checkouts/GLTFSceneKit/Sources/GLTFSceneKit/GLTFFunctions.swift:10:8: error: no such module 'SceneKit'
  8 | //
  9 |
 10 | import SceneKit
    |        `- error: no such module 'SceneKit'
 11 | import SpriteKit
 12 | import CoreGraphics
[50/67] Compiling GLTFSceneKit GLTFMesh.swift
/host/spi-builder-workspace/.build/checkouts/GLTFSceneKit/Sources/GLTFSceneKit/GLTFFunctions.swift:10:8: error: no such module 'SceneKit'
  8 | //
  9 |
 10 | import SceneKit
    |        `- error: no such module 'SceneKit'
 11 | import SpriteKit
 12 | import CoreGraphics
[51/67] Compiling GLTFSceneKit GLTFMeshPrimitive.swift
/host/spi-builder-workspace/.build/checkouts/GLTFSceneKit/Sources/GLTFSceneKit/GLTFFunctions.swift:10:8: error: no such module 'SceneKit'
  8 | //
  9 |
 10 | import SceneKit
    |        `- error: no such module 'SceneKit'
 11 | import SpriteKit
 12 | import CoreGraphics
[52/67] Compiling GLTFSceneKit GLTFNode.swift
/host/spi-builder-workspace/.build/checkouts/GLTFSceneKit/Sources/GLTFSceneKit/GLTFFunctions.swift:10:8: error: no such module 'SceneKit'
  8 | //
  9 |
 10 | import SceneKit
    |        `- error: no such module 'SceneKit'
 11 | import SpriteKit
 12 | import CoreGraphics
[53/67] Compiling GLTFSceneKit GLTFSampler.swift
/host/spi-builder-workspace/.build/checkouts/GLTFSceneKit/Sources/GLTFSceneKit/GLTFFunctions.swift:10:8: error: no such module 'SceneKit'
  8 | //
  9 |
 10 | import SceneKit
    |        `- error: no such module 'SceneKit'
 11 | import SpriteKit
 12 | import CoreGraphics
[54/67] Compiling GLTFSceneKit GLTFScene.swift
/host/spi-builder-workspace/.build/checkouts/GLTFSceneKit/Sources/GLTFSceneKit/GLTFFunctions.swift:10:8: error: no such module 'SceneKit'
  8 | //
  9 |
 10 | import SceneKit
    |        `- error: no such module 'SceneKit'
 11 | import SpriteKit
 12 | import CoreGraphics
BUILD FAILURE 6.0 linux