The Swift Package Index logo.Swift Package Index

Track the adoption of Swift 6 strict concurrency checks for data race safety. How many packages are Ready for Swift 6?

Build Information

Failed to build AUv3Controls, reference 0.17.2 (80e96c), with Swift 6.0 for watchOS using Xcode 16.2 on 1 May 2025 17:21:03 UTC.

Build Command

env DEVELOPER_DIR=/Applications/Xcode-16.2.0.app xcrun xcodebuild -IDEClonedSourcePackagesDirPathOverride=$PWD/.dependencies -skipMacroValidation -skipPackagePluginValidation -derivedDataPath $PWD/.derivedData build -scheme AUv3Controls -destination generic/platform=watchOS

Build Log

SwiftCompile normal arm64 /Users/admin/builder/spi-builder-workspace/Sources/AUv3Controls/Support/Logger.swift (in target 'AUv3Controls' from project 'AUv3Controls')
    cd /Users/admin/builder/spi-builder-workspace/.swiftpm/xcode
    /Applications/Xcode-16.2.0.app/Contents/Developer/Toolchains/XcodeDefault.xctoolchain/usr/bin/swift-frontend -c /Users/admin/builder/spi-builder-workspace/.derivedData/Build/Intermediates.noindex/AUv3Controls.build/Debug-watchos/AUv3Controls.build/DerivedSources/resource_bundle_accessor.swift /Users/admin/builder/spi-builder-workspace/Sources/AUv3Controls/Examples/Duality.swift /Users/admin/builder/spi-builder-workspace/Sources/AUv3Controls/Examples/Envelope.swift /Users/admin/builder/spi-builder-workspace/Sources/AUv3Controls/Extensions/AUParameter.swift /Users/admin/builder/spi-builder-workspace/Sources/AUv3Controls/Extensions/AUParameterTree.swift /Users/admin/builder/spi-builder-workspace/Sources/AUv3Controls/Extensions/Angle.swift /Users/admin/builder/spi-builder-workspace/Sources/AUv3Controls/Extensions/ClosedRange.swift /Users/admin/builder/spi-builder-workspace/Sources/AUv3Controls/Extensions/Color.swift /Users/admin/builder/spi-builder-workspace/Sources/AUv3Controls/Extensions/KeyPath.swift /Users/admin/builder/spi-builder-workspace/Sources/AUv3Controls/Extensions/UUID.swift /Users/admin/builder/spi-builder-workspace/Sources/AUv3Controls/Extensions/View.swift /Users/admin/builder/spi-builder-workspace/Sources/AUv3Controls/Knob/ControlFeature.swift /Users/admin/builder/spi-builder-workspace/Sources/AUv3Controls/Knob/EditorFeature.swift /Users/admin/builder/spi-builder-workspace/Sources/AUv3Controls/Knob/KnobConfig.swift /Users/admin/builder/spi-builder-workspace/Sources/AUv3Controls/Knob/KnobFeature.swift /Users/admin/builder/spi-builder-workspace/Sources/AUv3Controls/Knob/KnobValueFormatter.swift /Users/admin/builder/spi-builder-workspace/Sources/AUv3Controls/Knob/NormValueTransform.swift /Users/admin/builder/spi-builder-workspace/Sources/AUv3Controls/Knob/TitleFeature.swift -primary-file /Users/admin/builder/spi-builder-workspace/Sources/AUv3Controls/Knob/TrackFeature.swift -primary-file /Users/admin/builder/spi-builder-workspace/Sources/AUv3Controls/Support/Logger.swift /Users/admin/builder/spi-builder-workspace/Sources/AUv3Controls/Theme.swift /Users/admin/builder/spi-builder-workspace/Sources/AUv3Controls/Toggle/CheckedToggleStyle.swift /Users/admin/builder/spi-builder-workspace/Sources/AUv3Controls/Toggle/ToggleFeature.swift /Users/admin/builder/spi-builder-workspace/.derivedData/Build/Intermediates.noindex/AUv3Controls.build/Debug-watchos/AUv3Controls.build/DerivedSources/GeneratedAssetSymbols.swift -emit-dependencies-path /Users/admin/builder/spi-builder-workspace/.derivedData/Build/Intermediates.noindex/AUv3Controls.build/Debug-watchos/AUv3Controls.build/Objects-normal/arm64/TrackFeature.d -emit-const-values-path /Users/admin/builder/spi-builder-workspace/.derivedData/Build/Intermediates.noindex/AUv3Controls.build/Debug-watchos/AUv3Controls.build/Objects-normal/arm64/TrackFeature.swiftconstvalues -emit-reference-dependencies-path /Users/admin/builder/spi-builder-workspace/.derivedData/Build/Intermediates.noindex/AUv3Controls.build/Debug-watchos/AUv3Controls.build/Objects-normal/arm64/TrackFeature.swiftdeps -serialize-diagnostics-path /Users/admin/builder/spi-builder-workspace/.derivedData/Build/Intermediates.noindex/AUv3Controls.build/Debug-watchos/AUv3Controls.build/Objects-normal/arm64/TrackFeature.dia -emit-dependencies-path /Users/admin/builder/spi-builder-workspace/.derivedData/Build/Intermediates.noindex/AUv3Controls.build/Debug-watchos/AUv3Controls.build/Objects-normal/arm64/Logger.d -emit-const-values-path /Users/admin/builder/spi-builder-workspace/.derivedData/Build/Intermediates.noindex/AUv3Controls.build/Debug-watchos/AUv3Controls.build/Objects-normal/arm64/Logger.swiftconstvalues -emit-reference-dependencies-path /Users/admin/builder/spi-builder-workspace/.derivedData/Build/Intermediates.noindex/AUv3Controls.build/Debug-watchos/AUv3Controls.build/Objects-normal/arm64/Logger.swiftdeps -serialize-diagnostics-path /Users/admin/builder/spi-builder-workspace/.derivedData/Build/Intermediates.noindex/AUv3Controls.build/Debug-watchos/AUv3Controls.build/Objects-normal/arm64/Logger.dia -target arm64-apple-watchos10.0 -Xllvm -aarch64-use-tbi -enable-objc-interop -stack-check -sdk /Applications/Xcode-16.2.0.app/Contents/Developer/Platforms/WatchOS.platform/Developer/SDKs/WatchOS11.2.sdk -I /Users/admin/builder/spi-builder-workspace/.derivedData/Build/Products/Debug-watchos -I /Applications/Xcode-16.2.0.app/Contents/Developer/Platforms/WatchOS.platform/Developer/usr/lib -F /Users/admin/builder/spi-builder-workspace/.derivedData/Build/Products/Debug-watchos/PackageFrameworks -F /Users/admin/builder/spi-builder-workspace/.derivedData/Build/Products/Debug-watchos/PackageFrameworks -F /Users/admin/builder/spi-builder-workspace/.derivedData/Build/Products/Debug-watchos/PackageFrameworks -F /Users/admin/builder/spi-builder-workspace/.derivedData/Build/Products/Debug-watchos/PackageFrameworks -F /Users/admin/builder/spi-builder-workspace/.derivedData/Build/Products/Debug-watchos/PackageFrameworks -F /Users/admin/builder/spi-builder-workspace/.derivedData/Build/Products/Debug-watchos/PackageFrameworks -F /Users/admin/builder/spi-builder-workspace/.derivedData/Build/Products/Debug-watchos/PackageFrameworks -F /Users/admin/builder/spi-builder-workspace/.derivedData/Build/Products/Debug-watchos/PackageFrameworks -F /Users/admin/builder/spi-builder-workspace/.derivedData/Build/Products/Debug-watchos/PackageFrameworks -F /Users/admin/builder/spi-builder-workspace/.derivedData/Build/Products/Debug-watchos/PackageFrameworks -F /Users/admin/builder/spi-builder-workspace/.derivedData/Build/Products/Debug-watchos/PackageFrameworks -F /Users/admin/builder/spi-builder-workspace/.derivedData/Build/Products/Debug-watchos/PackageFrameworks -F /Users/admin/builder/spi-builder-workspace/.derivedData/Build/Products/Debug-watchos/PackageFrameworks -F /Users/admin/builder/spi-builder-workspace/.derivedData/Build/Products/Debug-watchos/PackageFrameworks -F /Users/admin/builder/spi-builder-workspace/.derivedData/Build/Products/Debug-watchos/PackageFrameworks -F /Users/admin/builder/spi-builder-workspace/.derivedData/Build/Products/Debug-watchos/PackageFrameworks -F /Users/admin/builder/spi-builder-workspace/.derivedData/Build/Products/Debug-watchos/PackageFrameworks -F /Users/admin/builder/spi-builder-workspace/.derivedData/Build/Products/Debug-watchos/PackageFrameworks -F /Users/admin/builder/spi-builder-workspace/.derivedData/Build/Products/Debug-watchos/PackageFrameworks -F /Users/admin/builder/spi-builder-workspace/.derivedData/Build/Products/Debug-watchos/PackageFrameworks -F /Users/admin/builder/spi-builder-workspace/.derivedData/Build/Products/Debug-watchos/PackageFrameworks -F /Users/admin/builder/spi-builder-workspace/.derivedData/Build/Products/Debug-watchos/PackageFrameworks -F /Users/admin/builder/spi-builder-workspace/.derivedData/Build/Products/Debug-watchos/PackageFrameworks -F /Users/admin/builder/spi-builder-workspace/.derivedData/Build/Products/Debug-watchos/PackageFrameworks -F /Users/admin/builder/spi-builder-workspace/.derivedData/Build/Products/Debug-watchos/PackageFrameworks -F /Users/admin/builder/spi-builder-workspace/.derivedData/Build/Products/Debug-watchos -F /Applications/Xcode-16.2.0.app/Contents/Developer/Platforms/WatchOS.platform/Developer/Library/Frameworks -F /Applications/Xcode-16.2.0.app/Contents/Developer/Platforms/WatchOS.platform/Developer/SDKs/WatchOS11.2.sdk/Developer/Library/Frameworks -no-color-diagnostics -enable-testing -g -debug-info-format\=dwarf -dwarf-version\=4 -module-cache-path /Users/admin/builder/spi-builder-workspace/.derivedData/ModuleCache.noindex -profile-generate -profile-coverage-mapping -swift-version 6 -enforce-exclusivity\=checked -Onone -D SWIFT_PACKAGE -D DEBUG -D Xcode -serialize-debugging-options -load-plugin-executable /Users/admin/builder/spi-builder-workspace/.derivedData/Build/Products/Debug/CasePathsMacros\#CasePathsMacros -load-plugin-executable /Users/admin/builder/spi-builder-workspace/.derivedData/Build/Products/Debug/ComposableArchitectureMacros\#ComposableArchitectureMacros -load-plugin-executable /Users/admin/builder/spi-builder-workspace/.derivedData/Build/Products/Debug/DependenciesMacrosPlugin\#DependenciesMacrosPlugin -load-plugin-executable /Users/admin/builder/spi-builder-workspace/.derivedData/Build/Products/Debug/PerceptionMacros\#PerceptionMacros -const-gather-protocols-file /Users/admin/builder/spi-builder-workspace/.derivedData/Build/Intermediates.noindex/AUv3Controls.build/Debug-watchos/AUv3Controls.build/Objects-normal/arm64/AUv3Controls_const_extract_protocols.json -enable-experimental-feature StrictConcurrency\=complete -enable-experimental-feature DebugDescriptionMacro -enable-experimental-feature OpaqueTypeErasure -empty-abi-descriptor -plugin-path /Applications/Xcode-16.2.0.app/Contents/Developer/Toolchains/XcodeDefault.xctoolchain/usr/lib/swift/host/plugins/testing -validate-clang-modules-once -clang-build-session-file /Users/admin/builder/spi-builder-workspace/.derivedData/ModuleCache.noindex/Session.modulevalidation -Xcc -working-directory -Xcc /Users/admin/builder/spi-builder-workspace/.swiftpm/xcode -resource-dir /Applications/Xcode-16.2.0.app/Contents/Developer/Toolchains/XcodeDefault.xctoolchain/usr/lib/swift -enable-anonymous-context-mangled-names -file-compilation-dir /Users/admin/builder/spi-builder-workspace/.swiftpm/xcode -Xcc -fmodule-map-file\=/Users/admin/builder/spi-builder-workspace/.derivedData/Build/Intermediates.noindex/GeneratedModuleMaps-watchos/UIKitNavigationShim.modulemap -Xcc -D_LIBCPP_HARDENING_MODE\=_LIBCPP_HARDENING_MODE_DEBUG -Xcc -ivfsstatcache -Xcc /Users/admin/builder/spi-builder-workspace/.derivedData/SDKStatCaches.noindex/watchos11.2-22S97-8cb5c683f5e64b0ecfc74e8d0065fbf6.sdkstatcache -Xcc -I/Users/admin/builder/spi-builder-workspace/.derivedData/Build/Intermediates.noindex/AUv3Controls.build/Debug-watchos/AUv3Controls.build/swift-overrides.hmap -Xcc -I/Users/admin/builder/spi-builder-workspace/.dependencies/checkouts/swift-navigation/Sources/UIKitNavigationShim/include -Xcc -I/Users/admin/builder/spi-builder-workspace/.derivedData/Build/Products/Debug-watchos/include -Xcc -I/Users/admin/builder/spi-builder-workspace/.derivedData/Build/Intermediates.noindex/AUv3Controls.build/Debug-watchos/AUv3Controls.build/DerivedSources-normal/arm64 -Xcc -I/Users/admin/builder/spi-builder-workspace/.derivedData/Build/Intermediates.noindex/AUv3Controls.build/Debug-watchos/AUv3Controls.build/DerivedSources/arm64 -Xcc -I/Users/admin/builder/spi-builder-workspace/.derivedData/Build/Intermediates.noindex/AUv3Controls.build/Debug-watchos/AUv3Controls.build/DerivedSources -Xcc -DSWIFT_PACKAGE -Xcc -DDEBUG\=1 -module-name AUv3Controls -package-name spi_builder_workspace -frontend-parseable-output -disable-clang-spi -target-sdk-version 11.2 -target-sdk-name watchos11.2 -external-plugin-path /Applications/Xcode-16.2.0.app/Contents/Developer/Platforms/WatchOS.platform/Developer/usr/lib/swift/host/plugins\#/Applications/Xcode-16.2.0.app/Contents/Developer/Platforms/WatchOS.platform/Developer/usr/bin/swift-plugin-server -external-plugin-path /Applications/Xcode-16.2.0.app/Contents/Developer/Platforms/WatchOS.platform/Developer/usr/local/lib/swift/host/plugins\#/Applications/Xcode-16.2.0.app/Contents/Developer/Platforms/WatchOS.platform/Developer/usr/bin/swift-plugin-server -plugin-path /Applications/Xcode-16.2.0.app/Contents/Developer/Toolchains/XcodeDefault.xctoolchain/usr/lib/swift/host/plugins -plugin-path /Applications/Xcode-16.2.0.app/Contents/Developer/Toolchains/XcodeDefault.xctoolchain/usr/local/lib/swift/host/plugins -o /Users/admin/builder/spi-builder-workspace/.derivedData/Build/Intermediates.noindex/AUv3Controls.build/Debug-watchos/AUv3Controls.build/Objects-normal/arm64/TrackFeature.o -o /Users/admin/builder/spi-builder-workspace/.derivedData/Build/Intermediates.noindex/AUv3Controls.build/Debug-watchos/AUv3Controls.build/Objects-normal/arm64/Logger.o -index-unit-output-path /AUv3Controls.build/Debug-watchos/AUv3Controls.build/Objects-normal/arm64/TrackFeature.o -index-unit-output-path /AUv3Controls.build/Debug-watchos/AUv3Controls.build/Objects-normal/arm64/Logger.o -index-store-path /Users/admin/builder/spi-builder-workspace/.derivedData/Index.noindex/DataStore -index-system-modules
SwiftCompile normal arm64_32 Compiling\ Theme.swift,\ CheckedToggleStyle.swift /Users/admin/builder/spi-builder-workspace/Sources/AUv3Controls/Theme.swift /Users/admin/builder/spi-builder-workspace/Sources/AUv3Controls/Toggle/CheckedToggleStyle.swift (in target 'AUv3Controls' from project 'AUv3Controls')
    cd /Users/admin/builder/spi-builder-workspace/.swiftpm/xcode
    builtin-swiftTaskExecution -- /Applications/Xcode-16.2.0.app/Contents/Developer/Toolchains/XcodeDefault.xctoolchain/usr/bin/swift-frontend -frontend -c /Users/admin/builder/spi-builder-workspace/.derivedData/Build/Intermediates.noindex/AUv3Controls.build/Debug-watchos/AUv3Controls.build/DerivedSources/resource_bundle_accessor.swift /Users/admin/builder/spi-builder-workspace/Sources/AUv3Controls/Examples/Duality.swift /Users/admin/builder/spi-builder-workspace/Sources/AUv3Controls/Examples/Envelope.swift /Users/admin/builder/spi-builder-workspace/Sources/AUv3Controls/Extensions/AUParameter.swift /Users/admin/builder/spi-builder-workspace/Sources/AUv3Controls/Extensions/AUParameterTree.swift /Users/admin/builder/spi-builder-workspace/Sources/AUv3Controls/Extensions/Angle.swift /Users/admin/builder/spi-builder-workspace/Sources/AUv3Controls/Extensions/ClosedRange.swift /Users/admin/builder/spi-builder-workspace/Sources/AUv3Controls/Extensions/Color.swift /Users/admin/builder/spi-builder-workspace/Sources/AUv3Controls/Extensions/KeyPath.swift /Users/admin/builder/spi-builder-workspace/Sources/AUv3Controls/Extensions/UUID.swift /Users/admin/builder/spi-builder-workspace/Sources/AUv3Controls/Extensions/View.swift /Users/admin/builder/spi-builder-workspace/Sources/AUv3Controls/Knob/ControlFeature.swift /Users/admin/builder/spi-builder-workspace/Sources/AUv3Controls/Knob/EditorFeature.swift /Users/admin/builder/spi-builder-workspace/Sources/AUv3Controls/Knob/KnobConfig.swift /Users/admin/builder/spi-builder-workspace/Sources/AUv3Controls/Knob/KnobFeature.swift /Users/admin/builder/spi-builder-workspace/Sources/AUv3Controls/Knob/KnobValueFormatter.swift /Users/admin/builder/spi-builder-workspace/Sources/AUv3Controls/Knob/NormValueTransform.swift /Users/admin/builder/spi-builder-workspace/Sources/AUv3Controls/Knob/TitleFeature.swift /Users/admin/builder/spi-builder-workspace/Sources/AUv3Controls/Knob/TrackFeature.swift /Users/admin/builder/spi-builder-workspace/Sources/AUv3Controls/Support/Logger.swift -primary-file /Users/admin/builder/spi-builder-workspace/Sources/AUv3Controls/Theme.swift -primary-file /Users/admin/builder/spi-builder-workspace/Sources/AUv3Controls/Toggle/CheckedToggleStyle.swift /Users/admin/builder/spi-builder-workspace/Sources/AUv3Controls/Toggle/ToggleFeature.swift /Users/admin/builder/spi-builder-workspace/.derivedData/Build/Intermediates.noindex/AUv3Controls.build/Debug-watchos/AUv3Controls.build/DerivedSources/GeneratedAssetSymbols.swift -emit-dependencies-path /Users/admin/builder/spi-builder-workspace/.derivedData/Build/Intermediates.noindex/AUv3Controls.build/Debug-watchos/AUv3Controls.build/Objects-normal/arm64_32/Theme.d -emit-const-values-path /Users/admin/builder/spi-builder-workspace/.derivedData/Build/Intermediates.noindex/AUv3Controls.build/Debug-watchos/AUv3Controls.build/Objects-normal/arm64_32/Theme.swiftconstvalues -emit-reference-dependencies-path /Users/admin/builder/spi-builder-workspace/.derivedData/Build/Intermediates.noindex/AUv3Controls.build/Debug-watchos/AUv3Controls.build/Objects-normal/arm64_32/Theme.swiftdeps -serialize-diagnostics-path /Users/admin/builder/spi-builder-workspace/.derivedData/Build/Intermediates.noindex/AUv3Controls.build/Debug-watchos/AUv3Controls.build/Objects-normal/arm64_32/Theme.dia -emit-dependencies-path /Users/admin/builder/spi-builder-workspace/.derivedData/Build/Intermediates.noindex/AUv3Controls.build/Debug-watchos/AUv3Controls.build/Objects-normal/arm64_32/CheckedToggleStyle.d -emit-const-values-path /Users/admin/builder/spi-builder-workspace/.derivedData/Build/Intermediates.noindex/AUv3Controls.build/Debug-watchos/AUv3Controls.build/Objects-normal/arm64_32/CheckedToggleStyle.swiftconstvalues -emit-reference-dependencies-path /Users/admin/builder/spi-builder-workspace/.derivedData/Build/Intermediates.noindex/AUv3Controls.build/Debug-watchos/AUv3Controls.build/Objects-normal/arm64_32/CheckedToggleStyle.swiftdeps -serialize-diagnostics-path /Users/admin/builder/spi-builder-workspace/.derivedData/Build/Intermediates.noindex/AUv3Controls.build/Debug-watchos/AUv3Controls.build/Objects-normal/arm64_32/CheckedToggleStyle.dia -target arm64_32-apple-watchos10.0 -enable-objc-interop -sdk /Applications/Xcode-16.2.0.app/Contents/Developer/Platforms/WatchOS.platform/Developer/SDKs/WatchOS11.2.sdk -I /Users/admin/builder/spi-builder-workspace/.derivedData/Build/Products/Debug-watchos -I /Applications/Xcode-16.2.0.app/Contents/Developer/Platforms/WatchOS.platform/Developer/usr/lib -F /Users/admin/builder/spi-builder-workspace/.derivedData/Build/Products/Debug-watchos/PackageFrameworks -F /Users/admin/builder/spi-builder-workspace/.derivedData/Build/Products/Debug-watchos/PackageFrameworks -F /Users/admin/builder/spi-builder-workspace/.derivedData/Build/Products/Debug-watchos/PackageFrameworks -F /Users/admin/builder/spi-builder-workspace/.derivedData/Build/Products/Debug-watchos/PackageFrameworks -F /Users/admin/builder/spi-builder-workspace/.derivedData/Build/Products/Debug-watchos/PackageFrameworks -F /Users/admin/builder/spi-builder-workspace/.derivedData/Build/Products/Debug-watchos/PackageFrameworks -F /Users/admin/builder/spi-builder-workspace/.derivedData/Build/Products/Debug-watchos/PackageFrameworks -F /Users/admin/builder/spi-builder-workspace/.derivedData/Build/Products/Debug-watchos/PackageFrameworks -F /Users/admin/builder/spi-builder-workspace/.derivedData/Build/Products/Debug-watchos/PackageFrameworks -F /Users/admin/builder/spi-builder-workspace/.derivedData/Build/Products/Debug-watchos/PackageFrameworks -F /Users/admin/builder/spi-builder-workspace/.derivedData/Build/Products/Debug-watchos/PackageFrameworks -F /Users/admin/builder/spi-builder-workspace/.derivedData/Build/Products/Debug-watchos/PackageFrameworks -F /Users/admin/builder/spi-builder-workspace/.derivedData/Build/Products/Debug-watchos/PackageFrameworks -F /Users/admin/builder/spi-builder-workspace/.derivedData/Build/Products/Debug-watchos/PackageFrameworks -F /Users/admin/builder/spi-builder-workspace/.derivedData/Build/Products/Debug-watchos/PackageFrameworks -F /Users/admin/builder/spi-builder-workspace/.derivedData/Build/Products/Debug-watchos/PackageFrameworks -F /Users/admin/builder/spi-builder-workspace/.derivedData/Build/Products/Debug-watchos/PackageFrameworks -F /Users/admin/builder/spi-builder-workspace/.derivedData/Build/Products/Debug-watchos/PackageFrameworks -F /Users/admin/builder/spi-builder-workspace/.derivedData/Build/Products/Debug-watchos/PackageFrameworks -F /Users/admin/builder/spi-builder-workspace/.derivedData/Build/Products/Debug-watchos/PackageFrameworks -F /Users/admin/builder/spi-builder-workspace/.derivedData/Build/Products/Debug-watchos/PackageFrameworks -F /Users/admin/builder/spi-builder-workspace/.derivedData/Build/Products/Debug-watchos/PackageFrameworks -F /Users/admin/builder/spi-builder-workspace/.derivedData/Build/Products/Debug-watchos/PackageFrameworks -F /Users/admin/builder/spi-builder-workspace/.derivedData/Build/Products/Debug-watchos/PackageFrameworks -F /Users/admin/builder/spi-builder-workspace/.derivedData/Build/Products/Debug-watchos/PackageFrameworks -F /Users/admin/builder/spi-builder-workspace/.derivedData/Build/Products/Debug-watchos -F /Applications/Xcode-16.2.0.app/Contents/Developer/Platforms/WatchOS.platform/Developer/Library/Frameworks -F /Applications/Xcode-16.2.0.app/Contents/Developer/Platforms/WatchOS.platform/Developer/SDKs/WatchOS11.2.sdk/Developer/Library/Frameworks -no-color-diagnostics -enable-testing -g -debug-info-format\=dwarf -dwarf-version\=4 -module-cache-path /Users/admin/builder/spi-builder-workspace/.derivedData/ModuleCache.noindex -profile-generate -profile-coverage-mapping -swift-version 6 -enforce-exclusivity\=checked -Onone -D SWIFT_PACKAGE -D DEBUG -D Xcode -serialize-debugging-options -load-plugin-executable /Users/admin/builder/spi-builder-workspace/.derivedData/Build/Products/Debug/CasePathsMacros\#CasePathsMacros -load-plugin-executable /Users/admin/builder/spi-builder-workspace/.derivedData/Build/Products/Debug/ComposableArchitectureMacros\#ComposableArchitectureMacros -load-plugin-executable /Users/admin/builder/spi-builder-workspace/.derivedData/Build/Products/Debug/DependenciesMacrosPlugin\#DependenciesMacrosPlugin -load-plugin-executable /Users/admin/builder/spi-builder-workspace/.derivedData/Build/Products/Debug/PerceptionMacros\#PerceptionMacros -const-gather-protocols-file /Users/admin/builder/spi-builder-workspace/.derivedData/Build/Intermediates.noindex/AUv3Controls.build/Debug-watchos/AUv3Controls.build/Objects-normal/arm64_32/AUv3Controls_const_extract_protocols.json -enable-experimental-feature StrictConcurrency\=complete -enable-experimental-feature DebugDescriptionMacro -enable-experimental-feature OpaqueTypeErasure -empty-abi-descriptor -plugin-path /Applications/Xcode-16.2.0.app/Contents/Developer/Toolchains/XcodeDefault.xctoolchain/usr/lib/swift/host/plugins/testing -validate-clang-modules-once -clang-build-session-file /Users/admin/builder/spi-builder-workspace/.derivedData/ModuleCache.noindex/Session.modulevalidation -Xcc -working-directory -Xcc /Users/admin/builder/spi-builder-workspace/.swiftpm/xcode -resource-dir /Applications/Xcode-16.2.0.app/Contents/Developer/Toolchains/XcodeDefault.xctoolchain/usr/lib/swift -enable-anonymous-context-mangled-names -file-compilation-dir /Users/admin/builder/spi-builder-workspace/.swiftpm/xcode -Xcc -fmodule-map-file\=/Users/admin/builder/spi-builder-workspace/.derivedData/Build/Intermediates.noindex/GeneratedModuleMaps-watchos/UIKitNavigationShim.modulemap -Xcc -D_LIBCPP_HARDENING_MODE\=_LIBCPP_HARDENING_MODE_DEBUG -Xcc -ivfsstatcache -Xcc /Users/admin/builder/spi-builder-workspace/.derivedData/SDKStatCaches.noindex/watchos11.2-22S97-8cb5c683f5e64b0ecfc74e8d0065fbf6.sdkstatcache -Xcc -I/Users/admin/builder/spi-builder-workspace/.derivedData/Build/Intermediates.noindex/AUv3Controls.build/Debug-watchos/AUv3Controls.build/swift-overrides.hmap -Xcc -I/Users/admin/builder/spi-builder-workspace/.dependencies/checkouts/swift-navigation/Sources/UIKitNavigationShim/include -Xcc -I/Users/admin/builder/spi-builder-workspace/.derivedData/Build/Products/Debug-watchos/include -Xcc -I/Users/admin/builder/spi-builder-workspace/.derivedData/Build/Intermediates.noindex/AUv3Controls.build/Debug-watchos/AUv3Controls.build/DerivedSources-normal/arm64_32 -Xcc -I/Users/admin/builder/spi-builder-workspace/.derivedData/Build/Intermediates.noindex/AUv3Controls.build/Debug-watchos/AUv3Controls.build/DerivedSources/arm64_32 -Xcc -I/Users/admin/builder/spi-builder-workspace/.derivedData/Build/Intermediates.noindex/AUv3Controls.build/Debug-watchos/AUv3Controls.build/DerivedSources -Xcc -DSWIFT_PACKAGE -Xcc -DDEBUG\=1 -module-name AUv3Controls -package-name spi_builder_workspace -frontend-parseable-output -disable-clang-spi -target-sdk-version 11.2 -target-sdk-name watchos11.2 -external-plugin-path /Applications/Xcode-16.2.0.app/Contents/Developer/Platforms/WatchOS.platform/Developer/usr/lib/swift/host/plugins\#/Applications/Xcode-16.2.0.app/Contents/Developer/Platforms/WatchOS.platform/Developer/usr/bin/swift-plugin-server -external-plugin-path /Applications/Xcode-16.2.0.app/Contents/Developer/Platforms/WatchOS.platform/Developer/usr/local/lib/swift/host/plugins\#/Applications/Xcode-16.2.0.app/Contents/Developer/Platforms/WatchOS.platform/Developer/usr/bin/swift-plugin-server -plugin-path /Applications/Xcode-16.2.0.app/Contents/Developer/Toolchains/XcodeDefault.xctoolchain/usr/lib/swift/host/plugins -plugin-path /Applications/Xcode-16.2.0.app/Contents/Developer/Toolchains/XcodeDefault.xctoolchain/usr/local/lib/swift/host/plugins -o /Users/admin/builder/spi-builder-workspace/.derivedData/Build/Intermediates.noindex/AUv3Controls.build/Debug-watchos/AUv3Controls.build/Objects-normal/arm64_32/Theme.o -o /Users/admin/builder/spi-builder-workspace/.derivedData/Build/Intermediates.noindex/AUv3Controls.build/Debug-watchos/AUv3Controls.build/Objects-normal/arm64_32/CheckedToggleStyle.o -index-unit-output-path /AUv3Controls.build/Debug-watchos/AUv3Controls.build/Objects-normal/arm64_32/Theme.o -index-unit-output-path /AUv3Controls.build/Debug-watchos/AUv3Controls.build/Objects-normal/arm64_32/CheckedToggleStyle.o -index-store-path /Users/admin/builder/spi-builder-workspace/.derivedData/Index.noindex/DataStore -index-system-modules
SwiftCompile normal arm64_32 /Users/admin/builder/spi-builder-workspace/Sources/AUv3Controls/Theme.swift (in target 'AUv3Controls' from project 'AUv3Controls')
    cd /Users/admin/builder/spi-builder-workspace/.swiftpm/xcode
    /Applications/Xcode-16.2.0.app/Contents/Developer/Toolchains/XcodeDefault.xctoolchain/usr/bin/swift-frontend -c /Users/admin/builder/spi-builder-workspace/.derivedData/Build/Intermediates.noindex/AUv3Controls.build/Debug-watchos/AUv3Controls.build/DerivedSources/resource_bundle_accessor.swift /Users/admin/builder/spi-builder-workspace/Sources/AUv3Controls/Examples/Duality.swift /Users/admin/builder/spi-builder-workspace/Sources/AUv3Controls/Examples/Envelope.swift /Users/admin/builder/spi-builder-workspace/Sources/AUv3Controls/Extensions/AUParameter.swift /Users/admin/builder/spi-builder-workspace/Sources/AUv3Controls/Extensions/AUParameterTree.swift /Users/admin/builder/spi-builder-workspace/Sources/AUv3Controls/Extensions/Angle.swift /Users/admin/builder/spi-builder-workspace/Sources/AUv3Controls/Extensions/ClosedRange.swift /Users/admin/builder/spi-builder-workspace/Sources/AUv3Controls/Extensions/Color.swift /Users/admin/builder/spi-builder-workspace/Sources/AUv3Controls/Extensions/KeyPath.swift /Users/admin/builder/spi-builder-workspace/Sources/AUv3Controls/Extensions/UUID.swift /Users/admin/builder/spi-builder-workspace/Sources/AUv3Controls/Extensions/View.swift /Users/admin/builder/spi-builder-workspace/Sources/AUv3Controls/Knob/ControlFeature.swift /Users/admin/builder/spi-builder-workspace/Sources/AUv3Controls/Knob/EditorFeature.swift /Users/admin/builder/spi-builder-workspace/Sources/AUv3Controls/Knob/KnobConfig.swift /Users/admin/builder/spi-builder-workspace/Sources/AUv3Controls/Knob/KnobFeature.swift /Users/admin/builder/spi-builder-workspace/Sources/AUv3Controls/Knob/KnobValueFormatter.swift /Users/admin/builder/spi-builder-workspace/Sources/AUv3Controls/Knob/NormValueTransform.swift /Users/admin/builder/spi-builder-workspace/Sources/AUv3Controls/Knob/TitleFeature.swift /Users/admin/builder/spi-builder-workspace/Sources/AUv3Controls/Knob/TrackFeature.swift /Users/admin/builder/spi-builder-workspace/Sources/AUv3Controls/Support/Logger.swift -primary-file /Users/admin/builder/spi-builder-workspace/Sources/AUv3Controls/Theme.swift -primary-file /Users/admin/builder/spi-builder-workspace/Sources/AUv3Controls/Toggle/CheckedToggleStyle.swift /Users/admin/builder/spi-builder-workspace/Sources/AUv3Controls/Toggle/ToggleFeature.swift /Users/admin/builder/spi-builder-workspace/.derivedData/Build/Intermediates.noindex/AUv3Controls.build/Debug-watchos/AUv3Controls.build/DerivedSources/GeneratedAssetSymbols.swift -emit-dependencies-path /Users/admin/builder/spi-builder-workspace/.derivedData/Build/Intermediates.noindex/AUv3Controls.build/Debug-watchos/AUv3Controls.build/Objects-normal/arm64_32/Theme.d -emit-const-values-path /Users/admin/builder/spi-builder-workspace/.derivedData/Build/Intermediates.noindex/AUv3Controls.build/Debug-watchos/AUv3Controls.build/Objects-normal/arm64_32/Theme.swiftconstvalues -emit-reference-dependencies-path /Users/admin/builder/spi-builder-workspace/.derivedData/Build/Intermediates.noindex/AUv3Controls.build/Debug-watchos/AUv3Controls.build/Objects-normal/arm64_32/Theme.swiftdeps -serialize-diagnostics-path /Users/admin/builder/spi-builder-workspace/.derivedData/Build/Intermediates.noindex/AUv3Controls.build/Debug-watchos/AUv3Controls.build/Objects-normal/arm64_32/Theme.dia -emit-dependencies-path /Users/admin/builder/spi-builder-workspace/.derivedData/Build/Intermediates.noindex/AUv3Controls.build/Debug-watchos/AUv3Controls.build/Objects-normal/arm64_32/CheckedToggleStyle.d -emit-const-values-path /Users/admin/builder/spi-builder-workspace/.derivedData/Build/Intermediates.noindex/AUv3Controls.build/Debug-watchos/AUv3Controls.build/Objects-normal/arm64_32/CheckedToggleStyle.swiftconstvalues -emit-reference-dependencies-path /Users/admin/builder/spi-builder-workspace/.derivedData/Build/Intermediates.noindex/AUv3Controls.build/Debug-watchos/AUv3Controls.build/Objects-normal/arm64_32/CheckedToggleStyle.swiftdeps -serialize-diagnostics-path /Users/admin/builder/spi-builder-workspace/.derivedData/Build/Intermediates.noindex/AUv3Controls.build/Debug-watchos/AUv3Controls.build/Objects-normal/arm64_32/CheckedToggleStyle.dia -target arm64_32-apple-watchos10.0 -enable-objc-interop -sdk /Applications/Xcode-16.2.0.app/Contents/Developer/Platforms/WatchOS.platform/Developer/SDKs/WatchOS11.2.sdk -I /Users/admin/builder/spi-builder-workspace/.derivedData/Build/Products/Debug-watchos -I /Applications/Xcode-16.2.0.app/Contents/Developer/Platforms/WatchOS.platform/Developer/usr/lib -F /Users/admin/builder/spi-builder-workspace/.derivedData/Build/Products/Debug-watchos/PackageFrameworks -F /Users/admin/builder/spi-builder-workspace/.derivedData/Build/Products/Debug-watchos/PackageFrameworks -F /Users/admin/builder/spi-builder-workspace/.derivedData/Build/Products/Debug-watchos/PackageFrameworks -F /Users/admin/builder/spi-builder-workspace/.derivedData/Build/Products/Debug-watchos/PackageFrameworks -F /Users/admin/builder/spi-builder-workspace/.derivedData/Build/Products/Debug-watchos/PackageFrameworks -F /Users/admin/builder/spi-builder-workspace/.derivedData/Build/Products/Debug-watchos/PackageFrameworks -F /Users/admin/builder/spi-builder-workspace/.derivedData/Build/Products/Debug-watchos/PackageFrameworks -F /Users/admin/builder/spi-builder-workspace/.derivedData/Build/Products/Debug-watchos/PackageFrameworks -F /Users/admin/builder/spi-builder-workspace/.derivedData/Build/Products/Debug-watchos/PackageFrameworks -F /Users/admin/builder/spi-builder-workspace/.derivedData/Build/Products/Debug-watchos/PackageFrameworks -F /Users/admin/builder/spi-builder-workspace/.derivedData/Build/Products/Debug-watchos/PackageFrameworks -F /Users/admin/builder/spi-builder-workspace/.derivedData/Build/Products/Debug-watchos/PackageFrameworks -F /Users/admin/builder/spi-builder-workspace/.derivedData/Build/Products/Debug-watchos/PackageFrameworks -F /Users/admin/builder/spi-builder-workspace/.derivedData/Build/Products/Debug-watchos/PackageFrameworks -F /Users/admin/builder/spi-builder-workspace/.derivedData/Build/Products/Debug-watchos/PackageFrameworks -F /Users/admin/builder/spi-builder-workspace/.derivedData/Build/Products/Debug-watchos/PackageFrameworks -F /Users/admin/builder/spi-builder-workspace/.derivedData/Build/Products/Debug-watchos/PackageFrameworks -F /Users/admin/builder/spi-builder-workspace/.derivedData/Build/Products/Debug-watchos/PackageFrameworks -F /Users/admin/builder/spi-builder-workspace/.derivedData/Build/Products/Debug-watchos/PackageFrameworks -F /Users/admin/builder/spi-builder-workspace/.derivedData/Build/Products/Debug-watchos/PackageFrameworks -F /Users/admin/builder/spi-builder-workspace/.derivedData/Build/Products/Debug-watchos/PackageFrameworks -F /Users/admin/builder/spi-builder-workspace/.derivedData/Build/Products/Debug-watchos/PackageFrameworks -F /Users/admin/builder/spi-builder-workspace/.derivedData/Build/Products/Debug-watchos/PackageFrameworks -F /Users/admin/builder/spi-builder-workspace/.derivedData/Build/Products/Debug-watchos/PackageFrameworks -F /Users/admin/builder/spi-builder-workspace/.derivedData/Build/Products/Debug-watchos/PackageFrameworks -F /Users/admin/builder/spi-builder-workspace/.derivedData/Build/Products/Debug-watchos -F /Applications/Xcode-16.2.0.app/Contents/Developer/Platforms/WatchOS.platform/Developer/Library/Frameworks -F /Applications/Xcode-16.2.0.app/Contents/Developer/Platforms/WatchOS.platform/Developer/SDKs/WatchOS11.2.sdk/Developer/Library/Frameworks -no-color-diagnostics -enable-testing -g -debug-info-format\=dwarf -dwarf-version\=4 -module-cache-path /Users/admin/builder/spi-builder-workspace/.derivedData/ModuleCache.noindex -profile-generate -profile-coverage-mapping -swift-version 6 -enforce-exclusivity\=checked -Onone -D SWIFT_PACKAGE -D DEBUG -D Xcode -serialize-debugging-options -load-plugin-executable /Users/admin/builder/spi-builder-workspace/.derivedData/Build/Products/Debug/CasePathsMacros\#CasePathsMacros -load-plugin-executable /Users/admin/builder/spi-builder-workspace/.derivedData/Build/Products/Debug/ComposableArchitectureMacros\#ComposableArchitectureMacros -load-plugin-executable /Users/admin/builder/spi-builder-workspace/.derivedData/Build/Products/Debug/DependenciesMacrosPlugin\#DependenciesMacrosPlugin -load-plugin-executable /Users/admin/builder/spi-builder-workspace/.derivedData/Build/Products/Debug/PerceptionMacros\#PerceptionMacros -const-gather-protocols-file /Users/admin/builder/spi-builder-workspace/.derivedData/Build/Intermediates.noindex/AUv3Controls.build/Debug-watchos/AUv3Controls.build/Objects-normal/arm64_32/AUv3Controls_const_extract_protocols.json -enable-experimental-feature StrictConcurrency\=complete -enable-experimental-feature DebugDescriptionMacro -enable-experimental-feature OpaqueTypeErasure -empty-abi-descriptor -plugin-path /Applications/Xcode-16.2.0.app/Contents/Developer/Toolchains/XcodeDefault.xctoolchain/usr/lib/swift/host/plugins/testing -validate-clang-modules-once -clang-build-session-file /Users/admin/builder/spi-builder-workspace/.derivedData/ModuleCache.noindex/Session.modulevalidation -Xcc -working-directory -Xcc /Users/admin/builder/spi-builder-workspace/.swiftpm/xcode -resource-dir /Applications/Xcode-16.2.0.app/Contents/Developer/Toolchains/XcodeDefault.xctoolchain/usr/lib/swift -enable-anonymous-context-mangled-names -file-compilation-dir /Users/admin/builder/spi-builder-workspace/.swiftpm/xcode -Xcc -fmodule-map-file\=/Users/admin/builder/spi-builder-workspace/.derivedData/Build/Intermediates.noindex/GeneratedModuleMaps-watchos/UIKitNavigationShim.modulemap -Xcc -D_LIBCPP_HARDENING_MODE\=_LIBCPP_HARDENING_MODE_DEBUG -Xcc -ivfsstatcache -Xcc /Users/admin/builder/spi-builder-workspace/.derivedData/SDKStatCaches.noindex/watchos11.2-22S97-8cb5c683f5e64b0ecfc74e8d0065fbf6.sdkstatcache -Xcc -I/Users/admin/builder/spi-builder-workspace/.derivedData/Build/Intermediates.noindex/AUv3Controls.build/Debug-watchos/AUv3Controls.build/swift-overrides.hmap -Xcc -I/Users/admin/builder/spi-builder-workspace/.dependencies/checkouts/swift-navigation/Sources/UIKitNavigationShim/include -Xcc -I/Users/admin/builder/spi-builder-workspace/.derivedData/Build/Products/Debug-watchos/include -Xcc -I/Users/admin/builder/spi-builder-workspace/.derivedData/Build/Intermediates.noindex/AUv3Controls.build/Debug-watchos/AUv3Controls.build/DerivedSources-normal/arm64_32 -Xcc -I/Users/admin/builder/spi-builder-workspace/.derivedData/Build/Intermediates.noindex/AUv3Controls.build/Debug-watchos/AUv3Controls.build/DerivedSources/arm64_32 -Xcc -I/Users/admin/builder/spi-builder-workspace/.derivedData/Build/Intermediates.noindex/AUv3Controls.build/Debug-watchos/AUv3Controls.build/DerivedSources -Xcc -DSWIFT_PACKAGE -Xcc -DDEBUG\=1 -module-name AUv3Controls -package-name spi_builder_workspace -frontend-parseable-output -disable-clang-spi -target-sdk-version 11.2 -target-sdk-name watchos11.2 -external-plugin-path /Applications/Xcode-16.2.0.app/Contents/Developer/Platforms/WatchOS.platform/Developer/usr/lib/swift/host/plugins\#/Applications/Xcode-16.2.0.app/Contents/Developer/Platforms/WatchOS.platform/Developer/usr/bin/swift-plugin-server -external-plugin-path /Applications/Xcode-16.2.0.app/Contents/Developer/Platforms/WatchOS.platform/Developer/usr/local/lib/swift/host/plugins\#/Applications/Xcode-16.2.0.app/Contents/Developer/Platforms/WatchOS.platform/Developer/usr/bin/swift-plugin-server -plugin-path /Applications/Xcode-16.2.0.app/Contents/Developer/Toolchains/XcodeDefault.xctoolchain/usr/lib/swift/host/plugins -plugin-path /Applications/Xcode-16.2.0.app/Contents/Developer/Toolchains/XcodeDefault.xctoolchain/usr/local/lib/swift/host/plugins -o /Users/admin/builder/spi-builder-workspace/.derivedData/Build/Intermediates.noindex/AUv3Controls.build/Debug-watchos/AUv3Controls.build/Objects-normal/arm64_32/Theme.o -o /Users/admin/builder/spi-builder-workspace/.derivedData/Build/Intermediates.noindex/AUv3Controls.build/Debug-watchos/AUv3Controls.build/Objects-normal/arm64_32/CheckedToggleStyle.o -index-unit-output-path /AUv3Controls.build/Debug-watchos/AUv3Controls.build/Objects-normal/arm64_32/Theme.o -index-unit-output-path /AUv3Controls.build/Debug-watchos/AUv3Controls.build/Objects-normal/arm64_32/CheckedToggleStyle.o -index-store-path /Users/admin/builder/spi-builder-workspace/.derivedData/Index.noindex/DataStore -index-system-modules
SwiftCompile normal arm64_32 /Users/admin/builder/spi-builder-workspace/Sources/AUv3Controls/Toggle/CheckedToggleStyle.swift (in target 'AUv3Controls' from project 'AUv3Controls')
    cd /Users/admin/builder/spi-builder-workspace/.swiftpm/xcode
    /Applications/Xcode-16.2.0.app/Contents/Developer/Toolchains/XcodeDefault.xctoolchain/usr/bin/swift-frontend -c /Users/admin/builder/spi-builder-workspace/.derivedData/Build/Intermediates.noindex/AUv3Controls.build/Debug-watchos/AUv3Controls.build/DerivedSources/resource_bundle_accessor.swift /Users/admin/builder/spi-builder-workspace/Sources/AUv3Controls/Examples/Duality.swift /Users/admin/builder/spi-builder-workspace/Sources/AUv3Controls/Examples/Envelope.swift /Users/admin/builder/spi-builder-workspace/Sources/AUv3Controls/Extensions/AUParameter.swift /Users/admin/builder/spi-builder-workspace/Sources/AUv3Controls/Extensions/AUParameterTree.swift /Users/admin/builder/spi-builder-workspace/Sources/AUv3Controls/Extensions/Angle.swift /Users/admin/builder/spi-builder-workspace/Sources/AUv3Controls/Extensions/ClosedRange.swift /Users/admin/builder/spi-builder-workspace/Sources/AUv3Controls/Extensions/Color.swift /Users/admin/builder/spi-builder-workspace/Sources/AUv3Controls/Extensions/KeyPath.swift /Users/admin/builder/spi-builder-workspace/Sources/AUv3Controls/Extensions/UUID.swift /Users/admin/builder/spi-builder-workspace/Sources/AUv3Controls/Extensions/View.swift /Users/admin/builder/spi-builder-workspace/Sources/AUv3Controls/Knob/ControlFeature.swift /Users/admin/builder/spi-builder-workspace/Sources/AUv3Controls/Knob/EditorFeature.swift /Users/admin/builder/spi-builder-workspace/Sources/AUv3Controls/Knob/KnobConfig.swift /Users/admin/builder/spi-builder-workspace/Sources/AUv3Controls/Knob/KnobFeature.swift /Users/admin/builder/spi-builder-workspace/Sources/AUv3Controls/Knob/KnobValueFormatter.swift /Users/admin/builder/spi-builder-workspace/Sources/AUv3Controls/Knob/NormValueTransform.swift /Users/admin/builder/spi-builder-workspace/Sources/AUv3Controls/Knob/TitleFeature.swift /Users/admin/builder/spi-builder-workspace/Sources/AUv3Controls/Knob/TrackFeature.swift /Users/admin/builder/spi-builder-workspace/Sources/AUv3Controls/Support/Logger.swift -primary-file /Users/admin/builder/spi-builder-workspace/Sources/AUv3Controls/Theme.swift -primary-file /Users/admin/builder/spi-builder-workspace/Sources/AUv3Controls/Toggle/CheckedToggleStyle.swift /Users/admin/builder/spi-builder-workspace/Sources/AUv3Controls/Toggle/ToggleFeature.swift /Users/admin/builder/spi-builder-workspace/.derivedData/Build/Intermediates.noindex/AUv3Controls.build/Debug-watchos/AUv3Controls.build/DerivedSources/GeneratedAssetSymbols.swift -emit-dependencies-path /Users/admin/builder/spi-builder-workspace/.derivedData/Build/Intermediates.noindex/AUv3Controls.build/Debug-watchos/AUv3Controls.build/Objects-normal/arm64_32/Theme.d -emit-const-values-path /Users/admin/builder/spi-builder-workspace/.derivedData/Build/Intermediates.noindex/AUv3Controls.build/Debug-watchos/AUv3Controls.build/Objects-normal/arm64_32/Theme.swiftconstvalues -emit-reference-dependencies-path /Users/admin/builder/spi-builder-workspace/.derivedData/Build/Intermediates.noindex/AUv3Controls.build/Debug-watchos/AUv3Controls.build/Objects-normal/arm64_32/Theme.swiftdeps -serialize-diagnostics-path /Users/admin/builder/spi-builder-workspace/.derivedData/Build/Intermediates.noindex/AUv3Controls.build/Debug-watchos/AUv3Controls.build/Objects-normal/arm64_32/Theme.dia -emit-dependencies-path /Users/admin/builder/spi-builder-workspace/.derivedData/Build/Intermediates.noindex/AUv3Controls.build/Debug-watchos/AUv3Controls.build/Objects-normal/arm64_32/CheckedToggleStyle.d -emit-const-values-path /Users/admin/builder/spi-builder-workspace/.derivedData/Build/Intermediates.noindex/AUv3Controls.build/Debug-watchos/AUv3Controls.build/Objects-normal/arm64_32/CheckedToggleStyle.swiftconstvalues -emit-reference-dependencies-path /Users/admin/builder/spi-builder-workspace/.derivedData/Build/Intermediates.noindex/AUv3Controls.build/Debug-watchos/AUv3Controls.build/Objects-normal/arm64_32/CheckedToggleStyle.swiftdeps -serialize-diagnostics-path /Users/admin/builder/spi-builder-workspace/.derivedData/Build/Intermediates.noindex/AUv3Controls.build/Debug-watchos/AUv3Controls.build/Objects-normal/arm64_32/CheckedToggleStyle.dia -target arm64_32-apple-watchos10.0 -enable-objc-interop -sdk /Applications/Xcode-16.2.0.app/Contents/Developer/Platforms/WatchOS.platform/Developer/SDKs/WatchOS11.2.sdk -I /Users/admin/builder/spi-builder-workspace/.derivedData/Build/Products/Debug-watchos -I /Applications/Xcode-16.2.0.app/Contents/Developer/Platforms/WatchOS.platform/Developer/usr/lib -F /Users/admin/builder/spi-builder-workspace/.derivedData/Build/Products/Debug-watchos/PackageFrameworks -F /Users/admin/builder/spi-builder-workspace/.derivedData/Build/Products/Debug-watchos/PackageFrameworks -F /Users/admin/builder/spi-builder-workspace/.derivedData/Build/Products/Debug-watchos/PackageFrameworks -F /Users/admin/builder/spi-builder-workspace/.derivedData/Build/Products/Debug-watchos/PackageFrameworks -F /Users/admin/builder/spi-builder-workspace/.derivedData/Build/Products/Debug-watchos/PackageFrameworks -F /Users/admin/builder/spi-builder-workspace/.derivedData/Build/Products/Debug-watchos/PackageFrameworks -F /Users/admin/builder/spi-builder-workspace/.derivedData/Build/Products/Debug-watchos/PackageFrameworks -F /Users/admin/builder/spi-builder-workspace/.derivedData/Build/Products/Debug-watchos/PackageFrameworks -F /Users/admin/builder/spi-builder-workspace/.derivedData/Build/Products/Debug-watchos/PackageFrameworks -F /Users/admin/builder/spi-builder-workspace/.derivedData/Build/Products/Debug-watchos/PackageFrameworks -F /Users/admin/builder/spi-builder-workspace/.derivedData/Build/Products/Debug-watchos/PackageFrameworks -F /Users/admin/builder/spi-builder-workspace/.derivedData/Build/Products/Debug-watchos/PackageFrameworks -F /Users/admin/builder/spi-builder-workspace/.derivedData/Build/Products/Debug-watchos/PackageFrameworks -F /Users/admin/builder/spi-builder-workspace/.derivedData/Build/Products/Debug-watchos/PackageFrameworks -F /Users/admin/builder/spi-builder-workspace/.derivedData/Build/Products/Debug-watchos/PackageFrameworks -F /Users/admin/builder/spi-builder-workspace/.derivedData/Build/Products/Debug-watchos/PackageFrameworks -F /Users/admin/builder/spi-builder-workspace/.derivedData/Build/Products/Debug-watchos/PackageFrameworks -F /Users/admin/builder/spi-builder-workspace/.derivedData/Build/Products/Debug-watchos/PackageFrameworks -F /Users/admin/builder/spi-builder-workspace/.derivedData/Build/Products/Debug-watchos/PackageFrameworks -F /Users/admin/builder/spi-builder-workspace/.derivedData/Build/Products/Debug-watchos/PackageFrameworks -F /Users/admin/builder/spi-builder-workspace/.derivedData/Build/Products/Debug-watchos/PackageFrameworks -F /Users/admin/builder/spi-builder-workspace/.derivedData/Build/Products/Debug-watchos/PackageFrameworks -F /Users/admin/builder/spi-builder-workspace/.derivedData/Build/Products/Debug-watchos/PackageFrameworks -F /Users/admin/builder/spi-builder-workspace/.derivedData/Build/Products/Debug-watchos/PackageFrameworks -F /Users/admin/builder/spi-builder-workspace/.derivedData/Build/Products/Debug-watchos/PackageFrameworks -F /Users/admin/builder/spi-builder-workspace/.derivedData/Build/Products/Debug-watchos -F /Applications/Xcode-16.2.0.app/Contents/Developer/Platforms/WatchOS.platform/Developer/Library/Frameworks -F /Applications/Xcode-16.2.0.app/Contents/Developer/Platforms/WatchOS.platform/Developer/SDKs/WatchOS11.2.sdk/Developer/Library/Frameworks -no-color-diagnostics -enable-testing -g -debug-info-format\=dwarf -dwarf-version\=4 -module-cache-path /Users/admin/builder/spi-builder-workspace/.derivedData/ModuleCache.noindex -profile-generate -profile-coverage-mapping -swift-version 6 -enforce-exclusivity\=checked -Onone -D SWIFT_PACKAGE -D DEBUG -D Xcode -serialize-debugging-options -load-plugin-executable /Users/admin/builder/spi-builder-workspace/.derivedData/Build/Products/Debug/CasePathsMacros\#CasePathsMacros -load-plugin-executable /Users/admin/builder/spi-builder-workspace/.derivedData/Build/Products/Debug/ComposableArchitectureMacros\#ComposableArchitectureMacros -load-plugin-executable /Users/admin/builder/spi-builder-workspace/.derivedData/Build/Products/Debug/DependenciesMacrosPlugin\#DependenciesMacrosPlugin -load-plugin-executable /Users/admin/builder/spi-builder-workspace/.derivedData/Build/Products/Debug/PerceptionMacros\#PerceptionMacros -const-gather-protocols-file /Users/admin/builder/spi-builder-workspace/.derivedData/Build/Intermediates.noindex/AUv3Controls.build/Debug-watchos/AUv3Controls.build/Objects-normal/arm64_32/AUv3Controls_const_extract_protocols.json -enable-experimental-feature StrictConcurrency\=complete -enable-experimental-feature DebugDescriptionMacro -enable-experimental-feature OpaqueTypeErasure -empty-abi-descriptor -plugin-path /Applications/Xcode-16.2.0.app/Contents/Developer/Toolchains/XcodeDefault.xctoolchain/usr/lib/swift/host/plugins/testing -validate-clang-modules-once -clang-build-session-file /Users/admin/builder/spi-builder-workspace/.derivedData/ModuleCache.noindex/Session.modulevalidation -Xcc -working-directory -Xcc /Users/admin/builder/spi-builder-workspace/.swiftpm/xcode -resource-dir /Applications/Xcode-16.2.0.app/Contents/Developer/Toolchains/XcodeDefault.xctoolchain/usr/lib/swift -enable-anonymous-context-mangled-names -file-compilation-dir /Users/admin/builder/spi-builder-workspace/.swiftpm/xcode -Xcc -fmodule-map-file\=/Users/admin/builder/spi-builder-workspace/.derivedData/Build/Intermediates.noindex/GeneratedModuleMaps-watchos/UIKitNavigationShim.modulemap -Xcc -D_LIBCPP_HARDENING_MODE\=_LIBCPP_HARDENING_MODE_DEBUG -Xcc -ivfsstatcache -Xcc /Users/admin/builder/spi-builder-workspace/.derivedData/SDKStatCaches.noindex/watchos11.2-22S97-8cb5c683f5e64b0ecfc74e8d0065fbf6.sdkstatcache -Xcc -I/Users/admin/builder/spi-builder-workspace/.derivedData/Build/Intermediates.noindex/AUv3Controls.build/Debug-watchos/AUv3Controls.build/swift-overrides.hmap -Xcc -I/Users/admin/builder/spi-builder-workspace/.dependencies/checkouts/swift-navigation/Sources/UIKitNavigationShim/include -Xcc -I/Users/admin/builder/spi-builder-workspace/.derivedData/Build/Products/Debug-watchos/include -Xcc -I/Users/admin/builder/spi-builder-workspace/.derivedData/Build/Intermediates.noindex/AUv3Controls.build/Debug-watchos/AUv3Controls.build/DerivedSources-normal/arm64_32 -Xcc -I/Users/admin/builder/spi-builder-workspace/.derivedData/Build/Intermediates.noindex/AUv3Controls.build/Debug-watchos/AUv3Controls.build/DerivedSources/arm64_32 -Xcc -I/Users/admin/builder/spi-builder-workspace/.derivedData/Build/Intermediates.noindex/AUv3Controls.build/Debug-watchos/AUv3Controls.build/DerivedSources -Xcc -DSWIFT_PACKAGE -Xcc -DDEBUG\=1 -module-name AUv3Controls -package-name spi_builder_workspace -frontend-parseable-output -disable-clang-spi -target-sdk-version 11.2 -target-sdk-name watchos11.2 -external-plugin-path /Applications/Xcode-16.2.0.app/Contents/Developer/Platforms/WatchOS.platform/Developer/usr/lib/swift/host/plugins\#/Applications/Xcode-16.2.0.app/Contents/Developer/Platforms/WatchOS.platform/Developer/usr/bin/swift-plugin-server -external-plugin-path /Applications/Xcode-16.2.0.app/Contents/Developer/Platforms/WatchOS.platform/Developer/usr/local/lib/swift/host/plugins\#/Applications/Xcode-16.2.0.app/Contents/Developer/Platforms/WatchOS.platform/Developer/usr/bin/swift-plugin-server -plugin-path /Applications/Xcode-16.2.0.app/Contents/Developer/Toolchains/XcodeDefault.xctoolchain/usr/lib/swift/host/plugins -plugin-path /Applications/Xcode-16.2.0.app/Contents/Developer/Toolchains/XcodeDefault.xctoolchain/usr/local/lib/swift/host/plugins -o /Users/admin/builder/spi-builder-workspace/.derivedData/Build/Intermediates.noindex/AUv3Controls.build/Debug-watchos/AUv3Controls.build/Objects-normal/arm64_32/Theme.o -o /Users/admin/builder/spi-builder-workspace/.derivedData/Build/Intermediates.noindex/AUv3Controls.build/Debug-watchos/AUv3Controls.build/Objects-normal/arm64_32/CheckedToggleStyle.o -index-unit-output-path /AUv3Controls.build/Debug-watchos/AUv3Controls.build/Objects-normal/arm64_32/Theme.o -index-unit-output-path /AUv3Controls.build/Debug-watchos/AUv3Controls.build/Objects-normal/arm64_32/CheckedToggleStyle.o -index-store-path /Users/admin/builder/spi-builder-workspace/.derivedData/Index.noindex/DataStore -index-system-modules
SwiftCompile normal arm64 Compiling\ NormValueTransform.swift,\ TitleFeature.swift /Users/admin/builder/spi-builder-workspace/Sources/AUv3Controls/Knob/NormValueTransform.swift /Users/admin/builder/spi-builder-workspace/Sources/AUv3Controls/Knob/TitleFeature.swift (in target 'AUv3Controls' from project 'AUv3Controls')
    cd /Users/admin/builder/spi-builder-workspace/.swiftpm/xcode
    builtin-swiftTaskExecution -- /Applications/Xcode-16.2.0.app/Contents/Developer/Toolchains/XcodeDefault.xctoolchain/usr/bin/swift-frontend -frontend -c /Users/admin/builder/spi-builder-workspace/.derivedData/Build/Intermediates.noindex/AUv3Controls.build/Debug-watchos/AUv3Controls.build/DerivedSources/resource_bundle_accessor.swift /Users/admin/builder/spi-builder-workspace/Sources/AUv3Controls/Examples/Duality.swift /Users/admin/builder/spi-builder-workspace/Sources/AUv3Controls/Examples/Envelope.swift /Users/admin/builder/spi-builder-workspace/Sources/AUv3Controls/Extensions/AUParameter.swift /Users/admin/builder/spi-builder-workspace/Sources/AUv3Controls/Extensions/AUParameterTree.swift /Users/admin/builder/spi-builder-workspace/Sources/AUv3Controls/Extensions/Angle.swift /Users/admin/builder/spi-builder-workspace/Sources/AUv3Controls/Extensions/ClosedRange.swift /Users/admin/builder/spi-builder-workspace/Sources/AUv3Controls/Extensions/Color.swift /Users/admin/builder/spi-builder-workspace/Sources/AUv3Controls/Extensions/KeyPath.swift /Users/admin/builder/spi-builder-workspace/Sources/AUv3Controls/Extensions/UUID.swift /Users/admin/builder/spi-builder-workspace/Sources/AUv3Controls/Extensions/View.swift /Users/admin/builder/spi-builder-workspace/Sources/AUv3Controls/Knob/ControlFeature.swift /Users/admin/builder/spi-builder-workspace/Sources/AUv3Controls/Knob/EditorFeature.swift /Users/admin/builder/spi-builder-workspace/Sources/AUv3Controls/Knob/KnobConfig.swift /Users/admin/builder/spi-builder-workspace/Sources/AUv3Controls/Knob/KnobFeature.swift /Users/admin/builder/spi-builder-workspace/Sources/AUv3Controls/Knob/KnobValueFormatter.swift -primary-file /Users/admin/builder/spi-builder-workspace/Sources/AUv3Controls/Knob/NormValueTransform.swift -primary-file /Users/admin/builder/spi-builder-workspace/Sources/AUv3Controls/Knob/TitleFeature.swift /Users/admin/builder/spi-builder-workspace/Sources/AUv3Controls/Knob/TrackFeature.swift /Users/admin/builder/spi-builder-workspace/Sources/AUv3Controls/Support/Logger.swift /Users/admin/builder/spi-builder-workspace/Sources/AUv3Controls/Theme.swift /Users/admin/builder/spi-builder-workspace/Sources/AUv3Controls/Toggle/CheckedToggleStyle.swift /Users/admin/builder/spi-builder-workspace/Sources/AUv3Controls/Toggle/ToggleFeature.swift /Users/admin/builder/spi-builder-workspace/.derivedData/Build/Intermediates.noindex/AUv3Controls.build/Debug-watchos/AUv3Controls.build/DerivedSources/GeneratedAssetSymbols.swift -emit-dependencies-path /Users/admin/builder/spi-builder-workspace/.derivedData/Build/Intermediates.noindex/AUv3Controls.build/Debug-watchos/AUv3Controls.build/Objects-normal/arm64/NormValueTransform.d -emit-const-values-path /Users/admin/builder/spi-builder-workspace/.derivedData/Build/Intermediates.noindex/AUv3Controls.build/Debug-watchos/AUv3Controls.build/Objects-normal/arm64/NormValueTransform.swiftconstvalues -emit-reference-dependencies-path /Users/admin/builder/spi-builder-workspace/.derivedData/Build/Intermediates.noindex/AUv3Controls.build/Debug-watchos/AUv3Controls.build/Objects-normal/arm64/NormValueTransform.swiftdeps -serialize-diagnostics-path /Users/admin/builder/spi-builder-workspace/.derivedData/Build/Intermediates.noindex/AUv3Controls.build/Debug-watchos/AUv3Controls.build/Objects-normal/arm64/NormValueTransform.dia -emit-dependencies-path /Users/admin/builder/spi-builder-workspace/.derivedData/Build/Intermediates.noindex/AUv3Controls.build/Debug-watchos/AUv3Controls.build/Objects-normal/arm64/TitleFeature.d -emit-const-values-path /Users/admin/builder/spi-builder-workspace/.derivedData/Build/Intermediates.noindex/AUv3Controls.build/Debug-watchos/AUv3Controls.build/Objects-normal/arm64/TitleFeature.swiftconstvalues -emit-reference-dependencies-path /Users/admin/builder/spi-builder-workspace/.derivedData/Build/Intermediates.noindex/AUv3Controls.build/Debug-watchos/AUv3Controls.build/Objects-normal/arm64/TitleFeature.swiftdeps -serialize-diagnostics-path /Users/admin/builder/spi-builder-workspace/.derivedData/Build/Intermediates.noindex/AUv3Controls.build/Debug-watchos/AUv3Controls.build/Objects-normal/arm64/TitleFeature.dia -target arm64-apple-watchos10.0 -Xllvm -aarch64-use-tbi -enable-objc-interop -stack-check -sdk /Applications/Xcode-16.2.0.app/Contents/Developer/Platforms/WatchOS.platform/Developer/SDKs/WatchOS11.2.sdk -I /Users/admin/builder/spi-builder-workspace/.derivedData/Build/Products/Debug-watchos -I /Applications/Xcode-16.2.0.app/Contents/Developer/Platforms/WatchOS.platform/Developer/usr/lib -F /Users/admin/builder/spi-builder-workspace/.derivedData/Build/Products/Debug-watchos/PackageFrameworks -F /Users/admin/builder/spi-builder-workspace/.derivedData/Build/Products/Debug-watchos/PackageFrameworks -F /Users/admin/builder/spi-builder-workspace/.derivedData/Build/Products/Debug-watchos/PackageFrameworks -F /Users/admin/builder/spi-builder-workspace/.derivedData/Build/Products/Debug-watchos/PackageFrameworks -F /Users/admin/builder/spi-builder-workspace/.derivedData/Build/Products/Debug-watchos/PackageFrameworks -F /Users/admin/builder/spi-builder-workspace/.derivedData/Build/Products/Debug-watchos/PackageFrameworks -F /Users/admin/builder/spi-builder-workspace/.derivedData/Build/Products/Debug-watchos/PackageFrameworks -F /Users/admin/builder/spi-builder-workspace/.derivedData/Build/Products/Debug-watchos/PackageFrameworks -F /Users/admin/builder/spi-builder-workspace/.derivedData/Build/Products/Debug-watchos/PackageFrameworks -F /Users/admin/builder/spi-builder-workspace/.derivedData/Build/Products/Debug-watchos/PackageFrameworks -F /Users/admin/builder/spi-builder-workspace/.derivedData/Build/Products/Debug-watchos/PackageFrameworks -F /Users/admin/builder/spi-builder-workspace/.derivedData/Build/Products/Debug-watchos/PackageFrameworks -F /Users/admin/builder/spi-builder-workspace/.derivedData/Build/Products/Debug-watchos/PackageFrameworks -F /Users/admin/builder/spi-builder-workspace/.derivedData/Build/Products/Debug-watchos/PackageFrameworks -F /Users/admin/builder/spi-builder-workspace/.derivedData/Build/Products/Debug-watchos/PackageFrameworks -F /Users/admin/builder/spi-builder-workspace/.derivedData/Build/Products/Debug-watchos/PackageFrameworks -F /Users/admin/builder/spi-builder-workspace/.derivedData/Build/Products/Debug-watchos/PackageFrameworks -F /Users/admin/builder/spi-builder-workspace/.derivedData/Build/Products/Debug-watchos/PackageFrameworks -F /Users/admin/builder/spi-builder-workspace/.derivedData/Build/Products/Debug-watchos/PackageFrameworks -F /Users/admin/builder/spi-builder-workspace/.derivedData/Build/Products/Debug-watchos/PackageFrameworks -F /Users/admin/builder/spi-builder-workspace/.derivedData/Build/Products/Debug-watchos/PackageFrameworks -F /Users/admin/builder/spi-builder-workspace/.derivedData/Build/Products/Debug-watchos/PackageFrameworks -F /Users/admin/builder/spi-builder-workspace/.derivedData/Build/Products/Debug-watchos/PackageFrameworks -F /Users/admin/builder/spi-builder-workspace/.derivedData/Build/Products/Debug-watchos/PackageFrameworks -F /Users/admin/builder/spi-builder-workspace/.derivedData/Build/Products/Debug-watchos/PackageFrameworks -F /Users/admin/builder/spi-builder-workspace/.derivedData/Build/Products/Debug-watchos -F /Applications/Xcode-16.2.0.app/Contents/Developer/Platforms/WatchOS.platform/Developer/Library/Frameworks -F /Applications/Xcode-16.2.0.app/Contents/Developer/Platforms/WatchOS.platform/Developer/SDKs/WatchOS11.2.sdk/Developer/Library/Frameworks -no-color-diagnostics -enable-testing -g -debug-info-format\=dwarf -dwarf-version\=4 -module-cache-path /Users/admin/builder/spi-builder-workspace/.derivedData/ModuleCache.noindex -profile-generate -profile-coverage-mapping -swift-version 6 -enforce-exclusivity\=checked -Onone -D SWIFT_PACKAGE -D DEBUG -D Xcode -serialize-debugging-options -load-plugin-executable /Users/admin/builder/spi-builder-workspace/.derivedData/Build/Products/Debug/CasePathsMacros\#CasePathsMacros -load-plugin-executable /Users/admin/builder/spi-builder-workspace/.derivedData/Build/Products/Debug/ComposableArchitectureMacros\#ComposableArchitectureMacros -load-plugin-executable /Users/admin/builder/spi-builder-workspace/.derivedData/Build/Products/Debug/DependenciesMacrosPlugin\#DependenciesMacrosPlugin -load-plugin-executable /Users/admin/builder/spi-builder-workspace/.derivedData/Build/Products/Debug/PerceptionMacros\#PerceptionMacros -const-gather-protocols-file /Users/admin/builder/spi-builder-workspace/.derivedData/Build/Intermediates.noindex/AUv3Controls.build/Debug-watchos/AUv3Controls.build/Objects-normal/arm64/AUv3Controls_const_extract_protocols.json -enable-experimental-feature StrictConcurrency\=complete -enable-experimental-feature DebugDescriptionMacro -enable-experimental-feature OpaqueTypeErasure -empty-abi-descriptor -plugin-path /Applications/Xcode-16.2.0.app/Contents/Developer/Toolchains/XcodeDefault.xctoolchain/usr/lib/swift/host/plugins/testing -validate-clang-modules-once -clang-build-session-file /Users/admin/builder/spi-builder-workspace/.derivedData/ModuleCache.noindex/Session.modulevalidation -Xcc -working-directory -Xcc /Users/admin/builder/spi-builder-workspace/.swiftpm/xcode -resource-dir /Applications/Xcode-16.2.0.app/Contents/Developer/Toolchains/XcodeDefault.xctoolchain/usr/lib/swift -enable-anonymous-context-mangled-names -file-compilation-dir /Users/admin/builder/spi-builder-workspace/.swiftpm/xcode -Xcc -fmodule-map-file\=/Users/admin/builder/spi-builder-workspace/.derivedData/Build/Intermediates.noindex/GeneratedModuleMaps-watchos/UIKitNavigationShim.modulemap -Xcc -D_LIBCPP_HARDENING_MODE\=_LIBCPP_HARDENING_MODE_DEBUG -Xcc -ivfsstatcache -Xcc /Users/admin/builder/spi-builder-workspace/.derivedData/SDKStatCaches.noindex/watchos11.2-22S97-8cb5c683f5e64b0ecfc74e8d0065fbf6.sdkstatcache -Xcc -I/Users/admin/builder/spi-builder-workspace/.derivedData/Build/Intermediates.noindex/AUv3Controls.build/Debug-watchos/AUv3Controls.build/swift-overrides.hmap -Xcc -I/Users/admin/builder/spi-builder-workspace/.dependencies/checkouts/swift-navigation/Sources/UIKitNavigationShim/include -Xcc -I/Users/admin/builder/spi-builder-workspace/.derivedData/Build/Products/Debug-watchos/include -Xcc -I/Users/admin/builder/spi-builder-workspace/.derivedData/Build/Intermediates.noindex/AUv3Controls.build/Debug-watchos/AUv3Controls.build/DerivedSources-normal/arm64 -Xcc -I/Users/admin/builder/spi-builder-workspace/.derivedData/Build/Intermediates.noindex/AUv3Controls.build/Debug-watchos/AUv3Controls.build/DerivedSources/arm64 -Xcc -I/Users/admin/builder/spi-builder-workspace/.derivedData/Build/Intermediates.noindex/AUv3Controls.build/Debug-watchos/AUv3Controls.build/DerivedSources -Xcc -DSWIFT_PACKAGE -Xcc -DDEBUG\=1 -module-name AUv3Controls -package-name spi_builder_workspace -frontend-parseable-output -disable-clang-spi -target-sdk-version 11.2 -target-sdk-name watchos11.2 -external-plugin-path /Applications/Xcode-16.2.0.app/Contents/Developer/Platforms/WatchOS.platform/Developer/usr/lib/swift/host/plugins\#/Applications/Xcode-16.2.0.app/Contents/Developer/Platforms/WatchOS.platform/Developer/usr/bin/swift-plugin-server -external-plugin-path /Applications/Xcode-16.2.0.app/Contents/Developer/Platforms/WatchOS.platform/Developer/usr/local/lib/swift/host/plugins\#/Applications/Xcode-16.2.0.app/Contents/Developer/Platforms/WatchOS.platform/Developer/usr/bin/swift-plugin-server -plugin-path /Applications/Xcode-16.2.0.app/Contents/Developer/Toolchains/XcodeDefault.xctoolchain/usr/lib/swift/host/plugins -plugin-path /Applications/Xcode-16.2.0.app/Contents/Developer/Toolchains/XcodeDefault.xctoolchain/usr/local/lib/swift/host/plugins -o /Users/admin/builder/spi-builder-workspace/.derivedData/Build/Intermediates.noindex/AUv3Controls.build/Debug-watchos/AUv3Controls.build/Objects-normal/arm64/NormValueTransform.o -o /Users/admin/builder/spi-builder-workspace/.derivedData/Build/Intermediates.noindex/AUv3Controls.build/Debug-watchos/AUv3Controls.build/Objects-normal/arm64/TitleFeature.o -index-unit-output-path /AUv3Controls.build/Debug-watchos/AUv3Controls.build/Objects-normal/arm64/NormValueTransform.o -index-unit-output-path /AUv3Controls.build/Debug-watchos/AUv3Controls.build/Objects-normal/arm64/TitleFeature.o -index-store-path /Users/admin/builder/spi-builder-workspace/.derivedData/Index.noindex/DataStore -index-system-modules
SwiftCompile normal arm64 /Users/admin/builder/spi-builder-workspace/Sources/AUv3Controls/Knob/NormValueTransform.swift (in target 'AUv3Controls' from project 'AUv3Controls')
    cd /Users/admin/builder/spi-builder-workspace/.swiftpm/xcode
    /Applications/Xcode-16.2.0.app/Contents/Developer/Toolchains/XcodeDefault.xctoolchain/usr/bin/swift-frontend -c /Users/admin/builder/spi-builder-workspace/.derivedData/Build/Intermediates.noindex/AUv3Controls.build/Debug-watchos/AUv3Controls.build/DerivedSources/resource_bundle_accessor.swift /Users/admin/builder/spi-builder-workspace/Sources/AUv3Controls/Examples/Duality.swift /Users/admin/builder/spi-builder-workspace/Sources/AUv3Controls/Examples/Envelope.swift /Users/admin/builder/spi-builder-workspace/Sources/AUv3Controls/Extensions/AUParameter.swift /Users/admin/builder/spi-builder-workspace/Sources/AUv3Controls/Extensions/AUParameterTree.swift /Users/admin/builder/spi-builder-workspace/Sources/AUv3Controls/Extensions/Angle.swift /Users/admin/builder/spi-builder-workspace/Sources/AUv3Controls/Extensions/ClosedRange.swift /Users/admin/builder/spi-builder-workspace/Sources/AUv3Controls/Extensions/Color.swift /Users/admin/builder/spi-builder-workspace/Sources/AUv3Controls/Extensions/KeyPath.swift /Users/admin/builder/spi-builder-workspace/Sources/AUv3Controls/Extensions/UUID.swift /Users/admin/builder/spi-builder-workspace/Sources/AUv3Controls/Extensions/View.swift /Users/admin/builder/spi-builder-workspace/Sources/AUv3Controls/Knob/ControlFeature.swift /Users/admin/builder/spi-builder-workspace/Sources/AUv3Controls/Knob/EditorFeature.swift /Users/admin/builder/spi-builder-workspace/Sources/AUv3Controls/Knob/KnobConfig.swift /Users/admin/builder/spi-builder-workspace/Sources/AUv3Controls/Knob/KnobFeature.swift /Users/admin/builder/spi-builder-workspace/Sources/AUv3Controls/Knob/KnobValueFormatter.swift -primary-file /Users/admin/builder/spi-builder-workspace/Sources/AUv3Controls/Knob/NormValueTransform.swift -primary-file /Users/admin/builder/spi-builder-workspace/Sources/AUv3Controls/Knob/TitleFeature.swift /Users/admin/builder/spi-builder-workspace/Sources/AUv3Controls/Knob/TrackFeature.swift /Users/admin/builder/spi-builder-workspace/Sources/AUv3Controls/Support/Logger.swift /Users/admin/builder/spi-builder-workspace/Sources/AUv3Controls/Theme.swift /Users/admin/builder/spi-builder-workspace/Sources/AUv3Controls/Toggle/CheckedToggleStyle.swift /Users/admin/builder/spi-builder-workspace/Sources/AUv3Controls/Toggle/ToggleFeature.swift /Users/admin/builder/spi-builder-workspace/.derivedData/Build/Intermediates.noindex/AUv3Controls.build/Debug-watchos/AUv3Controls.build/DerivedSources/GeneratedAssetSymbols.swift -emit-dependencies-path /Users/admin/builder/spi-builder-workspace/.derivedData/Build/Intermediates.noindex/AUv3Controls.build/Debug-watchos/AUv3Controls.build/Objects-normal/arm64/NormValueTransform.d -emit-const-values-path /Users/admin/builder/spi-builder-workspace/.derivedData/Build/Intermediates.noindex/AUv3Controls.build/Debug-watchos/AUv3Controls.build/Objects-normal/arm64/NormValueTransform.swiftconstvalues -emit-reference-dependencies-path /Users/admin/builder/spi-builder-workspace/.derivedData/Build/Intermediates.noindex/AUv3Controls.build/Debug-watchos/AUv3Controls.build/Objects-normal/arm64/NormValueTransform.swiftdeps -serialize-diagnostics-path /Users/admin/builder/spi-builder-workspace/.derivedData/Build/Intermediates.noindex/AUv3Controls.build/Debug-watchos/AUv3Controls.build/Objects-normal/arm64/NormValueTransform.dia -emit-dependencies-path /Users/admin/builder/spi-builder-workspace/.derivedData/Build/Intermediates.noindex/AUv3Controls.build/Debug-watchos/AUv3Controls.build/Objects-normal/arm64/TitleFeature.d -emit-const-values-path /Users/admin/builder/spi-builder-workspace/.derivedData/Build/Intermediates.noindex/AUv3Controls.build/Debug-watchos/AUv3Controls.build/Objects-normal/arm64/TitleFeature.swiftconstvalues -emit-reference-dependencies-path /Users/admin/builder/spi-builder-workspace/.derivedData/Build/Intermediates.noindex/AUv3Controls.build/Debug-watchos/AUv3Controls.build/Objects-normal/arm64/TitleFeature.swiftdeps -serialize-diagnostics-path /Users/admin/builder/spi-builder-workspace/.derivedData/Build/Intermediates.noindex/AUv3Controls.build/Debug-watchos/AUv3Controls.build/Objects-normal/arm64/TitleFeature.dia -target arm64-apple-watchos10.0 -Xllvm -aarch64-use-tbi -enable-objc-interop -stack-check -sdk /Applications/Xcode-16.2.0.app/Contents/Developer/Platforms/WatchOS.platform/Developer/SDKs/WatchOS11.2.sdk -I /Users/admin/builder/spi-builder-workspace/.derivedData/Build/Products/Debug-watchos -I /Applications/Xcode-16.2.0.app/Contents/Developer/Platforms/WatchOS.platform/Developer/usr/lib -F /Users/admin/builder/spi-builder-workspace/.derivedData/Build/Products/Debug-watchos/PackageFrameworks -F /Users/admin/builder/spi-builder-workspace/.derivedData/Build/Products/Debug-watchos/PackageFrameworks -F /Users/admin/builder/spi-builder-workspace/.derivedData/Build/Products/Debug-watchos/PackageFrameworks -F /Users/admin/builder/spi-builder-workspace/.derivedData/Build/Products/Debug-watchos/PackageFrameworks -F /Users/admin/builder/spi-builder-workspace/.derivedData/Build/Products/Debug-watchos/PackageFrameworks -F /Users/admin/builder/spi-builder-workspace/.derivedData/Build/Products/Debug-watchos/PackageFrameworks -F /Users/admin/builder/spi-builder-workspace/.derivedData/Build/Products/Debug-watchos/PackageFrameworks -F /Users/admin/builder/spi-builder-workspace/.derivedData/Build/Products/Debug-watchos/PackageFrameworks -F /Users/admin/builder/spi-builder-workspace/.derivedData/Build/Products/Debug-watchos/PackageFrameworks -F /Users/admin/builder/spi-builder-workspace/.derivedData/Build/Products/Debug-watchos/PackageFrameworks -F /Users/admin/builder/spi-builder-workspace/.derivedData/Build/Products/Debug-watchos/PackageFrameworks -F /Users/admin/builder/spi-builder-workspace/.derivedData/Build/Products/Debug-watchos/PackageFrameworks -F /Users/admin/builder/spi-builder-workspace/.derivedData/Build/Products/Debug-watchos/PackageFrameworks -F /Users/admin/builder/spi-builder-workspace/.derivedData/Build/Products/Debug-watchos/PackageFrameworks -F /Users/admin/builder/spi-builder-workspace/.derivedData/Build/Products/Debug-watchos/PackageFrameworks -F /Users/admin/builder/spi-builder-workspace/.derivedData/Build/Products/Debug-watchos/PackageFrameworks -F /Users/admin/builder/spi-builder-workspace/.derivedData/Build/Products/Debug-watchos/PackageFrameworks -F /Users/admin/builder/spi-builder-workspace/.derivedData/Build/Products/Debug-watchos/PackageFrameworks -F /Users/admin/builder/spi-builder-workspace/.derivedData/Build/Products/Debug-watchos/PackageFrameworks -F /Users/admin/builder/spi-builder-workspace/.derivedData/Build/Products/Debug-watchos/PackageFrameworks -F /Users/admin/builder/spi-builder-workspace/.derivedData/Build/Products/Debug-watchos/PackageFrameworks -F /Users/admin/builder/spi-builder-workspace/.derivedData/Build/Products/Debug-watchos/PackageFrameworks -F /Users/admin/builder/spi-builder-workspace/.derivedData/Build/Products/Debug-watchos/PackageFrameworks -F /Users/admin/builder/spi-builder-workspace/.derivedData/Build/Products/Debug-watchos/PackageFrameworks -F /Users/admin/builder/spi-builder-workspace/.derivedData/Build/Products/Debug-watchos/PackageFrameworks -F /Users/admin/builder/spi-builder-workspace/.derivedData/Build/Products/Debug-watchos -F /Applications/Xcode-16.2.0.app/Contents/Developer/Platforms/WatchOS.platform/Developer/Library/Frameworks -F /Applications/Xcode-16.2.0.app/Contents/Developer/Platforms/WatchOS.platform/Developer/SDKs/WatchOS11.2.sdk/Developer/Library/Frameworks -no-color-diagnostics -enable-testing -g -debug-info-format\=dwarf -dwarf-version\=4 -module-cache-path /Users/admin/builder/spi-builder-workspace/.derivedData/ModuleCache.noindex -profile-generate -profile-coverage-mapping -swift-version 6 -enforce-exclusivity\=checked -Onone -D SWIFT_PACKAGE -D DEBUG -D Xcode -serialize-debugging-options -load-plugin-executable /Users/admin/builder/spi-builder-workspace/.derivedData/Build/Products/Debug/CasePathsMacros\#CasePathsMacros -load-plugin-executable /Users/admin/builder/spi-builder-workspace/.derivedData/Build/Products/Debug/ComposableArchitectureMacros\#ComposableArchitectureMacros -load-plugin-executable /Users/admin/builder/spi-builder-workspace/.derivedData/Build/Products/Debug/DependenciesMacrosPlugin\#DependenciesMacrosPlugin -load-plugin-executable /Users/admin/builder/spi-builder-workspace/.derivedData/Build/Products/Debug/PerceptionMacros\#PerceptionMacros -const-gather-protocols-file /Users/admin/builder/spi-builder-workspace/.derivedData/Build/Intermediates.noindex/AUv3Controls.build/Debug-watchos/AUv3Controls.build/Objects-normal/arm64/AUv3Controls_const_extract_protocols.json -enable-experimental-feature StrictConcurrency\=complete -enable-experimental-feature DebugDescriptionMacro -enable-experimental-feature OpaqueTypeErasure -empty-abi-descriptor -plugin-path /Applications/Xcode-16.2.0.app/Contents/Developer/Toolchains/XcodeDefault.xctoolchain/usr/lib/swift/host/plugins/testing -validate-clang-modules-once -clang-build-session-file /Users/admin/builder/spi-builder-workspace/.derivedData/ModuleCache.noindex/Session.modulevalidation -Xcc -working-directory -Xcc /Users/admin/builder/spi-builder-workspace/.swiftpm/xcode -resource-dir /Applications/Xcode-16.2.0.app/Contents/Developer/Toolchains/XcodeDefault.xctoolchain/usr/lib/swift -enable-anonymous-context-mangled-names -file-compilation-dir /Users/admin/builder/spi-builder-workspace/.swiftpm/xcode -Xcc -fmodule-map-file\=/Users/admin/builder/spi-builder-workspace/.derivedData/Build/Intermediates.noindex/GeneratedModuleMaps-watchos/UIKitNavigationShim.modulemap -Xcc -D_LIBCPP_HARDENING_MODE\=_LIBCPP_HARDENING_MODE_DEBUG -Xcc -ivfsstatcache -Xcc /Users/admin/builder/spi-builder-workspace/.derivedData/SDKStatCaches.noindex/watchos11.2-22S97-8cb5c683f5e64b0ecfc74e8d0065fbf6.sdkstatcache -Xcc -I/Users/admin/builder/spi-builder-workspace/.derivedData/Build/Intermediates.noindex/AUv3Controls.build/Debug-watchos/AUv3Controls.build/swift-overrides.hmap -Xcc -I/Users/admin/builder/spi-builder-workspace/.dependencies/checkouts/swift-navigation/Sources/UIKitNavigationShim/include -Xcc -I/Users/admin/builder/spi-builder-workspace/.derivedData/Build/Products/Debug-watchos/include -Xcc -I/Users/admin/builder/spi-builder-workspace/.derivedData/Build/Intermediates.noindex/AUv3Controls.build/Debug-watchos/AUv3Controls.build/DerivedSources-normal/arm64 -Xcc -I/Users/admin/builder/spi-builder-workspace/.derivedData/Build/Intermediates.noindex/AUv3Controls.build/Debug-watchos/AUv3Controls.build/DerivedSources/arm64 -Xcc -I/Users/admin/builder/spi-builder-workspace/.derivedData/Build/Intermediates.noindex/AUv3Controls.build/Debug-watchos/AUv3Controls.build/DerivedSources -Xcc -DSWIFT_PACKAGE -Xcc -DDEBUG\=1 -module-name AUv3Controls -package-name spi_builder_workspace -frontend-parseable-output -disable-clang-spi -target-sdk-version 11.2 -target-sdk-name watchos11.2 -external-plugin-path /Applications/Xcode-16.2.0.app/Contents/Developer/Platforms/WatchOS.platform/Developer/usr/lib/swift/host/plugins\#/Applications/Xcode-16.2.0.app/Contents/Developer/Platforms/WatchOS.platform/Developer/usr/bin/swift-plugin-server -external-plugin-path /Applications/Xcode-16.2.0.app/Contents/Developer/Platforms/WatchOS.platform/Developer/usr/local/lib/swift/host/plugins\#/Applications/Xcode-16.2.0.app/Contents/Developer/Platforms/WatchOS.platform/Developer/usr/bin/swift-plugin-server -plugin-path /Applications/Xcode-16.2.0.app/Contents/Developer/Toolchains/XcodeDefault.xctoolchain/usr/lib/swift/host/plugins -plugin-path /Applications/Xcode-16.2.0.app/Contents/Developer/Toolchains/XcodeDefault.xctoolchain/usr/local/lib/swift/host/plugins -o /Users/admin/builder/spi-builder-workspace/.derivedData/Build/Intermediates.noindex/AUv3Controls.build/Debug-watchos/AUv3Controls.build/Objects-normal/arm64/NormValueTransform.o -o /Users/admin/builder/spi-builder-workspace/.derivedData/Build/Intermediates.noindex/AUv3Controls.build/Debug-watchos/AUv3Controls.build/Objects-normal/arm64/TitleFeature.o -index-unit-output-path /AUv3Controls.build/Debug-watchos/AUv3Controls.build/Objects-normal/arm64/NormValueTransform.o -index-unit-output-path /AUv3Controls.build/Debug-watchos/AUv3Controls.build/Objects-normal/arm64/TitleFeature.o -index-store-path /Users/admin/builder/spi-builder-workspace/.derivedData/Index.noindex/DataStore -index-system-modules
SwiftCompile normal arm64 /Users/admin/builder/spi-builder-workspace/Sources/AUv3Controls/Knob/TitleFeature.swift (in target 'AUv3Controls' from project 'AUv3Controls')
    cd /Users/admin/builder/spi-builder-workspace/.swiftpm/xcode
    /Applications/Xcode-16.2.0.app/Contents/Developer/Toolchains/XcodeDefault.xctoolchain/usr/bin/swift-frontend -c /Users/admin/builder/spi-builder-workspace/.derivedData/Build/Intermediates.noindex/AUv3Controls.build/Debug-watchos/AUv3Controls.build/DerivedSources/resource_bundle_accessor.swift /Users/admin/builder/spi-builder-workspace/Sources/AUv3Controls/Examples/Duality.swift /Users/admin/builder/spi-builder-workspace/Sources/AUv3Controls/Examples/Envelope.swift /Users/admin/builder/spi-builder-workspace/Sources/AUv3Controls/Extensions/AUParameter.swift /Users/admin/builder/spi-builder-workspace/Sources/AUv3Controls/Extensions/AUParameterTree.swift /Users/admin/builder/spi-builder-workspace/Sources/AUv3Controls/Extensions/Angle.swift /Users/admin/builder/spi-builder-workspace/Sources/AUv3Controls/Extensions/ClosedRange.swift /Users/admin/builder/spi-builder-workspace/Sources/AUv3Controls/Extensions/Color.swift /Users/admin/builder/spi-builder-workspace/Sources/AUv3Controls/Extensions/KeyPath.swift /Users/admin/builder/spi-builder-workspace/Sources/AUv3Controls/Extensions/UUID.swift /Users/admin/builder/spi-builder-workspace/Sources/AUv3Controls/Extensions/View.swift /Users/admin/builder/spi-builder-workspace/Sources/AUv3Controls/Knob/ControlFeature.swift /Users/admin/builder/spi-builder-workspace/Sources/AUv3Controls/Knob/EditorFeature.swift /Users/admin/builder/spi-builder-workspace/Sources/AUv3Controls/Knob/KnobConfig.swift /Users/admin/builder/spi-builder-workspace/Sources/AUv3Controls/Knob/KnobFeature.swift /Users/admin/builder/spi-builder-workspace/Sources/AUv3Controls/Knob/KnobValueFormatter.swift -primary-file /Users/admin/builder/spi-builder-workspace/Sources/AUv3Controls/Knob/NormValueTransform.swift -primary-file /Users/admin/builder/spi-builder-workspace/Sources/AUv3Controls/Knob/TitleFeature.swift /Users/admin/builder/spi-builder-workspace/Sources/AUv3Controls/Knob/TrackFeature.swift /Users/admin/builder/spi-builder-workspace/Sources/AUv3Controls/Support/Logger.swift /Users/admin/builder/spi-builder-workspace/Sources/AUv3Controls/Theme.swift /Users/admin/builder/spi-builder-workspace/Sources/AUv3Controls/Toggle/CheckedToggleStyle.swift /Users/admin/builder/spi-builder-workspace/Sources/AUv3Controls/Toggle/ToggleFeature.swift /Users/admin/builder/spi-builder-workspace/.derivedData/Build/Intermediates.noindex/AUv3Controls.build/Debug-watchos/AUv3Controls.build/DerivedSources/GeneratedAssetSymbols.swift -emit-dependencies-path /Users/admin/builder/spi-builder-workspace/.derivedData/Build/Intermediates.noindex/AUv3Controls.build/Debug-watchos/AUv3Controls.build/Objects-normal/arm64/NormValueTransform.d -emit-const-values-path /Users/admin/builder/spi-builder-workspace/.derivedData/Build/Intermediates.noindex/AUv3Controls.build/Debug-watchos/AUv3Controls.build/Objects-normal/arm64/NormValueTransform.swiftconstvalues -emit-reference-dependencies-path /Users/admin/builder/spi-builder-workspace/.derivedData/Build/Intermediates.noindex/AUv3Controls.build/Debug-watchos/AUv3Controls.build/Objects-normal/arm64/NormValueTransform.swiftdeps -serialize-diagnostics-path /Users/admin/builder/spi-builder-workspace/.derivedData/Build/Intermediates.noindex/AUv3Controls.build/Debug-watchos/AUv3Controls.build/Objects-normal/arm64/NormValueTransform.dia -emit-dependencies-path /Users/admin/builder/spi-builder-workspace/.derivedData/Build/Intermediates.noindex/AUv3Controls.build/Debug-watchos/AUv3Controls.build/Objects-normal/arm64/TitleFeature.d -emit-const-values-path /Users/admin/builder/spi-builder-workspace/.derivedData/Build/Intermediates.noindex/AUv3Controls.build/Debug-watchos/AUv3Controls.build/Objects-normal/arm64/TitleFeature.swiftconstvalues -emit-reference-dependencies-path /Users/admin/builder/spi-builder-workspace/.derivedData/Build/Intermediates.noindex/AUv3Controls.build/Debug-watchos/AUv3Controls.build/Objects-normal/arm64/TitleFeature.swiftdeps -serialize-diagnostics-path /Users/admin/builder/spi-builder-workspace/.derivedData/Build/Intermediates.noindex/AUv3Controls.build/Debug-watchos/AUv3Controls.build/Objects-normal/arm64/TitleFeature.dia -target arm64-apple-watchos10.0 -Xllvm -aarch64-use-tbi -enable-objc-interop -stack-check -sdk /Applications/Xcode-16.2.0.app/Contents/Developer/Platforms/WatchOS.platform/Developer/SDKs/WatchOS11.2.sdk -I /Users/admin/builder/spi-builder-workspace/.derivedData/Build/Products/Debug-watchos -I /Applications/Xcode-16.2.0.app/Contents/Developer/Platforms/WatchOS.platform/Developer/usr/lib -F /Users/admin/builder/spi-builder-workspace/.derivedData/Build/Products/Debug-watchos/PackageFrameworks -F /Users/admin/builder/spi-builder-workspace/.derivedData/Build/Products/Debug-watchos/PackageFrameworks -F /Users/admin/builder/spi-builder-workspace/.derivedData/Build/Products/Debug-watchos/PackageFrameworks -F /Users/admin/builder/spi-builder-workspace/.derivedData/Build/Products/Debug-watchos/PackageFrameworks -F /Users/admin/builder/spi-builder-workspace/.derivedData/Build/Products/Debug-watchos/PackageFrameworks -F /Users/admin/builder/spi-builder-workspace/.derivedData/Build/Products/Debug-watchos/PackageFrameworks -F /Users/admin/builder/spi-builder-workspace/.derivedData/Build/Products/Debug-watchos/PackageFrameworks -F /Users/admin/builder/spi-builder-workspace/.derivedData/Build/Products/Debug-watchos/PackageFrameworks -F /Users/admin/builder/spi-builder-workspace/.derivedData/Build/Products/Debug-watchos/PackageFrameworks -F /Users/admin/builder/spi-builder-workspace/.derivedData/Build/Products/Debug-watchos/PackageFrameworks -F /Users/admin/builder/spi-builder-workspace/.derivedData/Build/Products/Debug-watchos/PackageFrameworks -F /Users/admin/builder/spi-builder-workspace/.derivedData/Build/Products/Debug-watchos/PackageFrameworks -F /Users/admin/builder/spi-builder-workspace/.derivedData/Build/Products/Debug-watchos/PackageFrameworks -F /Users/admin/builder/spi-builder-workspace/.derivedData/Build/Products/Debug-watchos/PackageFrameworks -F /Users/admin/builder/spi-builder-workspace/.derivedData/Build/Products/Debug-watchos/PackageFrameworks -F /Users/admin/builder/spi-builder-workspace/.derivedData/Build/Products/Debug-watchos/PackageFrameworks -F /Users/admin/builder/spi-builder-workspace/.derivedData/Build/Products/Debug-watchos/PackageFrameworks -F /Users/admin/builder/spi-builder-workspace/.derivedData/Build/Products/Debug-watchos/PackageFrameworks -F /Users/admin/builder/spi-builder-workspace/.derivedData/Build/Products/Debug-watchos/PackageFrameworks -F /Users/admin/builder/spi-builder-workspace/.derivedData/Build/Products/Debug-watchos/PackageFrameworks -F /Users/admin/builder/spi-builder-workspace/.derivedData/Build/Products/Debug-watchos/PackageFrameworks -F /Users/admin/builder/spi-builder-workspace/.derivedData/Build/Products/Debug-watchos/PackageFrameworks -F /Users/admin/builder/spi-builder-workspace/.derivedData/Build/Products/Debug-watchos/PackageFrameworks -F /Users/admin/builder/spi-builder-workspace/.derivedData/Build/Products/Debug-watchos/PackageFrameworks -F /Users/admin/builder/spi-builder-workspace/.derivedData/Build/Products/Debug-watchos/PackageFrameworks -F /Users/admin/builder/spi-builder-workspace/.derivedData/Build/Products/Debug-watchos -F /Applications/Xcode-16.2.0.app/Contents/Developer/Platforms/WatchOS.platform/Developer/Library/Frameworks -F /Applications/Xcode-16.2.0.app/Contents/Developer/Platforms/WatchOS.platform/Developer/SDKs/WatchOS11.2.sdk/Developer/Library/Frameworks -no-color-diagnostics -enable-testing -g -debug-info-format\=dwarf -dwarf-version\=4 -module-cache-path /Users/admin/builder/spi-builder-workspace/.derivedData/ModuleCache.noindex -profile-generate -profile-coverage-mapping -swift-version 6 -enforce-exclusivity\=checked -Onone -D SWIFT_PACKAGE -D DEBUG -D Xcode -serialize-debugging-options -load-plugin-executable /Users/admin/builder/spi-builder-workspace/.derivedData/Build/Products/Debug/CasePathsMacros\#CasePathsMacros -load-plugin-executable /Users/admin/builder/spi-builder-workspace/.derivedData/Build/Products/Debug/ComposableArchitectureMacros\#ComposableArchitectureMacros -load-plugin-executable /Users/admin/builder/spi-builder-workspace/.derivedData/Build/Products/Debug/DependenciesMacrosPlugin\#DependenciesMacrosPlugin -load-plugin-executable /Users/admin/builder/spi-builder-workspace/.derivedData/Build/Products/Debug/PerceptionMacros\#PerceptionMacros -const-gather-protocols-file /Users/admin/builder/spi-builder-workspace/.derivedData/Build/Intermediates.noindex/AUv3Controls.build/Debug-watchos/AUv3Controls.build/Objects-normal/arm64/AUv3Controls_const_extract_protocols.json -enable-experimental-feature StrictConcurrency\=complete -enable-experimental-feature DebugDescriptionMacro -enable-experimental-feature OpaqueTypeErasure -empty-abi-descriptor -plugin-path /Applications/Xcode-16.2.0.app/Contents/Developer/Toolchains/XcodeDefault.xctoolchain/usr/lib/swift/host/plugins/testing -validate-clang-modules-once -clang-build-session-file /Users/admin/builder/spi-builder-workspace/.derivedData/ModuleCache.noindex/Session.modulevalidation -Xcc -working-directory -Xcc /Users/admin/builder/spi-builder-workspace/.swiftpm/xcode -resource-dir /Applications/Xcode-16.2.0.app/Contents/Developer/Toolchains/XcodeDefault.xctoolchain/usr/lib/swift -enable-anonymous-context-mangled-names -file-compilation-dir /Users/admin/builder/spi-builder-workspace/.swiftpm/xcode -Xcc -fmodule-map-file\=/Users/admin/builder/spi-builder-workspace/.derivedData/Build/Intermediates.noindex/GeneratedModuleMaps-watchos/UIKitNavigationShim.modulemap -Xcc -D_LIBCPP_HARDENING_MODE\=_LIBCPP_HARDENING_MODE_DEBUG -Xcc -ivfsstatcache -Xcc /Users/admin/builder/spi-builder-workspace/.derivedData/SDKStatCaches.noindex/watchos11.2-22S97-8cb5c683f5e64b0ecfc74e8d0065fbf6.sdkstatcache -Xcc -I/Users/admin/builder/spi-builder-workspace/.derivedData/Build/Intermediates.noindex/AUv3Controls.build/Debug-watchos/AUv3Controls.build/swift-overrides.hmap -Xcc -I/Users/admin/builder/spi-builder-workspace/.dependencies/checkouts/swift-navigation/Sources/UIKitNavigationShim/include -Xcc -I/Users/admin/builder/spi-builder-workspace/.derivedData/Build/Products/Debug-watchos/include -Xcc -I/Users/admin/builder/spi-builder-workspace/.derivedData/Build/Intermediates.noindex/AUv3Controls.build/Debug-watchos/AUv3Controls.build/DerivedSources-normal/arm64 -Xcc -I/Users/admin/builder/spi-builder-workspace/.derivedData/Build/Intermediates.noindex/AUv3Controls.build/Debug-watchos/AUv3Controls.build/DerivedSources/arm64 -Xcc -I/Users/admin/builder/spi-builder-workspace/.derivedData/Build/Intermediates.noindex/AUv3Controls.build/Debug-watchos/AUv3Controls.build/DerivedSources -Xcc -DSWIFT_PACKAGE -Xcc -DDEBUG\=1 -module-name AUv3Controls -package-name spi_builder_workspace -frontend-parseable-output -disable-clang-spi -target-sdk-version 11.2 -target-sdk-name watchos11.2 -external-plugin-path /Applications/Xcode-16.2.0.app/Contents/Developer/Platforms/WatchOS.platform/Developer/usr/lib/swift/host/plugins\#/Applications/Xcode-16.2.0.app/Contents/Developer/Platforms/WatchOS.platform/Developer/usr/bin/swift-plugin-server -external-plugin-path /Applications/Xcode-16.2.0.app/Contents/Developer/Platforms/WatchOS.platform/Developer/usr/local/lib/swift/host/plugins\#/Applications/Xcode-16.2.0.app/Contents/Developer/Platforms/WatchOS.platform/Developer/usr/bin/swift-plugin-server -plugin-path /Applications/Xcode-16.2.0.app/Contents/Developer/Toolchains/XcodeDefault.xctoolchain/usr/lib/swift/host/plugins -plugin-path /Applications/Xcode-16.2.0.app/Contents/Developer/Toolchains/XcodeDefault.xctoolchain/usr/local/lib/swift/host/plugins -o /Users/admin/builder/spi-builder-workspace/.derivedData/Build/Intermediates.noindex/AUv3Controls.build/Debug-watchos/AUv3Controls.build/Objects-normal/arm64/NormValueTransform.o -o /Users/admin/builder/spi-builder-workspace/.derivedData/Build/Intermediates.noindex/AUv3Controls.build/Debug-watchos/AUv3Controls.build/Objects-normal/arm64/TitleFeature.o -index-unit-output-path /AUv3Controls.build/Debug-watchos/AUv3Controls.build/Objects-normal/arm64/NormValueTransform.o -index-unit-output-path /AUv3Controls.build/Debug-watchos/AUv3Controls.build/Objects-normal/arm64/TitleFeature.o -index-store-path /Users/admin/builder/spi-builder-workspace/.derivedData/Index.noindex/DataStore -index-system-modules
SwiftCompile normal arm64 Compiling\ AUParameter.swift,\ AUParameterTree.swift,\ Angle.swift /Users/admin/builder/spi-builder-workspace/Sources/AUv3Controls/Extensions/AUParameter.swift /Users/admin/builder/spi-builder-workspace/Sources/AUv3Controls/Extensions/AUParameterTree.swift /Users/admin/builder/spi-builder-workspace/Sources/AUv3Controls/Extensions/Angle.swift (in target 'AUv3Controls' from project 'AUv3Controls')
    cd /Users/admin/builder/spi-builder-workspace/.swiftpm/xcode
    builtin-swiftTaskExecution -- /Applications/Xcode-16.2.0.app/Contents/Developer/Toolchains/XcodeDefault.xctoolchain/usr/bin/swift-frontend -frontend -c /Users/admin/builder/spi-builder-workspace/.derivedData/Build/Intermediates.noindex/AUv3Controls.build/Debug-watchos/AUv3Controls.build/DerivedSources/resource_bundle_accessor.swift /Users/admin/builder/spi-builder-workspace/Sources/AUv3Controls/Examples/Duality.swift /Users/admin/builder/spi-builder-workspace/Sources/AUv3Controls/Examples/Envelope.swift -primary-file /Users/admin/builder/spi-builder-workspace/Sources/AUv3Controls/Extensions/AUParameter.swift -primary-file /Users/admin/builder/spi-builder-workspace/Sources/AUv3Controls/Extensions/AUParameterTree.swift -primary-file /Users/admin/builder/spi-builder-workspace/Sources/AUv3Controls/Extensions/Angle.swift /Users/admin/builder/spi-builder-workspace/Sources/AUv3Controls/Extensions/ClosedRange.swift /Users/admin/builder/spi-builder-workspace/Sources/AUv3Controls/Extensions/Color.swift /Users/admin/builder/spi-builder-workspace/Sources/AUv3Controls/Extensions/KeyPath.swift /Users/admin/builder/spi-builder-workspace/Sources/AUv3Controls/Extensions/UUID.swift /Users/admin/builder/spi-builder-workspace/Sources/AUv3Controls/Extensions/View.swift /Users/admin/builder/spi-builder-workspace/Sources/AUv3Controls/Knob/ControlFeature.swift /Users/admin/builder/spi-builder-workspace/Sources/AUv3Controls/Knob/EditorFeature.swift /Users/admin/builder/spi-builder-workspace/Sources/AUv3Controls/Knob/KnobConfig.swift /Users/admin/builder/spi-builder-workspace/Sources/AUv3Controls/Knob/KnobFeature.swift /Users/admin/builder/spi-builder-workspace/Sources/AUv3Controls/Knob/KnobValueFormatter.swift /Users/admin/builder/spi-builder-workspace/Sources/AUv3Controls/Knob/NormValueTransform.swift /Users/admin/builder/spi-builder-workspace/Sources/AUv3Controls/Knob/TitleFeature.swift /Users/admin/builder/spi-builder-workspace/Sources/AUv3Controls/Knob/TrackFeature.swift /Users/admin/builder/spi-builder-workspace/Sources/AUv3Controls/Support/Logger.swift /Users/admin/builder/spi-builder-workspace/Sources/AUv3Controls/Theme.swift /Users/admin/builder/spi-builder-workspace/Sources/AUv3Controls/Toggle/CheckedToggleStyle.swift /Users/admin/builder/spi-builder-workspace/Sources/AUv3Controls/Toggle/ToggleFeature.swift /Users/admin/builder/spi-builder-workspace/.derivedData/Build/Intermediates.noindex/AUv3Controls.build/Debug-watchos/AUv3Controls.build/DerivedSources/GeneratedAssetSymbols.swift -supplementary-output-file-map /Users/admin/builder/spi-builder-workspace/.derivedData/Build/Intermediates.noindex/AUv3Controls.build/Debug-watchos/AUv3Controls.build/Objects-normal/arm64/supplementaryOutputs-3 -target arm64-apple-watchos10.0 -Xllvm -aarch64-use-tbi -enable-objc-interop -stack-check -sdk /Applications/Xcode-16.2.0.app/Contents/Developer/Platforms/WatchOS.platform/Developer/SDKs/WatchOS11.2.sdk -I /Users/admin/builder/spi-builder-workspace/.derivedData/Build/Products/Debug-watchos -I /Applications/Xcode-16.2.0.app/Contents/Developer/Platforms/WatchOS.platform/Developer/usr/lib -F /Users/admin/builder/spi-builder-workspace/.derivedData/Build/Products/Debug-watchos/PackageFrameworks -F /Users/admin/builder/spi-builder-workspace/.derivedData/Build/Products/Debug-watchos/PackageFrameworks -F /Users/admin/builder/spi-builder-workspace/.derivedData/Build/Products/Debug-watchos/PackageFrameworks -F /Users/admin/builder/spi-builder-workspace/.derivedData/Build/Products/Debug-watchos/PackageFrameworks -F /Users/admin/builder/spi-builder-workspace/.derivedData/Build/Products/Debug-watchos/PackageFrameworks -F /Users/admin/builder/spi-builder-workspace/.derivedData/Build/Products/Debug-watchos/PackageFrameworks -F /Users/admin/builder/spi-builder-workspace/.derivedData/Build/Products/Debug-watchos/PackageFrameworks -F /Users/admin/builder/spi-builder-workspace/.derivedData/Build/Products/Debug-watchos/PackageFrameworks -F /Users/admin/builder/spi-builder-workspace/.derivedData/Build/Products/Debug-watchos/PackageFrameworks -F /Users/admin/builder/spi-builder-workspace/.derivedData/Build/Products/Debug-watchos/PackageFrameworks -F /Users/admin/builder/spi-builder-workspace/.derivedData/Build/Products/Debug-watchos/PackageFrameworks -F /Users/admin/builder/spi-builder-workspace/.derivedData/Build/Products/Debug-watchos/PackageFrameworks -F /Users/admin/builder/spi-builder-workspace/.derivedData/Build/Products/Debug-watchos/PackageFrameworks -F /Users/admin/builder/spi-builder-workspace/.derivedData/Build/Products/Debug-watchos/PackageFrameworks -F /Users/admin/builder/spi-builder-workspace/.derivedData/Build/Products/Debug-watchos/PackageFrameworks -F /Users/admin/builder/spi-builder-workspace/.derivedData/Build/Products/Debug-watchos/PackageFrameworks -F /Users/admin/builder/spi-builder-workspace/.derivedData/Build/Products/Debug-watchos/PackageFrameworks -F /Users/admin/builder/spi-builder-workspace/.derivedData/Build/Products/Debug-watchos/PackageFrameworks -F /Users/admin/builder/spi-builder-workspace/.derivedData/Build/Products/Debug-watchos/PackageFrameworks -F /Users/admin/builder/spi-builder-workspace/.derivedData/Build/Products/Debug-watchos/PackageFrameworks -F /Users/admin/builder/spi-builder-workspace/.derivedData/Build/Products/Debug-watchos/PackageFrameworks -F /Users/admin/builder/spi-builder-workspace/.derivedData/Build/Products/Debug-watchos/PackageFrameworks -F /Users/admin/builder/spi-builder-workspace/.derivedData/Build/Products/Debug-watchos/PackageFrameworks -F /Users/admin/builder/spi-builder-workspace/.derivedData/Build/Products/Debug-watchos/PackageFrameworks -F /Users/admin/builder/spi-builder-workspace/.derivedData/Build/Products/Debug-watchos/PackageFrameworks -F /Users/admin/builder/spi-builder-workspace/.derivedData/Build/Products/Debug-watchos -F /Applications/Xcode-16.2.0.app/Contents/Developer/Platforms/WatchOS.platform/Developer/Library/Frameworks -F /Applications/Xcode-16.2.0.app/Contents/Developer/Platforms/WatchOS.platform/Developer/SDKs/WatchOS11.2.sdk/Developer/Library/Frameworks -no-color-diagnostics -enable-testing -g -debug-info-format\=dwarf -dwarf-version\=4 -module-cache-path /Users/admin/builder/spi-builder-workspace/.derivedData/ModuleCache.noindex -profile-generate -profile-coverage-mapping -swift-version 6 -enforce-exclusivity\=checked -Onone -D SWIFT_PACKAGE -D DEBUG -D Xcode -serialize-debugging-options -load-plugin-executable /Users/admin/builder/spi-builder-workspace/.derivedData/Build/Products/Debug/CasePathsMacros\#CasePathsMacros -load-plugin-executable /Users/admin/builder/spi-builder-workspace/.derivedData/Build/Products/Debug/ComposableArchitectureMacros\#ComposableArchitectureMacros -load-plugin-executable /Users/admin/builder/spi-builder-workspace/.derivedData/Build/Products/Debug/DependenciesMacrosPlugin\#DependenciesMacrosPlugin -load-plugin-executable /Users/admin/builder/spi-builder-workspace/.derivedData/Build/Products/Debug/PerceptionMacros\#PerceptionMacros -const-gather-protocols-file /Users/admin/builder/spi-builder-workspace/.derivedData/Build/Intermediates.noindex/AUv3Controls.build/Debug-watchos/AUv3Controls.build/Objects-normal/arm64/AUv3Controls_const_extract_protocols.json -enable-experimental-feature StrictConcurrency\=complete -enable-experimental-feature DebugDescriptionMacro -enable-experimental-feature OpaqueTypeErasure -empty-abi-descriptor -plugin-path /Applications/Xcode-16.2.0.app/Contents/Developer/Toolchains/XcodeDefault.xctoolchain/usr/lib/swift/host/plugins/testing -validate-clang-modules-once -clang-build-session-file /Users/admin/builder/spi-builder-workspace/.derivedData/ModuleCache.noindex/Session.modulevalidation -Xcc -working-directory -Xcc /Users/admin/builder/spi-builder-workspace/.swiftpm/xcode -resource-dir /Applications/Xcode-16.2.0.app/Contents/Developer/Toolchains/XcodeDefault.xctoolchain/usr/lib/swift -enable-anonymous-context-mangled-names -file-compilation-dir /Users/admin/builder/spi-builder-workspace/.swiftpm/xcode -Xcc -fmodule-map-file\=/Users/admin/builder/spi-builder-workspace/.derivedData/Build/Intermediates.noindex/GeneratedModuleMaps-watchos/UIKitNavigationShim.modulemap -Xcc -D_LIBCPP_HARDENING_MODE\=_LIBCPP_HARDENING_MODE_DEBUG -Xcc -ivfsstatcache -Xcc /Users/admin/builder/spi-builder-workspace/.derivedData/SDKStatCaches.noindex/watchos11.2-22S97-8cb5c683f5e64b0ecfc74e8d0065fbf6.sdkstatcache -Xcc -I/Users/admin/builder/spi-builder-workspace/.derivedData/Build/Intermediates.noindex/AUv3Controls.build/Debug-watchos/AUv3Controls.build/swift-overrides.hmap -Xcc -I/Users/admin/builder/spi-builder-workspace/.dependencies/checkouts/swift-navigation/Sources/UIKitNavigationShim/include -Xcc -I/Users/admin/builder/spi-builder-workspace/.derivedData/Build/Products/Debug-watchos/include -Xcc -I/Users/admin/builder/spi-builder-workspace/.derivedData/Build/Intermediates.noindex/AUv3Controls.build/Debug-watchos/AUv3Controls.build/DerivedSources-normal/arm64 -Xcc -I/Users/admin/builder/spi-builder-workspace/.derivedData/Build/Intermediates.noindex/AUv3Controls.build/Debug-watchos/AUv3Controls.build/DerivedSources/arm64 -Xcc -I/Users/admin/builder/spi-builder-workspace/.derivedData/Build/Intermediates.noindex/AUv3Controls.build/Debug-watchos/AUv3Controls.build/DerivedSources -Xcc -DSWIFT_PACKAGE -Xcc -DDEBUG\=1 -module-name AUv3Controls -package-name spi_builder_workspace -frontend-parseable-output -disable-clang-spi -target-sdk-version 11.2 -target-sdk-name watchos11.2 -external-plugin-path /Applications/Xcode-16.2.0.app/Contents/Developer/Platforms/WatchOS.platform/Developer/usr/lib/swift/host/plugins\#/Applications/Xcode-16.2.0.app/Contents/Developer/Platforms/WatchOS.platform/Developer/usr/bin/swift-plugin-server -external-plugin-path /Applications/Xcode-16.2.0.app/Contents/Developer/Platforms/WatchOS.platform/Developer/usr/local/lib/swift/host/plugins\#/Applications/Xcode-16.2.0.app/Contents/Developer/Platforms/WatchOS.platform/Developer/usr/bin/swift-plugin-server -plugin-path /Applications/Xcode-16.2.0.app/Contents/Developer/Toolchains/XcodeDefault.xctoolchain/usr/lib/swift/host/plugins -plugin-path /Applications/Xcode-16.2.0.app/Contents/Developer/Toolchains/XcodeDefault.xctoolchain/usr/local/lib/swift/host/plugins -o /Users/admin/builder/spi-builder-workspace/.derivedData/Build/Intermediates.noindex/AUv3Controls.build/Debug-watchos/AUv3Controls.build/Objects-normal/arm64/AUParameter.o -o /Users/admin/builder/spi-builder-workspace/.derivedData/Build/Intermediates.noindex/AUv3Controls.build/Debug-watchos/AUv3Controls.build/Objects-normal/arm64/AUParameterTree.o -o /Users/admin/builder/spi-builder-workspace/.derivedData/Build/Intermediates.noindex/AUv3Controls.build/Debug-watchos/AUv3Controls.build/Objects-normal/arm64/Angle.o -index-unit-output-path /AUv3Controls.build/Debug-watchos/AUv3Controls.build/Objects-normal/arm64/AUParameter.o -index-unit-output-path /AUv3Controls.build/Debug-watchos/AUv3Controls.build/Objects-normal/arm64/AUParameterTree.o -index-unit-output-path /AUv3Controls.build/Debug-watchos/AUv3Controls.build/Objects-normal/arm64/Angle.o -index-store-path /Users/admin/builder/spi-builder-workspace/.derivedData/Index.noindex/DataStore -index-system-modules
SwiftCompile normal arm64 /Users/admin/builder/spi-builder-workspace/Sources/AUv3Controls/Extensions/AUParameter.swift (in target 'AUv3Controls' from project 'AUv3Controls')
    cd /Users/admin/builder/spi-builder-workspace/.swiftpm/xcode
    /Applications/Xcode-16.2.0.app/Contents/Developer/Toolchains/XcodeDefault.xctoolchain/usr/bin/swift-frontend -c /Users/admin/builder/spi-builder-workspace/.derivedData/Build/Intermediates.noindex/AUv3Controls.build/Debug-watchos/AUv3Controls.build/DerivedSources/resource_bundle_accessor.swift /Users/admin/builder/spi-builder-workspace/Sources/AUv3Controls/Examples/Duality.swift /Users/admin/builder/spi-builder-workspace/Sources/AUv3Controls/Examples/Envelope.swift -primary-file /Users/admin/builder/spi-builder-workspace/Sources/AUv3Controls/Extensions/AUParameter.swift -primary-file /Users/admin/builder/spi-builder-workspace/Sources/AUv3Controls/Extensions/AUParameterTree.swift -primary-file /Users/admin/builder/spi-builder-workspace/Sources/AUv3Controls/Extensions/Angle.swift /Users/admin/builder/spi-builder-workspace/Sources/AUv3Controls/Extensions/ClosedRange.swift /Users/admin/builder/spi-builder-workspace/Sources/AUv3Controls/Extensions/Color.swift /Users/admin/builder/spi-builder-workspace/Sources/AUv3Controls/Extensions/KeyPath.swift /Users/admin/builder/spi-builder-workspace/Sources/AUv3Controls/Extensions/UUID.swift /Users/admin/builder/spi-builder-workspace/Sources/AUv3Controls/Extensions/View.swift /Users/admin/builder/spi-builder-workspace/Sources/AUv3Controls/Knob/ControlFeature.swift /Users/admin/builder/spi-builder-workspace/Sources/AUv3Controls/Knob/EditorFeature.swift /Users/admin/builder/spi-builder-workspace/Sources/AUv3Controls/Knob/KnobConfig.swift /Users/admin/builder/spi-builder-workspace/Sources/AUv3Controls/Knob/KnobFeature.swift /Users/admin/builder/spi-builder-workspace/Sources/AUv3Controls/Knob/KnobValueFormatter.swift /Users/admin/builder/spi-builder-workspace/Sources/AUv3Controls/Knob/NormValueTransform.swift /Users/admin/builder/spi-builder-workspace/Sources/AUv3Controls/Knob/TitleFeature.swift /Users/admin/builder/spi-builder-workspace/Sources/AUv3Controls/Knob/TrackFeature.swift /Users/admin/builder/spi-builder-workspace/Sources/AUv3Controls/Support/Logger.swift /Users/admin/builder/spi-builder-workspace/Sources/AUv3Controls/Theme.swift /Users/admin/builder/spi-builder-workspace/Sources/AUv3Controls/Toggle/CheckedToggleStyle.swift /Users/admin/builder/spi-builder-workspace/Sources/AUv3Controls/Toggle/ToggleFeature.swift /Users/admin/builder/spi-builder-workspace/.derivedData/Build/Intermediates.noindex/AUv3Controls.build/Debug-watchos/AUv3Controls.build/DerivedSources/GeneratedAssetSymbols.swift -supplementary-output-file-map /Users/admin/builder/spi-builder-workspace/.derivedData/Build/Intermediates.noindex/AUv3Controls.build/Debug-watchos/AUv3Controls.build/Objects-normal/arm64/supplementaryOutputs-3 -target arm64-apple-watchos10.0 -Xllvm -aarch64-use-tbi -enable-objc-interop -stack-check -sdk /Applications/Xcode-16.2.0.app/Contents/Developer/Platforms/WatchOS.platform/Developer/SDKs/WatchOS11.2.sdk -I /Users/admin/builder/spi-builder-workspace/.derivedData/Build/Products/Debug-watchos -I /Applications/Xcode-16.2.0.app/Contents/Developer/Platforms/WatchOS.platform/Developer/usr/lib -F /Users/admin/builder/spi-builder-workspace/.derivedData/Build/Products/Debug-watchos/PackageFrameworks -F /Users/admin/builder/spi-builder-workspace/.derivedData/Build/Products/Debug-watchos/PackageFrameworks -F /Users/admin/builder/spi-builder-workspace/.derivedData/Build/Products/Debug-watchos/PackageFrameworks -F /Users/admin/builder/spi-builder-workspace/.derivedData/Build/Products/Debug-watchos/PackageFrameworks -F /Users/admin/builder/spi-builder-workspace/.derivedData/Build/Products/Debug-watchos/PackageFrameworks -F /Users/admin/builder/spi-builder-workspace/.derivedData/Build/Products/Debug-watchos/PackageFrameworks -F /Users/admin/builder/spi-builder-workspace/.derivedData/Build/Products/Debug-watchos/PackageFrameworks -F /Users/admin/builder/spi-builder-workspace/.derivedData/Build/Products/Debug-watchos/PackageFrameworks -F /Users/admin/builder/spi-builder-workspace/.derivedData/Build/Products/Debug-watchos/PackageFrameworks -F /Users/admin/builder/spi-builder-workspace/.derivedData/Build/Products/Debug-watchos/PackageFrameworks -F /Users/admin/builder/spi-builder-workspace/.derivedData/Build/Products/Debug-watchos/PackageFrameworks -F /Users/admin/builder/spi-builder-workspace/.derivedData/Build/Products/Debug-watchos/PackageFrameworks -F /Users/admin/builder/spi-builder-workspace/.derivedData/Build/Products/Debug-watchos/PackageFrameworks -F /Users/admin/builder/spi-builder-workspace/.derivedData/Build/Products/Debug-watchos/PackageFrameworks -F /Users/admin/builder/spi-builder-workspace/.derivedData/Build/Products/Debug-watchos/PackageFrameworks -F /Users/admin/builder/spi-builder-workspace/.derivedData/Build/Products/Debug-watchos/PackageFrameworks -F /Users/admin/builder/spi-builder-workspace/.derivedData/Build/Products/Debug-watchos/PackageFrameworks -F /Users/admin/builder/spi-builder-workspace/.derivedData/Build/Products/Debug-watchos/PackageFrameworks -F /Users/admin/builder/spi-builder-workspace/.derivedData/Build/Products/Debug-watchos/PackageFrameworks -F /Users/admin/builder/spi-builder-workspace/.derivedData/Build/Products/Debug-watchos/PackageFrameworks -F /Users/admin/builder/spi-builder-workspace/.derivedData/Build/Products/Debug-watchos/PackageFrameworks -F /Users/admin/builder/spi-builder-workspace/.derivedData/Build/Products/Debug-watchos/PackageFrameworks -F /Users/admin/builder/spi-builder-workspace/.derivedData/Build/Products/Debug-watchos/PackageFrameworks -F /Users/admin/builder/spi-builder-workspace/.derivedData/Build/Products/Debug-watchos/PackageFrameworks -F /Users/admin/builder/spi-builder-workspace/.derivedData/Build/Products/Debug-watchos/PackageFrameworks -F /Users/admin/builder/spi-builder-workspace/.derivedData/Build/Products/Debug-watchos -F /Applications/Xcode-16.2.0.app/Contents/Developer/Platforms/WatchOS.platform/Developer/Library/Frameworks -F /Applications/Xcode-16.2.0.app/Contents/Developer/Platforms/WatchOS.platform/Developer/SDKs/WatchOS11.2.sdk/Developer/Library/Frameworks -no-color-diagnostics -enable-testing -g -debug-info-format\=dwarf -dwarf-version\=4 -module-cache-path /Users/admin/builder/spi-builder-workspace/.derivedData/ModuleCache.noindex -profile-generate -profile-coverage-mapping -swift-version 6 -enforce-exclusivity\=checked -Onone -D SWIFT_PACKAGE -D DEBUG -D Xcode -serialize-debugging-options -load-plugin-executable /Users/admin/builder/spi-builder-workspace/.derivedData/Build/Products/Debug/CasePathsMacros\#CasePathsMacros -load-plugin-executable /Users/admin/builder/spi-builder-workspace/.derivedData/Build/Products/Debug/ComposableArchitectureMacros\#ComposableArchitectureMacros -load-plugin-executable /Users/admin/builder/spi-builder-workspace/.derivedData/Build/Products/Debug/DependenciesMacrosPlugin\#DependenciesMacrosPlugin -load-plugin-executable /Users/admin/builder/spi-builder-workspace/.derivedData/Build/Products/Debug/PerceptionMacros\#PerceptionMacros -const-gather-protocols-file /Users/admin/builder/spi-builder-workspace/.derivedData/Build/Intermediates.noindex/AUv3Controls.build/Debug-watchos/AUv3Controls.build/Objects-normal/arm64/AUv3Controls_const_extract_protocols.json -enable-experimental-feature StrictConcurrency\=complete -enable-experimental-feature DebugDescriptionMacro -enable-experimental-feature OpaqueTypeErasure -empty-abi-descriptor -plugin-path /Applications/Xcode-16.2.0.app/Contents/Developer/Toolchains/XcodeDefault.xctoolchain/usr/lib/swift/host/plugins/testing -validate-clang-modules-once -clang-build-session-file /Users/admin/builder/spi-builder-workspace/.derivedData/ModuleCache.noindex/Session.modulevalidation -Xcc -working-directory -Xcc /Users/admin/builder/spi-builder-workspace/.swiftpm/xcode -resource-dir /Applications/Xcode-16.2.0.app/Contents/Developer/Toolchains/XcodeDefault.xctoolchain/usr/lib/swift -enable-anonymous-context-mangled-names -file-compilation-dir /Users/admin/builder/spi-builder-workspace/.swiftpm/xcode -Xcc -fmodule-map-file\=/Users/admin/builder/spi-builder-workspace/.derivedData/Build/Intermediates.noindex/GeneratedModuleMaps-watchos/UIKitNavigationShim.modulemap -Xcc -D_LIBCPP_HARDENING_MODE\=_LIBCPP_HARDENING_MODE_DEBUG -Xcc -ivfsstatcache -Xcc /Users/admin/builder/spi-builder-workspace/.derivedData/SDKStatCaches.noindex/watchos11.2-22S97-8cb5c683f5e64b0ecfc74e8d0065fbf6.sdkstatcache -Xcc -I/Users/admin/builder/spi-builder-workspace/.derivedData/Build/Intermediates.noindex/AUv3Controls.build/Debug-watchos/AUv3Controls.build/swift-overrides.hmap -Xcc -I/Users/admin/builder/spi-builder-workspace/.dependencies/checkouts/swift-navigation/Sources/UIKitNavigationShim/include -Xcc -I/Users/admin/builder/spi-builder-workspace/.derivedData/Build/Products/Debug-watchos/include -Xcc -I/Users/admin/builder/spi-builder-workspace/.derivedData/Build/Intermediates.noindex/AUv3Controls.build/Debug-watchos/AUv3Controls.build/DerivedSources-normal/arm64 -Xcc -I/Users/admin/builder/spi-builder-workspace/.derivedData/Build/Intermediates.noindex/AUv3Controls.build/Debug-watchos/AUv3Controls.build/DerivedSources/arm64 -Xcc -I/Users/admin/builder/spi-builder-workspace/.derivedData/Build/Intermediates.noindex/AUv3Controls.build/Debug-watchos/AUv3Controls.build/DerivedSources -Xcc -DSWIFT_PACKAGE -Xcc -DDEBUG\=1 -module-name AUv3Controls -package-name spi_builder_workspace -frontend-parseable-output -disable-clang-spi -target-sdk-version 11.2 -target-sdk-name watchos11.2 -external-plugin-path /Applications/Xcode-16.2.0.app/Contents/Developer/Platforms/WatchOS.platform/Developer/usr/lib/swift/host/plugins\#/Applications/Xcode-16.2.0.app/Contents/Developer/Platforms/WatchOS.platform/Developer/usr/bin/swift-plugin-server -external-plugin-path /Applications/Xcode-16.2.0.app/Contents/Developer/Platforms/WatchOS.platform/Developer/usr/local/lib/swift/host/plugins\#/Applications/Xcode-16.2.0.app/Contents/Developer/Platforms/WatchOS.platform/Developer/usr/bin/swift-plugin-server -plugin-path /Applications/Xcode-16.2.0.app/Contents/Developer/Toolchains/XcodeDefault.xctoolchain/usr/lib/swift/host/plugins -plugin-path /Applications/Xcode-16.2.0.app/Contents/Developer/Toolchains/XcodeDefault.xctoolchain/usr/local/lib/swift/host/plugins -o /Users/admin/builder/spi-builder-workspace/.derivedData/Build/Intermediates.noindex/AUv3Controls.build/Debug-watchos/AUv3Controls.build/Objects-normal/arm64/AUParameter.o -o /Users/admin/builder/spi-builder-workspace/.derivedData/Build/Intermediates.noindex/AUv3Controls.build/Debug-watchos/AUv3Controls.build/Objects-normal/arm64/AUParameterTree.o -o /Users/admin/builder/spi-builder-workspace/.derivedData/Build/Intermediates.noindex/AUv3Controls.build/Debug-watchos/AUv3Controls.build/Objects-normal/arm64/Angle.o -index-unit-output-path /AUv3Controls.build/Debug-watchos/AUv3Controls.build/Objects-normal/arm64/AUParameter.o -index-unit-output-path /AUv3Controls.build/Debug-watchos/AUv3Controls.build/Objects-normal/arm64/AUParameterTree.o -index-unit-output-path /AUv3Controls.build/Debug-watchos/AUv3Controls.build/Objects-normal/arm64/Angle.o -index-store-path /Users/admin/builder/spi-builder-workspace/.derivedData/Index.noindex/DataStore -index-system-modules
/Users/admin/builder/spi-builder-workspace/Sources/AUv3Controls/Extensions/AUParameter.swift:3:8: error: no such module 'AudioToolbox'
import AudioToolbox
       ^
SwiftCompile normal arm64 /Users/admin/builder/spi-builder-workspace/Sources/AUv3Controls/Extensions/AUParameterTree.swift (in target 'AUv3Controls' from project 'AUv3Controls')
    cd /Users/admin/builder/spi-builder-workspace/.swiftpm/xcode
    /Applications/Xcode-16.2.0.app/Contents/Developer/Toolchains/XcodeDefault.xctoolchain/usr/bin/swift-frontend -c /Users/admin/builder/spi-builder-workspace/.derivedData/Build/Intermediates.noindex/AUv3Controls.build/Debug-watchos/AUv3Controls.build/DerivedSources/resource_bundle_accessor.swift /Users/admin/builder/spi-builder-workspace/Sources/AUv3Controls/Examples/Duality.swift /Users/admin/builder/spi-builder-workspace/Sources/AUv3Controls/Examples/Envelope.swift -primary-file /Users/admin/builder/spi-builder-workspace/Sources/AUv3Controls/Extensions/AUParameter.swift -primary-file /Users/admin/builder/spi-builder-workspace/Sources/AUv3Controls/Extensions/AUParameterTree.swift -primary-file /Users/admin/builder/spi-builder-workspace/Sources/AUv3Controls/Extensions/Angle.swift /Users/admin/builder/spi-builder-workspace/Sources/AUv3Controls/Extensions/ClosedRange.swift /Users/admin/builder/spi-builder-workspace/Sources/AUv3Controls/Extensions/Color.swift /Users/admin/builder/spi-builder-workspace/Sources/AUv3Controls/Extensions/KeyPath.swift /Users/admin/builder/spi-builder-workspace/Sources/AUv3Controls/Extensions/UUID.swift /Users/admin/builder/spi-builder-workspace/Sources/AUv3Controls/Extensions/View.swift /Users/admin/builder/spi-builder-workspace/Sources/AUv3Controls/Knob/ControlFeature.swift /Users/admin/builder/spi-builder-workspace/Sources/AUv3Controls/Knob/EditorFeature.swift /Users/admin/builder/spi-builder-workspace/Sources/AUv3Controls/Knob/KnobConfig.swift /Users/admin/builder/spi-builder-workspace/Sources/AUv3Controls/Knob/KnobFeature.swift /Users/admin/builder/spi-builder-workspace/Sources/AUv3Controls/Knob/KnobValueFormatter.swift /Users/admin/builder/spi-builder-workspace/Sources/AUv3Controls/Knob/NormValueTransform.swift /Users/admin/builder/spi-builder-workspace/Sources/AUv3Controls/Knob/TitleFeature.swift /Users/admin/builder/spi-builder-workspace/Sources/AUv3Controls/Knob/TrackFeature.swift /Users/admin/builder/spi-builder-workspace/Sources/AUv3Controls/Support/Logger.swift /Users/admin/builder/spi-builder-workspace/Sources/AUv3Controls/Theme.swift /Users/admin/builder/spi-builder-workspace/Sources/AUv3Controls/Toggle/CheckedToggleStyle.swift /Users/admin/builder/spi-builder-workspace/Sources/AUv3Controls/Toggle/ToggleFeature.swift /Users/admin/builder/spi-builder-workspace/.derivedData/Build/Intermediates.noindex/AUv3Controls.build/Debug-watchos/AUv3Controls.build/DerivedSources/GeneratedAssetSymbols.swift -supplementary-output-file-map /Users/admin/builder/spi-builder-workspace/.derivedData/Build/Intermediates.noindex/AUv3Controls.build/Debug-watchos/AUv3Controls.build/Objects-normal/arm64/supplementaryOutputs-3 -target arm64-apple-watchos10.0 -Xllvm -aarch64-use-tbi -enable-objc-interop -stack-check -sdk /Applications/Xcode-16.2.0.app/Contents/Developer/Platforms/WatchOS.platform/Developer/SDKs/WatchOS11.2.sdk -I /Users/admin/builder/spi-builder-workspace/.derivedData/Build/Products/Debug-watchos -I /Applications/Xcode-16.2.0.app/Contents/Developer/Platforms/WatchOS.platform/Developer/usr/lib -F /Users/admin/builder/spi-builder-workspace/.derivedData/Build/Products/Debug-watchos/PackageFrameworks -F /Users/admin/builder/spi-builder-workspace/.derivedData/Build/Products/Debug-watchos/PackageFrameworks -F /Users/admin/builder/spi-builder-workspace/.derivedData/Build/Products/Debug-watchos/PackageFrameworks -F /Users/admin/builder/spi-builder-workspace/.derivedData/Build/Products/Debug-watchos/PackageFrameworks -F /Users/admin/builder/spi-builder-workspace/.derivedData/Build/Products/Debug-watchos/PackageFrameworks -F /Users/admin/builder/spi-builder-workspace/.derivedData/Build/Products/Debug-watchos/PackageFrameworks -F /Users/admin/builder/spi-builder-workspace/.derivedData/Build/Products/Debug-watchos/PackageFrameworks -F /Users/admin/builder/spi-builder-workspace/.derivedData/Build/Products/Debug-watchos/PackageFrameworks -F /Users/admin/builder/spi-builder-workspace/.derivedData/Build/Products/Debug-watchos/PackageFrameworks -F /Users/admin/builder/spi-builder-workspace/.derivedData/Build/Products/Debug-watchos/PackageFrameworks -F /Users/admin/builder/spi-builder-workspace/.derivedData/Build/Products/Debug-watchos/PackageFrameworks -F /Users/admin/builder/spi-builder-workspace/.derivedData/Build/Products/Debug-watchos/PackageFrameworks -F /Users/admin/builder/spi-builder-workspace/.derivedData/Build/Products/Debug-watchos/PackageFrameworks -F /Users/admin/builder/spi-builder-workspace/.derivedData/Build/Products/Debug-watchos/PackageFrameworks -F /Users/admin/builder/spi-builder-workspace/.derivedData/Build/Products/Debug-watchos/PackageFrameworks -F /Users/admin/builder/spi-builder-workspace/.derivedData/Build/Products/Debug-watchos/PackageFrameworks -F /Users/admin/builder/spi-builder-workspace/.derivedData/Build/Products/Debug-watchos/PackageFrameworks -F /Users/admin/builder/spi-builder-workspace/.derivedData/Build/Products/Debug-watchos/PackageFrameworks -F /Users/admin/builder/spi-builder-workspace/.derivedData/Build/Products/Debug-watchos/PackageFrameworks -F /Users/admin/builder/spi-builder-workspace/.derivedData/Build/Products/Debug-watchos/PackageFrameworks -F /Users/admin/builder/spi-builder-workspace/.derivedData/Build/Products/Debug-watchos/PackageFrameworks -F /Users/admin/builder/spi-builder-workspace/.derivedData/Build/Products/Debug-watchos/PackageFrameworks -F /Users/admin/builder/spi-builder-workspace/.derivedData/Build/Products/Debug-watchos/PackageFrameworks -F /Users/admin/builder/spi-builder-workspace/.derivedData/Build/Products/Debug-watchos/PackageFrameworks -F /Users/admin/builder/spi-builder-workspace/.derivedData/Build/Products/Debug-watchos/PackageFrameworks -F /Users/admin/builder/spi-builder-workspace/.derivedData/Build/Products/Debug-watchos -F /Applications/Xcode-16.2.0.app/Contents/Developer/Platforms/WatchOS.platform/Developer/Library/Frameworks -F /Applications/Xcode-16.2.0.app/Contents/Developer/Platforms/WatchOS.platform/Developer/SDKs/WatchOS11.2.sdk/Developer/Library/Frameworks -no-color-diagnostics -enable-testing -g -debug-info-format\=dwarf -dwarf-version\=4 -module-cache-path /Users/admin/builder/spi-builder-workspace/.derivedData/ModuleCache.noindex -profile-generate -profile-coverage-mapping -swift-version 6 -enforce-exclusivity\=checked -Onone -D SWIFT_PACKAGE -D DEBUG -D Xcode -serialize-debugging-options -load-plugin-executable /Users/admin/builder/spi-builder-workspace/.derivedData/Build/Products/Debug/CasePathsMacros\#CasePathsMacros -load-plugin-executable /Users/admin/builder/spi-builder-workspace/.derivedData/Build/Products/Debug/ComposableArchitectureMacros\#ComposableArchitectureMacros -load-plugin-executable /Users/admin/builder/spi-builder-workspace/.derivedData/Build/Products/Debug/DependenciesMacrosPlugin\#DependenciesMacrosPlugin -load-plugin-executable /Users/admin/builder/spi-builder-workspace/.derivedData/Build/Products/Debug/PerceptionMacros\#PerceptionMacros -const-gather-protocols-file /Users/admin/builder/spi-builder-workspace/.derivedData/Build/Intermediates.noindex/AUv3Controls.build/Debug-watchos/AUv3Controls.build/Objects-normal/arm64/AUv3Controls_const_extract_protocols.json -enable-experimental-feature StrictConcurrency\=complete -enable-experimental-feature DebugDescriptionMacro -enable-experimental-feature OpaqueTypeErasure -empty-abi-descriptor -plugin-path /Applications/Xcode-16.2.0.app/Contents/Developer/Toolchains/XcodeDefault.xctoolchain/usr/lib/swift/host/plugins/testing -validate-clang-modules-once -clang-build-session-file /Users/admin/builder/spi-builder-workspace/.derivedData/ModuleCache.noindex/Session.modulevalidation -Xcc -working-directory -Xcc /Users/admin/builder/spi-builder-workspace/.swiftpm/xcode -resource-dir /Applications/Xcode-16.2.0.app/Contents/Developer/Toolchains/XcodeDefault.xctoolchain/usr/lib/swift -enable-anonymous-context-mangled-names -file-compilation-dir /Users/admin/builder/spi-builder-workspace/.swiftpm/xcode -Xcc -fmodule-map-file\=/Users/admin/builder/spi-builder-workspace/.derivedData/Build/Intermediates.noindex/GeneratedModuleMaps-watchos/UIKitNavigationShim.modulemap -Xcc -D_LIBCPP_HARDENING_MODE\=_LIBCPP_HARDENING_MODE_DEBUG -Xcc -ivfsstatcache -Xcc /Users/admin/builder/spi-builder-workspace/.derivedData/SDKStatCaches.noindex/watchos11.2-22S97-8cb5c683f5e64b0ecfc74e8d0065fbf6.sdkstatcache -Xcc -I/Users/admin/builder/spi-builder-workspace/.derivedData/Build/Intermediates.noindex/AUv3Controls.build/Debug-watchos/AUv3Controls.build/swift-overrides.hmap -Xcc -I/Users/admin/builder/spi-builder-workspace/.dependencies/checkouts/swift-navigation/Sources/UIKitNavigationShim/include -Xcc -I/Users/admin/builder/spi-builder-workspace/.derivedData/Build/Products/Debug-watchos/include -Xcc -I/Users/admin/builder/spi-builder-workspace/.derivedData/Build/Intermediates.noindex/AUv3Controls.build/Debug-watchos/AUv3Controls.build/DerivedSources-normal/arm64 -Xcc -I/Users/admin/builder/spi-builder-workspace/.derivedData/Build/Intermediates.noindex/AUv3Controls.build/Debug-watchos/AUv3Controls.build/DerivedSources/arm64 -Xcc -I/Users/admin/builder/spi-builder-workspace/.derivedData/Build/Intermediates.noindex/AUv3Controls.build/Debug-watchos/AUv3Controls.build/DerivedSources -Xcc -DSWIFT_PACKAGE -Xcc -DDEBUG\=1 -module-name AUv3Controls -package-name spi_builder_workspace -frontend-parseable-output -disable-clang-spi -target-sdk-version 11.2 -target-sdk-name watchos11.2 -external-plugin-path /Applications/Xcode-16.2.0.app/Contents/Developer/Platforms/WatchOS.platform/Developer/usr/lib/swift/host/plugins\#/Applications/Xcode-16.2.0.app/Contents/Developer/Platforms/WatchOS.platform/Developer/usr/bin/swift-plugin-server -external-plugin-path /Applications/Xcode-16.2.0.app/Contents/Developer/Platforms/WatchOS.platform/Developer/usr/local/lib/swift/host/plugins\#/Applications/Xcode-16.2.0.app/Contents/Developer/Platforms/WatchOS.platform/Developer/usr/bin/swift-plugin-server -plugin-path /Applications/Xcode-16.2.0.app/Contents/Developer/Toolchains/XcodeDefault.xctoolchain/usr/lib/swift/host/plugins -plugin-path /Applications/Xcode-16.2.0.app/Contents/Developer/Toolchains/XcodeDefault.xctoolchain/usr/local/lib/swift/host/plugins -o /Users/admin/builder/spi-builder-workspace/.derivedData/Build/Intermediates.noindex/AUv3Controls.build/Debug-watchos/AUv3Controls.build/Objects-normal/arm64/AUParameter.o -o /Users/admin/builder/spi-builder-workspace/.derivedData/Build/Intermediates.noindex/AUv3Controls.build/Debug-watchos/AUv3Controls.build/Objects-normal/arm64/AUParameterTree.o -o /Users/admin/builder/spi-builder-workspace/.derivedData/Build/Intermediates.noindex/AUv3Controls.build/Debug-watchos/AUv3Controls.build/Objects-normal/arm64/Angle.o -index-unit-output-path /AUv3Controls.build/Debug-watchos/AUv3Controls.build/Objects-normal/arm64/AUParameter.o -index-unit-output-path /AUv3Controls.build/Debug-watchos/AUv3Controls.build/Objects-normal/arm64/AUParameterTree.o -index-unit-output-path /AUv3Controls.build/Debug-watchos/AUv3Controls.build/Objects-normal/arm64/Angle.o -index-store-path /Users/admin/builder/spi-builder-workspace/.derivedData/Index.noindex/DataStore -index-system-modules
SwiftCompile normal arm64 /Users/admin/builder/spi-builder-workspace/Sources/AUv3Controls/Extensions/Angle.swift (in target 'AUv3Controls' from project 'AUv3Controls')
    cd /Users/admin/builder/spi-builder-workspace/.swiftpm/xcode
    /Applications/Xcode-16.2.0.app/Contents/Developer/Toolchains/XcodeDefault.xctoolchain/usr/bin/swift-frontend -c /Users/admin/builder/spi-builder-workspace/.derivedData/Build/Intermediates.noindex/AUv3Controls.build/Debug-watchos/AUv3Controls.build/DerivedSources/resource_bundle_accessor.swift /Users/admin/builder/spi-builder-workspace/Sources/AUv3Controls/Examples/Duality.swift /Users/admin/builder/spi-builder-workspace/Sources/AUv3Controls/Examples/Envelope.swift -primary-file /Users/admin/builder/spi-builder-workspace/Sources/AUv3Controls/Extensions/AUParameter.swift -primary-file /Users/admin/builder/spi-builder-workspace/Sources/AUv3Controls/Extensions/AUParameterTree.swift -primary-file /Users/admin/builder/spi-builder-workspace/Sources/AUv3Controls/Extensions/Angle.swift /Users/admin/builder/spi-builder-workspace/Sources/AUv3Controls/Extensions/ClosedRange.swift /Users/admin/builder/spi-builder-workspace/Sources/AUv3Controls/Extensions/Color.swift /Users/admin/builder/spi-builder-workspace/Sources/AUv3Controls/Extensions/KeyPath.swift /Users/admin/builder/spi-builder-workspace/Sources/AUv3Controls/Extensions/UUID.swift /Users/admin/builder/spi-builder-workspace/Sources/AUv3Controls/Extensions/View.swift /Users/admin/builder/spi-builder-workspace/Sources/AUv3Controls/Knob/ControlFeature.swift /Users/admin/builder/spi-builder-workspace/Sources/AUv3Controls/Knob/EditorFeature.swift /Users/admin/builder/spi-builder-workspace/Sources/AUv3Controls/Knob/KnobConfig.swift /Users/admin/builder/spi-builder-workspace/Sources/AUv3Controls/Knob/KnobFeature.swift /Users/admin/builder/spi-builder-workspace/Sources/AUv3Controls/Knob/KnobValueFormatter.swift /Users/admin/builder/spi-builder-workspace/Sources/AUv3Controls/Knob/NormValueTransform.swift /Users/admin/builder/spi-builder-workspace/Sources/AUv3Controls/Knob/TitleFeature.swift /Users/admin/builder/spi-builder-workspace/Sources/AUv3Controls/Knob/TrackFeature.swift /Users/admin/builder/spi-builder-workspace/Sources/AUv3Controls/Support/Logger.swift /Users/admin/builder/spi-builder-workspace/Sources/AUv3Controls/Theme.swift /Users/admin/builder/spi-builder-workspace/Sources/AUv3Controls/Toggle/CheckedToggleStyle.swift /Users/admin/builder/spi-builder-workspace/Sources/AUv3Controls/Toggle/ToggleFeature.swift /Users/admin/builder/spi-builder-workspace/.derivedData/Build/Intermediates.noindex/AUv3Controls.build/Debug-watchos/AUv3Controls.build/DerivedSources/GeneratedAssetSymbols.swift -supplementary-output-file-map /Users/admin/builder/spi-builder-workspace/.derivedData/Build/Intermediates.noindex/AUv3Controls.build/Debug-watchos/AUv3Controls.build/Objects-normal/arm64/supplementaryOutputs-3 -target arm64-apple-watchos10.0 -Xllvm -aarch64-use-tbi -enable-objc-interop -stack-check -sdk /Applications/Xcode-16.2.0.app/Contents/Developer/Platforms/WatchOS.platform/Developer/SDKs/WatchOS11.2.sdk -I /Users/admin/builder/spi-builder-workspace/.derivedData/Build/Products/Debug-watchos -I /Applications/Xcode-16.2.0.app/Contents/Developer/Platforms/WatchOS.platform/Developer/usr/lib -F /Users/admin/builder/spi-builder-workspace/.derivedData/Build/Products/Debug-watchos/PackageFrameworks -F /Users/admin/builder/spi-builder-workspace/.derivedData/Build/Products/Debug-watchos/PackageFrameworks -F /Users/admin/builder/spi-builder-workspace/.derivedData/Build/Products/Debug-watchos/PackageFrameworks -F /Users/admin/builder/spi-builder-workspace/.derivedData/Build/Products/Debug-watchos/PackageFrameworks -F /Users/admin/builder/spi-builder-workspace/.derivedData/Build/Products/Debug-watchos/PackageFrameworks -F /Users/admin/builder/spi-builder-workspace/.derivedData/Build/Products/Debug-watchos/PackageFrameworks -F /Users/admin/builder/spi-builder-workspace/.derivedData/Build/Products/Debug-watchos/PackageFrameworks -F /Users/admin/builder/spi-builder-workspace/.derivedData/Build/Products/Debug-watchos/PackageFrameworks -F /Users/admin/builder/spi-builder-workspace/.derivedData/Build/Products/Debug-watchos/PackageFrameworks -F /Users/admin/builder/spi-builder-workspace/.derivedData/Build/Products/Debug-watchos/PackageFrameworks -F /Users/admin/builder/spi-builder-workspace/.derivedData/Build/Products/Debug-watchos/PackageFrameworks -F /Users/admin/builder/spi-builder-workspace/.derivedData/Build/Products/Debug-watchos/PackageFrameworks -F /Users/admin/builder/spi-builder-workspace/.derivedData/Build/Products/Debug-watchos/PackageFrameworks -F /Users/admin/builder/spi-builder-workspace/.derivedData/Build/Products/Debug-watchos/PackageFrameworks -F /Users/admin/builder/spi-builder-workspace/.derivedData/Build/Products/Debug-watchos/PackageFrameworks -F /Users/admin/builder/spi-builder-workspace/.derivedData/Build/Products/Debug-watchos/PackageFrameworks -F /Users/admin/builder/spi-builder-workspace/.derivedData/Build/Products/Debug-watchos/PackageFrameworks -F /Users/admin/builder/spi-builder-workspace/.derivedData/Build/Products/Debug-watchos/PackageFrameworks -F /Users/admin/builder/spi-builder-workspace/.derivedData/Build/Products/Debug-watchos/PackageFrameworks -F /Users/admin/builder/spi-builder-workspace/.derivedData/Build/Products/Debug-watchos/PackageFrameworks -F /Users/admin/builder/spi-builder-workspace/.derivedData/Build/Products/Debug-watchos/PackageFrameworks -F /Users/admin/builder/spi-builder-workspace/.derivedData/Build/Products/Debug-watchos/PackageFrameworks -F /Users/admin/builder/spi-builder-workspace/.derivedData/Build/Products/Debug-watchos/PackageFrameworks -F /Users/admin/builder/spi-builder-workspace/.derivedData/Build/Products/Debug-watchos/PackageFrameworks -F /Users/admin/builder/spi-builder-workspace/.derivedData/Build/Products/Debug-watchos/PackageFrameworks -F /Users/admin/builder/spi-builder-workspace/.derivedData/Build/Products/Debug-watchos -F /Applications/Xcode-16.2.0.app/Contents/Developer/Platforms/WatchOS.platform/Developer/Library/Frameworks -F /Applications/Xcode-16.2.0.app/Contents/Developer/Platforms/WatchOS.platform/Developer/SDKs/WatchOS11.2.sdk/Developer/Library/Frameworks -no-color-diagnostics -enable-testing -g -debug-info-format\=dwarf -dwarf-version\=4 -module-cache-path /Users/admin/builder/spi-builder-workspace/.derivedData/ModuleCache.noindex -profile-generate -profile-coverage-mapping -swift-version 6 -enforce-exclusivity\=checked -Onone -D SWIFT_PACKAGE -D DEBUG -D Xcode -serialize-debugging-options -load-plugin-executable /Users/admin/builder/spi-builder-workspace/.derivedData/Build/Products/Debug/CasePathsMacros\#CasePathsMacros -load-plugin-executable /Users/admin/builder/spi-builder-workspace/.derivedData/Build/Products/Debug/ComposableArchitectureMacros\#ComposableArchitectureMacros -load-plugin-executable /Users/admin/builder/spi-builder-workspace/.derivedData/Build/Products/Debug/DependenciesMacrosPlugin\#DependenciesMacrosPlugin -load-plugin-executable /Users/admin/builder/spi-builder-workspace/.derivedData/Build/Products/Debug/PerceptionMacros\#PerceptionMacros -const-gather-protocols-file /Users/admin/builder/spi-builder-workspace/.derivedData/Build/Intermediates.noindex/AUv3Controls.build/Debug-watchos/AUv3Controls.build/Objects-normal/arm64/AUv3Controls_const_extract_protocols.json -enable-experimental-feature StrictConcurrency\=complete -enable-experimental-feature DebugDescriptionMacro -enable-experimental-feature OpaqueTypeErasure -empty-abi-descriptor -plugin-path /Applications/Xcode-16.2.0.app/Contents/Developer/Toolchains/XcodeDefault.xctoolchain/usr/lib/swift/host/plugins/testing -validate-clang-modules-once -clang-build-session-file /Users/admin/builder/spi-builder-workspace/.derivedData/ModuleCache.noindex/Session.modulevalidation -Xcc -working-directory -Xcc /Users/admin/builder/spi-builder-workspace/.swiftpm/xcode -resource-dir /Applications/Xcode-16.2.0.app/Contents/Developer/Toolchains/XcodeDefault.xctoolchain/usr/lib/swift -enable-anonymous-context-mangled-names -file-compilation-dir /Users/admin/builder/spi-builder-workspace/.swiftpm/xcode -Xcc -fmodule-map-file\=/Users/admin/builder/spi-builder-workspace/.derivedData/Build/Intermediates.noindex/GeneratedModuleMaps-watchos/UIKitNavigationShim.modulemap -Xcc -D_LIBCPP_HARDENING_MODE\=_LIBCPP_HARDENING_MODE_DEBUG -Xcc -ivfsstatcache -Xcc /Users/admin/builder/spi-builder-workspace/.derivedData/SDKStatCaches.noindex/watchos11.2-22S97-8cb5c683f5e64b0ecfc74e8d0065fbf6.sdkstatcache -Xcc -I/Users/admin/builder/spi-builder-workspace/.derivedData/Build/Intermediates.noindex/AUv3Controls.build/Debug-watchos/AUv3Controls.build/swift-overrides.hmap -Xcc -I/Users/admin/builder/spi-builder-workspace/.dependencies/checkouts/swift-navigation/Sources/UIKitNavigationShim/include -Xcc -I/Users/admin/builder/spi-builder-workspace/.derivedData/Build/Products/Debug-watchos/include -Xcc -I/Users/admin/builder/spi-builder-workspace/.derivedData/Build/Intermediates.noindex/AUv3Controls.build/Debug-watchos/AUv3Controls.build/DerivedSources-normal/arm64 -Xcc -I/Users/admin/builder/spi-builder-workspace/.derivedData/Build/Intermediates.noindex/AUv3Controls.build/Debug-watchos/AUv3Controls.build/DerivedSources/arm64 -Xcc -I/Users/admin/builder/spi-builder-workspace/.derivedData/Build/Intermediates.noindex/AUv3Controls.build/Debug-watchos/AUv3Controls.build/DerivedSources -Xcc -DSWIFT_PACKAGE -Xcc -DDEBUG\=1 -module-name AUv3Controls -package-name spi_builder_workspace -frontend-parseable-output -disable-clang-spi -target-sdk-version 11.2 -target-sdk-name watchos11.2 -external-plugin-path /Applications/Xcode-16.2.0.app/Contents/Developer/Platforms/WatchOS.platform/Developer/usr/lib/swift/host/plugins\#/Applications/Xcode-16.2.0.app/Contents/Developer/Platforms/WatchOS.platform/Developer/usr/bin/swift-plugin-server -external-plugin-path /Applications/Xcode-16.2.0.app/Contents/Developer/Platforms/WatchOS.platform/Developer/usr/local/lib/swift/host/plugins\#/Applications/Xcode-16.2.0.app/Contents/Developer/Platforms/WatchOS.platform/Developer/usr/bin/swift-plugin-server -plugin-path /Applications/Xcode-16.2.0.app/Contents/Developer/Toolchains/XcodeDefault.xctoolchain/usr/lib/swift/host/plugins -plugin-path /Applications/Xcode-16.2.0.app/Contents/Developer/Toolchains/XcodeDefault.xctoolchain/usr/local/lib/swift/host/plugins -o /Users/admin/builder/spi-builder-workspace/.derivedData/Build/Intermediates.noindex/AUv3Controls.build/Debug-watchos/AUv3Controls.build/Objects-normal/arm64/AUParameter.o -o /Users/admin/builder/spi-builder-workspace/.derivedData/Build/Intermediates.noindex/AUv3Controls.build/Debug-watchos/AUv3Controls.build/Objects-normal/arm64/AUParameterTree.o -o /Users/admin/builder/spi-builder-workspace/.derivedData/Build/Intermediates.noindex/AUv3Controls.build/Debug-watchos/AUv3Controls.build/Objects-normal/arm64/Angle.o -index-unit-output-path /AUv3Controls.build/Debug-watchos/AUv3Controls.build/Objects-normal/arm64/AUParameter.o -index-unit-output-path /AUv3Controls.build/Debug-watchos/AUv3Controls.build/Objects-normal/arm64/AUParameterTree.o -index-unit-output-path /AUv3Controls.build/Debug-watchos/AUv3Controls.build/Objects-normal/arm64/Angle.o -index-store-path /Users/admin/builder/spi-builder-workspace/.derivedData/Index.noindex/DataStore -index-system-modules
SwiftCompile normal arm64 Compiling\ ClosedRange.swift,\ Color.swift,\ KeyPath.swift /Users/admin/builder/spi-builder-workspace/Sources/AUv3Controls/Extensions/ClosedRange.swift /Users/admin/builder/spi-builder-workspace/Sources/AUv3Controls/Extensions/Color.swift /Users/admin/builder/spi-builder-workspace/Sources/AUv3Controls/Extensions/KeyPath.swift (in target 'AUv3Controls' from project 'AUv3Controls')
    cd /Users/admin/builder/spi-builder-workspace/.swiftpm/xcode
    builtin-swiftTaskExecution -- /Applications/Xcode-16.2.0.app/Contents/Developer/Toolchains/XcodeDefault.xctoolchain/usr/bin/swift-frontend -frontend -c /Users/admin/builder/spi-builder-workspace/.derivedData/Build/Intermediates.noindex/AUv3Controls.build/Debug-watchos/AUv3Controls.build/DerivedSources/resource_bundle_accessor.swift /Users/admin/builder/spi-builder-workspace/Sources/AUv3Controls/Examples/Duality.swift /Users/admin/builder/spi-builder-workspace/Sources/AUv3Controls/Examples/Envelope.swift /Users/admin/builder/spi-builder-workspace/Sources/AUv3Controls/Extensions/AUParameter.swift /Users/admin/builder/spi-builder-workspace/Sources/AUv3Controls/Extensions/AUParameterTree.swift /Users/admin/builder/spi-builder-workspace/Sources/AUv3Controls/Extensions/Angle.swift -primary-file /Users/admin/builder/spi-builder-workspace/Sources/AUv3Controls/Extensions/ClosedRange.swift -primary-file /Users/admin/builder/spi-builder-workspace/Sources/AUv3Controls/Extensions/Color.swift -primary-file /Users/admin/builder/spi-builder-workspace/Sources/AUv3Controls/Extensions/KeyPath.swift /Users/admin/builder/spi-builder-workspace/Sources/AUv3Controls/Extensions/UUID.swift /Users/admin/builder/spi-builder-workspace/Sources/AUv3Controls/Extensions/View.swift /Users/admin/builder/spi-builder-workspace/Sources/AUv3Controls/Knob/ControlFeature.swift /Users/admin/builder/spi-builder-workspace/Sources/AUv3Controls/Knob/EditorFeature.swift /Users/admin/builder/spi-builder-workspace/Sources/AUv3Controls/Knob/KnobConfig.swift /Users/admin/builder/spi-builder-workspace/Sources/AUv3Controls/Knob/KnobFeature.swift /Users/admin/builder/spi-builder-workspace/Sources/AUv3Controls/Knob/KnobValueFormatter.swift /Users/admin/builder/spi-builder-workspace/Sources/AUv3Controls/Knob/NormValueTransform.swift /Users/admin/builder/spi-builder-workspace/Sources/AUv3Controls/Knob/TitleFeature.swift /Users/admin/builder/spi-builder-workspace/Sources/AUv3Controls/Knob/TrackFeature.swift /Users/admin/builder/spi-builder-workspace/Sources/AUv3Controls/Support/Logger.swift /Users/admin/builder/spi-builder-workspace/Sources/AUv3Controls/Theme.swift /Users/admin/builder/spi-builder-workspace/Sources/AUv3Controls/Toggle/CheckedToggleStyle.swift /Users/admin/builder/spi-builder-workspace/Sources/AUv3Controls/Toggle/ToggleFeature.swift /Users/admin/builder/spi-builder-workspace/.derivedData/Build/Intermediates.noindex/AUv3Controls.build/Debug-watchos/AUv3Controls.build/DerivedSources/GeneratedAssetSymbols.swift -supplementary-output-file-map /Users/admin/builder/spi-builder-workspace/.derivedData/Build/Intermediates.noindex/AUv3Controls.build/Debug-watchos/AUv3Controls.build/Objects-normal/arm64/supplementaryOutputs-5 -target arm64-apple-watchos10.0 -Xllvm -aarch64-use-tbi -enable-objc-interop -stack-check -sdk /Applications/Xcode-16.2.0.app/Contents/Developer/Platforms/WatchOS.platform/Developer/SDKs/WatchOS11.2.sdk -I /Users/admin/builder/spi-builder-workspace/.derivedData/Build/Products/Debug-watchos -I /Applications/Xcode-16.2.0.app/Contents/Developer/Platforms/WatchOS.platform/Developer/usr/lib -F /Users/admin/builder/spi-builder-workspace/.derivedData/Build/Products/Debug-watchos/PackageFrameworks -F /Users/admin/builder/spi-builder-workspace/.derivedData/Build/Products/Debug-watchos/PackageFrameworks -F /Users/admin/builder/spi-builder-workspace/.derivedData/Build/Products/Debug-watchos/PackageFrameworks -F /Users/admin/builder/spi-builder-workspace/.derivedData/Build/Products/Debug-watchos/PackageFrameworks -F /Users/admin/builder/spi-builder-workspace/.derivedData/Build/Products/Debug-watchos/PackageFrameworks -F /Users/admin/builder/spi-builder-workspace/.derivedData/Build/Products/Debug-watchos/PackageFrameworks -F /Users/admin/builder/spi-builder-workspace/.derivedData/Build/Products/Debug-watchos/PackageFrameworks -F /Users/admin/builder/spi-builder-workspace/.derivedData/Build/Products/Debug-watchos/PackageFrameworks -F /Users/admin/builder/spi-builder-workspace/.derivedData/Build/Products/Debug-watchos/PackageFrameworks -F /Users/admin/builder/spi-builder-workspace/.derivedData/Build/Products/Debug-watchos/PackageFrameworks -F /Users/admin/builder/spi-builder-workspace/.derivedData/Build/Products/Debug-watchos/PackageFrameworks -F /Users/admin/builder/spi-builder-workspace/.derivedData/Build/Products/Debug-watchos/PackageFrameworks -F /Users/admin/builder/spi-builder-workspace/.derivedData/Build/Products/Debug-watchos/PackageFrameworks -F /Users/admin/builder/spi-builder-workspace/.derivedData/Build/Products/Debug-watchos/PackageFrameworks -F /Users/admin/builder/spi-builder-workspace/.derivedData/Build/Products/Debug-watchos/PackageFrameworks -F /Users/admin/builder/spi-builder-workspace/.derivedData/Build/Products/Debug-watchos/PackageFrameworks -F /Users/admin/builder/spi-builder-workspace/.derivedData/Build/Products/Debug-watchos/PackageFrameworks -F /Users/admin/builder/spi-builder-workspace/.derivedData/Build/Products/Debug-watchos/PackageFrameworks -F /Users/admin/builder/spi-builder-workspace/.derivedData/Build/Products/Debug-watchos/PackageFrameworks -F /Users/admin/builder/spi-builder-workspace/.derivedData/Build/Products/Debug-watchos/PackageFrameworks -F /Users/admin/builder/spi-builder-workspace/.derivedData/Build/Products/Debug-watchos/PackageFrameworks -F /Users/admin/builder/spi-builder-workspace/.derivedData/Build/Products/Debug-watchos/PackageFrameworks -F /Users/admin/builder/spi-builder-workspace/.derivedData/Build/Products/Debug-watchos/PackageFrameworks -F /Users/admin/builder/spi-builder-workspace/.derivedData/Build/Products/Debug-watchos/PackageFrameworks -F /Users/admin/builder/spi-builder-workspace/.derivedData/Build/Products/Debug-watchos/PackageFrameworks -F /Users/admin/builder/spi-builder-workspace/.derivedData/Build/Products/Debug-watchos -F /Applications/Xcode-16.2.0.app/Contents/Developer/Platforms/WatchOS.platform/Developer/Library/Frameworks -F /Applications/Xcode-16.2.0.app/Contents/Developer/Platforms/WatchOS.platform/Developer/SDKs/WatchOS11.2.sdk/Developer/Library/Frameworks -no-color-diagnostics -enable-testing -g -debug-info-format\=dwarf -dwarf-version\=4 -module-cache-path /Users/admin/builder/spi-builder-workspace/.derivedData/ModuleCache.noindex -profile-generate -profile-coverage-mapping -swift-version 6 -enforce-exclusivity\=checked -Onone -D SWIFT_PACKAGE -D DEBUG -D Xcode -serialize-debugging-options -load-plugin-executable /Users/admin/builder/spi-builder-workspace/.derivedData/Build/Products/Debug/CasePathsMacros\#CasePathsMacros -load-plugin-executable /Users/admin/builder/spi-builder-workspace/.derivedData/Build/Products/Debug/ComposableArchitectureMacros\#ComposableArchitectureMacros -load-plugin-executable /Users/admin/builder/spi-builder-workspace/.derivedData/Build/Products/Debug/DependenciesMacrosPlugin\#DependenciesMacrosPlugin -load-plugin-executable /Users/admin/builder/spi-builder-workspace/.derivedData/Build/Products/Debug/PerceptionMacros\#PerceptionMacros -const-gather-protocols-file /Users/admin/builder/spi-builder-workspace/.derivedData/Build/Intermediates.noindex/AUv3Controls.build/Debug-watchos/AUv3Controls.build/Objects-normal/arm64/AUv3Controls_const_extract_protocols.json -enable-experimental-feature StrictConcurrency\=complete -enable-experimental-feature DebugDescriptionMacro -enable-experimental-feature OpaqueTypeErasure -empty-abi-descriptor -plugin-path /Applications/Xcode-16.2.0.app/Contents/Developer/Toolchains/XcodeDefault.xctoolchain/usr/lib/swift/host/plugins/testing -validate-clang-modules-once -clang-build-session-file /Users/admin/builder/spi-builder-workspace/.derivedData/ModuleCache.noindex/Session.modulevalidation -Xcc -working-directory -Xcc /Users/admin/builder/spi-builder-workspace/.swiftpm/xcode -resource-dir /Applications/Xcode-16.2.0.app/Contents/Developer/Toolchains/XcodeDefault.xctoolchain/usr/lib/swift -enable-anonymous-context-mangled-names -file-compilation-dir /Users/admin/builder/spi-builder-workspace/.swiftpm/xcode -Xcc -fmodule-map-file\=/Users/admin/builder/spi-builder-workspace/.derivedData/Build/Intermediates.noindex/GeneratedModuleMaps-watchos/UIKitNavigationShim.modulemap -Xcc -D_LIBCPP_HARDENING_MODE\=_LIBCPP_HARDENING_MODE_DEBUG -Xcc -ivfsstatcache -Xcc /Users/admin/builder/spi-builder-workspace/.derivedData/SDKStatCaches.noindex/watchos11.2-22S97-8cb5c683f5e64b0ecfc74e8d0065fbf6.sdkstatcache -Xcc -I/Users/admin/builder/spi-builder-workspace/.derivedData/Build/Intermediates.noindex/AUv3Controls.build/Debug-watchos/AUv3Controls.build/swift-overrides.hmap -Xcc -I/Users/admin/builder/spi-builder-workspace/.dependencies/checkouts/swift-navigation/Sources/UIKitNavigationShim/include -Xcc -I/Users/admin/builder/spi-builder-workspace/.derivedData/Build/Products/Debug-watchos/include -Xcc -I/Users/admin/builder/spi-builder-workspace/.derivedData/Build/Intermediates.noindex/AUv3Controls.build/Debug-watchos/AUv3Controls.build/DerivedSources-normal/arm64 -Xcc -I/Users/admin/builder/spi-builder-workspace/.derivedData/Build/Intermediates.noindex/AUv3Controls.build/Debug-watchos/AUv3Controls.build/DerivedSources/arm64 -Xcc -I/Users/admin/builder/spi-builder-workspace/.derivedData/Build/Intermediates.noindex/AUv3Controls.build/Debug-watchos/AUv3Controls.build/DerivedSources -Xcc -DSWIFT_PACKAGE -Xcc -DDEBUG\=1 -module-name AUv3Controls -package-name spi_builder_workspace -frontend-parseable-output -disable-clang-spi -target-sdk-version 11.2 -target-sdk-name watchos11.2 -external-plugin-path /Applications/Xcode-16.2.0.app/Contents/Developer/Platforms/WatchOS.platform/Developer/usr/lib/swift/host/plugins\#/Applications/Xcode-16.2.0.app/Contents/Developer/Platforms/WatchOS.platform/Developer/usr/bin/swift-plugin-server -external-plugin-path /Applications/Xcode-16.2.0.app/Contents/Developer/Platforms/WatchOS.platform/Developer/usr/local/lib/swift/host/plugins\#/Applications/Xcode-16.2.0.app/Contents/Developer/Platforms/WatchOS.platform/Developer/usr/bin/swift-plugin-server -plugin-path /Applications/Xcode-16.2.0.app/Contents/Developer/Toolchains/XcodeDefault.xctoolchain/usr/lib/swift/host/plugins -plugin-path /Applications/Xcode-16.2.0.app/Contents/Developer/Toolchains/XcodeDefault.xctoolchain/usr/local/lib/swift/host/plugins -o /Users/admin/builder/spi-builder-workspace/.derivedData/Build/Intermediates.noindex/AUv3Controls.build/Debug-watchos/AUv3Controls.build/Objects-normal/arm64/ClosedRange.o -o /Users/admin/builder/spi-builder-workspace/.derivedData/Build/Intermediates.noindex/AUv3Controls.build/Debug-watchos/AUv3Controls.build/Objects-normal/arm64/Color.o -o /Users/admin/builder/spi-builder-workspace/.derivedData/Build/Intermediates.noindex/AUv3Controls.build/Debug-watchos/AUv3Controls.build/Objects-normal/arm64/KeyPath.o -index-unit-output-path /AUv3Controls.build/Debug-watchos/AUv3Controls.build/Objects-normal/arm64/ClosedRange.o -index-unit-output-path /AUv3Controls.build/Debug-watchos/AUv3Controls.build/Objects-normal/arm64/Color.o -index-unit-output-path /AUv3Controls.build/Debug-watchos/AUv3Controls.build/Objects-normal/arm64/KeyPath.o -index-store-path /Users/admin/builder/spi-builder-workspace/.derivedData/Index.noindex/DataStore -index-system-modules
SwiftCompile normal arm64 /Users/admin/builder/spi-builder-workspace/Sources/AUv3Controls/Extensions/ClosedRange.swift (in target 'AUv3Controls' from project 'AUv3Controls')
    cd /Users/admin/builder/spi-builder-workspace/.swiftpm/xcode
    /Applications/Xcode-16.2.0.app/Contents/Developer/Toolchains/XcodeDefault.xctoolchain/usr/bin/swift-frontend -c /Users/admin/builder/spi-builder-workspace/.derivedData/Build/Intermediates.noindex/AUv3Controls.build/Debug-watchos/AUv3Controls.build/DerivedSources/resource_bundle_accessor.swift /Users/admin/builder/spi-builder-workspace/Sources/AUv3Controls/Examples/Duality.swift /Users/admin/builder/spi-builder-workspace/Sources/AUv3Controls/Examples/Envelope.swift /Users/admin/builder/spi-builder-workspace/Sources/AUv3Controls/Extensions/AUParameter.swift /Users/admin/builder/spi-builder-workspace/Sources/AUv3Controls/Extensions/AUParameterTree.swift /Users/admin/builder/spi-builder-workspace/Sources/AUv3Controls/Extensions/Angle.swift -primary-file /Users/admin/builder/spi-builder-workspace/Sources/AUv3Controls/Extensions/ClosedRange.swift -primary-file /Users/admin/builder/spi-builder-workspace/Sources/AUv3Controls/Extensions/Color.swift -primary-file /Users/admin/builder/spi-builder-workspace/Sources/AUv3Controls/Extensions/KeyPath.swift /Users/admin/builder/spi-builder-workspace/Sources/AUv3Controls/Extensions/UUID.swift /Users/admin/builder/spi-builder-workspace/Sources/AUv3Controls/Extensions/View.swift /Users/admin/builder/spi-builder-workspace/Sources/AUv3Controls/Knob/ControlFeature.swift /Users/admin/builder/spi-builder-workspace/Sources/AUv3Controls/Knob/EditorFeature.swift /Users/admin/builder/spi-builder-workspace/Sources/AUv3Controls/Knob/KnobConfig.swift /Users/admin/builder/spi-builder-workspace/Sources/AUv3Controls/Knob/KnobFeature.swift /Users/admin/builder/spi-builder-workspace/Sources/AUv3Controls/Knob/KnobValueFormatter.swift /Users/admin/builder/spi-builder-workspace/Sources/AUv3Controls/Knob/NormValueTransform.swift /Users/admin/builder/spi-builder-workspace/Sources/AUv3Controls/Knob/TitleFeature.swift /Users/admin/builder/spi-builder-workspace/Sources/AUv3Controls/Knob/TrackFeature.swift /Users/admin/builder/spi-builder-workspace/Sources/AUv3Controls/Support/Logger.swift /Users/admin/builder/spi-builder-workspace/Sources/AUv3Controls/Theme.swift /Users/admin/builder/spi-builder-workspace/Sources/AUv3Controls/Toggle/CheckedToggleStyle.swift /Users/admin/builder/spi-builder-workspace/Sources/AUv3Controls/Toggle/ToggleFeature.swift /Users/admin/builder/spi-builder-workspace/.derivedData/Build/Intermediates.noindex/AUv3Controls.build/Debug-watchos/AUv3Controls.build/DerivedSources/GeneratedAssetSymbols.swift -supplementary-output-file-map /Users/admin/builder/spi-builder-workspace/.derivedData/Build/Intermediates.noindex/AUv3Controls.build/Debug-watchos/AUv3Controls.build/Objects-normal/arm64/supplementaryOutputs-5 -target arm64-apple-watchos10.0 -Xllvm -aarch64-use-tbi -enable-objc-interop -stack-check -sdk /Applications/Xcode-16.2.0.app/Contents/Developer/Platforms/WatchOS.platform/Developer/SDKs/WatchOS11.2.sdk -I /Users/admin/builder/spi-builder-workspace/.derivedData/Build/Products/Debug-watchos -I /Applications/Xcode-16.2.0.app/Contents/Developer/Platforms/WatchOS.platform/Developer/usr/lib -F /Users/admin/builder/spi-builder-workspace/.derivedData/Build/Products/Debug-watchos/PackageFrameworks -F /Users/admin/builder/spi-builder-workspace/.derivedData/Build/Products/Debug-watchos/PackageFrameworks -F /Users/admin/builder/spi-builder-workspace/.derivedData/Build/Products/Debug-watchos/PackageFrameworks -F /Users/admin/builder/spi-builder-workspace/.derivedData/Build/Products/Debug-watchos/PackageFrameworks -F /Users/admin/builder/spi-builder-workspace/.derivedData/Build/Products/Debug-watchos/PackageFrameworks -F /Users/admin/builder/spi-builder-workspace/.derivedData/Build/Products/Debug-watchos/PackageFrameworks -F /Users/admin/builder/spi-builder-workspace/.derivedData/Build/Products/Debug-watchos/PackageFrameworks -F /Users/admin/builder/spi-builder-workspace/.derivedData/Build/Products/Debug-watchos/PackageFrameworks -F /Users/admin/builder/spi-builder-workspace/.derivedData/Build/Products/Debug-watchos/PackageFrameworks -F /Users/admin/builder/spi-builder-workspace/.derivedData/Build/Products/Debug-watchos/PackageFrameworks -F /Users/admin/builder/spi-builder-workspace/.derivedData/Build/Products/Debug-watchos/PackageFrameworks -F /Users/admin/builder/spi-builder-workspace/.derivedData/Build/Products/Debug-watchos/PackageFrameworks -F /Users/admin/builder/spi-builder-workspace/.derivedData/Build/Products/Debug-watchos/PackageFrameworks -F /Users/admin/builder/spi-builder-workspace/.derivedData/Build/Products/Debug-watchos/PackageFrameworks -F /Users/admin/builder/spi-builder-workspace/.derivedData/Build/Products/Debug-watchos/PackageFrameworks -F /Users/admin/builder/spi-builder-workspace/.derivedData/Build/Products/Debug-watchos/PackageFrameworks -F /Users/admin/builder/spi-builder-workspace/.derivedData/Build/Products/Debug-watchos/PackageFrameworks -F /Users/admin/builder/spi-builder-workspace/.derivedData/Build/Products/Debug-watchos/PackageFrameworks -F /Users/admin/builder/spi-builder-workspace/.derivedData/Build/Products/Debug-watchos/PackageFrameworks -F /Users/admin/builder/spi-builder-workspace/.derivedData/Build/Products/Debug-watchos/PackageFrameworks -F /Users/admin/builder/spi-builder-workspace/.derivedData/Build/Products/Debug-watchos/PackageFrameworks -F /Users/admin/builder/spi-builder-workspace/.derivedData/Build/Products/Debug-watchos/PackageFrameworks -F /Users/admin/builder/spi-builder-workspace/.derivedData/Build/Products/Debug-watchos/PackageFrameworks -F /Users/admin/builder/spi-builder-workspace/.derivedData/Build/Products/Debug-watchos/PackageFrameworks -F /Users/admin/builder/spi-builder-workspace/.derivedData/Build/Products/Debug-watchos/PackageFrameworks -F /Users/admin/builder/spi-builder-workspace/.derivedData/Build/Products/Debug-watchos -F /Applications/Xcode-16.2.0.app/Contents/Developer/Platforms/WatchOS.platform/Developer/Library/Frameworks -F /Applications/Xcode-16.2.0.app/Contents/Developer/Platforms/WatchOS.platform/Developer/SDKs/WatchOS11.2.sdk/Developer/Library/Frameworks -no-color-diagnostics -enable-testing -g -debug-info-format\=dwarf -dwarf-version\=4 -module-cache-path /Users/admin/builder/spi-builder-workspace/.derivedData/ModuleCache.noindex -profile-generate -profile-coverage-mapping -swift-version 6 -enforce-exclusivity\=checked -Onone -D SWIFT_PACKAGE -D DEBUG -D Xcode -serialize-debugging-options -load-plugin-executable /Users/admin/builder/spi-builder-workspace/.derivedData/Build/Products/Debug/CasePathsMacros\#CasePathsMacros -load-plugin-executable /Users/admin/builder/spi-builder-workspace/.derivedData/Build/Products/Debug/ComposableArchitectureMacros\#ComposableArchitectureMacros -load-plugin-executable /Users/admin/builder/spi-builder-workspace/.derivedData/Build/Products/Debug/DependenciesMacrosPlugin\#DependenciesMacrosPlugin -load-plugin-executable /Users/admin/builder/spi-builder-workspace/.derivedData/Build/Products/Debug/PerceptionMacros\#PerceptionMacros -const-gather-protocols-file /Users/admin/builder/spi-builder-workspace/.derivedData/Build/Intermediates.noindex/AUv3Controls.build/Debug-watchos/AUv3Controls.build/Objects-normal/arm64/AUv3Controls_const_extract_protocols.json -enable-experimental-feature StrictConcurrency\=complete -enable-experimental-feature DebugDescriptionMacro -enable-experimental-feature OpaqueTypeErasure -empty-abi-descriptor -plugin-path /Applications/Xcode-16.2.0.app/Contents/Developer/Toolchains/XcodeDefault.xctoolchain/usr/lib/swift/host/plugins/testing -validate-clang-modules-once -clang-build-session-file /Users/admin/builder/spi-builder-workspace/.derivedData/ModuleCache.noindex/Session.modulevalidation -Xcc -working-directory -Xcc /Users/admin/builder/spi-builder-workspace/.swiftpm/xcode -resource-dir /Applications/Xcode-16.2.0.app/Contents/Developer/Toolchains/XcodeDefault.xctoolchain/usr/lib/swift -enable-anonymous-context-mangled-names -file-compilation-dir /Users/admin/builder/spi-builder-workspace/.swiftpm/xcode -Xcc -fmodule-map-file\=/Users/admin/builder/spi-builder-workspace/.derivedData/Build/Intermediates.noindex/GeneratedModuleMaps-watchos/UIKitNavigationShim.modulemap -Xcc -D_LIBCPP_HARDENING_MODE\=_LIBCPP_HARDENING_MODE_DEBUG -Xcc -ivfsstatcache -Xcc /Users/admin/builder/spi-builder-workspace/.derivedData/SDKStatCaches.noindex/watchos11.2-22S97-8cb5c683f5e64b0ecfc74e8d0065fbf6.sdkstatcache -Xcc -I/Users/admin/builder/spi-builder-workspace/.derivedData/Build/Intermediates.noindex/AUv3Controls.build/Debug-watchos/AUv3Controls.build/swift-overrides.hmap -Xcc -I/Users/admin/builder/spi-builder-workspace/.dependencies/checkouts/swift-navigation/Sources/UIKitNavigationShim/include -Xcc -I/Users/admin/builder/spi-builder-workspace/.derivedData/Build/Products/Debug-watchos/include -Xcc -I/Users/admin/builder/spi-builder-workspace/.derivedData/Build/Intermediates.noindex/AUv3Controls.build/Debug-watchos/AUv3Controls.build/DerivedSources-normal/arm64 -Xcc -I/Users/admin/builder/spi-builder-workspace/.derivedData/Build/Intermediates.noindex/AUv3Controls.build/Debug-watchos/AUv3Controls.build/DerivedSources/arm64 -Xcc -I/Users/admin/builder/spi-builder-workspace/.derivedData/Build/Intermediates.noindex/AUv3Controls.build/Debug-watchos/AUv3Controls.build/DerivedSources -Xcc -DSWIFT_PACKAGE -Xcc -DDEBUG\=1 -module-name AUv3Controls -package-name spi_builder_workspace -frontend-parseable-output -disable-clang-spi -target-sdk-version 11.2 -target-sdk-name watchos11.2 -external-plugin-path /Applications/Xcode-16.2.0.app/Contents/Developer/Platforms/WatchOS.platform/Developer/usr/lib/swift/host/plugins\#/Applications/Xcode-16.2.0.app/Contents/Developer/Platforms/WatchOS.platform/Developer/usr/bin/swift-plugin-server -external-plugin-path /Applications/Xcode-16.2.0.app/Contents/Developer/Platforms/WatchOS.platform/Developer/usr/local/lib/swift/host/plugins\#/Applications/Xcode-16.2.0.app/Contents/Developer/Platforms/WatchOS.platform/Developer/usr/bin/swift-plugin-server -plugin-path /Applications/Xcode-16.2.0.app/Contents/Developer/Toolchains/XcodeDefault.xctoolchain/usr/lib/swift/host/plugins -plugin-path /Applications/Xcode-16.2.0.app/Contents/Developer/Toolchains/XcodeDefault.xctoolchain/usr/local/lib/swift/host/plugins -o /Users/admin/builder/spi-builder-workspace/.derivedData/Build/Intermediates.noindex/AUv3Controls.build/Debug-watchos/AUv3Controls.build/Objects-normal/arm64/ClosedRange.o -o /Users/admin/builder/spi-builder-workspace/.derivedData/Build/Intermediates.noindex/AUv3Controls.build/Debug-watchos/AUv3Controls.build/Objects-normal/arm64/Color.o -o /Users/admin/builder/spi-builder-workspace/.derivedData/Build/Intermediates.noindex/AUv3Controls.build/Debug-watchos/AUv3Controls.build/Objects-normal/arm64/KeyPath.o -index-unit-output-path /AUv3Controls.build/Debug-watchos/AUv3Controls.build/Objects-normal/arm64/ClosedRange.o -index-unit-output-path /AUv3Controls.build/Debug-watchos/AUv3Controls.build/Objects-normal/arm64/Color.o -index-unit-output-path /AUv3Controls.build/Debug-watchos/AUv3Controls.build/Objects-normal/arm64/KeyPath.o -index-store-path /Users/admin/builder/spi-builder-workspace/.derivedData/Index.noindex/DataStore -index-system-modules
SwiftCompile normal arm64 /Users/admin/builder/spi-builder-workspace/Sources/AUv3Controls/Extensions/Color.swift (in target 'AUv3Controls' from project 'AUv3Controls')
    cd /Users/admin/builder/spi-builder-workspace/.swiftpm/xcode
    /Applications/Xcode-16.2.0.app/Contents/Developer/Toolchains/XcodeDefault.xctoolchain/usr/bin/swift-frontend -c /Users/admin/builder/spi-builder-workspace/.derivedData/Build/Intermediates.noindex/AUv3Controls.build/Debug-watchos/AUv3Controls.build/DerivedSources/resource_bundle_accessor.swift /Users/admin/builder/spi-builder-workspace/Sources/AUv3Controls/Examples/Duality.swift /Users/admin/builder/spi-builder-workspace/Sources/AUv3Controls/Examples/Envelope.swift /Users/admin/builder/spi-builder-workspace/Sources/AUv3Controls/Extensions/AUParameter.swift /Users/admin/builder/spi-builder-workspace/Sources/AUv3Controls/Extensions/AUParameterTree.swift /Users/admin/builder/spi-builder-workspace/Sources/AUv3Controls/Extensions/Angle.swift -primary-file /Users/admin/builder/spi-builder-workspace/Sources/AUv3Controls/Extensions/ClosedRange.swift -primary-file /Users/admin/builder/spi-builder-workspace/Sources/AUv3Controls/Extensions/Color.swift -primary-file /Users/admin/builder/spi-builder-workspace/Sources/AUv3Controls/Extensions/KeyPath.swift /Users/admin/builder/spi-builder-workspace/Sources/AUv3Controls/Extensions/UUID.swift /Users/admin/builder/spi-builder-workspace/Sources/AUv3Controls/Extensions/View.swift /Users/admin/builder/spi-builder-workspace/Sources/AUv3Controls/Knob/ControlFeature.swift /Users/admin/builder/spi-builder-workspace/Sources/AUv3Controls/Knob/EditorFeature.swift /Users/admin/builder/spi-builder-workspace/Sources/AUv3Controls/Knob/KnobConfig.swift /Users/admin/builder/spi-builder-workspace/Sources/AUv3Controls/Knob/KnobFeature.swift /Users/admin/builder/spi-builder-workspace/Sources/AUv3Controls/Knob/KnobValueFormatter.swift /Users/admin/builder/spi-builder-workspace/Sources/AUv3Controls/Knob/NormValueTransform.swift /Users/admin/builder/spi-builder-workspace/Sources/AUv3Controls/Knob/TitleFeature.swift /Users/admin/builder/spi-builder-workspace/Sources/AUv3Controls/Knob/TrackFeature.swift /Users/admin/builder/spi-builder-workspace/Sources/AUv3Controls/Support/Logger.swift /Users/admin/builder/spi-builder-workspace/Sources/AUv3Controls/Theme.swift /Users/admin/builder/spi-builder-workspace/Sources/AUv3Controls/Toggle/CheckedToggleStyle.swift /Users/admin/builder/spi-builder-workspace/Sources/AUv3Controls/Toggle/ToggleFeature.swift /Users/admin/builder/spi-builder-workspace/.derivedData/Build/Intermediates.noindex/AUv3Controls.build/Debug-watchos/AUv3Controls.build/DerivedSources/GeneratedAssetSymbols.swift -supplementary-output-file-map /Users/admin/builder/spi-builder-workspace/.derivedData/Build/Intermediates.noindex/AUv3Controls.build/Debug-watchos/AUv3Controls.build/Objects-normal/arm64/supplementaryOutputs-5 -target arm64-apple-watchos10.0 -Xllvm -aarch64-use-tbi -enable-objc-interop -stack-check -sdk /Applications/Xcode-16.2.0.app/Contents/Developer/Platforms/WatchOS.platform/Developer/SDKs/WatchOS11.2.sdk -I /Users/admin/builder/spi-builder-workspace/.derivedData/Build/Products/Debug-watchos -I /Applications/Xcode-16.2.0.app/Contents/Developer/Platforms/WatchOS.platform/Developer/usr/lib -F /Users/admin/builder/spi-builder-workspace/.derivedData/Build/Products/Debug-watchos/PackageFrameworks -F /Users/admin/builder/spi-builder-workspace/.derivedData/Build/Products/Debug-watchos/PackageFrameworks -F /Users/admin/builder/spi-builder-workspace/.derivedData/Build/Products/Debug-watchos/PackageFrameworks -F /Users/admin/builder/spi-builder-workspace/.derivedData/Build/Products/Debug-watchos/PackageFrameworks -F /Users/admin/builder/spi-builder-workspace/.derivedData/Build/Products/Debug-watchos/PackageFrameworks -F /Users/admin/builder/spi-builder-workspace/.derivedData/Build/Products/Debug-watchos/PackageFrameworks -F /Users/admin/builder/spi-builder-workspace/.derivedData/Build/Products/Debug-watchos/PackageFrameworks -F /Users/admin/builder/spi-builder-workspace/.derivedData/Build/Products/Debug-watchos/PackageFrameworks -F /Users/admin/builder/spi-builder-workspace/.derivedData/Build/Products/Debug-watchos/PackageFrameworks -F /Users/admin/builder/spi-builder-workspace/.derivedData/Build/Products/Debug-watchos/PackageFrameworks -F /Users/admin/builder/spi-builder-workspace/.derivedData/Build/Products/Debug-watchos/PackageFrameworks -F /Users/admin/builder/spi-builder-workspace/.derivedData/Build/Products/Debug-watchos/PackageFrameworks -F /Users/admin/builder/spi-builder-workspace/.derivedData/Build/Products/Debug-watchos/PackageFrameworks -F /Users/admin/builder/spi-builder-workspace/.derivedData/Build/Products/Debug-watchos/PackageFrameworks -F /Users/admin/builder/spi-builder-workspace/.derivedData/Build/Products/Debug-watchos/PackageFrameworks -F /Users/admin/builder/spi-builder-workspace/.derivedData/Build/Products/Debug-watchos/PackageFrameworks -F /Users/admin/builder/spi-builder-workspace/.derivedData/Build/Products/Debug-watchos/PackageFrameworks -F /Users/admin/builder/spi-builder-workspace/.derivedData/Build/Products/Debug-watchos/PackageFrameworks -F /Users/admin/builder/spi-builder-workspace/.derivedData/Build/Products/Debug-watchos/PackageFrameworks -F /Users/admin/builder/spi-builder-workspace/.derivedData/Build/Products/Debug-watchos/PackageFrameworks -F /Users/admin/builder/spi-builder-workspace/.derivedData/Build/Products/Debug-watchos/PackageFrameworks -F /Users/admin/builder/spi-builder-workspace/.derivedData/Build/Products/Debug-watchos/PackageFrameworks -F /Users/admin/builder/spi-builder-workspace/.derivedData/Build/Products/Debug-watchos/PackageFrameworks -F /Users/admin/builder/spi-builder-workspace/.derivedData/Build/Products/Debug-watchos/PackageFrameworks -F /Users/admin/builder/spi-builder-workspace/.derivedData/Build/Products/Debug-watchos/PackageFrameworks -F /Users/admin/builder/spi-builder-workspace/.derivedData/Build/Products/Debug-watchos -F /Applications/Xcode-16.2.0.app/Contents/Developer/Platforms/WatchOS.platform/Developer/Library/Frameworks -F /Applications/Xcode-16.2.0.app/Contents/Developer/Platforms/WatchOS.platform/Developer/SDKs/WatchOS11.2.sdk/Developer/Library/Frameworks -no-color-diagnostics -enable-testing -g -debug-info-format\=dwarf -dwarf-version\=4 -module-cache-path /Users/admin/builder/spi-builder-workspace/.derivedData/ModuleCache.noindex -profile-generate -profile-coverage-mapping -swift-version 6 -enforce-exclusivity\=checked -Onone -D SWIFT_PACKAGE -D DEBUG -D Xcode -serialize-debugging-options -load-plugin-executable /Users/admin/builder/spi-builder-workspace/.derivedData/Build/Products/Debug/CasePathsMacros\#CasePathsMacros -load-plugin-executable /Users/admin/builder/spi-builder-workspace/.derivedData/Build/Products/Debug/ComposableArchitectureMacros\#ComposableArchitectureMacros -load-plugin-executable /Users/admin/builder/spi-builder-workspace/.derivedData/Build/Products/Debug/DependenciesMacrosPlugin\#DependenciesMacrosPlugin -load-plugin-executable /Users/admin/builder/spi-builder-workspace/.derivedData/Build/Products/Debug/PerceptionMacros\#PerceptionMacros -const-gather-protocols-file /Users/admin/builder/spi-builder-workspace/.derivedData/Build/Intermediates.noindex/AUv3Controls.build/Debug-watchos/AUv3Controls.build/Objects-normal/arm64/AUv3Controls_const_extract_protocols.json -enable-experimental-feature StrictConcurrency\=complete -enable-experimental-feature DebugDescriptionMacro -enable-experimental-feature OpaqueTypeErasure -empty-abi-descriptor -plugin-path /Applications/Xcode-16.2.0.app/Contents/Developer/Toolchains/XcodeDefault.xctoolchain/usr/lib/swift/host/plugins/testing -validate-clang-modules-once -clang-build-session-file /Users/admin/builder/spi-builder-workspace/.derivedData/ModuleCache.noindex/Session.modulevalidation -Xcc -working-directory -Xcc /Users/admin/builder/spi-builder-workspace/.swiftpm/xcode -resource-dir /Applications/Xcode-16.2.0.app/Contents/Developer/Toolchains/XcodeDefault.xctoolchain/usr/lib/swift -enable-anonymous-context-mangled-names -file-compilation-dir /Users/admin/builder/spi-builder-workspace/.swiftpm/xcode -Xcc -fmodule-map-file\=/Users/admin/builder/spi-builder-workspace/.derivedData/Build/Intermediates.noindex/GeneratedModuleMaps-watchos/UIKitNavigationShim.modulemap -Xcc -D_LIBCPP_HARDENING_MODE\=_LIBCPP_HARDENING_MODE_DEBUG -Xcc -ivfsstatcache -Xcc /Users/admin/builder/spi-builder-workspace/.derivedData/SDKStatCaches.noindex/watchos11.2-22S97-8cb5c683f5e64b0ecfc74e8d0065fbf6.sdkstatcache -Xcc -I/Users/admin/builder/spi-builder-workspace/.derivedData/Build/Intermediates.noindex/AUv3Controls.build/Debug-watchos/AUv3Controls.build/swift-overrides.hmap -Xcc -I/Users/admin/builder/spi-builder-workspace/.dependencies/checkouts/swift-navigation/Sources/UIKitNavigationShim/include -Xcc -I/Users/admin/builder/spi-builder-workspace/.derivedData/Build/Products/Debug-watchos/include -Xcc -I/Users/admin/builder/spi-builder-workspace/.derivedData/Build/Intermediates.noindex/AUv3Controls.build/Debug-watchos/AUv3Controls.build/DerivedSources-normal/arm64 -Xcc -I/Users/admin/builder/spi-builder-workspace/.derivedData/Build/Intermediates.noindex/AUv3Controls.build/Debug-watchos/AUv3Controls.build/DerivedSources/arm64 -Xcc -I/Users/admin/builder/spi-builder-workspace/.derivedData/Build/Intermediates.noindex/AUv3Controls.build/Debug-watchos/AUv3Controls.build/DerivedSources -Xcc -DSWIFT_PACKAGE -Xcc -DDEBUG\=1 -module-name AUv3Controls -package-name spi_builder_workspace -frontend-parseable-output -disable-clang-spi -target-sdk-version 11.2 -target-sdk-name watchos11.2 -external-plugin-path /Applications/Xcode-16.2.0.app/Contents/Developer/Platforms/WatchOS.platform/Developer/usr/lib/swift/host/plugins\#/Applications/Xcode-16.2.0.app/Contents/Developer/Platforms/WatchOS.platform/Developer/usr/bin/swift-plugin-server -external-plugin-path /Applications/Xcode-16.2.0.app/Contents/Developer/Platforms/WatchOS.platform/Developer/usr/local/lib/swift/host/plugins\#/Applications/Xcode-16.2.0.app/Contents/Developer/Platforms/WatchOS.platform/Developer/usr/bin/swift-plugin-server -plugin-path /Applications/Xcode-16.2.0.app/Contents/Developer/Toolchains/XcodeDefault.xctoolchain/usr/lib/swift/host/plugins -plugin-path /Applications/Xcode-16.2.0.app/Contents/Developer/Toolchains/XcodeDefault.xctoolchain/usr/local/lib/swift/host/plugins -o /Users/admin/builder/spi-builder-workspace/.derivedData/Build/Intermediates.noindex/AUv3Controls.build/Debug-watchos/AUv3Controls.build/Objects-normal/arm64/ClosedRange.o -o /Users/admin/builder/spi-builder-workspace/.derivedData/Build/Intermediates.noindex/AUv3Controls.build/Debug-watchos/AUv3Controls.build/Objects-normal/arm64/Color.o -o /Users/admin/builder/spi-builder-workspace/.derivedData/Build/Intermediates.noindex/AUv3Controls.build/Debug-watchos/AUv3Controls.build/Objects-normal/arm64/KeyPath.o -index-unit-output-path /AUv3Controls.build/Debug-watchos/AUv3Controls.build/Objects-normal/arm64/ClosedRange.o -index-unit-output-path /AUv3Controls.build/Debug-watchos/AUv3Controls.build/Objects-normal/arm64/Color.o -index-unit-output-path /AUv3Controls.build/Debug-watchos/AUv3Controls.build/Objects-normal/arm64/KeyPath.o -index-store-path /Users/admin/builder/spi-builder-workspace/.derivedData/Index.noindex/DataStore -index-system-modules
SwiftCompile normal arm64 /Users/admin/builder/spi-builder-workspace/Sources/AUv3Controls/Extensions/KeyPath.swift (in target 'AUv3Controls' from project 'AUv3Controls')
    cd /Users/admin/builder/spi-builder-workspace/.swiftpm/xcode
    /Applications/Xcode-16.2.0.app/Contents/Developer/Toolchains/XcodeDefault.xctoolchain/usr/bin/swift-frontend -c /Users/admin/builder/spi-builder-workspace/.derivedData/Build/Intermediates.noindex/AUv3Controls.build/Debug-watchos/AUv3Controls.build/DerivedSources/resource_bundle_accessor.swift /Users/admin/builder/spi-builder-workspace/Sources/AUv3Controls/Examples/Duality.swift /Users/admin/builder/spi-builder-workspace/Sources/AUv3Controls/Examples/Envelope.swift /Users/admin/builder/spi-builder-workspace/Sources/AUv3Controls/Extensions/AUParameter.swift /Users/admin/builder/spi-builder-workspace/Sources/AUv3Controls/Extensions/AUParameterTree.swift /Users/admin/builder/spi-builder-workspace/Sources/AUv3Controls/Extensions/Angle.swift -primary-file /Users/admin/builder/spi-builder-workspace/Sources/AUv3Controls/Extensions/ClosedRange.swift -primary-file /Users/admin/builder/spi-builder-workspace/Sources/AUv3Controls/Extensions/Color.swift -primary-file /Users/admin/builder/spi-builder-workspace/Sources/AUv3Controls/Extensions/KeyPath.swift /Users/admin/builder/spi-builder-workspace/Sources/AUv3Controls/Extensions/UUID.swift /Users/admin/builder/spi-builder-workspace/Sources/AUv3Controls/Extensions/View.swift /Users/admin/builder/spi-builder-workspace/Sources/AUv3Controls/Knob/ControlFeature.swift /Users/admin/builder/spi-builder-workspace/Sources/AUv3Controls/Knob/EditorFeature.swift /Users/admin/builder/spi-builder-workspace/Sources/AUv3Controls/Knob/KnobConfig.swift /Users/admin/builder/spi-builder-workspace/Sources/AUv3Controls/Knob/KnobFeature.swift /Users/admin/builder/spi-builder-workspace/Sources/AUv3Controls/Knob/KnobValueFormatter.swift /Users/admin/builder/spi-builder-workspace/Sources/AUv3Controls/Knob/NormValueTransform.swift /Users/admin/builder/spi-builder-workspace/Sources/AUv3Controls/Knob/TitleFeature.swift /Users/admin/builder/spi-builder-workspace/Sources/AUv3Controls/Knob/TrackFeature.swift /Users/admin/builder/spi-builder-workspace/Sources/AUv3Controls/Support/Logger.swift /Users/admin/builder/spi-builder-workspace/Sources/AUv3Controls/Theme.swift /Users/admin/builder/spi-builder-workspace/Sources/AUv3Controls/Toggle/CheckedToggleStyle.swift /Users/admin/builder/spi-builder-workspace/Sources/AUv3Controls/Toggle/ToggleFeature.swift /Users/admin/builder/spi-builder-workspace/.derivedData/Build/Intermediates.noindex/AUv3Controls.build/Debug-watchos/AUv3Controls.build/DerivedSources/GeneratedAssetSymbols.swift -supplementary-output-file-map /Users/admin/builder/spi-builder-workspace/.derivedData/Build/Intermediates.noindex/AUv3Controls.build/Debug-watchos/AUv3Controls.build/Objects-normal/arm64/supplementaryOutputs-5 -target arm64-apple-watchos10.0 -Xllvm -aarch64-use-tbi -enable-objc-interop -stack-check -sdk /Applications/Xcode-16.2.0.app/Contents/Developer/Platforms/WatchOS.platform/Developer/SDKs/WatchOS11.2.sdk -I /Users/admin/builder/spi-builder-workspace/.derivedData/Build/Products/Debug-watchos -I /Applications/Xcode-16.2.0.app/Contents/Developer/Platforms/WatchOS.platform/Developer/usr/lib -F /Users/admin/builder/spi-builder-workspace/.derivedData/Build/Products/Debug-watchos/PackageFrameworks -F /Users/admin/builder/spi-builder-workspace/.derivedData/Build/Products/Debug-watchos/PackageFrameworks -F /Users/admin/builder/spi-builder-workspace/.derivedData/Build/Products/Debug-watchos/PackageFrameworks -F /Users/admin/builder/spi-builder-workspace/.derivedData/Build/Products/Debug-watchos/PackageFrameworks -F /Users/admin/builder/spi-builder-workspace/.derivedData/Build/Products/Debug-watchos/PackageFrameworks -F /Users/admin/builder/spi-builder-workspace/.derivedData/Build/Products/Debug-watchos/PackageFrameworks -F /Users/admin/builder/spi-builder-workspace/.derivedData/Build/Products/Debug-watchos/PackageFrameworks -F /Users/admin/builder/spi-builder-workspace/.derivedData/Build/Products/Debug-watchos/PackageFrameworks -F /Users/admin/builder/spi-builder-workspace/.derivedData/Build/Products/Debug-watchos/PackageFrameworks -F /Users/admin/builder/spi-builder-workspace/.derivedData/Build/Products/Debug-watchos/PackageFrameworks -F /Users/admin/builder/spi-builder-workspace/.derivedData/Build/Products/Debug-watchos/PackageFrameworks -F /Users/admin/builder/spi-builder-workspace/.derivedData/Build/Products/Debug-watchos/PackageFrameworks -F /Users/admin/builder/spi-builder-workspace/.derivedData/Build/Products/Debug-watchos/PackageFrameworks -F /Users/admin/builder/spi-builder-workspace/.derivedData/Build/Products/Debug-watchos/PackageFrameworks -F /Users/admin/builder/spi-builder-workspace/.derivedData/Build/Products/Debug-watchos/PackageFrameworks -F /Users/admin/builder/spi-builder-workspace/.derivedData/Build/Products/Debug-watchos/PackageFrameworks -F /Users/admin/builder/spi-builder-workspace/.derivedData/Build/Products/Debug-watchos/PackageFrameworks -F /Users/admin/builder/spi-builder-workspace/.derivedData/Build/Products/Debug-watchos/PackageFrameworks -F /Users/admin/builder/spi-builder-workspace/.derivedData/Build/Products/Debug-watchos/PackageFrameworks -F /Users/admin/builder/spi-builder-workspace/.derivedData/Build/Products/Debug-watchos/PackageFrameworks -F /Users/admin/builder/spi-builder-workspace/.derivedData/Build/Products/Debug-watchos/PackageFrameworks -F /Users/admin/builder/spi-builder-workspace/.derivedData/Build/Products/Debug-watchos/PackageFrameworks -F /Users/admin/builder/spi-builder-workspace/.derivedData/Build/Products/Debug-watchos/PackageFrameworks -F /Users/admin/builder/spi-builder-workspace/.derivedData/Build/Products/Debug-watchos/PackageFrameworks -F /Users/admin/builder/spi-builder-workspace/.derivedData/Build/Products/Debug-watchos/PackageFrameworks -F /Users/admin/builder/spi-builder-workspace/.derivedData/Build/Products/Debug-watchos -F /Applications/Xcode-16.2.0.app/Contents/Developer/Platforms/WatchOS.platform/Developer/Library/Frameworks -F /Applications/Xcode-16.2.0.app/Contents/Developer/Platforms/WatchOS.platform/Developer/SDKs/WatchOS11.2.sdk/Developer/Library/Frameworks -no-color-diagnostics -enable-testing -g -debug-info-format\=dwarf -dwarf-version\=4 -module-cache-path /Users/admin/builder/spi-builder-workspace/.derivedData/ModuleCache.noindex -profile-generate -profile-coverage-mapping -swift-version 6 -enforce-exclusivity\=checked -Onone -D SWIFT_PACKAGE -D DEBUG -D Xcode -serialize-debugging-options -load-plugin-executable /Users/admin/builder/spi-builder-workspace/.derivedData/Build/Products/Debug/CasePathsMacros\#CasePathsMacros -load-plugin-executable /Users/admin/builder/spi-builder-workspace/.derivedData/Build/Products/Debug/ComposableArchitectureMacros\#ComposableArchitectureMacros -load-plugin-executable /Users/admin/builder/spi-builder-workspace/.derivedData/Build/Products/Debug/DependenciesMacrosPlugin\#DependenciesMacrosPlugin -load-plugin-executable /Users/admin/builder/spi-builder-workspace/.derivedData/Build/Products/Debug/PerceptionMacros\#PerceptionMacros -const-gather-protocols-file /Users/admin/builder/spi-builder-workspace/.derivedData/Build/Intermediates.noindex/AUv3Controls.build/Debug-watchos/AUv3Controls.build/Objects-normal/arm64/AUv3Controls_const_extract_protocols.json -enable-experimental-feature StrictConcurrency\=complete -enable-experimental-feature DebugDescriptionMacro -enable-experimental-feature OpaqueTypeErasure -empty-abi-descriptor -plugin-path /Applications/Xcode-16.2.0.app/Contents/Developer/Toolchains/XcodeDefault.xctoolchain/usr/lib/swift/host/plugins/testing -validate-clang-modules-once -clang-build-session-file /Users/admin/builder/spi-builder-workspace/.derivedData/ModuleCache.noindex/Session.modulevalidation -Xcc -working-directory -Xcc /Users/admin/builder/spi-builder-workspace/.swiftpm/xcode -resource-dir /Applications/Xcode-16.2.0.app/Contents/Developer/Toolchains/XcodeDefault.xctoolchain/usr/lib/swift -enable-anonymous-context-mangled-names -file-compilation-dir /Users/admin/builder/spi-builder-workspace/.swiftpm/xcode -Xcc -fmodule-map-file\=/Users/admin/builder/spi-builder-workspace/.derivedData/Build/Intermediates.noindex/GeneratedModuleMaps-watchos/UIKitNavigationShim.modulemap -Xcc -D_LIBCPP_HARDENING_MODE\=_LIBCPP_HARDENING_MODE_DEBUG -Xcc -ivfsstatcache -Xcc /Users/admin/builder/spi-builder-workspace/.derivedData/SDKStatCaches.noindex/watchos11.2-22S97-8cb5c683f5e64b0ecfc74e8d0065fbf6.sdkstatcache -Xcc -I/Users/admin/builder/spi-builder-workspace/.derivedData/Build/Intermediates.noindex/AUv3Controls.build/Debug-watchos/AUv3Controls.build/swift-overrides.hmap -Xcc -I/Users/admin/builder/spi-builder-workspace/.dependencies/checkouts/swift-navigation/Sources/UIKitNavigationShim/include -Xcc -I/Users/admin/builder/spi-builder-workspace/.derivedData/Build/Products/Debug-watchos/include -Xcc -I/Users/admin/builder/spi-builder-workspace/.derivedData/Build/Intermediates.noindex/AUv3Controls.build/Debug-watchos/AUv3Controls.build/DerivedSources-normal/arm64 -Xcc -I/Users/admin/builder/spi-builder-workspace/.derivedData/Build/Intermediates.noindex/AUv3Controls.build/Debug-watchos/AUv3Controls.build/DerivedSources/arm64 -Xcc -I/Users/admin/builder/spi-builder-workspace/.derivedData/Build/Intermediates.noindex/AUv3Controls.build/Debug-watchos/AUv3Controls.build/DerivedSources -Xcc -DSWIFT_PACKAGE -Xcc -DDEBUG\=1 -module-name AUv3Controls -package-name spi_builder_workspace -frontend-parseable-output -disable-clang-spi -target-sdk-version 11.2 -target-sdk-name watchos11.2 -external-plugin-path /Applications/Xcode-16.2.0.app/Contents/Developer/Platforms/WatchOS.platform/Developer/usr/lib/swift/host/plugins\#/Applications/Xcode-16.2.0.app/Contents/Developer/Platforms/WatchOS.platform/Developer/usr/bin/swift-plugin-server -external-plugin-path /Applications/Xcode-16.2.0.app/Contents/Developer/Platforms/WatchOS.platform/Developer/usr/local/lib/swift/host/plugins\#/Applications/Xcode-16.2.0.app/Contents/Developer/Platforms/WatchOS.platform/Developer/usr/bin/swift-plugin-server -plugin-path /Applications/Xcode-16.2.0.app/Contents/Developer/Toolchains/XcodeDefault.xctoolchain/usr/lib/swift/host/plugins -plugin-path /Applications/Xcode-16.2.0.app/Contents/Developer/Toolchains/XcodeDefault.xctoolchain/usr/local/lib/swift/host/plugins -o /Users/admin/builder/spi-builder-workspace/.derivedData/Build/Intermediates.noindex/AUv3Controls.build/Debug-watchos/AUv3Controls.build/Objects-normal/arm64/ClosedRange.o -o /Users/admin/builder/spi-builder-workspace/.derivedData/Build/Intermediates.noindex/AUv3Controls.build/Debug-watchos/AUv3Controls.build/Objects-normal/arm64/Color.o -o /Users/admin/builder/spi-builder-workspace/.derivedData/Build/Intermediates.noindex/AUv3Controls.build/Debug-watchos/AUv3Controls.build/Objects-normal/arm64/KeyPath.o -index-unit-output-path /AUv3Controls.build/Debug-watchos/AUv3Controls.build/Objects-normal/arm64/ClosedRange.o -index-unit-output-path /AUv3Controls.build/Debug-watchos/AUv3Controls.build/Objects-normal/arm64/Color.o -index-unit-output-path /AUv3Controls.build/Debug-watchos/AUv3Controls.build/Objects-normal/arm64/KeyPath.o -index-store-path /Users/admin/builder/spi-builder-workspace/.derivedData/Index.noindex/DataStore -index-system-modules
SwiftDriver\ Compilation ComposableArchitecture normal arm64 com.apple.xcode.tools.swift.compiler (in target 'ComposableArchitecture' from project 'swift-composable-architecture')
    cd /Users/admin/builder/spi-builder-workspace/.swiftpm/xcode
    builtin-Swift-Compilation -- /Applications/Xcode-16.2.0.app/Contents/Developer/Toolchains/XcodeDefault.xctoolchain/usr/bin/swiftc -module-name ComposableArchitecture -Onone -enforce-exclusivity\=checked @/Users/admin/builder/spi-builder-workspace/.derivedData/Build/Intermediates.noindex/swift-composable-architecture.build/Debug-watchos/ComposableArchitecture.build/Objects-normal/arm64/ComposableArchitecture.SwiftFileList -DSWIFT_PACKAGE -DDEBUG -Xcc -fmodule-map-file\=/Users/admin/builder/spi-builder-workspace/.derivedData/Build/Intermediates.noindex/GeneratedModuleMaps-watchos/UIKitNavigationShim.modulemap -DXcode -enable-upcoming-feature ExistentialAny -plugin-path /Applications/Xcode-16.2.0.app/Contents/Developer/Toolchains/XcodeDefault.xctoolchain/usr/lib/swift/host/plugins/testing -enable-experimental-feature DebugDescriptionMacro -sdk /Applications/Xcode-16.2.0.app/Contents/Developer/Platforms/WatchOS.platform/Developer/SDKs/WatchOS11.2.sdk -target arm64-apple-watchos6.0 -g -module-cache-path /Users/admin/builder/spi-builder-workspace/.derivedData/ModuleCache.noindex -Xfrontend -serialize-debugging-options -profile-coverage-mapping -profile-generate -enable-testing -suppress-warnings -index-store-path /Users/admin/builder/spi-builder-workspace/.derivedData/Index.noindex/DataStore -enable-experimental-feature OpaqueTypeErasure -Xcc -D_LIBCPP_HARDENING_MODE\=_LIBCPP_HARDENING_MODE_DEBUG -swift-version 6 -I /Users/admin/builder/spi-builder-workspace/.derivedData/Build/Products/Debug-watchos -I /Applications/Xcode-16.2.0.app/Contents/Developer/Platforms/WatchOS.platform/Developer/usr/lib -F /Users/admin/builder/spi-builder-workspace/.derivedData/Build/Products/Debug-watchos/PackageFrameworks -F /Users/admin/builder/spi-builder-workspace/.derivedData/Build/Products/Debug-watchos/PackageFrameworks -F /Users/admin/builder/spi-builder-workspace/.derivedData/Build/Products/Debug-watchos/PackageFrameworks -F /Users/admin/builder/spi-builder-workspace/.derivedData/Build/Products/Debug-watchos/PackageFrameworks -F /Users/admin/builder/spi-builder-workspace/.derivedData/Build/Products/Debug-watchos/PackageFrameworks -F /Users/admin/builder/spi-builder-workspace/.derivedData/Build/Products/Debug-watchos/PackageFrameworks -F /Users/admin/builder/spi-builder-workspace/.derivedData/Build/Products/Debug-watchos/PackageFrameworks -F /Users/admin/builder/spi-builder-workspace/.derivedData/Build/Products/Debug-watchos/PackageFrameworks -F /Users/admin/builder/spi-builder-workspace/.derivedData/Build/Products/Debug-watchos/PackageFrameworks -F /Users/admin/builder/spi-builder-workspace/.derivedData/Build/Products/Debug-watchos/PackageFrameworks -F /Users/admin/builder/spi-builder-workspace/.derivedData/Build/Products/Debug-watchos/PackageFrameworks -F /Users/admin/builder/spi-builder-workspace/.derivedData/Build/Products/Debug-watchos/PackageFrameworks -F /Users/admin/builder/spi-builder-workspace/.derivedData/Build/Products/Debug-watchos/PackageFrameworks -F /Users/admin/builder/spi-builder-workspace/.derivedData/Build/Products/Debug-watchos/PackageFrameworks -F /Users/admin/builder/spi-builder-workspace/.derivedData/Build/Products/Debug-watchos/PackageFrameworks -F /Users/admin/builder/spi-builder-workspace/.derivedData/Build/Products/Debug-watchos/PackageFrameworks -F /Users/admin/builder/spi-builder-workspace/.derivedData/Build/Products/Debug-watchos/PackageFrameworks -F /Users/admin/builder/spi-builder-workspace/.derivedData/Build/Products/Debug-watchos/PackageFrameworks -F /Users/admin/builder/spi-builder-workspace/.derivedData/Build/Products/Debug-watchos/PackageFrameworks -F /Users/admin/builder/spi-builder-workspace/.derivedData/Build/Products/Debug-watchos/PackageFrameworks -F /Users/admin/builder/spi-builder-workspace/.derivedData/Build/Products/Debug-watchos/PackageFrameworks -F /Users/admin/builder/spi-builder-workspace/.derivedData/Build/Products/Debug-watchos/PackageFrameworks -F /Users/admin/builder/spi-builder-workspace/.derivedData/Build/Products/Debug-watchos -F /Applications/Xcode-16.2.0.app/Contents/Developer/Platforms/WatchOS.platform/Developer/Library/Frameworks -F /Applications/Xcode-16.2.0.app/Contents/Developer/Platforms/WatchOS.platform/Developer/SDKs/WatchOS11.2.sdk/Developer/Library/Frameworks -Xfrontend -load-plugin-executable -Xfrontend /Users/admin/builder/spi-builder-workspace/.derivedData/Build/Products/Debug/CasePathsMacros\#CasePathsMacros -Xfrontend -load-plugin-executable -Xfrontend /Users/admin/builder/spi-builder-workspace/.derivedData/Build/Products/Debug/ComposableArchitectureMacros\#ComposableArchitectureMacros -Xfrontend -load-plugin-executable -Xfrontend /Users/admin/builder/spi-builder-workspace/.derivedData/Build/Products/Debug/DependenciesMacrosPlugin\#DependenciesMacrosPlugin -Xfrontend -load-plugin-executable -Xfrontend /Users/admin/builder/spi-builder-workspace/.derivedData/Build/Products/Debug/PerceptionMacros\#PerceptionMacros -c -j10 -enable-batch-mode -incremental -Xcc -ivfsstatcache -Xcc /Users/admin/builder/spi-builder-workspace/.derivedData/SDKStatCaches.noindex/watchos11.2-22S97-8cb5c683f5e64b0ecfc74e8d0065fbf6.sdkstatcache -output-file-map /Users/admin/builder/spi-builder-workspace/.derivedData/Build/Intermediates.noindex/swift-composable-architecture.build/Debug-watchos/ComposableArchitecture.build/Objects-normal/arm64/ComposableArchitecture-OutputFileMap.json -use-frontend-parseable-output -save-temps -no-color-diagnostics -serialize-diagnostics -emit-dependencies -emit-module -emit-module-path /Users/admin/builder/spi-builder-workspace/.derivedData/Build/Intermediates.noindex/swift-composable-architecture.build/Debug-watchos/ComposableArchitecture.build/Objects-normal/arm64/ComposableArchitecture.swiftmodule -user-module-version 1.19.1 -validate-clang-modules-once -clang-build-session-file /Users/admin/builder/spi-builder-workspace/.derivedData/ModuleCache.noindex/Session.modulevalidation -package-name swift_composable_architecture -Xcc -I/Users/admin/builder/spi-builder-workspace/.derivedData/Build/Intermediates.noindex/swift-composable-architecture.build/Debug-watchos/ComposableArchitecture.build/swift-overrides.hmap -emit-const-values -Xfrontend -const-gather-protocols-file -Xfrontend /Users/admin/builder/spi-builder-workspace/.derivedData/Build/Intermediates.noindex/swift-composable-architecture.build/Debug-watchos/ComposableArchitecture.build/Objects-normal/arm64/ComposableArchitecture_const_extract_protocols.json -Xcc -I/Users/admin/builder/spi-builder-workspace/.dependencies/checkouts/swift-navigation/Sources/UIKitNavigationShim/include -Xcc -I/Users/admin/builder/spi-builder-workspace/.derivedData/Build/Products/Debug-watchos/include -Xcc -I/Users/admin/builder/spi-builder-workspace/.derivedData/Build/Intermediates.noindex/swift-composable-architecture.build/Debug-watchos/ComposableArchitecture.build/DerivedSources-normal/arm64 -Xcc -I/Users/admin/builder/spi-builder-workspace/.derivedData/Build/Intermediates.noindex/swift-composable-architecture.build/Debug-watchos/ComposableArchitecture.build/DerivedSources/arm64 -Xcc -I/Users/admin/builder/spi-builder-workspace/.derivedData/Build/Intermediates.noindex/swift-composable-architecture.build/Debug-watchos/ComposableArchitecture.build/DerivedSources -Xcc -DSWIFT_PACKAGE -Xcc -DDEBUG\=1 -emit-objc-header -emit-objc-header-path /Users/admin/builder/spi-builder-workspace/.derivedData/Build/Intermediates.noindex/swift-composable-architecture.build/Debug-watchos/ComposableArchitecture.build/Objects-normal/arm64/ComposableArchitecture-Swift.h -working-directory /Users/admin/builder/spi-builder-workspace/.swiftpm/xcode -experimental-emit-module-separately -disable-cmo
** BUILD FAILED **
The following build commands failed:
	SwiftCompile normal arm64 Compiling\ AUParameter.swift,\ AUParameterTree.swift,\ Angle.swift /Users/admin/builder/spi-builder-workspace/Sources/AUv3Controls/Extensions/AUParameter.swift /Users/admin/builder/spi-builder-workspace/Sources/AUv3Controls/Extensions/AUParameterTree.swift /Users/admin/builder/spi-builder-workspace/Sources/AUv3Controls/Extensions/Angle.swift (in target 'AUv3Controls' from project 'AUv3Controls')
	SwiftCompile normal arm64 /Users/admin/builder/spi-builder-workspace/Sources/AUv3Controls/Extensions/AUParameter.swift (in target 'AUv3Controls' from project 'AUv3Controls')
	Building workspace spi-builder-workspace with scheme AUv3Controls
(3 failures)
BUILD FAILURE 6.0 watchOS