The Swift Package Index logo.Swift Package Index

Track the adoption of Swift 6 strict concurrency checks for data race safety. How many packages are Ready for Swift 6?

Build Information

Failed to build TaskProgress, reference master (7b6786), with Swift 6.1 for tvOS using Xcode 16.3 on 30 Apr 2025 06:03:32 UTC.

Build Command

env DEVELOPER_DIR=/Applications/Xcode-16.3.0.app xcrun xcodebuild -IDEClonedSourcePackagesDirPathOverride=$PWD/.dependencies -skipMacroValidation -skipPackagePluginValidation -derivedDataPath $PWD/.derivedData build -scheme TaskProgress-Package -destination generic/platform=tvOS

Build Log

========================================
RunAll
========================================
Builder version: 4.61.1
Interrupt handler set up.
========================================
Checkout
========================================
Clone URL: https://github.com/Jomy10/TaskProgress.git
Reference: master
Initialized empty Git repository in /Users/admin/builder/spi-builder-workspace/.git/
From https://github.com/Jomy10/TaskProgress
 * branch            master     -> FETCH_HEAD
 * [new branch]      master     -> origin/master
HEAD is now at 7b6786b add debugDescription to ProgressTask
Cloned https://github.com/Jomy10/TaskProgress.git
Revision (git rev-parse @):
7b6786b2e5336690ffd5d84df53755242510d541
SPI manifest file found: $PWD/.spi.yml
SUCCESS checkout https://github.com/Jomy10/TaskProgress.git at master
========================================
Build
========================================
Selected platform:         tvOS
Swift version:             6.1
Building package at path:  $PWD
https://github.com/Jomy10/TaskProgress.git
https://github.com/Jomy10/TaskProgress.git
{
  "dependencies" : [
  ],
  "manifest_display_name" : "TaskProgress",
  "name" : "TaskProgress",
  "path" : "/Users/admin/builder/spi-builder-workspace",
  "platforms" : [
    {
      "name" : "macos",
      "version" : "10.15"
    }
  ],
  "products" : [
    {
      "name" : "TaskProgress",
      "targets" : [
        "TaskProgress"
      ],
      "type" : {
        "library" : [
          "automatic"
        ]
      }
    },
    {
      "name" : "Example",
      "targets" : [
        "Example"
      ],
      "type" : {
        "executable" : null
      }
    }
  ],
  "targets" : [
    {
      "c99name" : "TaskProgress",
      "module_type" : "SwiftTarget",
      "name" : "TaskProgress",
      "path" : "Sources/TaskProgress",
      "product_memberships" : [
        "TaskProgress",
        "Example"
      ],
      "sources" : [
        "Ansi.swift",
        "Format.swift",
        "ProgressIndicators.swift",
        "ProgressTask.swift"
      ],
      "type" : "library"
    },
    {
      "c99name" : "Example",
      "module_type" : "SwiftTarget",
      "name" : "Example",
      "path" : "Sources/Example",
      "product_memberships" : [
        "Example"
      ],
      "sources" : [
        "main.swift"
      ],
      "target_dependencies" : [
        "TaskProgress"
      ],
      "type" : "executable"
    }
  ],
  "tools_version" : "6.0"
}
Command line invocation:
    /Applications/Xcode-16.3.0.app/Contents/Developer/usr/bin/xcodebuild -IDEClonedSourcePackagesDirPathOverride=/Users/admin/builder/spi-builder-workspace/.dependencies -resolvePackageDependencies
Resolve Package Graph
Resolve Package Graph
Resolved source packages:
  TaskProgress: /Users/admin/builder/spi-builder-workspace
resolved source packages: TaskProgress
{
  "dependencies" : [
  ],
  "manifest_display_name" : "TaskProgress",
  "name" : "TaskProgress",
  "path" : "/Users/admin/builder/spi-builder-workspace",
  "platforms" : [
    {
      "name" : "macos",
      "version" : "10.15"
    }
  ],
  "products" : [
    {
      "name" : "TaskProgress",
      "targets" : [
        "TaskProgress"
      ],
      "type" : {
        "library" : [
          "automatic"
        ]
      }
    },
    {
      "name" : "Example",
      "targets" : [
        "Example"
      ],
      "type" : {
        "executable" : null
      }
    }
  ],
  "targets" : [
    {
      "c99name" : "TaskProgress",
      "module_type" : "SwiftTarget",
      "name" : "TaskProgress",
      "path" : "Sources/TaskProgress",
      "product_memberships" : [
        "TaskProgress",
        "Example"
      ],
      "sources" : [
        "Ansi.swift",
        "Format.swift",
        "ProgressIndicators.swift",
        "ProgressTask.swift"
      ],
      "type" : "library"
    },
    {
      "c99name" : "Example",
      "module_type" : "SwiftTarget",
      "name" : "Example",
      "path" : "Sources/Example",
      "product_memberships" : [
        "Example"
      ],
      "sources" : [
        "main.swift"
      ],
      "target_dependencies" : [
        "TaskProgress"
      ],
      "type" : "executable"
    }
  ],
  "tools_version" : "6.0"
}
{
  "workspace" : {
    "name" : "spi-builder-workspace",
    "schemes" : [
      "Example",
      "TaskProgress",
      "TaskProgress-Package"
    ]
  }
}
Running build ...
env DEVELOPER_DIR=/Applications/Xcode-16.3.0.app xcrun xcodebuild -IDEClonedSourcePackagesDirPathOverride=$PWD/.dependencies -skipMacroValidation -skipPackagePluginValidation -derivedDataPath $PWD/.derivedData build -scheme TaskProgress-Package -destination generic/platform=tvOS OTHER_SWIFT_FLAGS=-stats-output-dir .stats
Command line invocation:
    /Applications/Xcode-16.3.0.app/Contents/Developer/usr/bin/xcodebuild -IDEClonedSourcePackagesDirPathOverride=/Users/admin/builder/spi-builder-workspace/.dependencies -skipMacroValidation -skipPackagePluginValidation -derivedDataPath /Users/admin/builder/spi-builder-workspace/.derivedData build -scheme TaskProgress-Package -destination generic/platform=tvOS "OTHER_SWIFT_FLAGS=-stats-output-dir .stats"
Build settings from command line:
    OTHER_SWIFT_FLAGS = -stats-output-dir .stats
Resolve Package Graph
Resolved source packages:
  TaskProgress: /Users/admin/builder/spi-builder-workspace
ComputePackagePrebuildTargetDependencyGraph
Prepare packages
CreateBuildRequest
SendProjectDescription
CreateBuildOperation
ComputeTargetDependencyGraph
note: Building targets in dependency order
note: Target dependency graph (3 targets)
    Target 'Example' in project 'TaskProgress'
        ➜ Explicit dependency on target 'TaskProgress' in project 'TaskProgress'
    Target 'TaskProgress' in project 'TaskProgress'
        ➜ Explicit dependency on target 'TaskProgress' in project 'TaskProgress'
    Target 'TaskProgress' in project 'TaskProgress' (no dependencies)
GatherProvisioningInputs
CreateBuildDescription
ExecuteExternalTool /Applications/Xcode-16.3.0.app/Contents/Developer/Toolchains/XcodeDefault.xctoolchain/usr/bin/clang -v -E -dM -isysroot /Applications/Xcode-16.3.0.app/Contents/Developer/Platforms/AppleTVOS.platform/Developer/SDKs/AppleTVOS18.4.sdk -x c -c /dev/null
ExecuteExternalTool /Applications/Xcode-16.3.0.app/Contents/Developer/Toolchains/XcodeDefault.xctoolchain/usr/bin/swiftc --version
ExecuteExternalTool /Applications/Xcode-16.3.0.app/Contents/Developer/Toolchains/XcodeDefault.xctoolchain/usr/bin/ld -version_details
Build description signature: acc643f45c7a1a60af88fc54fac17515
Build description path: /Users/admin/builder/spi-builder-workspace/.derivedData/Build/Intermediates.noindex/XCBuildData/acc643f45c7a1a60af88fc54fac17515.xcbuilddata
CreateBuildDirectory /Users/admin/builder/spi-builder-workspace/.derivedData/Build/Products
    cd /Users/admin/builder/spi-builder-workspace/.swiftpm/xcode
    builtin-create-build-directory /Users/admin/builder/spi-builder-workspace/.derivedData/Build/Products
ClangStatCache /Applications/Xcode-16.3.0.app/Contents/Developer/Toolchains/XcodeDefault.xctoolchain/usr/bin/clang-stat-cache /Applications/Xcode-16.3.0.app/Contents/Developer/Platforms/AppleTVOS.platform/Developer/SDKs/AppleTVOS18.4.sdk /Users/admin/builder/spi-builder-workspace/.derivedData/SDKStatCaches.noindex/appletvos18.4-22L251-271d326055c85f9856fa135c41255102.sdkstatcache
    cd /Users/admin/builder/spi-builder-workspace/.swiftpm/xcode
    /Applications/Xcode-16.3.0.app/Contents/Developer/Toolchains/XcodeDefault.xctoolchain/usr/bin/clang-stat-cache /Applications/Xcode-16.3.0.app/Contents/Developer/Platforms/AppleTVOS.platform/Developer/SDKs/AppleTVOS18.4.sdk -o /Users/admin/builder/spi-builder-workspace/.derivedData/SDKStatCaches.noindex/appletvos18.4-22L251-271d326055c85f9856fa135c41255102.sdkstatcache
CreateBuildDirectory /Users/admin/builder/spi-builder-workspace/.derivedData/Build/Intermediates.noindex
    cd /Users/admin/builder/spi-builder-workspace/.swiftpm/xcode
    builtin-create-build-directory /Users/admin/builder/spi-builder-workspace/.derivedData/Build/Intermediates.noindex
CreateBuildDirectory /Users/admin/builder/spi-builder-workspace/.derivedData/Build/Intermediates.noindex/EagerLinkingTBDs/Debug-appletvos
    cd /Users/admin/builder/spi-builder-workspace/.swiftpm/xcode
    builtin-create-build-directory /Users/admin/builder/spi-builder-workspace/.derivedData/Build/Intermediates.noindex/EagerLinkingTBDs/Debug-appletvos
CreateBuildDirectory /Users/admin/builder/spi-builder-workspace/.derivedData/Build/Products/Debug-appletvos
    cd /Users/admin/builder/spi-builder-workspace/.swiftpm/xcode
    builtin-create-build-directory /Users/admin/builder/spi-builder-workspace/.derivedData/Build/Products/Debug-appletvos
CreateBuildDirectory /Users/admin/builder/spi-builder-workspace/.derivedData/Build/Products/Debug-appletvos/PackageFrameworks
    cd /Users/admin/builder/spi-builder-workspace/.swiftpm/xcode
    builtin-create-build-directory /Users/admin/builder/spi-builder-workspace/.derivedData/Build/Products/Debug-appletvos/PackageFrameworks
WriteAuxiliaryFile /Users/admin/builder/spi-builder-workspace/.derivedData/Build/Intermediates.noindex/TaskProgress.build/Debug-appletvos/TaskProgress.build/TaskProgress.DependencyMetadataFileList (in target 'TaskProgress' from project 'TaskProgress')
    cd /Users/admin/builder/spi-builder-workspace
    write-file /Users/admin/builder/spi-builder-workspace/.derivedData/Build/Intermediates.noindex/TaskProgress.build/Debug-appletvos/TaskProgress.build/TaskProgress.DependencyMetadataFileList
WriteAuxiliaryFile /Users/admin/builder/spi-builder-workspace/.derivedData/Build/Intermediates.noindex/TaskProgress.build/Debug-appletvos/TaskProgress.build/TaskProgress.modulemap (in target 'TaskProgress' from project 'TaskProgress')
    cd /Users/admin/builder/spi-builder-workspace
    write-file /Users/admin/builder/spi-builder-workspace/.derivedData/Build/Intermediates.noindex/TaskProgress.build/Debug-appletvos/TaskProgress.build/TaskProgress.modulemap
WriteAuxiliaryFile /Users/admin/builder/spi-builder-workspace/.derivedData/Build/Intermediates.noindex/TaskProgress.build/Debug-appletvos/TaskProgress.build/TaskProgress.DependencyStaticMetadataFileList (in target 'TaskProgress' from project 'TaskProgress')
    cd /Users/admin/builder/spi-builder-workspace
    write-file /Users/admin/builder/spi-builder-workspace/.derivedData/Build/Intermediates.noindex/TaskProgress.build/Debug-appletvos/TaskProgress.build/TaskProgress.DependencyStaticMetadataFileList
WriteAuxiliaryFile /Users/admin/builder/spi-builder-workspace/.derivedData/Build/Intermediates.noindex/TaskProgress.build/Debug-appletvos/TaskProgress.build/Objects-normal/arm64/TaskProgress.SwiftFileList (in target 'TaskProgress' from project 'TaskProgress')
    cd /Users/admin/builder/spi-builder-workspace
    write-file /Users/admin/builder/spi-builder-workspace/.derivedData/Build/Intermediates.noindex/TaskProgress.build/Debug-appletvos/TaskProgress.build/Objects-normal/arm64/TaskProgress.SwiftFileList
WriteAuxiliaryFile /Users/admin/builder/spi-builder-workspace/.derivedData/Build/Intermediates.noindex/TaskProgress.build/Debug-appletvos/TaskProgress.build/Objects-normal/arm64/TaskProgress.SwiftConstValuesFileList (in target 'TaskProgress' from project 'TaskProgress')
    cd /Users/admin/builder/spi-builder-workspace
    write-file /Users/admin/builder/spi-builder-workspace/.derivedData/Build/Intermediates.noindex/TaskProgress.build/Debug-appletvos/TaskProgress.build/Objects-normal/arm64/TaskProgress.SwiftConstValuesFileList
WriteAuxiliaryFile /Users/admin/builder/spi-builder-workspace/.derivedData/Build/Intermediates.noindex/TaskProgress.build/Debug-appletvos/TaskProgress.build/Objects-normal/arm64/TaskProgress_const_extract_protocols.json (in target 'TaskProgress' from project 'TaskProgress')
    cd /Users/admin/builder/spi-builder-workspace
    write-file /Users/admin/builder/spi-builder-workspace/.derivedData/Build/Intermediates.noindex/TaskProgress.build/Debug-appletvos/TaskProgress.build/Objects-normal/arm64/TaskProgress_const_extract_protocols.json
WriteAuxiliaryFile /Users/admin/builder/spi-builder-workspace/.derivedData/Build/Intermediates.noindex/TaskProgress.build/Debug-appletvos/TaskProgress.build/Objects-normal/arm64/TaskProgress-OutputFileMap.json (in target 'TaskProgress' from project 'TaskProgress')
    cd /Users/admin/builder/spi-builder-workspace
    write-file /Users/admin/builder/spi-builder-workspace/.derivedData/Build/Intermediates.noindex/TaskProgress.build/Debug-appletvos/TaskProgress.build/Objects-normal/arm64/TaskProgress-OutputFileMap.json
WriteAuxiliaryFile /Users/admin/builder/spi-builder-workspace/.derivedData/Build/Intermediates.noindex/TaskProgress.build/Debug-appletvos/TaskProgress.build/Objects-normal/arm64/TaskProgress.LinkFileList (in target 'TaskProgress' from project 'TaskProgress')
    cd /Users/admin/builder/spi-builder-workspace
    write-file /Users/admin/builder/spi-builder-workspace/.derivedData/Build/Intermediates.noindex/TaskProgress.build/Debug-appletvos/TaskProgress.build/Objects-normal/arm64/TaskProgress.LinkFileList
WriteAuxiliaryFile /Users/admin/builder/spi-builder-workspace/.derivedData/Build/Intermediates.noindex/TaskProgress.build/Debug-appletvos/Example.build/Objects-normal/arm64/Example_const_extract_protocols.json (in target 'Example' from project 'TaskProgress')
    cd /Users/admin/builder/spi-builder-workspace
    write-file /Users/admin/builder/spi-builder-workspace/.derivedData/Build/Intermediates.noindex/TaskProgress.build/Debug-appletvos/Example.build/Objects-normal/arm64/Example_const_extract_protocols.json
WriteAuxiliaryFile /Users/admin/builder/spi-builder-workspace/.derivedData/Build/Intermediates.noindex/TaskProgress.build/Debug-appletvos/Example.build/Objects-normal/arm64/Example.SwiftFileList (in target 'Example' from project 'TaskProgress')
    cd /Users/admin/builder/spi-builder-workspace
    write-file /Users/admin/builder/spi-builder-workspace/.derivedData/Build/Intermediates.noindex/TaskProgress.build/Debug-appletvos/Example.build/Objects-normal/arm64/Example.SwiftFileList
WriteAuxiliaryFile /Users/admin/builder/spi-builder-workspace/.derivedData/Build/Intermediates.noindex/TaskProgress.build/Debug-appletvos/Example.build/Objects-normal/arm64/Example.LinkFileList (in target 'Example' from project 'TaskProgress')
    cd /Users/admin/builder/spi-builder-workspace
    write-file /Users/admin/builder/spi-builder-workspace/.derivedData/Build/Intermediates.noindex/TaskProgress.build/Debug-appletvos/Example.build/Objects-normal/arm64/Example.LinkFileList
WriteAuxiliaryFile /Users/admin/builder/spi-builder-workspace/.derivedData/Build/Intermediates.noindex/TaskProgress.build/Debug-appletvos/Example.build/Objects-normal/arm64/Example-OutputFileMap.json (in target 'Example' from project 'TaskProgress')
    cd /Users/admin/builder/spi-builder-workspace
    write-file /Users/admin/builder/spi-builder-workspace/.derivedData/Build/Intermediates.noindex/TaskProgress.build/Debug-appletvos/Example.build/Objects-normal/arm64/Example-OutputFileMap.json
WriteAuxiliaryFile /Users/admin/builder/spi-builder-workspace/.derivedData/Build/Intermediates.noindex/TaskProgress.build/Debug-appletvos/Example.build/Example.DependencyStaticMetadataFileList (in target 'Example' from project 'TaskProgress')
    cd /Users/admin/builder/spi-builder-workspace
    write-file /Users/admin/builder/spi-builder-workspace/.derivedData/Build/Intermediates.noindex/TaskProgress.build/Debug-appletvos/Example.build/Example.DependencyStaticMetadataFileList
WriteAuxiliaryFile /Users/admin/builder/spi-builder-workspace/.derivedData/Build/Intermediates.noindex/TaskProgress.build/Debug-appletvos/Example.build/Example.DependencyMetadataFileList (in target 'Example' from project 'TaskProgress')
    cd /Users/admin/builder/spi-builder-workspace
    write-file /Users/admin/builder/spi-builder-workspace/.derivedData/Build/Intermediates.noindex/TaskProgress.build/Debug-appletvos/Example.build/Example.DependencyMetadataFileList
Copy /Users/admin/builder/spi-builder-workspace/.derivedData/Build/Intermediates.noindex/GeneratedModuleMaps-appletvos/TaskProgress.modulemap /Users/admin/builder/spi-builder-workspace/.derivedData/Build/Intermediates.noindex/TaskProgress.build/Debug-appletvos/TaskProgress.build/TaskProgress.modulemap (in target 'TaskProgress' from project 'TaskProgress')
    cd /Users/admin/builder/spi-builder-workspace
    builtin-copy -exclude .DS_Store -exclude CVS -exclude .svn -exclude .git -exclude .hg -resolve-src-symlinks /Users/admin/builder/spi-builder-workspace/.derivedData/Build/Intermediates.noindex/TaskProgress.build/Debug-appletvos/TaskProgress.build/TaskProgress.modulemap /Users/admin/builder/spi-builder-workspace/.derivedData/Build/Intermediates.noindex/GeneratedModuleMaps-appletvos
SwiftDriver TaskProgress normal arm64 com.apple.xcode.tools.swift.compiler (in target 'TaskProgress' from project 'TaskProgress')
    cd /Users/admin/builder/spi-builder-workspace/.swiftpm/xcode
    builtin-SwiftDriver -- /Applications/Xcode-16.3.0.app/Contents/Developer/Toolchains/XcodeDefault.xctoolchain/usr/bin/swiftc -module-name TaskProgress -Onone -enforce-exclusivity\=checked @/Users/admin/builder/spi-builder-workspace/.derivedData/Build/Intermediates.noindex/TaskProgress.build/Debug-appletvos/TaskProgress.build/Objects-normal/arm64/TaskProgress.SwiftFileList -DSWIFT_PACKAGE -DDEBUG -stats-output-dir .stats -plugin-path /Applications/Xcode-16.3.0.app/Contents/Developer/Toolchains/XcodeDefault.xctoolchain/usr/lib/swift/host/plugins/testing -enable-experimental-feature DebugDescriptionMacro -sdk /Applications/Xcode-16.3.0.app/Contents/Developer/Platforms/AppleTVOS.platform/Developer/SDKs/AppleTVOS18.4.sdk -target arm64-apple-tvos12.0 -g -module-cache-path /Users/admin/builder/spi-builder-workspace/.derivedData/ModuleCache.noindex -Xfrontend -serialize-debugging-options -enable-testing -index-store-path /Users/admin/builder/spi-builder-workspace/.derivedData/Index.noindex/DataStore -swift-version 6 -I /Users/admin/builder/spi-builder-workspace/.derivedData/Build/Products/Debug-appletvos -I /Applications/Xcode-16.3.0.app/Contents/Developer/Platforms/AppleTVOS.platform/Developer/usr/lib -F /Users/admin/builder/spi-builder-workspace/.derivedData/Build/Products/Debug-appletvos -F /Applications/Xcode-16.3.0.app/Contents/Developer/Platforms/AppleTVOS.platform/Developer/Library/Frameworks -F /Applications/Xcode-16.3.0.app/Contents/Developer/Platforms/AppleTVOS.platform/Developer/SDKs/AppleTVOS18.4.sdk/Developer/Library/Frameworks -c -j10 -enable-batch-mode -incremental -Xcc -ivfsstatcache -Xcc /Users/admin/builder/spi-builder-workspace/.derivedData/SDKStatCaches.noindex/appletvos18.4-22L251-271d326055c85f9856fa135c41255102.sdkstatcache -output-file-map /Users/admin/builder/spi-builder-workspace/.derivedData/Build/Intermediates.noindex/TaskProgress.build/Debug-appletvos/TaskProgress.build/Objects-normal/arm64/TaskProgress-OutputFileMap.json -use-frontend-parseable-output -save-temps -no-color-diagnostics -serialize-diagnostics -emit-dependencies -emit-module -emit-module-path /Users/admin/builder/spi-builder-workspace/.derivedData/Build/Intermediates.noindex/TaskProgress.build/Debug-appletvos/TaskProgress.build/Objects-normal/arm64/TaskProgress.swiftmodule -validate-clang-modules-once -clang-build-session-file /Users/admin/builder/spi-builder-workspace/.derivedData/ModuleCache.noindex/Session.modulevalidation -package-name spi_builder_workspace -Xcc -I/Users/admin/builder/spi-builder-workspace/.derivedData/Build/Intermediates.noindex/TaskProgress.build/Debug-appletvos/TaskProgress.build/swift-overrides.hmap -emit-const-values -Xfrontend -const-gather-protocols-file -Xfrontend /Users/admin/builder/spi-builder-workspace/.derivedData/Build/Intermediates.noindex/TaskProgress.build/Debug-appletvos/TaskProgress.build/Objects-normal/arm64/TaskProgress_const_extract_protocols.json -Xcc -I/Users/admin/builder/spi-builder-workspace/.derivedData/Build/Products/Debug-appletvos/include -Xcc -I/Users/admin/builder/spi-builder-workspace/.derivedData/Build/Intermediates.noindex/TaskProgress.build/Debug-appletvos/TaskProgress.build/DerivedSources-normal/arm64 -Xcc -I/Users/admin/builder/spi-builder-workspace/.derivedData/Build/Intermediates.noindex/TaskProgress.build/Debug-appletvos/TaskProgress.build/DerivedSources/arm64 -Xcc -I/Users/admin/builder/spi-builder-workspace/.derivedData/Build/Intermediates.noindex/TaskProgress.build/Debug-appletvos/TaskProgress.build/DerivedSources -Xcc -DSWIFT_PACKAGE -Xcc -DDEBUG\=1 -emit-objc-header -emit-objc-header-path /Users/admin/builder/spi-builder-workspace/.derivedData/Build/Intermediates.noindex/TaskProgress.build/Debug-appletvos/TaskProgress.build/Objects-normal/arm64/TaskProgress-Swift.h -working-directory /Users/admin/builder/spi-builder-workspace/.swiftpm/xcode -experimental-emit-module-separately -disable-cmo
SwiftCompile normal arm64 Compiling\ Format.swift /Users/admin/builder/spi-builder-workspace/Sources/TaskProgress/Format.swift (in target 'TaskProgress' from project 'TaskProgress')
SwiftCompile normal arm64 /Users/admin/builder/spi-builder-workspace/Sources/TaskProgress/Format.swift (in target 'TaskProgress' from project 'TaskProgress')
    cd /Users/admin/builder/spi-builder-workspace/.swiftpm/xcode

SwiftCompile normal arm64 Compiling\ ProgressIndicators.swift /Users/admin/builder/spi-builder-workspace/Sources/TaskProgress/ProgressIndicators.swift (in target 'TaskProgress' from project 'TaskProgress')
SwiftCompile normal arm64 /Users/admin/builder/spi-builder-workspace/Sources/TaskProgress/ProgressIndicators.swift (in target 'TaskProgress' from project 'TaskProgress')
    cd /Users/admin/builder/spi-builder-workspace/.swiftpm/xcode

SwiftCompile normal arm64 Compiling\ Ansi.swift /Users/admin/builder/spi-builder-workspace/Sources/TaskProgress/Ansi.swift (in target 'TaskProgress' from project 'TaskProgress')
SwiftCompile normal arm64 /Users/admin/builder/spi-builder-workspace/Sources/TaskProgress/Ansi.swift (in target 'TaskProgress' from project 'TaskProgress')
    cd /Users/admin/builder/spi-builder-workspace/.swiftpm/xcode

SwiftCompile normal arm64 Compiling\ ProgressTask.swift /Users/admin/builder/spi-builder-workspace/Sources/TaskProgress/ProgressTask.swift (in target 'TaskProgress' from project 'TaskProgress')
SwiftCompile normal arm64 /Users/admin/builder/spi-builder-workspace/Sources/TaskProgress/ProgressTask.swift (in target 'TaskProgress' from project 'TaskProgress')
    cd /Users/admin/builder/spi-builder-workspace/.swiftpm/xcode

SwiftEmitModule normal arm64 Emitting\ module\ for\ TaskProgress (in target 'TaskProgress' from project 'TaskProgress')
Failed frontend command:
/Applications/Xcode-16.3.0.app/Contents/Developer/Toolchains/XcodeDefault.xctoolchain/usr/bin/swift-frontend -frontend -emit-module -experimental-skip-non-inlinable-function-bodies-without-types /Users/admin/builder/spi-builder-workspace/Sources/TaskProgress/Ansi.swift /Users/admin/builder/spi-builder-workspace/Sources/TaskProgress/Format.swift /Users/admin/builder/spi-builder-workspace/Sources/TaskProgress/ProgressIndicators.swift /Users/admin/builder/spi-builder-workspace/Sources/TaskProgress/ProgressTask.swift -target arm64-apple-tvos12.0 -Xllvm -aarch64-use-tbi -enable-objc-interop -sdk /Applications/Xcode-16.3.0.app/Contents/Developer/Platforms/AppleTVOS.platform/Developer/SDKs/AppleTVOS18.4.sdk -I /Users/admin/builder/spi-builder-workspace/.derivedData/Build/Products/Debug-appletvos -I /Applications/Xcode-16.3.0.app/Contents/Developer/Platforms/AppleTVOS.platform/Developer/usr/lib -F /Users/admin/builder/spi-builder-workspace/.derivedData/Build/Products/Debug-appletvos -F /Applications/Xcode-16.3.0.app/Contents/Developer/Platforms/AppleTVOS.platform/Developer/Library/Frameworks -F /Applications/Xcode-16.3.0.app/Contents/Developer/Platforms/AppleTVOS.platform/Developer/SDKs/AppleTVOS18.4.sdk/Developer/Library/Frameworks -no-color-diagnostics -enable-testing -g -debug-info-format\=dwarf -dwarf-version\=4 -module-cache-path /Users/admin/builder/spi-builder-workspace/.derivedData/ModuleCache.noindex -swift-version 6 -enforce-exclusivity\=checked -stats-output-dir /Users/admin/builder/spi-builder-workspace/.swiftpm/xcode/.stats -Onone -D SWIFT_PACKAGE -D DEBUG -serialize-debugging-options -const-gather-protocols-file /Users/admin/builder/spi-builder-workspace/.derivedData/Build/Intermediates.noindex/TaskProgress.build/Debug-appletvos/TaskProgress.build/Objects-normal/arm64/TaskProgress_const_extract_protocols.json -enable-experimental-feature DebugDescriptionMacro -empty-abi-descriptor -plugin-path /Applications/Xcode-16.3.0.app/Contents/Developer/Toolchains/XcodeDefault.xctoolchain/usr/lib/swift/host/plugins/testing -validate-clang-modules-once -clang-build-session-file /Users/admin/builder/spi-builder-workspace/.derivedData/ModuleCache.noindex/Session.modulevalidation -Xcc -working-directory -Xcc /Users/admin/builder/spi-builder-workspace/.swiftpm/xcode -resource-dir /Applications/Xcode-16.3.0.app/Contents/Developer/Toolchains/XcodeDefault.xctoolchain/usr/lib/swift -enable-anonymous-context-mangled-names -file-compilation-dir /Users/admin/builder/spi-builder-workspace/.swiftpm/xcode -Xcc -ivfsstatcache -Xcc /Users/admin/builder/spi-builder-workspace/.derivedData/SDKStatCaches.noindex/appletvos18.4-22L251-271d326055c85f9856fa135c41255102.sdkstatcache -Xcc -I/Users/admin/builder/spi-builder-workspace/.derivedData/Build/Intermediates.noindex/TaskProgress.build/Debug-appletvos/TaskProgress.build/swift-overrides.hmap -Xcc -I/Users/admin/builder/spi-builder-workspace/.derivedData/Build/Products/Debug-appletvos/include -Xcc -I/Users/admin/builder/spi-builder-workspace/.derivedData/Build/Intermediates.noindex/TaskProgress.build/Debug-appletvos/TaskProgress.build/DerivedSources-normal/arm64 -Xcc -I/Users/admin/builder/spi-builder-workspace/.derivedData/Build/Intermediates.noindex/TaskProgress.build/Debug-appletvos/TaskProgress.build/DerivedSources/arm64 -Xcc -I/Users/admin/builder/spi-builder-workspace/.derivedData/Build/Intermediates.noindex/TaskProgress.build/Debug-appletvos/TaskProgress.build/DerivedSources -Xcc -DSWIFT_PACKAGE -Xcc -DDEBUG\=1 -module-name TaskProgress -package-name spi_builder_workspace -frontend-parseable-output -disable-clang-spi -target-sdk-version 18.4 -target-sdk-name appletvos18.4 -external-plugin-path /Applications/Xcode-16.3.0.app/Contents/Developer/Platforms/AppleTVOS.platform/Developer/usr/lib/swift/host/plugins\#/Applications/Xcode-16.3.0.app/Contents/Developer/Platforms/AppleTVOS.platform/Developer/usr/bin/swift-plugin-server -external-plugin-path /Applications/Xcode-16.3.0.app/Contents/Developer/Platforms/AppleTVOS.platform/Developer/usr/local/lib/swift/host/plugins\#/Applications/Xcode-16.3.0.app/Contents/Developer/Platforms/AppleTVOS.platform/Developer/usr/bin/swift-plugin-server -in-process-plugin-server-path /Applications/Xcode-16.3.0.app/Contents/Developer/Toolchains/XcodeDefault.xctoolchain/usr/lib/swift/host/libSwiftInProcPluginServer.dylib -plugin-path /Applications/Xcode-16.3.0.app/Contents/Developer/Toolchains/XcodeDefault.xctoolchain/usr/lib/swift/host/plugins -plugin-path /Applications/Xcode-16.3.0.app/Contents/Developer/Toolchains/XcodeDefault.xctoolchain/usr/local/lib/swift/host/plugins -emit-module-doc-path /Users/admin/builder/spi-builder-workspace/.derivedData/Build/Intermediates.noindex/TaskProgress.build/Debug-appletvos/TaskProgress.build/Objects-normal/arm64/TaskProgress.swiftdoc -emit-module-source-info-path /Users/admin/builder/spi-builder-workspace/.derivedData/Build/Intermediates.noindex/TaskProgress.build/Debug-appletvos/TaskProgress.build/Objects-normal/arm64/TaskProgress.swiftsourceinfo -emit-objc-header-path /Users/admin/builder/spi-builder-workspace/.derivedData/Build/Intermediates.noindex/TaskProgress.build/Debug-appletvos/TaskProgress.build/Objects-normal/arm64/TaskProgress-Swift.h -serialize-diagnostics-path /Users/admin/builder/spi-builder-workspace/.derivedData/Build/Intermediates.noindex/TaskProgress.build/Debug-appletvos/TaskProgress.build/Objects-normal/arm64/TaskProgress-master-emit-module.dia -emit-dependencies-path /Users/admin/builder/spi-builder-workspace/.derivedData/Build/Intermediates.noindex/TaskProgress.build/Debug-appletvos/TaskProgress.build/Objects-normal/arm64/TaskProgress-master-emit-module.d -o /Users/admin/builder/spi-builder-workspace/.derivedData/Build/Intermediates.noindex/TaskProgress.build/Debug-appletvos/TaskProgress.build/Objects-normal/arm64/TaskProgress.swiftmodule -emit-abi-descriptor-path /Users/admin/builder/spi-builder-workspace/.derivedData/Build/Intermediates.noindex/TaskProgress.build/Debug-appletvos/TaskProgress.build/Objects-normal/arm64/TaskProgress.abi.json
EmitSwiftModule normal arm64 (in target 'TaskProgress' from project 'TaskProgress')
    cd /Users/admin/builder/spi-builder-workspace/.swiftpm/xcode

/Users/admin/builder/spi-builder-workspace/Sources/TaskProgress/ProgressIndicators.swift:24:19: error: 'Task' is only available in tvOS 13.0 or newer
  var screenTask: Task<Void, any Error>?
                  ^
/Users/admin/builder/spi-builder-workspace/Sources/TaskProgress/ProgressIndicators.swift:19:20: note: add @available attribute to enclosing class
public final class ProgressIndicators: @unchecked Sendable {
                   ^
** BUILD FAILED **
The following build commands failed:
	SwiftEmitModule normal arm64 Emitting\ module\ for\ TaskProgress (in target 'TaskProgress' from project 'TaskProgress')
	EmitSwiftModule normal arm64 (in target 'TaskProgress' from project 'TaskProgress')
	Building workspace spi-builder-workspace with scheme TaskProgress-Package
(3 failures)
Command line invocation:
    /Applications/Xcode-16.3.0.app/Contents/Developer/usr/bin/xcodebuild -IDEClonedSourcePackagesDirPathOverride=/Users/admin/builder/spi-builder-workspace/.dependencies -resolvePackageDependencies
Resolve Package Graph
Resolved source packages:
  TaskProgress: /Users/admin/builder/spi-builder-workspace
resolved source packages: TaskProgress
{
  "dependencies" : [
  ],
  "manifest_display_name" : "TaskProgress",
  "name" : "TaskProgress",
  "path" : "/Users/admin/builder/spi-builder-workspace",
  "platforms" : [
    {
      "name" : "macos",
      "version" : "10.15"
    }
  ],
  "products" : [
    {
      "name" : "TaskProgress",
      "targets" : [
        "TaskProgress"
      ],
      "type" : {
        "library" : [
          "automatic"
        ]
      }
    },
    {
      "name" : "Example",
      "targets" : [
        "Example"
      ],
      "type" : {
        "executable" : null
      }
    }
  ],
  "targets" : [
    {
      "c99name" : "TaskProgress",
      "module_type" : "SwiftTarget",
      "name" : "TaskProgress",
      "path" : "Sources/TaskProgress",
      "product_memberships" : [
        "TaskProgress",
        "Example"
      ],
      "sources" : [
        "Ansi.swift",
        "Format.swift",
        "ProgressIndicators.swift",
        "ProgressTask.swift"
      ],
      "type" : "library"
    },
    {
      "c99name" : "Example",
      "module_type" : "SwiftTarget",
      "name" : "Example",
      "path" : "Sources/Example",
      "product_memberships" : [
        "Example"
      ],
      "sources" : [
        "main.swift"
      ],
      "target_dependencies" : [
        "TaskProgress"
      ],
      "type" : "executable"
    }
  ],
  "tools_version" : "6.0"
}
{
  "workspace" : {
    "name" : "spi-builder-workspace",
    "schemes" : [
      "Example",
      "TaskProgress",
      "TaskProgress-Package"
    ]
  }
}
Running build ...
env DEVELOPER_DIR=/Applications/Xcode-16.3.0.app xcrun xcodebuild -IDEClonedSourcePackagesDirPathOverride=$PWD/.dependencies -skipMacroValidation -skipPackagePluginValidation -derivedDataPath $PWD/.derivedData build -scheme TaskProgress-Package -destination generic/platform=tvOS
Command line invocation:
    /Applications/Xcode-16.3.0.app/Contents/Developer/usr/bin/xcodebuild -IDEClonedSourcePackagesDirPathOverride=/Users/admin/builder/spi-builder-workspace/.dependencies -skipMacroValidation -skipPackagePluginValidation -derivedDataPath /Users/admin/builder/spi-builder-workspace/.derivedData build -scheme TaskProgress-Package -destination generic/platform=tvOS
Resolve Package Graph
Resolved source packages:
  TaskProgress: /Users/admin/builder/spi-builder-workspace
ComputePackagePrebuildTargetDependencyGraph
Prepare packages
CreateBuildRequest
SendProjectDescription
CreateBuildOperation
ComputeTargetDependencyGraph
note: Building targets in dependency order
note: Target dependency graph (3 targets)
    Target 'Example' in project 'TaskProgress'
        ➜ Explicit dependency on target 'TaskProgress' in project 'TaskProgress'
    Target 'TaskProgress' in project 'TaskProgress'
        ➜ Explicit dependency on target 'TaskProgress' in project 'TaskProgress'
    Target 'TaskProgress' in project 'TaskProgress' (no dependencies)
GatherProvisioningInputs
CreateBuildDescription
ExecuteExternalTool /Applications/Xcode-16.3.0.app/Contents/Developer/Toolchains/XcodeDefault.xctoolchain/usr/bin/swiftc --version
ExecuteExternalTool /Applications/Xcode-16.3.0.app/Contents/Developer/Toolchains/XcodeDefault.xctoolchain/usr/bin/clang -v -E -dM -isysroot /Applications/Xcode-16.3.0.app/Contents/Developer/Platforms/AppleTVOS.platform/Developer/SDKs/AppleTVOS18.4.sdk -x c -c /dev/null
ExecuteExternalTool /Applications/Xcode-16.3.0.app/Contents/Developer/Toolchains/XcodeDefault.xctoolchain/usr/bin/ld -version_details
Build description signature: 1ed2318556fbcd4fc2ad4394ecc15994
Build description path: /Users/admin/builder/spi-builder-workspace/.derivedData/Build/Intermediates.noindex/XCBuildData/1ed2318556fbcd4fc2ad4394ecc15994.xcbuilddata
ClangStatCache /Applications/Xcode-16.3.0.app/Contents/Developer/Toolchains/XcodeDefault.xctoolchain/usr/bin/clang-stat-cache /Applications/Xcode-16.3.0.app/Contents/Developer/Platforms/AppleTVOS.platform/Developer/SDKs/AppleTVOS18.4.sdk /Users/admin/builder/spi-builder-workspace/.derivedData/SDKStatCaches.noindex/appletvos18.4-22L251-271d326055c85f9856fa135c41255102.sdkstatcache
    cd /Users/admin/builder/spi-builder-workspace/.swiftpm/xcode
    /Applications/Xcode-16.3.0.app/Contents/Developer/Toolchains/XcodeDefault.xctoolchain/usr/bin/clang-stat-cache /Applications/Xcode-16.3.0.app/Contents/Developer/Platforms/AppleTVOS.platform/Developer/SDKs/AppleTVOS18.4.sdk -o /Users/admin/builder/spi-builder-workspace/.derivedData/SDKStatCaches.noindex/appletvos18.4-22L251-271d326055c85f9856fa135c41255102.sdkstatcache
SwiftDriver TaskProgress normal arm64 com.apple.xcode.tools.swift.compiler (in target 'TaskProgress' from project 'TaskProgress')
    cd /Users/admin/builder/spi-builder-workspace/.swiftpm/xcode
    builtin-SwiftDriver -- /Applications/Xcode-16.3.0.app/Contents/Developer/Toolchains/XcodeDefault.xctoolchain/usr/bin/swiftc -module-name TaskProgress -Onone -enforce-exclusivity\=checked @/Users/admin/builder/spi-builder-workspace/.derivedData/Build/Intermediates.noindex/TaskProgress.build/Debug-appletvos/TaskProgress.build/Objects-normal/arm64/TaskProgress.SwiftFileList -DSWIFT_PACKAGE -DDEBUG -DXcode -plugin-path /Applications/Xcode-16.3.0.app/Contents/Developer/Toolchains/XcodeDefault.xctoolchain/usr/lib/swift/host/plugins/testing -enable-experimental-feature DebugDescriptionMacro -sdk /Applications/Xcode-16.3.0.app/Contents/Developer/Platforms/AppleTVOS.platform/Developer/SDKs/AppleTVOS18.4.sdk -target arm64-apple-tvos12.0 -g -module-cache-path /Users/admin/builder/spi-builder-workspace/.derivedData/ModuleCache.noindex -Xfrontend -serialize-debugging-options -enable-testing -index-store-path /Users/admin/builder/spi-builder-workspace/.derivedData/Index.noindex/DataStore -swift-version 6 -I /Users/admin/builder/spi-builder-workspace/.derivedData/Build/Products/Debug-appletvos -I /Applications/Xcode-16.3.0.app/Contents/Developer/Platforms/AppleTVOS.platform/Developer/usr/lib -F /Users/admin/builder/spi-builder-workspace/.derivedData/Build/Products/Debug-appletvos -F /Applications/Xcode-16.3.0.app/Contents/Developer/Platforms/AppleTVOS.platform/Developer/Library/Frameworks -F /Applications/Xcode-16.3.0.app/Contents/Developer/Platforms/AppleTVOS.platform/Developer/SDKs/AppleTVOS18.4.sdk/Developer/Library/Frameworks -c -j10 -enable-batch-mode -incremental -Xcc -ivfsstatcache -Xcc /Users/admin/builder/spi-builder-workspace/.derivedData/SDKStatCaches.noindex/appletvos18.4-22L251-271d326055c85f9856fa135c41255102.sdkstatcache -output-file-map /Users/admin/builder/spi-builder-workspace/.derivedData/Build/Intermediates.noindex/TaskProgress.build/Debug-appletvos/TaskProgress.build/Objects-normal/arm64/TaskProgress-OutputFileMap.json -use-frontend-parseable-output -save-temps -no-color-diagnostics -serialize-diagnostics -emit-dependencies -emit-module -emit-module-path /Users/admin/builder/spi-builder-workspace/.derivedData/Build/Intermediates.noindex/TaskProgress.build/Debug-appletvos/TaskProgress.build/Objects-normal/arm64/TaskProgress.swiftmodule -validate-clang-modules-once -clang-build-session-file /Users/admin/builder/spi-builder-workspace/.derivedData/ModuleCache.noindex/Session.modulevalidation -package-name spi_builder_workspace -Xcc -I/Users/admin/builder/spi-builder-workspace/.derivedData/Build/Intermediates.noindex/TaskProgress.build/Debug-appletvos/TaskProgress.build/swift-overrides.hmap -emit-const-values -Xfrontend -const-gather-protocols-file -Xfrontend /Users/admin/builder/spi-builder-workspace/.derivedData/Build/Intermediates.noindex/TaskProgress.build/Debug-appletvos/TaskProgress.build/Objects-normal/arm64/TaskProgress_const_extract_protocols.json -Xcc -I/Users/admin/builder/spi-builder-workspace/.derivedData/Build/Products/Debug-appletvos/include -Xcc -I/Users/admin/builder/spi-builder-workspace/.derivedData/Build/Intermediates.noindex/TaskProgress.build/Debug-appletvos/TaskProgress.build/DerivedSources-normal/arm64 -Xcc -I/Users/admin/builder/spi-builder-workspace/.derivedData/Build/Intermediates.noindex/TaskProgress.build/Debug-appletvos/TaskProgress.build/DerivedSources/arm64 -Xcc -I/Users/admin/builder/spi-builder-workspace/.derivedData/Build/Intermediates.noindex/TaskProgress.build/Debug-appletvos/TaskProgress.build/DerivedSources -Xcc -DSWIFT_PACKAGE -Xcc -DDEBUG\=1 -emit-objc-header -emit-objc-header-path /Users/admin/builder/spi-builder-workspace/.derivedData/Build/Intermediates.noindex/TaskProgress.build/Debug-appletvos/TaskProgress.build/Objects-normal/arm64/TaskProgress-Swift.h -working-directory /Users/admin/builder/spi-builder-workspace/.swiftpm/xcode -experimental-emit-module-separately -disable-cmo
SwiftCompile normal arm64 Compiling\ ProgressIndicators.swift /Users/admin/builder/spi-builder-workspace/Sources/TaskProgress/ProgressIndicators.swift (in target 'TaskProgress' from project 'TaskProgress')
SwiftCompile normal arm64 /Users/admin/builder/spi-builder-workspace/Sources/TaskProgress/ProgressIndicators.swift (in target 'TaskProgress' from project 'TaskProgress')
    cd /Users/admin/builder/spi-builder-workspace/.swiftpm/xcode

SwiftEmitModule normal arm64 Emitting\ module\ for\ TaskProgress (in target 'TaskProgress' from project 'TaskProgress')
Failed frontend command:
/Applications/Xcode-16.3.0.app/Contents/Developer/Toolchains/XcodeDefault.xctoolchain/usr/bin/swift-frontend -frontend -emit-module -experimental-skip-non-inlinable-function-bodies-without-types /Users/admin/builder/spi-builder-workspace/Sources/TaskProgress/Ansi.swift /Users/admin/builder/spi-builder-workspace/Sources/TaskProgress/Format.swift /Users/admin/builder/spi-builder-workspace/Sources/TaskProgress/ProgressIndicators.swift /Users/admin/builder/spi-builder-workspace/Sources/TaskProgress/ProgressTask.swift -target arm64-apple-tvos12.0 -Xllvm -aarch64-use-tbi -enable-objc-interop -sdk /Applications/Xcode-16.3.0.app/Contents/Developer/Platforms/AppleTVOS.platform/Developer/SDKs/AppleTVOS18.4.sdk -I /Users/admin/builder/spi-builder-workspace/.derivedData/Build/Products/Debug-appletvos -I /Applications/Xcode-16.3.0.app/Contents/Developer/Platforms/AppleTVOS.platform/Developer/usr/lib -F /Users/admin/builder/spi-builder-workspace/.derivedData/Build/Products/Debug-appletvos -F /Applications/Xcode-16.3.0.app/Contents/Developer/Platforms/AppleTVOS.platform/Developer/Library/Frameworks -F /Applications/Xcode-16.3.0.app/Contents/Developer/Platforms/AppleTVOS.platform/Developer/SDKs/AppleTVOS18.4.sdk/Developer/Library/Frameworks -no-color-diagnostics -enable-testing -g -debug-info-format\=dwarf -dwarf-version\=4 -module-cache-path /Users/admin/builder/spi-builder-workspace/.derivedData/ModuleCache.noindex -swift-version 6 -enforce-exclusivity\=checked -Onone -D SWIFT_PACKAGE -D DEBUG -D Xcode -serialize-debugging-options -const-gather-protocols-file /Users/admin/builder/spi-builder-workspace/.derivedData/Build/Intermediates.noindex/TaskProgress.build/Debug-appletvos/TaskProgress.build/Objects-normal/arm64/TaskProgress_const_extract_protocols.json -enable-experimental-feature DebugDescriptionMacro -empty-abi-descriptor -plugin-path /Applications/Xcode-16.3.0.app/Contents/Developer/Toolchains/XcodeDefault.xctoolchain/usr/lib/swift/host/plugins/testing -validate-clang-modules-once -clang-build-session-file /Users/admin/builder/spi-builder-workspace/.derivedData/ModuleCache.noindex/Session.modulevalidation -Xcc -working-directory -Xcc /Users/admin/builder/spi-builder-workspace/.swiftpm/xcode -resource-dir /Applications/Xcode-16.3.0.app/Contents/Developer/Toolchains/XcodeDefault.xctoolchain/usr/lib/swift -enable-anonymous-context-mangled-names -file-compilation-dir /Users/admin/builder/spi-builder-workspace/.swiftpm/xcode -Xcc -ivfsstatcache -Xcc /Users/admin/builder/spi-builder-workspace/.derivedData/SDKStatCaches.noindex/appletvos18.4-22L251-271d326055c85f9856fa135c41255102.sdkstatcache -Xcc -I/Users/admin/builder/spi-builder-workspace/.derivedData/Build/Intermediates.noindex/TaskProgress.build/Debug-appletvos/TaskProgress.build/swift-overrides.hmap -Xcc -I/Users/admin/builder/spi-builder-workspace/.derivedData/Build/Products/Debug-appletvos/include -Xcc -I/Users/admin/builder/spi-builder-workspace/.derivedData/Build/Intermediates.noindex/TaskProgress.build/Debug-appletvos/TaskProgress.build/DerivedSources-normal/arm64 -Xcc -I/Users/admin/builder/spi-builder-workspace/.derivedData/Build/Intermediates.noindex/TaskProgress.build/Debug-appletvos/TaskProgress.build/DerivedSources/arm64 -Xcc -I/Users/admin/builder/spi-builder-workspace/.derivedData/Build/Intermediates.noindex/TaskProgress.build/Debug-appletvos/TaskProgress.build/DerivedSources -Xcc -DSWIFT_PACKAGE -Xcc -DDEBUG\=1 -module-name TaskProgress -package-name spi_builder_workspace -frontend-parseable-output -disable-clang-spi -target-sdk-version 18.4 -target-sdk-name appletvos18.4 -external-plugin-path /Applications/Xcode-16.3.0.app/Contents/Developer/Platforms/AppleTVOS.platform/Developer/usr/lib/swift/host/plugins\#/Applications/Xcode-16.3.0.app/Contents/Developer/Platforms/AppleTVOS.platform/Developer/usr/bin/swift-plugin-server -external-plugin-path /Applications/Xcode-16.3.0.app/Contents/Developer/Platforms/AppleTVOS.platform/Developer/usr/local/lib/swift/host/plugins\#/Applications/Xcode-16.3.0.app/Contents/Developer/Platforms/AppleTVOS.platform/Developer/usr/bin/swift-plugin-server -in-process-plugin-server-path /Applications/Xcode-16.3.0.app/Contents/Developer/Toolchains/XcodeDefault.xctoolchain/usr/lib/swift/host/libSwiftInProcPluginServer.dylib -plugin-path /Applications/Xcode-16.3.0.app/Contents/Developer/Toolchains/XcodeDefault.xctoolchain/usr/lib/swift/host/plugins -plugin-path /Applications/Xcode-16.3.0.app/Contents/Developer/Toolchains/XcodeDefault.xctoolchain/usr/local/lib/swift/host/plugins -emit-module-doc-path /Users/admin/builder/spi-builder-workspace/.derivedData/Build/Intermediates.noindex/TaskProgress.build/Debug-appletvos/TaskProgress.build/Objects-normal/arm64/TaskProgress.swiftdoc -emit-module-source-info-path /Users/admin/builder/spi-builder-workspace/.derivedData/Build/Intermediates.noindex/TaskProgress.build/Debug-appletvos/TaskProgress.build/Objects-normal/arm64/TaskProgress.swiftsourceinfo -emit-objc-header-path /Users/admin/builder/spi-builder-workspace/.derivedData/Build/Intermediates.noindex/TaskProgress.build/Debug-appletvos/TaskProgress.build/Objects-normal/arm64/TaskProgress-Swift.h -serialize-diagnostics-path /Users/admin/builder/spi-builder-workspace/.derivedData/Build/Intermediates.noindex/TaskProgress.build/Debug-appletvos/TaskProgress.build/Objects-normal/arm64/TaskProgress-master-emit-module.dia -emit-dependencies-path /Users/admin/builder/spi-builder-workspace/.derivedData/Build/Intermediates.noindex/TaskProgress.build/Debug-appletvos/TaskProgress.build/Objects-normal/arm64/TaskProgress-master-emit-module.d -o /Users/admin/builder/spi-builder-workspace/.derivedData/Build/Intermediates.noindex/TaskProgress.build/Debug-appletvos/TaskProgress.build/Objects-normal/arm64/TaskProgress.swiftmodule -emit-abi-descriptor-path /Users/admin/builder/spi-builder-workspace/.derivedData/Build/Intermediates.noindex/TaskProgress.build/Debug-appletvos/TaskProgress.build/Objects-normal/arm64/TaskProgress.abi.json
EmitSwiftModule normal arm64 (in target 'TaskProgress' from project 'TaskProgress')
    cd /Users/admin/builder/spi-builder-workspace/.swiftpm/xcode

/Users/admin/builder/spi-builder-workspace/Sources/TaskProgress/ProgressIndicators.swift:24:19: error: 'Task' is only available in tvOS 13.0 or newer
  var screenTask: Task<Void, any Error>?
                  ^
/Users/admin/builder/spi-builder-workspace/Sources/TaskProgress/ProgressIndicators.swift:19:20: note: add @available attribute to enclosing class
public final class ProgressIndicators: @unchecked Sendable {
                   ^
SwiftCompile normal arm64 Compiling\ ProgressTask.swift /Users/admin/builder/spi-builder-workspace/Sources/TaskProgress/ProgressTask.swift (in target 'TaskProgress' from project 'TaskProgress')
SwiftCompile normal arm64 /Users/admin/builder/spi-builder-workspace/Sources/TaskProgress/ProgressTask.swift (in target 'TaskProgress' from project 'TaskProgress')
    cd /Users/admin/builder/spi-builder-workspace/.swiftpm/xcode

SwiftCompile normal arm64 Compiling\ Ansi.swift /Users/admin/builder/spi-builder-workspace/Sources/TaskProgress/Ansi.swift (in target 'TaskProgress' from project 'TaskProgress')
SwiftCompile normal arm64 /Users/admin/builder/spi-builder-workspace/Sources/TaskProgress/Ansi.swift (in target 'TaskProgress' from project 'TaskProgress')
    cd /Users/admin/builder/spi-builder-workspace/.swiftpm/xcode

SwiftCompile normal arm64 Compiling\ Format.swift /Users/admin/builder/spi-builder-workspace/Sources/TaskProgress/Format.swift (in target 'TaskProgress' from project 'TaskProgress')
SwiftCompile normal arm64 /Users/admin/builder/spi-builder-workspace/Sources/TaskProgress/Format.swift (in target 'TaskProgress' from project 'TaskProgress')
    cd /Users/admin/builder/spi-builder-workspace/.swiftpm/xcode

** BUILD FAILED **
The following build commands failed:
	SwiftEmitModule normal arm64 Emitting\ module\ for\ TaskProgress (in target 'TaskProgress' from project 'TaskProgress')
	EmitSwiftModule normal arm64 (in target 'TaskProgress' from project 'TaskProgress')
	Building workspace spi-builder-workspace with scheme TaskProgress-Package
(3 failures)
BUILD FAILURE 6.1 tvOS