Build Information
Failed to build SectionKit, reference 2.4.5 (afc679
), with Swift 5.10 for Linux on 16 Apr 2025 13:09:20 UTC.
Build Command
bash -c docker run --pull=always --rm -v "checkouts-4609320-1":/host -w "$PWD" registry.gitlab.com/finestructure/spi-images:basic-5.10-latest swift build --triple x86_64-unknown-linux-gnu 2>&1
Build Log
========================================
RunAll
========================================
Builder version: 4.60.1
Interrupt handler set up.
========================================
Checkout
========================================
Clone URL: https://github.com/linhay/SectionKit.git
Reference: 2.4.5
Initialized empty Git repository in /host/spi-builder-workspace/.git/
hint: Using 'master' as the name for the initial branch. This default branch name
hint: is subject to change. To configure the initial branch name to use in all
hint: of your new repositories, which will suppress this warning, call:
hint:
hint: git config --global init.defaultBranch <name>
hint:
hint: Names commonly chosen instead of 'master' are 'main', 'trunk' and
hint: 'development'. The just-created branch can be renamed via this command:
hint:
hint: git branch -m <name>
From https://github.com/linhay/SectionKit
* tag 2.4.5 -> FETCH_HEAD
HEAD is now at afc679b chore: 2.4.5
Cloned https://github.com/linhay/SectionKit.git
Revision (git rev-parse @):
afc679bea8446a6fbc1ba58e77686e25d717cafe
SPI manifest file found: $PWD/.spi.yml
SUCCESS checkout https://github.com/linhay/SectionKit.git at 2.4.5
========================================
Build
========================================
Selected platform: linux
Swift version: 5.10
Building package at path: $PWD
https://github.com/linhay/SectionKit.git
Running build ...
bash -c docker run --pull=always --rm -v "checkouts-4609320-1":/host -w "$PWD" registry.gitlab.com/finestructure/spi-images:basic-5.10-latest swift build --triple x86_64-unknown-linux-gnu 2>&1
basic-5.10-latest: Pulling from finestructure/spi-images
Digest: sha256:616ef225d0085997f26355ad9695b1159b91f6187a43f9ff135cb59d096bc97d
Status: Image is up to date for registry.gitlab.com/finestructure/spi-images:basic-5.10-latest
Fetching https://github.com/apple/swift-docc-plugin
[1/2049] Fetching swift-docc-plugin
Fetched https://github.com/apple/swift-docc-plugin from cache (0.37s)
Computing version for https://github.com/apple/swift-docc-plugin
Computed https://github.com/apple/swift-docc-plugin at 1.4.3 (0.95s)
Fetching https://github.com/swiftlang/swift-docc-symbolkit
[1/3366] Fetching swift-docc-symbolkit
Fetched https://github.com/swiftlang/swift-docc-symbolkit from cache (0.33s)
Computing version for https://github.com/swiftlang/swift-docc-symbolkit
Computed https://github.com/swiftlang/swift-docc-symbolkit at 1.0.0 (0.39s)
Creating working copy for https://github.com/swiftlang/swift-docc-symbolkit
Working copy of https://github.com/swiftlang/swift-docc-symbolkit resolved at 1.0.0
Creating working copy for https://github.com/apple/swift-docc-plugin
Working copy of https://github.com/apple/swift-docc-plugin resolved at 1.4.3
[1/1] Compiling plugin Swift-DocC
[2/2] Compiling plugin Swift-DocC Preview
Building for debugging...
[2/5] Write sources
[4/5] Write swift-version-24593BA9C3E375BF.txt
error: emit-module command failed with exit code 1 (use -v to see invocation)
[6/69] Emitting module SectionKit
/host/spi-builder-workspace/Sources/SectionKit/CollectionBaseProtocol/SKCDataSource/SKCDataSourceForward.swift:8:8: error: no such module 'UIKit'
import UIKit
^
[7/77] Compiling SectionKit SKCDataSourcePrefetchingForwardProtocol.swift
/host/spi-builder-workspace/Sources/SectionKit/CollectionBaseProtocol/SKCDataSource/SKCDataSourceForward.swift:8:8: error: no such module 'UIKit'
import UIKit
^
[8/77] Compiling SectionKit SKCDataSourcePrefetchingObserverProtocol.swift
/host/spi-builder-workspace/Sources/SectionKit/CollectionBaseProtocol/SKCDataSource/SKCDataSourceForward.swift:8:8: error: no such module 'UIKit'
import UIKit
^
[9/77] Compiling SectionKit SKCViewDataSourcePrefetching.swift
/host/spi-builder-workspace/Sources/SectionKit/CollectionBaseProtocol/SKCDataSource/SKCDataSourceForward.swift:8:8: error: no such module 'UIKit'
import UIKit
^
[10/77] Compiling SectionKit SKCViewDataSourcePrefetchingProtocol.swift
/host/spi-builder-workspace/Sources/SectionKit/CollectionBaseProtocol/SKCDataSource/SKCDataSourceForward.swift:8:8: error: no such module 'UIKit'
import UIKit
^
[11/77] Compiling SectionKit SKCDelegate.swift
/host/spi-builder-workspace/Sources/SectionKit/CollectionBaseProtocol/SKCDataSource/SKCDataSourceForward.swift:8:8: error: no such module 'UIKit'
import UIKit
^
[12/77] Compiling SectionKit SKCDelegateForward.swift
/host/spi-builder-workspace/Sources/SectionKit/CollectionBaseProtocol/SKCDataSource/SKCDataSourceForward.swift:8:8: error: no such module 'UIKit'
import UIKit
^
[13/77] Compiling SectionKit SKCDelegateForwardProtocol.swift
/host/spi-builder-workspace/Sources/SectionKit/CollectionBaseProtocol/SKCDataSource/SKCDataSourceForward.swift:8:8: error: no such module 'UIKit'
import UIKit
^
[14/77] Compiling SectionKit SKCDelegateObserverProtocol.swift
/host/spi-builder-workspace/Sources/SectionKit/CollectionBaseProtocol/SKCDataSource/SKCDataSourceForward.swift:8:8: error: no such module 'UIKit'
import UIKit
^
[15/77] Compiling SectionKit SKCDelegateProtocol.swift
/host/spi-builder-workspace/Sources/SectionKit/CollectionBaseProtocol/SKCDataSource/SKCDataSourceForward.swift:8:8: error: no such module 'UIKit'
import UIKit
^
[16/77] Compiling SectionKit SKCManager.swift
/host/spi-builder-workspace/Sources/SectionKit/CollectionBaseProtocol/SKCDataSource/SKCDataSourceForward.swift:8:8: error: no such module 'UIKit'
import UIKit
^
[17/77] Compiling SectionKit SKCSectionActionProtocol.swift
/host/spi-builder-workspace/Sources/SectionKit/CollectionBaseProtocol/SKCDataSource/SKCDataSourceForward.swift:8:8: error: no such module 'UIKit'
import UIKit
^
[18/77] Compiling SectionKit SKCSectionInjection.swift
/host/spi-builder-workspace/Sources/SectionKit/CollectionBaseProtocol/SKCDataSource/SKCDataSourceForward.swift:8:8: error: no such module 'UIKit'
import UIKit
^
[19/77] Compiling SectionKit SKSafeSizeProviderProtocol.swift
/host/spi-builder-workspace/Sources/SectionKit/CollectionBaseProtocol/SKCDataSource/SKCDataSourceForward.swift:8:8: error: no such module 'UIKit'
import UIKit
^
[20/77] Compiling SectionKit SKSupplementaryKind.swift
/host/spi-builder-workspace/Sources/SectionKit/CollectionBaseProtocol/SKCDataSource/SKCDataSourceForward.swift:8:8: error: no such module 'UIKit'
import UIKit
^
[21/77] Compiling SectionKit SKCDataSource.swift
/host/spi-builder-workspace/Sources/SectionKit/CollectionBaseProtocol/SKCDataSource/SKCDataSourceForward.swift:8:8: error: no such module 'UIKit'
import UIKit
^
[22/77] Compiling SectionKit SKCDataSourceForward.swift
/host/spi-builder-workspace/Sources/SectionKit/CollectionBaseProtocol/SKCDataSource/SKCDataSourceForward.swift:8:8: error: no such module 'UIKit'
import UIKit
^
[23/77] Compiling SectionKit SKCDataSourceProtocol.swift
/host/spi-builder-workspace/Sources/SectionKit/CollectionBaseProtocol/SKCDataSource/SKCDataSourceForward.swift:8:8: error: no such module 'UIKit'
import UIKit
^
[24/77] Compiling SectionKit SKCDataSourcePrefetchingForward.swift
/host/spi-builder-workspace/Sources/SectionKit/CollectionBaseProtocol/SKCDataSource/SKCDataSourceForward.swift:8:8: error: no such module 'UIKit'
import UIKit
^
[25/77] Compiling SectionKit SKCSingleTypeSection+HighPerformance.swift
/host/spi-builder-workspace/Sources/SectionKit/CollectionBaseProtocol/SKCDataSource/SKCDataSourceForward.swift:8:8: error: no such module 'UIKit'
import UIKit
^
[26/77] Compiling SectionKit SKCSingleTypeSection+displayedTimes.swift
/host/spi-builder-workspace/Sources/SectionKit/CollectionBaseProtocol/SKCDataSource/SKCDataSourceForward.swift:8:8: error: no such module 'UIKit'
import UIKit
^
[27/77] Compiling SectionKit SKCSingleTypeSection+onAction.swift
/host/spi-builder-workspace/Sources/SectionKit/CollectionBaseProtocol/SKCDataSource/SKCDataSourceForward.swift:8:8: error: no such module 'UIKit'
import UIKit
^
[28/77] Compiling SectionKit SKCSingleTypeSection+refresh.swift
/host/spi-builder-workspace/Sources/SectionKit/CollectionBaseProtocol/SKCDataSource/SKCDataSourceForward.swift:8:8: error: no such module 'UIKit'
import UIKit
^
[29/77] Compiling SectionKit SKCSingleTypeSection+subscribe.swift
/host/spi-builder-workspace/Sources/SectionKit/CollectionBaseProtocol/SKCDataSource/SKCDataSourceForward.swift:8:8: error: no such module 'UIKit'
import UIKit
^
[30/77] Compiling SectionKit SKCSingleTypeSection+supplementary.swift
/host/spi-builder-workspace/Sources/SectionKit/CollectionBaseProtocol/SKCDataSource/SKCDataSourceForward.swift:8:8: error: no such module 'UIKit'
import UIKit
^
[31/77] Compiling SectionKit SKCSingleTypeSection.swift
/host/spi-builder-workspace/Sources/SectionKit/CollectionBaseProtocol/SKCDataSource/SKCDataSourceForward.swift:8:8: error: no such module 'UIKit'
import UIKit
^
[32/77] Compiling SectionKit SKCSingleTypeSectionRowContext.swift
/host/spi-builder-workspace/Sources/SectionKit/CollectionBaseProtocol/SKCDataSource/SKCDataSourceForward.swift:8:8: error: no such module 'UIKit'
import UIKit
^
[33/77] Compiling SectionKit SKCSingleTypeWrapper.swift
/host/spi-builder-workspace/Sources/SectionKit/CollectionBaseProtocol/SKCDataSource/SKCDataSourceForward.swift:8:8: error: no such module 'UIKit'
import UIKit
^
[34/77] Compiling SectionKit SKPrint.swift
/host/spi-builder-workspace/Sources/SectionKit/CollectionBaseProtocol/SKCDataSource/SKCDataSourceForward.swift:8:8: error: no such module 'UIKit'
import UIKit
^
[35/77] Compiling SectionKit SKPublished.swift
/host/spi-builder-workspace/Sources/SectionKit/CollectionBaseProtocol/SKCDataSource/SKCDataSourceForward.swift:8:8: error: no such module 'UIKit'
import UIKit
^
[36/77] Compiling SectionKit SKScrollViewDelegateForward.swift
/host/spi-builder-workspace/Sources/SectionKit/CollectionBaseProtocol/SKCDataSource/SKCDataSourceForward.swift:8:8: error: no such module 'UIKit'
import UIKit
^
[37/77] Compiling SectionKit SKScrollViewDelegateForwardProtocol.swift
/host/spi-builder-workspace/Sources/SectionKit/CollectionBaseProtocol/SKCDataSource/SKCDataSourceForward.swift:8:8: error: no such module 'UIKit'
import UIKit
^
[38/77] Compiling SectionKit SKScrollViewDelegateHandler.swift
/host/spi-builder-workspace/Sources/SectionKit/CollectionBaseProtocol/SKCDataSource/SKCDataSourceForward.swift:8:8: error: no such module 'UIKit'
import UIKit
^
[39/77] Compiling SectionKit SKScrollViewDelegateObserverBox.swift
/host/spi-builder-workspace/Sources/SectionKit/CollectionBaseProtocol/SKCDataSource/SKCDataSourceForward.swift:8:8: error: no such module 'UIKit'
import UIKit
^
[40/77] Compiling SectionKit SKScrollViewDelegateObserverProtocol.swift
/host/spi-builder-workspace/Sources/SectionKit/CollectionBaseProtocol/SKCDataSource/SKCDataSourceForward.swift:8:8: error: no such module 'UIKit'
import UIKit
^
[41/77] Compiling SectionKit SKUIAction.swift
/host/spi-builder-workspace/Sources/SectionKit/CollectionBaseProtocol/SKCDataSource/SKCDataSourceForward.swift:8:8: error: no such module 'UIKit'
import UIKit
^
[42/77] Compiling SectionKit SKUIContextMenuResult.swift
/host/spi-builder-workspace/Sources/SectionKit/CollectionBaseProtocol/SKCDataSource/SKCDataSourceForward.swift:8:8: error: no such module 'UIKit'
import UIKit
^
[43/77] Compiling SectionKit SKConfigurableAdaptiveView.swift
/host/spi-builder-workspace/Sources/SectionKit/CollectionBaseProtocol/SKCDataSource/SKCDataSourceForward.swift:8:8: error: no such module 'UIKit'
import UIKit
^
[44/77] Compiling SectionKit SKConfigurableLayoutProtocol.swift
/host/spi-builder-workspace/Sources/SectionKit/CollectionBaseProtocol/SKCDataSource/SKCDataSourceForward.swift:8:8: error: no such module 'UIKit'
import UIKit
^
[45/77] Compiling SectionKit SKConfigurableModelProtocol.swift
/host/spi-builder-workspace/Sources/SectionKit/CollectionBaseProtocol/SKCDataSource/SKCDataSourceForward.swift:8:8: error: no such module 'UIKit'
import UIKit
^
[46/77] Compiling SectionKit SKConfigurableView.swift
/host/spi-builder-workspace/Sources/SectionKit/CollectionBaseProtocol/SKCDataSource/SKCDataSourceForward.swift:8:8: error: no such module 'UIKit'
import UIKit
^
[47/77] Compiling SectionKit SKLayoutDirection.swift
/host/spi-builder-workspace/Sources/SectionKit/CollectionBaseProtocol/SKCDataSource/SKCDataSourceForward.swift:8:8: error: no such module 'UIKit'
import UIKit
^
[48/77] Compiling SectionKit SKLoadNibProtocol.swift
/host/spi-builder-workspace/Sources/SectionKit/CollectionBaseProtocol/SKCDataSource/SKCDataSourceForward.swift:8:8: error: no such module 'UIKit'
import UIKit
^
[49/77] Compiling SectionKit SKLoadViewProtocol.swift
/host/spi-builder-workspace/Sources/SectionKit/CollectionBaseProtocol/SKCDataSource/SKCDataSourceForward.swift:8:8: error: no such module 'UIKit'
import UIKit
^
[50/77] Compiling SectionKit SectionKit.swift
/host/spi-builder-workspace/Sources/SectionKit/CollectionBaseProtocol/SKCDataSource/SKCDataSourceForward.swift:8:8: error: no such module 'UIKit'
import UIKit
^
[51/77] Compiling SectionKit SKCSupplementary.swift
/host/spi-builder-workspace/Sources/SectionKit/CollectionBaseProtocol/SKCDataSource/SKCDataSourceForward.swift:8:8: error: no such module 'UIKit'
import UIKit
^
[52/77] Compiling SectionKit SKCSupplementaryActionType.swift
/host/spi-builder-workspace/Sources/SectionKit/CollectionBaseProtocol/SKCDataSource/SKCDataSourceForward.swift:8:8: error: no such module 'UIKit'
import UIKit
^
[53/77] Compiling SectionKit SKCSingleTypeSectionProtocol.swift
/host/spi-builder-workspace/Sources/SectionKit/CollectionBaseProtocol/SKCDataSource/SKCDataSourceForward.swift:8:8: error: no such module 'UIKit'
import UIKit
^
[54/77] Compiling SectionKit SKCSupplementaryProtocol.swift
/host/spi-builder-workspace/Sources/SectionKit/CollectionBaseProtocol/SKCDataSource/SKCDataSourceForward.swift:8:8: error: no such module 'UIKit'
import UIKit
^
[55/77] Compiling SectionKit SKActor.swift
/host/spi-builder-workspace/Sources/SectionKit/CollectionBaseProtocol/SKCDataSource/SKCDataSourceForward.swift:8:8: error: no such module 'UIKit'
import UIKit
^
[56/77] Compiling SectionKit SKBinding.swift
/host/spi-builder-workspace/Sources/SectionKit/CollectionBaseProtocol/SKCDataSource/SKCDataSourceForward.swift:8:8: error: no such module 'UIKit'
import UIKit
^
[57/77] Compiling SectionKit SKHandleResult.swift
/host/spi-builder-workspace/Sources/SectionKit/CollectionBaseProtocol/SKCDataSource/SKCDataSourceForward.swift:8:8: error: no such module 'UIKit'
import UIKit
^
[58/77] Compiling SectionKit SKIDBox.swift
/host/spi-builder-workspace/Sources/SectionKit/CollectionBaseProtocol/SKCDataSource/SKCDataSourceForward.swift:8:8: error: no such module 'UIKit'
import UIKit
^
[59/77] Compiling SectionKit SKInout.swift
/host/spi-builder-workspace/Sources/SectionKit/CollectionBaseProtocol/SKCDataSource/SKCDataSourceForward.swift:8:8: error: no such module 'UIKit'
import UIKit
^
[60/77] Compiling SectionKit SKCDelegateFlowLayoutForward.swift
/host/spi-builder-workspace/Sources/SectionKit/CollectionBaseProtocol/SKCDataSource/SKCDataSourceForward.swift:8:8: error: no such module 'UIKit'
import UIKit
^
[61/77] Compiling SectionKit SKCDelegateFlowLayoutForwardProtocol.swift
/host/spi-builder-workspace/Sources/SectionKit/CollectionBaseProtocol/SKCDataSource/SKCDataSourceForward.swift:8:8: error: no such module 'UIKit'
import UIKit
^
[62/77] Compiling SectionKit SKCDelegateFlowLayoutObserverProtocol.swift
/host/spi-builder-workspace/Sources/SectionKit/CollectionBaseProtocol/SKCDataSource/SKCDataSourceForward.swift:8:8: error: no such module 'UIKit'
import UIKit
^
[63/77] Compiling SectionKit SKCViewDelegateFlowLayout.swift
/host/spi-builder-workspace/Sources/SectionKit/CollectionBaseProtocol/SKCDataSource/SKCDataSourceForward.swift:8:8: error: no such module 'UIKit'
import UIKit
^
[64/77] Compiling SectionKit SKCViewDelegateFlowLayoutProtocol.swift
/host/spi-builder-workspace/Sources/SectionKit/CollectionBaseProtocol/SKCDataSource/SKCDataSourceForward.swift:8:8: error: no such module 'UIKit'
import UIKit
^
[65/77] Compiling SectionKit SKCSectionProtocol.swift
/host/spi-builder-workspace/Sources/SectionKit/CollectionBaseProtocol/SKCDataSource/SKCDataSourceForward.swift:8:8: error: no such module 'UIKit'
import UIKit
^
[66/77] Compiling SectionKit SKCCellStyleContext.swift
/host/spi-builder-workspace/Sources/SectionKit/CollectionBaseProtocol/SKCDataSource/SKCDataSourceForward.swift:8:8: error: no such module 'UIKit'
import UIKit
^
[67/77] Compiling SectionKit SKCPrefetch.swift
/host/spi-builder-workspace/Sources/SectionKit/CollectionBaseProtocol/SKCDataSource/SKCDataSourceForward.swift:8:8: error: no such module 'UIKit'
import UIKit
^
[68/77] Compiling SectionKit SKCSingleType+CellActionContext.swift
/host/spi-builder-workspace/Sources/SectionKit/CollectionBaseProtocol/SKCDataSource/SKCDataSourceForward.swift:8:8: error: no such module 'UIKit'
import UIKit
^
[69/77] Compiling SectionKit SKWeakBox.swift
/host/spi-builder-workspace/Sources/SectionKit/CollectionBaseProtocol/SKCDataSource/SKCDataSourceForward.swift:8:8: error: no such module 'UIKit'
import UIKit
^
[70/77] Compiling SectionKit SKWhen.swift
/host/spi-builder-workspace/Sources/SectionKit/CollectionBaseProtocol/SKCDataSource/SKCDataSourceForward.swift:8:8: error: no such module 'UIKit'
import UIKit
^
[71/77] Compiling SectionKit SKCountedStore.swift
/host/spi-builder-workspace/Sources/SectionKit/CollectionBaseProtocol/SKCDataSource/SKCDataSourceForward.swift:8:8: error: no such module 'UIKit'
import UIKit
^
[72/77] Compiling SectionKit SKDisplayedTimesProtocol.swift
/host/spi-builder-workspace/Sources/SectionKit/CollectionBaseProtocol/SKCDataSource/SKCDataSourceForward.swift:8:8: error: no such module 'UIKit'
import UIKit
^
[73/77] Compiling SectionKit SKHighPerformanceStore.swift
/host/spi-builder-workspace/Sources/SectionKit/CollectionBaseProtocol/SKCDataSource/SKCDataSourceForward.swift:8:8: error: no such module 'UIKit'
import UIKit
^
[74/77] Compiling SectionKit SKKVCache.swift
/host/spi-builder-workspace/Sources/SectionKit/CollectionBaseProtocol/SKCDataSource/SKCDataSourceForward.swift:8:8: error: no such module 'UIKit'
import UIKit
^
[75/77] Compiling SectionKit SectionArrayResultBuilder.swift
/host/spi-builder-workspace/Sources/SectionKit/CollectionBaseProtocol/SKCDataSource/SKCDataSourceForward.swift:8:8: error: no such module 'UIKit'
import UIKit
^
[76/77] Compiling SectionKit SKAdaptive.swift
/host/spi-builder-workspace/Sources/SectionKit/CollectionBaseProtocol/SKCDataSource/SKCDataSourceForward.swift:8:8: error: no such module 'UIKit'
import UIKit
^
[77/77] Compiling SectionKit SKConfigurableAdaptiveMainView.swift
/host/spi-builder-workspace/Sources/SectionKit/CollectionBaseProtocol/SKCDataSource/SKCDataSourceForward.swift:8:8: error: no such module 'UIKit'
import UIKit
^
error: fatalError
BUILD FAILURE 5.10 linux