Build Information
Failed to build Bitmap, reference main (c99802
), with Swift 5.9 for Linux on 15 Apr 2025 12:44:46 UTC.
Build Command
bash -c docker run --pull=always --rm -v "checkouts-4606859-0":/host -w "$PWD" registry.gitlab.com/finestructure/spi-images:basic-5.9-latest swift build --triple x86_64-unknown-linux-gnu 2>&1
Build Log
========================================
RunAll
========================================
Builder version: 4.60.1
Interrupt handler set up.
========================================
Checkout
========================================
Clone URL: https://github.com/dagronf/Bitmap.git
Reference: main
Initialized empty Git repository in /host/spi-builder-workspace/.git/
hint: Using 'master' as the name for the initial branch. This default branch name
hint: is subject to change. To configure the initial branch name to use in all
hint: of your new repositories, which will suppress this warning, call:
hint:
hint: git config --global init.defaultBranch <name>
hint:
hint: Names commonly chosen instead of 'master' are 'main', 'trunk' and
hint: 'development'. The just-created branch can be renamed via this command:
hint:
hint: git branch -m <name>
From https://github.com/dagronf/Bitmap
* branch main -> FETCH_HEAD
* [new branch] main -> origin/main
HEAD is now at c998028 More quantizing routines
Cloned https://github.com/dagronf/Bitmap.git
Revision (git rev-parse @):
c998028004035c34dbd969e7e89027ce358bbb33
SPI manifest file found: $PWD/.spi.yml
SUCCESS checkout https://github.com/dagronf/Bitmap.git at main
========================================
Build
========================================
Selected platform: linux
Swift version: 5.9
Building package at path: $PWD
https://github.com/dagronf/Bitmap.git
Running build ...
bash -c docker run --pull=always --rm -v "checkouts-4606859-0":/host -w "$PWD" registry.gitlab.com/finestructure/spi-images:basic-5.9-latest swift build --triple x86_64-unknown-linux-gnu 2>&1
basic-5.9-latest: Pulling from finestructure/spi-images
Digest: sha256:93fe18f778ec94e026baa8cc68b2ae87de241b204c49ca7a3a12cf55897227aa
Status: Image is up to date for registry.gitlab.com/finestructure/spi-images:basic-5.9-latest
Fetching https://github.com/dagronf/SwiftImageReadWrite
[1/378] Fetching swiftimagereadwrite
Fetched https://github.com/dagronf/SwiftImageReadWrite (0.22s)
Computing version for https://github.com/dagronf/SwiftImageReadWrite
Computed https://github.com/dagronf/SwiftImageReadWrite at 1.9.2 (0.39s)
Creating working copy for https://github.com/dagronf/SwiftImageReadWrite
Working copy of https://github.com/dagronf/SwiftImageReadWrite resolved at 1.9.2
Building for debugging...
[0/2] Copying PrivacyInfo.xcprivacy
[3/19] Emitting module SwiftImageReadWrite
[4/21] Compiling SwiftImageReadWrite PlatformImage+codable.swift
[5/21] Compiling SwiftImageReadWrite PlatformImage+export.swift
[6/21] Compiling SwiftImageReadWrite Errors.swift
[7/21] Compiling SwiftImageReadWrite ImageExportTypes.swift
[8/21] Compiling SwiftImageReadWrite PlatformImage.swift
[9/21] Compiling SwiftImageReadWrite Utils.swift
[10/21] Compiling SwiftImageReadWrite CGImage+export.swift
[11/21] Compiling SwiftImageReadWrite CGImage+extensions.swift
[12/21] Compiling SwiftImageReadWrite CGImage+import.swift
[13/21] Compiling SwiftImageReadWrite CGImage+SVG.swift
[14/21] Compiling SwiftImageReadWrite CGImage+codable.swift
[15/21] Compiling SwiftImageReadWrite CGImage+colorspace.swift
[16/21] Compiling SwiftImageReadWrite CGImage+platform.swift
[17/21] Compiling SwiftImageReadWrite CIImage+extensions.swift
[18/21] Compiling SwiftImageReadWrite PlatformImage+import.swift
[19/21] Compiling SwiftImageReadWrite PlatformImage+macOS.swift
[20/21] Compiling SwiftImageReadWrite SwiftUI+extensions.swift
[21/21] Compiling SwiftImageReadWrite resource_bundle_accessor.swift
[24/67] Compiling Bitmap Bitmap+Blur.swift
/host/spi-builder-workspace/Sources/Bitmap/Bitmap+Drawing.swift:21:8: error: no such module 'CoreGraphics'
import CoreGraphics
^
[25/67] Compiling Bitmap Bitmap+Border.swift
/host/spi-builder-workspace/Sources/Bitmap/Bitmap+Drawing.swift:21:8: error: no such module 'CoreGraphics'
import CoreGraphics
^
[26/67] Compiling Bitmap Bitmap+Clip.swift
/host/spi-builder-workspace/Sources/Bitmap/Bitmap+Drawing.swift:21:8: error: no such module 'CoreGraphics'
import CoreGraphics
^
[27/67] Compiling Bitmap Bitmap+ColorInvert.swift
/host/spi-builder-workspace/Sources/Bitmap/Bitmap+Drawing.swift:21:8: error: no such module 'CoreGraphics'
import CoreGraphics
^
[28/67] Compiling Bitmap Bitmap+ColorMapping.swift
/host/spi-builder-workspace/Sources/Bitmap/Bitmap+Drawing.swift:21:8: error: no such module 'CoreGraphics'
import CoreGraphics
^
[29/67] Compiling Bitmap Bitmap+Crop.swift
/host/spi-builder-workspace/Sources/Bitmap/Bitmap+Drawing.swift:21:8: error: no such module 'CoreGraphics'
import CoreGraphics
^
[30/73] Compiling Bitmap Bitmap+Generator.swift
/host/spi-builder-workspace/Sources/Bitmap/Bitmap+Drawing.swift:21:8: error: no such module 'CoreGraphics'
import CoreGraphics
^
[31/73] Compiling Bitmap Bitmap+Grayscale.swift
/host/spi-builder-workspace/Sources/Bitmap/Bitmap+Drawing.swift:21:8: error: no such module 'CoreGraphics'
import CoreGraphics
^
[32/73] Compiling Bitmap Bitmap+Image.swift
/host/spi-builder-workspace/Sources/Bitmap/Bitmap+Drawing.swift:21:8: error: no such module 'CoreGraphics'
import CoreGraphics
^
[33/73] Compiling Bitmap Bitmap+InnerShadow.swift
/host/spi-builder-workspace/Sources/Bitmap/Bitmap+Drawing.swift:21:8: error: no such module 'CoreGraphics'
import CoreGraphics
^
[34/73] Compiling Bitmap Bitmap+Inset.swift
/host/spi-builder-workspace/Sources/Bitmap/Bitmap+Drawing.swift:21:8: error: no such module 'CoreGraphics'
import CoreGraphics
^
[35/73] Compiling Bitmap Bitmap+Masking.swift
/host/spi-builder-workspace/Sources/Bitmap/Bitmap+Drawing.swift:21:8: error: no such module 'CoreGraphics'
import CoreGraphics
^
[36/73] Compiling Bitmap Bitmap+Text.swift
/host/spi-builder-workspace/Sources/Bitmap/Bitmap+Drawing.swift:21:8: error: no such module 'CoreGraphics'
import CoreGraphics
^
[37/73] Compiling Bitmap Bitmap+Tint.swift
/host/spi-builder-workspace/Sources/Bitmap/Bitmap+Drawing.swift:21:8: error: no such module 'CoreGraphics'
import CoreGraphics
^
[38/73] Compiling Bitmap Bitmap+Transparency.swift
/host/spi-builder-workspace/Sources/Bitmap/Bitmap+Drawing.swift:21:8: error: no such module 'CoreGraphics'
import CoreGraphics
^
[39/73] Compiling Bitmap Angle2D.swift
/host/spi-builder-workspace/Sources/Bitmap/Bitmap+Drawing.swift:21:8: error: no such module 'CoreGraphics'
import CoreGraphics
^
[40/73] Compiling Bitmap CGColor+extensions.swift
/host/spi-builder-workspace/Sources/Bitmap/Bitmap+Drawing.swift:21:8: error: no such module 'CoreGraphics'
import CoreGraphics
^
[41/73] Compiling Bitmap CGColor+standard.swift
/host/spi-builder-workspace/Sources/Bitmap/Bitmap+Drawing.swift:21:8: error: no such module 'CoreGraphics'
import CoreGraphics
^
[42/73] Compiling Bitmap Bitmap+Dither.swift
/host/spi-builder-workspace/Sources/Bitmap/Bitmap+Drawing.swift:21:8: error: no such module 'CoreGraphics'
import CoreGraphics
^
[43/73] Compiling Bitmap Bitmap+Erase.swift
/host/spi-builder-workspace/Sources/Bitmap/Bitmap+Drawing.swift:21:8: error: no such module 'CoreGraphics'
import CoreGraphics
^
[44/73] Compiling Bitmap Bitmap+Extract.swift
/host/spi-builder-workspace/Sources/Bitmap/Bitmap+Drawing.swift:21:8: error: no such module 'CoreGraphics'
import CoreGraphics
^
[45/73] Compiling Bitmap Bitmap+FillStroke.swift
/host/spi-builder-workspace/Sources/Bitmap/Bitmap+Drawing.swift:21:8: error: no such module 'CoreGraphics'
import CoreGraphics
^
[46/73] Compiling Bitmap Bitmap+Flip.swift
/host/spi-builder-workspace/Sources/Bitmap/Bitmap+Drawing.swift:21:8: error: no such module 'CoreGraphics'
import CoreGraphics
^
[47/73] Compiling Bitmap Bitmap+Gamma.swift
/host/spi-builder-workspace/Sources/Bitmap/Bitmap+Drawing.swift:21:8: error: no such module 'CoreGraphics'
import CoreGraphics
^
[48/73] Compiling Bitmap Bitmap+CIImage.swift
/host/spi-builder-workspace/Sources/Bitmap/Bitmap+Drawing.swift:21:8: error: no such module 'CoreGraphics'
import CoreGraphics
^
[49/73] Compiling Bitmap Bitmap+Drawing.swift
/host/spi-builder-workspace/Sources/Bitmap/Bitmap+Drawing.swift:21:8: error: no such module 'CoreGraphics'
import CoreGraphics
^
[50/73] Compiling Bitmap Bitmap+Error.swift
/host/spi-builder-workspace/Sources/Bitmap/Bitmap+Drawing.swift:21:8: error: no such module 'CoreGraphics'
import CoreGraphics
^
[51/73] Compiling Bitmap Bitmap+ImportExport.swift
/host/spi-builder-workspace/Sources/Bitmap/Bitmap+Drawing.swift:21:8: error: no such module 'CoreGraphics'
import CoreGraphics
^
[52/73] Compiling Bitmap Bitmap+Pixel.swift
/host/spi-builder-workspace/Sources/Bitmap/Bitmap+Drawing.swift:21:8: error: no such module 'CoreGraphics'
import CoreGraphics
^
[53/73] Compiling Bitmap Bitmap+Platform.swift
/host/spi-builder-workspace/Sources/Bitmap/Bitmap+Drawing.swift:21:8: error: no such module 'CoreGraphics'
import CoreGraphics
^
[54/73] Compiling Bitmap Bitmap+RGBA.swift
/host/spi-builder-workspace/Sources/Bitmap/Bitmap+Drawing.swift:21:8: error: no such module 'CoreGraphics'
import CoreGraphics
^
[55/73] Compiling Bitmap CGContext+extensions.swift
/host/spi-builder-workspace/Sources/Bitmap/Bitmap+Drawing.swift:21:8: error: no such module 'CoreGraphics'
import CoreGraphics
^
[56/73] Compiling Bitmap CGContext+innerShadow.swift
/host/spi-builder-workspace/Sources/Bitmap/Bitmap+Drawing.swift:21:8: error: no such module 'CoreGraphics'
import CoreGraphics
^
[57/73] Compiling Bitmap CGImage+extensions.swift
/host/spi-builder-workspace/Sources/Bitmap/Bitmap+Drawing.swift:21:8: error: no such module 'CoreGraphics'
import CoreGraphics
^
[58/73] Compiling Bitmap CGRect+extensions.swift
/host/spi-builder-workspace/Sources/Bitmap/Bitmap+Drawing.swift:21:8: error: no such module 'CoreGraphics'
import CoreGraphics
^
[59/73] Compiling Bitmap Clamp.swift
/host/spi-builder-workspace/Sources/Bitmap/Bitmap+Drawing.swift:21:8: error: no such module 'CoreGraphics'
import CoreGraphics
^
[60/73] Compiling Bitmap resource_bundle_accessor.swift
/host/spi-builder-workspace/Sources/Bitmap/Bitmap+Drawing.swift:21:8: error: no such module 'CoreGraphics'
import CoreGraphics
^
[61/73] Compiling Bitmap Bitmap+RGBAData.swift
/host/spi-builder-workspace/Sources/Bitmap/Bitmap+Drawing.swift:21:8: error: no such module 'CoreGraphics'
import CoreGraphics
^
[62/73] Compiling Bitmap Bitmap+RepresentationType.swift
/host/spi-builder-workspace/Sources/Bitmap/Bitmap+Drawing.swift:21:8: error: no such module 'CoreGraphics'
import CoreGraphics
^
[63/73] Compiling Bitmap Bitmap.swift
/host/spi-builder-workspace/Sources/Bitmap/Bitmap+Drawing.swift:21:8: error: no such module 'CoreGraphics'
import CoreGraphics
^
[64/73] Compiling Bitmap Bitmap+AdjustColorControls.swift
/host/spi-builder-workspace/Sources/Bitmap/Bitmap+Drawing.swift:21:8: error: no such module 'CoreGraphics'
import CoreGraphics
^
[65/73] Compiling Bitmap Bitmap+AdjustingSize.swift
/host/spi-builder-workspace/Sources/Bitmap/Bitmap+Drawing.swift:21:8: error: no such module 'CoreGraphics'
import CoreGraphics
^
[66/73] Compiling Bitmap Bitmap+Blending.swift
/host/spi-builder-workspace/Sources/Bitmap/Bitmap+Drawing.swift:21:8: error: no such module 'CoreGraphics'
import CoreGraphics
^
[67/73] Compiling Bitmap Bitmap+Padding.swift
/host/spi-builder-workspace/Sources/Bitmap/Bitmap+Drawing.swift:21:8: error: no such module 'CoreGraphics'
import CoreGraphics
^
[68/73] Compiling Bitmap Bitmap+Quantize.swift
/host/spi-builder-workspace/Sources/Bitmap/Bitmap+Drawing.swift:21:8: error: no such module 'CoreGraphics'
import CoreGraphics
^
[69/73] Compiling Bitmap Bitmap+Rotation.swift
/host/spi-builder-workspace/Sources/Bitmap/Bitmap+Drawing.swift:21:8: error: no such module 'CoreGraphics'
import CoreGraphics
^
[70/73] Compiling Bitmap Bitmap+Scale.swift
/host/spi-builder-workspace/Sources/Bitmap/Bitmap+Drawing.swift:21:8: error: no such module 'CoreGraphics'
import CoreGraphics
^
[71/73] Compiling Bitmap Bitmap+Scroll.swift
/host/spi-builder-workspace/Sources/Bitmap/Bitmap+Drawing.swift:21:8: error: no such module 'CoreGraphics'
import CoreGraphics
^
[72/73] Compiling Bitmap Bitmap+Shadow.swift
/host/spi-builder-workspace/Sources/Bitmap/Bitmap+Drawing.swift:21:8: error: no such module 'CoreGraphics'
import CoreGraphics
^
error: emit-module command failed with exit code 1 (use -v to see invocation)
[73/73] Emitting module Bitmap
/host/spi-builder-workspace/Sources/Bitmap/Bitmap+Drawing.swift:21:8: error: no such module 'CoreGraphics'
import CoreGraphics
^
error: fatalError
BUILD FAILURE 5.9 linux