The Swift Package Index logo.Swift Package Index

Track the adoption of Swift 6 strict concurrency checks for data race safety. How many packages are Ready for Swift 6?

Build Information

Failed to build ConstraintsOperators, reference 2.33.0 (c17cc2), with Swift 6.1 for macOS (Xcode) using Xcode 16.3 on 27 Apr 2025 05:02:45 UTC.

Build Command

env DEVELOPER_DIR=/Applications/Xcode-16.3.0.app xcrun xcodebuild -IDEClonedSourcePackagesDirPathOverride=$PWD/.dependencies -skipMacroValidation -skipPackagePluginValidation -derivedDataPath $PWD/.derivedData build -scheme ConstraintsOperators -destination platform=macOS,arch=arm64

Build Log

========================================
RunAll
========================================
Builder version: 4.61.0
Interrupt handler set up.
========================================
Checkout
========================================
Clone URL: https://github.com/dankinsoid/ConstraintsOperators.git
Reference: 2.33.0
Initialized empty Git repository in /Users/admin/builder/spi-builder-workspace/.git/
From https://github.com/dankinsoid/ConstraintsOperators
 * tag               2.33.0     -> FETCH_HEAD
HEAD is now at c17cc24 2.33.0
Cloned https://github.com/dankinsoid/ConstraintsOperators.git
Revision (git rev-parse @):
c17cc247cccd10a2c5e9cb0ece118cf1784108fb
SUCCESS checkout https://github.com/dankinsoid/ConstraintsOperators.git at 2.33.0
========================================
Build
========================================
Selected platform:         macosXcodebuild
Swift version:             6.1
Building package at path:  $PWD
https://github.com/dankinsoid/ConstraintsOperators.git
https://github.com/dankinsoid/ConstraintsOperators.git
{
  "dependencies" : [
  ],
  "manifest_display_name" : "ConstraintsOperators",
  "name" : "ConstraintsOperators",
  "path" : "/Users/admin/builder/spi-builder-workspace",
  "platforms" : [
    {
      "name" : "ios",
      "version" : "11.0"
    }
  ],
  "products" : [
    {
      "name" : "ConstraintsOperators",
      "targets" : [
        "ConstraintsOperators"
      ],
      "type" : {
        "library" : [
          "automatic"
        ]
      }
    }
  ],
  "targets" : [
    {
      "c99name" : "ConstraintsOperatorsTests",
      "module_type" : "SwiftTarget",
      "name" : "ConstraintsOperatorsTests",
      "path" : "Tests/ConstraintsOperatorsTests",
      "sources" : [
        "ConstraintsOperatorsTests.swift",
        "XCTestManifests.swift"
      ],
      "target_dependencies" : [
        "ConstraintsOperators"
      ],
      "type" : "test"
    },
    {
      "c99name" : "ConstraintsOperators",
      "module_type" : "SwiftTarget",
      "name" : "ConstraintsOperators",
      "path" : "Sources/ConstraintsOperators",
      "product_memberships" : [
        "ConstraintsOperators"
      ],
      "sources" : [
        "Attributes.swift",
        "Constraints.swift",
        "ConstraintsCreators.swift",
        "ConvienceLayout.swift",
        "Edges.swift",
        "Functions.swift",
        "LayoutAttributeType.swift",
        "LayoutConstraint.swift",
        "NS++.swift",
        "NSLayoutConstraint++.swift",
        "Operators.swift"
      ],
      "type" : "library"
    }
  ],
  "tools_version" : "5.6"
}
Command line invocation:
    /Applications/Xcode-16.3.0.app/Contents/Developer/usr/bin/xcodebuild -IDEClonedSourcePackagesDirPathOverride=/Users/admin/builder/spi-builder-workspace/.dependencies -resolvePackageDependencies
Resolve Package Graph
Resolved source packages:
  ConstraintsOperators: /Users/admin/builder/spi-builder-workspace
resolved source packages: ConstraintsOperators
{
  "dependencies" : [
  ],
  "manifest_display_name" : "ConstraintsOperators",
  "name" : "ConstraintsOperators",
  "path" : "/Users/admin/builder/spi-builder-workspace",
  "platforms" : [
    {
      "name" : "ios",
      "version" : "11.0"
    }
  ],
  "products" : [
    {
      "name" : "ConstraintsOperators",
      "targets" : [
        "ConstraintsOperators"
      ],
      "type" : {
        "library" : [
          "automatic"
        ]
      }
    }
  ],
  "targets" : [
    {
      "c99name" : "ConstraintsOperatorsTests",
      "module_type" : "SwiftTarget",
      "name" : "ConstraintsOperatorsTests",
      "path" : "Tests/ConstraintsOperatorsTests",
      "sources" : [
        "ConstraintsOperatorsTests.swift",
        "XCTestManifests.swift"
      ],
      "target_dependencies" : [
        "ConstraintsOperators"
      ],
      "type" : "test"
    },
    {
      "c99name" : "ConstraintsOperators",
      "module_type" : "SwiftTarget",
      "name" : "ConstraintsOperators",
      "path" : "Sources/ConstraintsOperators",
      "product_memberships" : [
        "ConstraintsOperators"
      ],
      "sources" : [
        "Attributes.swift",
        "Constraints.swift",
        "ConstraintsCreators.swift",
        "ConvienceLayout.swift",
        "Edges.swift",
        "Functions.swift",
        "LayoutAttributeType.swift",
        "LayoutConstraint.swift",
        "NS++.swift",
        "NSLayoutConstraint++.swift",
        "Operators.swift"
      ],
      "type" : "library"
    }
  ],
  "tools_version" : "5.6"
}
{
  "workspace" : {
    "name" : "spi-builder-workspace",
    "schemes" : [
      "ConstraintsOperators"
    ]
  }
}
Running build ...
env DEVELOPER_DIR=/Applications/Xcode-16.3.0.app xcrun xcodebuild -IDEClonedSourcePackagesDirPathOverride=$PWD/.dependencies -skipMacroValidation -skipPackagePluginValidation -derivedDataPath $PWD/.derivedData build -scheme ConstraintsOperators -destination platform=macOS,arch=arm64 OTHER_SWIFT_FLAGS=-stats-output-dir .stats -strict-concurrency=complete -enable-upcoming-feature StrictConcurrency -enable-upcoming-feature DisableOutwardActorInference -enable-upcoming-feature GlobalActorIsolatedTypesUsability -enable-upcoming-feature InferSendableFromCaptures
Command line invocation:
    /Applications/Xcode-16.3.0.app/Contents/Developer/usr/bin/xcodebuild -IDEClonedSourcePackagesDirPathOverride=/Users/admin/builder/spi-builder-workspace/.dependencies -skipMacroValidation -skipPackagePluginValidation -derivedDataPath /Users/admin/builder/spi-builder-workspace/.derivedData build -scheme ConstraintsOperators -destination platform=macOS,arch=arm64 "OTHER_SWIFT_FLAGS=-stats-output-dir .stats -strict-concurrency=complete -enable-upcoming-feature StrictConcurrency -enable-upcoming-feature DisableOutwardActorInference -enable-upcoming-feature GlobalActorIsolatedTypesUsability -enable-upcoming-feature InferSendableFromCaptures"
Build settings from command line:
    OTHER_SWIFT_FLAGS = -stats-output-dir .stats -strict-concurrency=complete -enable-upcoming-feature StrictConcurrency -enable-upcoming-feature DisableOutwardActorInference -enable-upcoming-feature GlobalActorIsolatedTypesUsability -enable-upcoming-feature InferSendableFromCaptures
Resolve Package Graph
Resolved source packages:
  ConstraintsOperators: /Users/admin/builder/spi-builder-workspace
ComputePackagePrebuildTargetDependencyGraph
Prepare packages
CreateBuildRequest
SendProjectDescription
CreateBuildOperation
ComputeTargetDependencyGraph
note: Building targets in dependency order
note: Target dependency graph (2 targets)
    Target 'ConstraintsOperators' in project 'ConstraintsOperators'
        ➜ Explicit dependency on target 'ConstraintsOperators' in project 'ConstraintsOperators'
    Target 'ConstraintsOperators' in project 'ConstraintsOperators' (no dependencies)
GatherProvisioningInputs
CreateBuildDescription
ExecuteExternalTool /Applications/Xcode-16.3.0.app/Contents/Developer/Toolchains/XcodeDefault.xctoolchain/usr/bin/clang -v -E -dM -isysroot /Applications/Xcode-16.3.0.app/Contents/Developer/Platforms/MacOSX.platform/Developer/SDKs/MacOSX15.4.sdk -x c -c /dev/null
ExecuteExternalTool /Applications/Xcode-16.3.0.app/Contents/Developer/Toolchains/XcodeDefault.xctoolchain/usr/bin/swiftc --version
ExecuteExternalTool /Applications/Xcode-16.3.0.app/Contents/Developer/Toolchains/XcodeDefault.xctoolchain/usr/bin/ld -version_details
Build description signature: e2a99540019fb16f147dd17872578a88
Build description path: /Users/admin/builder/spi-builder-workspace/.derivedData/Build/Intermediates.noindex/XCBuildData/e2a99540019fb16f147dd17872578a88.xcbuilddata
ClangStatCache /Applications/Xcode-16.3.0.app/Contents/Developer/Toolchains/XcodeDefault.xctoolchain/usr/bin/clang-stat-cache /Applications/Xcode-16.3.0.app/Contents/Developer/Platforms/MacOSX.platform/Developer/SDKs/MacOSX15.4.sdk /Users/admin/builder/spi-builder-workspace/.derivedData/SDKStatCaches.noindex/macosx15.4-24E241-8287b8f5db97e746a1562fbca0c9d29b.sdkstatcache
    cd /Users/admin/builder/spi-builder-workspace/.swiftpm/xcode
    /Applications/Xcode-16.3.0.app/Contents/Developer/Toolchains/XcodeDefault.xctoolchain/usr/bin/clang-stat-cache /Applications/Xcode-16.3.0.app/Contents/Developer/Platforms/MacOSX.platform/Developer/SDKs/MacOSX15.4.sdk -o /Users/admin/builder/spi-builder-workspace/.derivedData/SDKStatCaches.noindex/macosx15.4-24E241-8287b8f5db97e746a1562fbca0c9d29b.sdkstatcache
CreateBuildDirectory /Users/admin/builder/spi-builder-workspace/.derivedData/Build/Intermediates.noindex
    cd /Users/admin/builder/spi-builder-workspace/.swiftpm/xcode
    builtin-create-build-directory /Users/admin/builder/spi-builder-workspace/.derivedData/Build/Intermediates.noindex
CreateBuildDirectory /Users/admin/builder/spi-builder-workspace/.derivedData/Build/Products
    cd /Users/admin/builder/spi-builder-workspace/.swiftpm/xcode
    builtin-create-build-directory /Users/admin/builder/spi-builder-workspace/.derivedData/Build/Products
CreateBuildDirectory /Users/admin/builder/spi-builder-workspace/.derivedData/Build/Products/Debug
    cd /Users/admin/builder/spi-builder-workspace/.swiftpm/xcode
    builtin-create-build-directory /Users/admin/builder/spi-builder-workspace/.derivedData/Build/Products/Debug
CreateBuildDirectory /Users/admin/builder/spi-builder-workspace/.derivedData/Build/Intermediates.noindex/EagerLinkingTBDs/Debug
    cd /Users/admin/builder/spi-builder-workspace/.swiftpm/xcode
    builtin-create-build-directory /Users/admin/builder/spi-builder-workspace/.derivedData/Build/Intermediates.noindex/EagerLinkingTBDs/Debug
CreateBuildDirectory /Users/admin/builder/spi-builder-workspace/.derivedData/Build/Products/Debug/PackageFrameworks
    cd /Users/admin/builder/spi-builder-workspace/.swiftpm/xcode
    builtin-create-build-directory /Users/admin/builder/spi-builder-workspace/.derivedData/Build/Products/Debug/PackageFrameworks
WriteAuxiliaryFile /Users/admin/builder/spi-builder-workspace/.derivedData/Build/Intermediates.noindex/ConstraintsOperators.build/Debug/ConstraintsOperators.build/ConstraintsOperators.modulemap (in target 'ConstraintsOperators' from project 'ConstraintsOperators')
    cd /Users/admin/builder/spi-builder-workspace
    write-file /Users/admin/builder/spi-builder-workspace/.derivedData/Build/Intermediates.noindex/ConstraintsOperators.build/Debug/ConstraintsOperators.build/ConstraintsOperators.modulemap
WriteAuxiliaryFile /Users/admin/builder/spi-builder-workspace/.derivedData/Build/Intermediates.noindex/ConstraintsOperators.build/Debug/ConstraintsOperators.build/ConstraintsOperators.DependencyMetadataFileList (in target 'ConstraintsOperators' from project 'ConstraintsOperators')
    cd /Users/admin/builder/spi-builder-workspace
    write-file /Users/admin/builder/spi-builder-workspace/.derivedData/Build/Intermediates.noindex/ConstraintsOperators.build/Debug/ConstraintsOperators.build/ConstraintsOperators.DependencyMetadataFileList
WriteAuxiliaryFile /Users/admin/builder/spi-builder-workspace/.derivedData/Build/Intermediates.noindex/ConstraintsOperators.build/Debug/ConstraintsOperators.build/Objects-normal/arm64/ConstraintsOperators.SwiftFileList (in target 'ConstraintsOperators' from project 'ConstraintsOperators')
    cd /Users/admin/builder/spi-builder-workspace
    write-file /Users/admin/builder/spi-builder-workspace/.derivedData/Build/Intermediates.noindex/ConstraintsOperators.build/Debug/ConstraintsOperators.build/Objects-normal/arm64/ConstraintsOperators.SwiftFileList
WriteAuxiliaryFile /Users/admin/builder/spi-builder-workspace/.derivedData/Build/Intermediates.noindex/ConstraintsOperators.build/Debug/ConstraintsOperators.build/Objects-normal/arm64/ConstraintsOperators.SwiftConstValuesFileList (in target 'ConstraintsOperators' from project 'ConstraintsOperators')
    cd /Users/admin/builder/spi-builder-workspace
    write-file /Users/admin/builder/spi-builder-workspace/.derivedData/Build/Intermediates.noindex/ConstraintsOperators.build/Debug/ConstraintsOperators.build/Objects-normal/arm64/ConstraintsOperators.SwiftConstValuesFileList
WriteAuxiliaryFile /Users/admin/builder/spi-builder-workspace/.derivedData/Build/Intermediates.noindex/ConstraintsOperators.build/Debug/ConstraintsOperators.build/Objects-normal/arm64/ConstraintsOperators.LinkFileList (in target 'ConstraintsOperators' from project 'ConstraintsOperators')
    cd /Users/admin/builder/spi-builder-workspace
    write-file /Users/admin/builder/spi-builder-workspace/.derivedData/Build/Intermediates.noindex/ConstraintsOperators.build/Debug/ConstraintsOperators.build/Objects-normal/arm64/ConstraintsOperators.LinkFileList
WriteAuxiliaryFile /Users/admin/builder/spi-builder-workspace/.derivedData/Build/Intermediates.noindex/ConstraintsOperators.build/Debug/ConstraintsOperators.build/ConstraintsOperators.DependencyStaticMetadataFileList (in target 'ConstraintsOperators' from project 'ConstraintsOperators')
    cd /Users/admin/builder/spi-builder-workspace
    write-file /Users/admin/builder/spi-builder-workspace/.derivedData/Build/Intermediates.noindex/ConstraintsOperators.build/Debug/ConstraintsOperators.build/ConstraintsOperators.DependencyStaticMetadataFileList
WriteAuxiliaryFile /Users/admin/builder/spi-builder-workspace/.derivedData/Build/Intermediates.noindex/ConstraintsOperators.build/Debug/ConstraintsOperators.build/Objects-normal/arm64/ConstraintsOperators-OutputFileMap.json (in target 'ConstraintsOperators' from project 'ConstraintsOperators')
    cd /Users/admin/builder/spi-builder-workspace
    write-file /Users/admin/builder/spi-builder-workspace/.derivedData/Build/Intermediates.noindex/ConstraintsOperators.build/Debug/ConstraintsOperators.build/Objects-normal/arm64/ConstraintsOperators-OutputFileMap.json
WriteAuxiliaryFile /Users/admin/builder/spi-builder-workspace/.derivedData/Build/Intermediates.noindex/ConstraintsOperators.build/Debug/ConstraintsOperators.build/Objects-normal/arm64/ConstraintsOperators_const_extract_protocols.json (in target 'ConstraintsOperators' from project 'ConstraintsOperators')
    cd /Users/admin/builder/spi-builder-workspace
    write-file /Users/admin/builder/spi-builder-workspace/.derivedData/Build/Intermediates.noindex/ConstraintsOperators.build/Debug/ConstraintsOperators.build/Objects-normal/arm64/ConstraintsOperators_const_extract_protocols.json
Copy /Users/admin/builder/spi-builder-workspace/.derivedData/Build/Intermediates.noindex/GeneratedModuleMaps/ConstraintsOperators.modulemap /Users/admin/builder/spi-builder-workspace/.derivedData/Build/Intermediates.noindex/ConstraintsOperators.build/Debug/ConstraintsOperators.build/ConstraintsOperators.modulemap (in target 'ConstraintsOperators' from project 'ConstraintsOperators')
    cd /Users/admin/builder/spi-builder-workspace
    builtin-copy -exclude .DS_Store -exclude CVS -exclude .svn -exclude .git -exclude .hg -resolve-src-symlinks /Users/admin/builder/spi-builder-workspace/.derivedData/Build/Intermediates.noindex/ConstraintsOperators.build/Debug/ConstraintsOperators.build/ConstraintsOperators.modulemap /Users/admin/builder/spi-builder-workspace/.derivedData/Build/Intermediates.noindex/GeneratedModuleMaps
SwiftDriver ConstraintsOperators normal arm64 com.apple.xcode.tools.swift.compiler (in target 'ConstraintsOperators' from project 'ConstraintsOperators')
    cd /Users/admin/builder/spi-builder-workspace/.swiftpm/xcode
    builtin-SwiftDriver -- /Applications/Xcode-16.3.0.app/Contents/Developer/Toolchains/XcodeDefault.xctoolchain/usr/bin/swiftc -module-name ConstraintsOperators -Onone -enforce-exclusivity\=checked @/Users/admin/builder/spi-builder-workspace/.derivedData/Build/Intermediates.noindex/ConstraintsOperators.build/Debug/ConstraintsOperators.build/Objects-normal/arm64/ConstraintsOperators.SwiftFileList -DSWIFT_PACKAGE -DDEBUG -stats-output-dir .stats -strict-concurrency\=complete -enable-upcoming-feature StrictConcurrency -enable-upcoming-feature DisableOutwardActorInference -enable-upcoming-feature GlobalActorIsolatedTypesUsability -enable-upcoming-feature InferSendableFromCaptures -plugin-path /Applications/Xcode-16.3.0.app/Contents/Developer/Toolchains/XcodeDefault.xctoolchain/usr/lib/swift/host/plugins/testing -enable-experimental-feature DebugDescriptionMacro -sdk /Applications/Xcode-16.3.0.app/Contents/Developer/Platforms/MacOSX.platform/Developer/SDKs/MacOSX15.4.sdk -target arm64-apple-macos10.13 -g -module-cache-path /Users/admin/builder/spi-builder-workspace/.derivedData/ModuleCache.noindex -Xfrontend -serialize-debugging-options -profile-coverage-mapping -profile-generate -enable-testing -index-store-path /Users/admin/builder/spi-builder-workspace/.derivedData/Index.noindex/DataStore -swift-version 5 -I /Users/admin/builder/spi-builder-workspace/.derivedData/Build/Products/Debug -I /Applications/Xcode-16.3.0.app/Contents/Developer/Platforms/MacOSX.platform/Developer/usr/lib -F /Users/admin/builder/spi-builder-workspace/.derivedData/Build/Products/Debug -F /Applications/Xcode-16.3.0.app/Contents/Developer/Platforms/MacOSX.platform/Developer/Library/Frameworks -c -j10 -enable-batch-mode -incremental -Xcc -ivfsstatcache -Xcc /Users/admin/builder/spi-builder-workspace/.derivedData/SDKStatCaches.noindex/macosx15.4-24E241-8287b8f5db97e746a1562fbca0c9d29b.sdkstatcache -output-file-map /Users/admin/builder/spi-builder-workspace/.derivedData/Build/Intermediates.noindex/ConstraintsOperators.build/Debug/ConstraintsOperators.build/Objects-normal/arm64/ConstraintsOperators-OutputFileMap.json -use-frontend-parseable-output -save-temps -no-color-diagnostics -serialize-diagnostics -emit-dependencies -emit-module -emit-module-path /Users/admin/builder/spi-builder-workspace/.derivedData/Build/Intermediates.noindex/ConstraintsOperators.build/Debug/ConstraintsOperators.build/Objects-normal/arm64/ConstraintsOperators.swiftmodule -validate-clang-modules-once -clang-build-session-file /Users/admin/builder/spi-builder-workspace/.derivedData/ModuleCache.noindex/Session.modulevalidation -Xcc -I/Users/admin/builder/spi-builder-workspace/.derivedData/Build/Intermediates.noindex/ConstraintsOperators.build/Debug/ConstraintsOperators.build/swift-overrides.hmap -emit-const-values -Xfrontend -const-gather-protocols-file -Xfrontend /Users/admin/builder/spi-builder-workspace/.derivedData/Build/Intermediates.noindex/ConstraintsOperators.build/Debug/ConstraintsOperators.build/Objects-normal/arm64/ConstraintsOperators_const_extract_protocols.json -Xcc -I/Users/admin/builder/spi-builder-workspace/.derivedData/Build/Products/Debug/include -Xcc -I/Users/admin/builder/spi-builder-workspace/.derivedData/Build/Intermediates.noindex/ConstraintsOperators.build/Debug/ConstraintsOperators.build/DerivedSources-normal/arm64 -Xcc -I/Users/admin/builder/spi-builder-workspace/.derivedData/Build/Intermediates.noindex/ConstraintsOperators.build/Debug/ConstraintsOperators.build/DerivedSources/arm64 -Xcc -I/Users/admin/builder/spi-builder-workspace/.derivedData/Build/Intermediates.noindex/ConstraintsOperators.build/Debug/ConstraintsOperators.build/DerivedSources -Xcc -DSWIFT_PACKAGE -Xcc -DDEBUG\=1 -emit-objc-header -emit-objc-header-path /Users/admin/builder/spi-builder-workspace/.derivedData/Build/Intermediates.noindex/ConstraintsOperators.build/Debug/ConstraintsOperators.build/Objects-normal/arm64/ConstraintsOperators-Swift.h -working-directory /Users/admin/builder/spi-builder-workspace/.swiftpm/xcode -experimental-emit-module-separately -disable-cmo
SwiftCompile normal arm64 Compiling\ Attributes.swift,\ Constraints.swift /Users/admin/builder/spi-builder-workspace/Sources/ConstraintsOperators/Attributes.swift /Users/admin/builder/spi-builder-workspace/Sources/ConstraintsOperators/Constraints.swift (in target 'ConstraintsOperators' from project 'ConstraintsOperators')
SwiftCompile normal arm64 /Users/admin/builder/spi-builder-workspace/Sources/ConstraintsOperators/Attributes.swift (in target 'ConstraintsOperators' from project 'ConstraintsOperators')
    cd /Users/admin/builder/spi-builder-workspace/.swiftpm/xcode

SwiftCompile normal arm64 /Users/admin/builder/spi-builder-workspace/Sources/ConstraintsOperators/Constraints.swift (in target 'ConstraintsOperators' from project 'ConstraintsOperators')
    cd /Users/admin/builder/spi-builder-workspace/.swiftpm/xcode

SwiftCompile normal arm64 Compiling\ ConvienceLayout.swift /Users/admin/builder/spi-builder-workspace/Sources/ConstraintsOperators/ConvienceLayout.swift (in target 'ConstraintsOperators' from project 'ConstraintsOperators')
SwiftCompile normal arm64 /Users/admin/builder/spi-builder-workspace/Sources/ConstraintsOperators/ConvienceLayout.swift (in target 'ConstraintsOperators' from project 'ConstraintsOperators')
    cd /Users/admin/builder/spi-builder-workspace/.swiftpm/xcode

SwiftCompile normal arm64 Compiling\ Functions.swift /Users/admin/builder/spi-builder-workspace/Sources/ConstraintsOperators/Functions.swift (in target 'ConstraintsOperators' from project 'ConstraintsOperators')
SwiftCompile normal arm64 /Users/admin/builder/spi-builder-workspace/Sources/ConstraintsOperators/Functions.swift (in target 'ConstraintsOperators' from project 'ConstraintsOperators')
    cd /Users/admin/builder/spi-builder-workspace/.swiftpm/xcode

SwiftCompile normal arm64 Compiling\ Edges.swift /Users/admin/builder/spi-builder-workspace/Sources/ConstraintsOperators/Edges.swift (in target 'ConstraintsOperators' from project 'ConstraintsOperators')
SwiftCompile normal arm64 /Users/admin/builder/spi-builder-workspace/Sources/ConstraintsOperators/Edges.swift (in target 'ConstraintsOperators' from project 'ConstraintsOperators')
    cd /Users/admin/builder/spi-builder-workspace/.swiftpm/xcode

SwiftEmitModule normal arm64 Emitting\ module\ for\ ConstraintsOperators (in target 'ConstraintsOperators' from project 'ConstraintsOperators')
Failed frontend command:
/Applications/Xcode-16.3.0.app/Contents/Developer/Toolchains/XcodeDefault.xctoolchain/usr/bin/swift-frontend -frontend -emit-module -experimental-skip-non-inlinable-function-bodies-without-types /Users/admin/builder/spi-builder-workspace/Sources/ConstraintsOperators/Attributes.swift /Users/admin/builder/spi-builder-workspace/Sources/ConstraintsOperators/Constraints.swift /Users/admin/builder/spi-builder-workspace/Sources/ConstraintsOperators/ConstraintsCreators.swift /Users/admin/builder/spi-builder-workspace/Sources/ConstraintsOperators/ConvienceLayout.swift /Users/admin/builder/spi-builder-workspace/Sources/ConstraintsOperators/Edges.swift /Users/admin/builder/spi-builder-workspace/Sources/ConstraintsOperators/Functions.swift /Users/admin/builder/spi-builder-workspace/Sources/ConstraintsOperators/LayoutAttributeType.swift /Users/admin/builder/spi-builder-workspace/Sources/ConstraintsOperators/LayoutConstraint.swift /Users/admin/builder/spi-builder-workspace/Sources/ConstraintsOperators/NS++.swift /Users/admin/builder/spi-builder-workspace/Sources/ConstraintsOperators/NSLayoutConstraint++.swift /Users/admin/builder/spi-builder-workspace/Sources/ConstraintsOperators/Operators.swift -target arm64-apple-macos10.13 -Xllvm -aarch64-use-tbi -enable-objc-interop -sdk /Applications/Xcode-16.3.0.app/Contents/Developer/Platforms/MacOSX.platform/Developer/SDKs/MacOSX15.4.sdk -I /Users/admin/builder/spi-builder-workspace/.derivedData/Build/Products/Debug -I /Applications/Xcode-16.3.0.app/Contents/Developer/Platforms/MacOSX.platform/Developer/usr/lib -F /Users/admin/builder/spi-builder-workspace/.derivedData/Build/Products/Debug -F /Applications/Xcode-16.3.0.app/Contents/Developer/Platforms/MacOSX.platform/Developer/Library/Frameworks -no-color-diagnostics -enable-testing -g -debug-info-format\=dwarf -dwarf-version\=4 -module-cache-path /Users/admin/builder/spi-builder-workspace/.derivedData/ModuleCache.noindex -profile-generate -profile-coverage-mapping -swift-version 5 -enforce-exclusivity\=checked -stats-output-dir /Users/admin/builder/spi-builder-workspace/.swiftpm/xcode/.stats -Onone -D SWIFT_PACKAGE -D DEBUG -serialize-debugging-options -const-gather-protocols-file /Users/admin/builder/spi-builder-workspace/.derivedData/Build/Intermediates.noindex/ConstraintsOperators.build/Debug/ConstraintsOperators.build/Objects-normal/arm64/ConstraintsOperators_const_extract_protocols.json -enable-upcoming-feature StrictConcurrency -enable-upcoming-feature DisableOutwardActorInference -enable-upcoming-feature GlobalActorIsolatedTypesUsability -enable-upcoming-feature InferSendableFromCaptures -enable-experimental-feature DebugDescriptionMacro -strict-concurrency\=complete -empty-abi-descriptor -plugin-path /Applications/Xcode-16.3.0.app/Contents/Developer/Toolchains/XcodeDefault.xctoolchain/usr/lib/swift/host/plugins/testing -validate-clang-modules-once -clang-build-session-file /Users/admin/builder/spi-builder-workspace/.derivedData/ModuleCache.noindex/Session.modulevalidation -Xcc -working-directory -Xcc /Users/admin/builder/spi-builder-workspace/.swiftpm/xcode -resource-dir /Applications/Xcode-16.3.0.app/Contents/Developer/Toolchains/XcodeDefault.xctoolchain/usr/lib/swift -enable-anonymous-context-mangled-names -file-compilation-dir /Users/admin/builder/spi-builder-workspace/.swiftpm/xcode -Xcc -ivfsstatcache -Xcc /Users/admin/builder/spi-builder-workspace/.derivedData/SDKStatCaches.noindex/macosx15.4-24E241-8287b8f5db97e746a1562fbca0c9d29b.sdkstatcache -Xcc -I/Users/admin/builder/spi-builder-workspace/.derivedData/Build/Intermediates.noindex/ConstraintsOperators.build/Debug/ConstraintsOperators.build/swift-overrides.hmap -Xcc -I/Users/admin/builder/spi-builder-workspace/.derivedData/Build/Products/Debug/include -Xcc -I/Users/admin/builder/spi-builder-workspace/.derivedData/Build/Intermediates.noindex/ConstraintsOperators.build/Debug/ConstraintsOperators.build/DerivedSources-normal/arm64 -Xcc -I/Users/admin/builder/spi-builder-workspace/.derivedData/Build/Intermediates.noindex/ConstraintsOperators.build/Debug/ConstraintsOperators.build/DerivedSources/arm64 -Xcc -I/Users/admin/builder/spi-builder-workspace/.derivedData/Build/Intermediates.noindex/ConstraintsOperators.build/Debug/ConstraintsOperators.build/DerivedSources -Xcc -DSWIFT_PACKAGE -Xcc -DDEBUG\=1 -module-name ConstraintsOperators -frontend-parseable-output -disable-clang-spi -target-sdk-version 15.4 -target-sdk-name macosx15.4 -external-plugin-path /Applications/Xcode-16.3.0.app/Contents/Developer/Platforms/MacOSX.platform/Developer/usr/lib/swift/host/plugins\#/Applications/Xcode-16.3.0.app/Contents/Developer/Platforms/MacOSX.platform/Developer/usr/bin/swift-plugin-server -external-plugin-path /Applications/Xcode-16.3.0.app/Contents/Developer/Platforms/MacOSX.platform/Developer/usr/local/lib/swift/host/plugins\#/Applications/Xcode-16.3.0.app/Contents/Developer/Platforms/MacOSX.platform/Developer/usr/bin/swift-plugin-server -in-process-plugin-server-path /Applications/Xcode-16.3.0.app/Contents/Developer/Toolchains/XcodeDefault.xctoolchain/usr/lib/swift/host/libSwiftInProcPluginServer.dylib -plugin-path /Applications/Xcode-16.3.0.app/Contents/Developer/Toolchains/XcodeDefault.xctoolchain/usr/lib/swift/host/plugins -plugin-path /Applications/Xcode-16.3.0.app/Contents/Developer/Toolchains/XcodeDefault.xctoolchain/usr/local/lib/swift/host/plugins -emit-module-doc-path /Users/admin/builder/spi-builder-workspace/.derivedData/Build/Intermediates.noindex/ConstraintsOperators.build/Debug/ConstraintsOperators.build/Objects-normal/arm64/ConstraintsOperators.swiftdoc -emit-module-source-info-path /Users/admin/builder/spi-builder-workspace/.derivedData/Build/Intermediates.noindex/ConstraintsOperators.build/Debug/ConstraintsOperators.build/Objects-normal/arm64/ConstraintsOperators.swiftsourceinfo -emit-objc-header-path /Users/admin/builder/spi-builder-workspace/.derivedData/Build/Intermediates.noindex/ConstraintsOperators.build/Debug/ConstraintsOperators.build/Objects-normal/arm64/ConstraintsOperators-Swift.h -serialize-diagnostics-path /Users/admin/builder/spi-builder-workspace/.derivedData/Build/Intermediates.noindex/ConstraintsOperators.build/Debug/ConstraintsOperators.build/Objects-normal/arm64/ConstraintsOperators-master-emit-module.dia -emit-dependencies-path /Users/admin/builder/spi-builder-workspace/.derivedData/Build/Intermediates.noindex/ConstraintsOperators.build/Debug/ConstraintsOperators.build/Objects-normal/arm64/ConstraintsOperators-master-emit-module.d -o /Users/admin/builder/spi-builder-workspace/.derivedData/Build/Intermediates.noindex/ConstraintsOperators.build/Debug/ConstraintsOperators.build/Objects-normal/arm64/ConstraintsOperators.swiftmodule -emit-abi-descriptor-path /Users/admin/builder/spi-builder-workspace/.derivedData/Build/Intermediates.noindex/ConstraintsOperators.build/Debug/ConstraintsOperators.build/Objects-normal/arm64/ConstraintsOperators.abi.json
EmitSwiftModule normal arm64 (in target 'ConstraintsOperators' from project 'ConstraintsOperators')
    cd /Users/admin/builder/spi-builder-workspace/.swiftpm/xcode

/Users/admin/builder/spi-builder-workspace/Sources/ConstraintsOperators/Constraints.swift:8:8: error: no such module 'UIKit'
import UIKit
       ^
SwiftCompile normal arm64 Compiling\ NS++.swift /Users/admin/builder/spi-builder-workspace/Sources/ConstraintsOperators/NS++.swift (in target 'ConstraintsOperators' from project 'ConstraintsOperators')
SwiftCompile normal arm64 /Users/admin/builder/spi-builder-workspace/Sources/ConstraintsOperators/NS++.swift (in target 'ConstraintsOperators' from project 'ConstraintsOperators')
    cd /Users/admin/builder/spi-builder-workspace/.swiftpm/xcode

SwiftCompile normal arm64 Compiling\ LayoutAttributeType.swift /Users/admin/builder/spi-builder-workspace/Sources/ConstraintsOperators/LayoutAttributeType.swift (in target 'ConstraintsOperators' from project 'ConstraintsOperators')
SwiftCompile normal arm64 /Users/admin/builder/spi-builder-workspace/Sources/ConstraintsOperators/LayoutAttributeType.swift (in target 'ConstraintsOperators' from project 'ConstraintsOperators')
    cd /Users/admin/builder/spi-builder-workspace/.swiftpm/xcode

SwiftCompile normal arm64 Compiling\ Operators.swift /Users/admin/builder/spi-builder-workspace/Sources/ConstraintsOperators/Operators.swift (in target 'ConstraintsOperators' from project 'ConstraintsOperators')
SwiftCompile normal arm64 /Users/admin/builder/spi-builder-workspace/Sources/ConstraintsOperators/Operators.swift (in target 'ConstraintsOperators' from project 'ConstraintsOperators')
    cd /Users/admin/builder/spi-builder-workspace/.swiftpm/xcode

SwiftCompile normal arm64 Compiling\ LayoutConstraint.swift /Users/admin/builder/spi-builder-workspace/Sources/ConstraintsOperators/LayoutConstraint.swift (in target 'ConstraintsOperators' from project 'ConstraintsOperators')
SwiftCompile normal arm64 /Users/admin/builder/spi-builder-workspace/Sources/ConstraintsOperators/LayoutConstraint.swift (in target 'ConstraintsOperators' from project 'ConstraintsOperators')
    cd /Users/admin/builder/spi-builder-workspace/.swiftpm/xcode

SwiftCompile normal arm64 Compiling\ NSLayoutConstraint++.swift /Users/admin/builder/spi-builder-workspace/Sources/ConstraintsOperators/NSLayoutConstraint++.swift (in target 'ConstraintsOperators' from project 'ConstraintsOperators')
SwiftCompile normal arm64 /Users/admin/builder/spi-builder-workspace/Sources/ConstraintsOperators/NSLayoutConstraint++.swift (in target 'ConstraintsOperators' from project 'ConstraintsOperators')
    cd /Users/admin/builder/spi-builder-workspace/.swiftpm/xcode

SwiftCompile normal arm64 Compiling\ ConstraintsCreators.swift /Users/admin/builder/spi-builder-workspace/Sources/ConstraintsOperators/ConstraintsCreators.swift (in target 'ConstraintsOperators' from project 'ConstraintsOperators')
Command SwiftCompile failed with a nonzero exit code
--- xcodebuild: WARNING: Using the first of multiple matching destinations:
{ platform:macOS, arch:arm64, id:25515a6f1489a0bfd7afc372b247fdc9753b2c74, name:My Mac }
{ platform:macOS, arch:arm64, variant:Mac Catalyst, id:25515a6f1489a0bfd7afc372b247fdc9753b2c74, name:My Mac }
{ platform:macOS, arch:arm64, variant:DriverKit, id:25515a6f1489a0bfd7afc372b247fdc9753b2c74, name:My Mac }
{ platform:macOS, arch:arm64, variant:Designed for [iPad,iPhone], id:25515a6f1489a0bfd7afc372b247fdc9753b2c74, name:My Mac }
** BUILD FAILED **
The following build commands failed:
	SwiftEmitModule normal arm64 Emitting\ module\ for\ ConstraintsOperators (in target 'ConstraintsOperators' from project 'ConstraintsOperators')
	EmitSwiftModule normal arm64 (in target 'ConstraintsOperators' from project 'ConstraintsOperators')
	SwiftCompile normal arm64 Compiling\ ConstraintsCreators.swift /Users/admin/builder/spi-builder-workspace/Sources/ConstraintsOperators/ConstraintsCreators.swift (in target 'ConstraintsOperators' from project 'ConstraintsOperators')
	Building workspace spi-builder-workspace with scheme ConstraintsOperators
(4 failures)
Command line invocation:
    /Applications/Xcode-16.3.0.app/Contents/Developer/usr/bin/xcodebuild -IDEClonedSourcePackagesDirPathOverride=/Users/admin/builder/spi-builder-workspace/.dependencies -resolvePackageDependencies
Resolve Package Graph
Resolved source packages:
  ConstraintsOperators: /Users/admin/builder/spi-builder-workspace
resolved source packages: ConstraintsOperators
{
  "dependencies" : [
  ],
  "manifest_display_name" : "ConstraintsOperators",
  "name" : "ConstraintsOperators",
  "path" : "/Users/admin/builder/spi-builder-workspace",
  "platforms" : [
    {
      "name" : "ios",
      "version" : "11.0"
    }
  ],
  "products" : [
    {
      "name" : "ConstraintsOperators",
      "targets" : [
        "ConstraintsOperators"
      ],
      "type" : {
        "library" : [
          "automatic"
        ]
      }
    }
  ],
  "targets" : [
    {
      "c99name" : "ConstraintsOperatorsTests",
      "module_type" : "SwiftTarget",
      "name" : "ConstraintsOperatorsTests",
      "path" : "Tests/ConstraintsOperatorsTests",
      "sources" : [
        "ConstraintsOperatorsTests.swift",
        "XCTestManifests.swift"
      ],
      "target_dependencies" : [
        "ConstraintsOperators"
      ],
      "type" : "test"
    },
    {
      "c99name" : "ConstraintsOperators",
      "module_type" : "SwiftTarget",
      "name" : "ConstraintsOperators",
      "path" : "Sources/ConstraintsOperators",
      "product_memberships" : [
        "ConstraintsOperators"
      ],
      "sources" : [
        "Attributes.swift",
        "Constraints.swift",
        "ConstraintsCreators.swift",
        "ConvienceLayout.swift",
        "Edges.swift",
        "Functions.swift",
        "LayoutAttributeType.swift",
        "LayoutConstraint.swift",
        "NS++.swift",
        "NSLayoutConstraint++.swift",
        "Operators.swift"
      ],
      "type" : "library"
    }
  ],
  "tools_version" : "5.6"
}
{
  "workspace" : {
    "name" : "spi-builder-workspace",
    "schemes" : [
      "ConstraintsOperators"
    ]
  }
}
Running build ...
env DEVELOPER_DIR=/Applications/Xcode-16.3.0.app xcrun xcodebuild -IDEClonedSourcePackagesDirPathOverride=$PWD/.dependencies -skipMacroValidation -skipPackagePluginValidation -derivedDataPath $PWD/.derivedData build -scheme ConstraintsOperators -destination platform=macOS,arch=arm64
Command line invocation:
    /Applications/Xcode-16.3.0.app/Contents/Developer/usr/bin/xcodebuild -IDEClonedSourcePackagesDirPathOverride=/Users/admin/builder/spi-builder-workspace/.dependencies -skipMacroValidation -skipPackagePluginValidation -derivedDataPath /Users/admin/builder/spi-builder-workspace/.derivedData build -scheme ConstraintsOperators -destination platform=macOS,arch=arm64
Resolve Package Graph
Resolved source packages:
  ConstraintsOperators: /Users/admin/builder/spi-builder-workspace
ComputePackagePrebuildTargetDependencyGraph
Prepare packages
CreateBuildRequest
SendProjectDescription
CreateBuildOperation
ComputeTargetDependencyGraph
note: Building targets in dependency order
note: Target dependency graph (2 targets)
    Target 'ConstraintsOperators' in project 'ConstraintsOperators'
        ➜ Explicit dependency on target 'ConstraintsOperators' in project 'ConstraintsOperators'
    Target 'ConstraintsOperators' in project 'ConstraintsOperators' (no dependencies)
GatherProvisioningInputs
CreateBuildDescription
ExecuteExternalTool /Applications/Xcode-16.3.0.app/Contents/Developer/Toolchains/XcodeDefault.xctoolchain/usr/bin/clang -v -E -dM -isysroot /Applications/Xcode-16.3.0.app/Contents/Developer/Platforms/MacOSX.platform/Developer/SDKs/MacOSX15.4.sdk -x c -c /dev/null
ExecuteExternalTool /Applications/Xcode-16.3.0.app/Contents/Developer/Toolchains/XcodeDefault.xctoolchain/usr/bin/swiftc --version
ExecuteExternalTool /Applications/Xcode-16.3.0.app/Contents/Developer/Toolchains/XcodeDefault.xctoolchain/usr/bin/ld -version_details
Build description signature: 43404e1b1d7b39aa1f28e12d0bc808d3
Build description path: /Users/admin/builder/spi-builder-workspace/.derivedData/Build/Intermediates.noindex/XCBuildData/43404e1b1d7b39aa1f28e12d0bc808d3.xcbuilddata
ClangStatCache /Applications/Xcode-16.3.0.app/Contents/Developer/Toolchains/XcodeDefault.xctoolchain/usr/bin/clang-stat-cache /Applications/Xcode-16.3.0.app/Contents/Developer/Platforms/MacOSX.platform/Developer/SDKs/MacOSX15.4.sdk /Users/admin/builder/spi-builder-workspace/.derivedData/SDKStatCaches.noindex/macosx15.4-24E241-8287b8f5db97e746a1562fbca0c9d29b.sdkstatcache
    cd /Users/admin/builder/spi-builder-workspace/.swiftpm/xcode
    /Applications/Xcode-16.3.0.app/Contents/Developer/Toolchains/XcodeDefault.xctoolchain/usr/bin/clang-stat-cache /Applications/Xcode-16.3.0.app/Contents/Developer/Platforms/MacOSX.platform/Developer/SDKs/MacOSX15.4.sdk -o /Users/admin/builder/spi-builder-workspace/.derivedData/SDKStatCaches.noindex/macosx15.4-24E241-8287b8f5db97e746a1562fbca0c9d29b.sdkstatcache
SwiftDriver ConstraintsOperators normal arm64 com.apple.xcode.tools.swift.compiler (in target 'ConstraintsOperators' from project 'ConstraintsOperators')
    cd /Users/admin/builder/spi-builder-workspace/.swiftpm/xcode
    builtin-SwiftDriver -- /Applications/Xcode-16.3.0.app/Contents/Developer/Toolchains/XcodeDefault.xctoolchain/usr/bin/swiftc -module-name ConstraintsOperators -Onone -enforce-exclusivity\=checked @/Users/admin/builder/spi-builder-workspace/.derivedData/Build/Intermediates.noindex/ConstraintsOperators.build/Debug/ConstraintsOperators.build/Objects-normal/arm64/ConstraintsOperators.SwiftFileList -DSWIFT_PACKAGE -DDEBUG -DXcode -plugin-path /Applications/Xcode-16.3.0.app/Contents/Developer/Toolchains/XcodeDefault.xctoolchain/usr/lib/swift/host/plugins/testing -enable-experimental-feature DebugDescriptionMacro -sdk /Applications/Xcode-16.3.0.app/Contents/Developer/Platforms/MacOSX.platform/Developer/SDKs/MacOSX15.4.sdk -target arm64-apple-macos10.13 -g -module-cache-path /Users/admin/builder/spi-builder-workspace/.derivedData/ModuleCache.noindex -Xfrontend -serialize-debugging-options -profile-coverage-mapping -profile-generate -enable-testing -index-store-path /Users/admin/builder/spi-builder-workspace/.derivedData/Index.noindex/DataStore -swift-version 5 -I /Users/admin/builder/spi-builder-workspace/.derivedData/Build/Products/Debug -I /Applications/Xcode-16.3.0.app/Contents/Developer/Platforms/MacOSX.platform/Developer/usr/lib -F /Users/admin/builder/spi-builder-workspace/.derivedData/Build/Products/Debug -F /Applications/Xcode-16.3.0.app/Contents/Developer/Platforms/MacOSX.platform/Developer/Library/Frameworks -c -j10 -enable-batch-mode -incremental -Xcc -ivfsstatcache -Xcc /Users/admin/builder/spi-builder-workspace/.derivedData/SDKStatCaches.noindex/macosx15.4-24E241-8287b8f5db97e746a1562fbca0c9d29b.sdkstatcache -output-file-map /Users/admin/builder/spi-builder-workspace/.derivedData/Build/Intermediates.noindex/ConstraintsOperators.build/Debug/ConstraintsOperators.build/Objects-normal/arm64/ConstraintsOperators-OutputFileMap.json -use-frontend-parseable-output -save-temps -no-color-diagnostics -serialize-diagnostics -emit-dependencies -emit-module -emit-module-path /Users/admin/builder/spi-builder-workspace/.derivedData/Build/Intermediates.noindex/ConstraintsOperators.build/Debug/ConstraintsOperators.build/Objects-normal/arm64/ConstraintsOperators.swiftmodule -validate-clang-modules-once -clang-build-session-file /Users/admin/builder/spi-builder-workspace/.derivedData/ModuleCache.noindex/Session.modulevalidation -Xcc -I/Users/admin/builder/spi-builder-workspace/.derivedData/Build/Intermediates.noindex/ConstraintsOperators.build/Debug/ConstraintsOperators.build/swift-overrides.hmap -emit-const-values -Xfrontend -const-gather-protocols-file -Xfrontend /Users/admin/builder/spi-builder-workspace/.derivedData/Build/Intermediates.noindex/ConstraintsOperators.build/Debug/ConstraintsOperators.build/Objects-normal/arm64/ConstraintsOperators_const_extract_protocols.json -Xcc -I/Users/admin/builder/spi-builder-workspace/.derivedData/Build/Products/Debug/include -Xcc -I/Users/admin/builder/spi-builder-workspace/.derivedData/Build/Intermediates.noindex/ConstraintsOperators.build/Debug/ConstraintsOperators.build/DerivedSources-normal/arm64 -Xcc -I/Users/admin/builder/spi-builder-workspace/.derivedData/Build/Intermediates.noindex/ConstraintsOperators.build/Debug/ConstraintsOperators.build/DerivedSources/arm64 -Xcc -I/Users/admin/builder/spi-builder-workspace/.derivedData/Build/Intermediates.noindex/ConstraintsOperators.build/Debug/ConstraintsOperators.build/DerivedSources -Xcc -DSWIFT_PACKAGE -Xcc -DDEBUG\=1 -emit-objc-header -emit-objc-header-path /Users/admin/builder/spi-builder-workspace/.derivedData/Build/Intermediates.noindex/ConstraintsOperators.build/Debug/ConstraintsOperators.build/Objects-normal/arm64/ConstraintsOperators-Swift.h -working-directory /Users/admin/builder/spi-builder-workspace/.swiftpm/xcode -experimental-emit-module-separately -disable-cmo
SwiftCompile normal arm64 Compiling\ Edges.swift /Users/admin/builder/spi-builder-workspace/Sources/ConstraintsOperators/Edges.swift (in target 'ConstraintsOperators' from project 'ConstraintsOperators')
SwiftCompile normal arm64 /Users/admin/builder/spi-builder-workspace/Sources/ConstraintsOperators/Edges.swift (in target 'ConstraintsOperators' from project 'ConstraintsOperators')
    cd /Users/admin/builder/spi-builder-workspace/.swiftpm/xcode

SwiftCompile normal arm64 Compiling\ Attributes.swift,\ Constraints.swift /Users/admin/builder/spi-builder-workspace/Sources/ConstraintsOperators/Attributes.swift /Users/admin/builder/spi-builder-workspace/Sources/ConstraintsOperators/Constraints.swift (in target 'ConstraintsOperators' from project 'ConstraintsOperators')
SwiftCompile normal arm64 /Users/admin/builder/spi-builder-workspace/Sources/ConstraintsOperators/Attributes.swift (in target 'ConstraintsOperators' from project 'ConstraintsOperators')
    cd /Users/admin/builder/spi-builder-workspace/.swiftpm/xcode

SwiftCompile normal arm64 /Users/admin/builder/spi-builder-workspace/Sources/ConstraintsOperators/Constraints.swift (in target 'ConstraintsOperators' from project 'ConstraintsOperators')
    cd /Users/admin/builder/spi-builder-workspace/.swiftpm/xcode

SwiftCompile normal arm64 Compiling\ ConvienceLayout.swift /Users/admin/builder/spi-builder-workspace/Sources/ConstraintsOperators/ConvienceLayout.swift (in target 'ConstraintsOperators' from project 'ConstraintsOperators')
SwiftCompile normal arm64 /Users/admin/builder/spi-builder-workspace/Sources/ConstraintsOperators/ConvienceLayout.swift (in target 'ConstraintsOperators' from project 'ConstraintsOperators')
    cd /Users/admin/builder/spi-builder-workspace/.swiftpm/xcode

SwiftCompile normal arm64 Compiling\ LayoutAttributeType.swift /Users/admin/builder/spi-builder-workspace/Sources/ConstraintsOperators/LayoutAttributeType.swift (in target 'ConstraintsOperators' from project 'ConstraintsOperators')
SwiftCompile normal arm64 /Users/admin/builder/spi-builder-workspace/Sources/ConstraintsOperators/LayoutAttributeType.swift (in target 'ConstraintsOperators' from project 'ConstraintsOperators')
    cd /Users/admin/builder/spi-builder-workspace/.swiftpm/xcode

SwiftCompile normal arm64 Compiling\ LayoutConstraint.swift /Users/admin/builder/spi-builder-workspace/Sources/ConstraintsOperators/LayoutConstraint.swift (in target 'ConstraintsOperators' from project 'ConstraintsOperators')
SwiftCompile normal arm64 /Users/admin/builder/spi-builder-workspace/Sources/ConstraintsOperators/LayoutConstraint.swift (in target 'ConstraintsOperators' from project 'ConstraintsOperators')
    cd /Users/admin/builder/spi-builder-workspace/.swiftpm/xcode

SwiftCompile normal arm64 Compiling\ NS++.swift /Users/admin/builder/spi-builder-workspace/Sources/ConstraintsOperators/NS++.swift (in target 'ConstraintsOperators' from project 'ConstraintsOperators')
SwiftCompile normal arm64 /Users/admin/builder/spi-builder-workspace/Sources/ConstraintsOperators/NS++.swift (in target 'ConstraintsOperators' from project 'ConstraintsOperators')
    cd /Users/admin/builder/spi-builder-workspace/.swiftpm/xcode

SwiftCompile normal arm64 Compiling\ Functions.swift /Users/admin/builder/spi-builder-workspace/Sources/ConstraintsOperators/Functions.swift (in target 'ConstraintsOperators' from project 'ConstraintsOperators')
SwiftCompile normal arm64 /Users/admin/builder/spi-builder-workspace/Sources/ConstraintsOperators/Functions.swift (in target 'ConstraintsOperators' from project 'ConstraintsOperators')
    cd /Users/admin/builder/spi-builder-workspace/.swiftpm/xcode

SwiftCompile normal arm64 Compiling\ ConstraintsCreators.swift /Users/admin/builder/spi-builder-workspace/Sources/ConstraintsOperators/ConstraintsCreators.swift (in target 'ConstraintsOperators' from project 'ConstraintsOperators')
SwiftCompile normal arm64 /Users/admin/builder/spi-builder-workspace/Sources/ConstraintsOperators/ConstraintsCreators.swift (in target 'ConstraintsOperators' from project 'ConstraintsOperators')
    cd /Users/admin/builder/spi-builder-workspace/.swiftpm/xcode

SwiftCompile normal arm64 Compiling\ NSLayoutConstraint++.swift /Users/admin/builder/spi-builder-workspace/Sources/ConstraintsOperators/NSLayoutConstraint++.swift (in target 'ConstraintsOperators' from project 'ConstraintsOperators')
SwiftCompile normal arm64 /Users/admin/builder/spi-builder-workspace/Sources/ConstraintsOperators/NSLayoutConstraint++.swift (in target 'ConstraintsOperators' from project 'ConstraintsOperators')
    cd /Users/admin/builder/spi-builder-workspace/.swiftpm/xcode

SwiftEmitModule normal arm64 Emitting\ module\ for\ ConstraintsOperators (in target 'ConstraintsOperators' from project 'ConstraintsOperators')
Failed frontend command:
/Applications/Xcode-16.3.0.app/Contents/Developer/Toolchains/XcodeDefault.xctoolchain/usr/bin/swift-frontend -frontend -emit-module -experimental-skip-non-inlinable-function-bodies-without-types /Users/admin/builder/spi-builder-workspace/Sources/ConstraintsOperators/Attributes.swift /Users/admin/builder/spi-builder-workspace/Sources/ConstraintsOperators/Constraints.swift /Users/admin/builder/spi-builder-workspace/Sources/ConstraintsOperators/ConstraintsCreators.swift /Users/admin/builder/spi-builder-workspace/Sources/ConstraintsOperators/ConvienceLayout.swift /Users/admin/builder/spi-builder-workspace/Sources/ConstraintsOperators/Edges.swift /Users/admin/builder/spi-builder-workspace/Sources/ConstraintsOperators/Functions.swift /Users/admin/builder/spi-builder-workspace/Sources/ConstraintsOperators/LayoutAttributeType.swift /Users/admin/builder/spi-builder-workspace/Sources/ConstraintsOperators/LayoutConstraint.swift /Users/admin/builder/spi-builder-workspace/Sources/ConstraintsOperators/NS++.swift /Users/admin/builder/spi-builder-workspace/Sources/ConstraintsOperators/NSLayoutConstraint++.swift /Users/admin/builder/spi-builder-workspace/Sources/ConstraintsOperators/Operators.swift -target arm64-apple-macos10.13 -Xllvm -aarch64-use-tbi -enable-objc-interop -sdk /Applications/Xcode-16.3.0.app/Contents/Developer/Platforms/MacOSX.platform/Developer/SDKs/MacOSX15.4.sdk -I /Users/admin/builder/spi-builder-workspace/.derivedData/Build/Products/Debug -I /Applications/Xcode-16.3.0.app/Contents/Developer/Platforms/MacOSX.platform/Developer/usr/lib -F /Users/admin/builder/spi-builder-workspace/.derivedData/Build/Products/Debug -F /Applications/Xcode-16.3.0.app/Contents/Developer/Platforms/MacOSX.platform/Developer/Library/Frameworks -no-color-diagnostics -enable-testing -g -debug-info-format\=dwarf -dwarf-version\=4 -module-cache-path /Users/admin/builder/spi-builder-workspace/.derivedData/ModuleCache.noindex -profile-generate -profile-coverage-mapping -swift-version 5 -enforce-exclusivity\=checked -Onone -D SWIFT_PACKAGE -D DEBUG -D Xcode -serialize-debugging-options -const-gather-protocols-file /Users/admin/builder/spi-builder-workspace/.derivedData/Build/Intermediates.noindex/ConstraintsOperators.build/Debug/ConstraintsOperators.build/Objects-normal/arm64/ConstraintsOperators_const_extract_protocols.json -enable-experimental-feature DebugDescriptionMacro -empty-abi-descriptor -plugin-path /Applications/Xcode-16.3.0.app/Contents/Developer/Toolchains/XcodeDefault.xctoolchain/usr/lib/swift/host/plugins/testing -validate-clang-modules-once -clang-build-session-file /Users/admin/builder/spi-builder-workspace/.derivedData/ModuleCache.noindex/Session.modulevalidation -Xcc -working-directory -Xcc /Users/admin/builder/spi-builder-workspace/.swiftpm/xcode -resource-dir /Applications/Xcode-16.3.0.app/Contents/Developer/Toolchains/XcodeDefault.xctoolchain/usr/lib/swift -enable-anonymous-context-mangled-names -file-compilation-dir /Users/admin/builder/spi-builder-workspace/.swiftpm/xcode -Xcc -ivfsstatcache -Xcc /Users/admin/builder/spi-builder-workspace/.derivedData/SDKStatCaches.noindex/macosx15.4-24E241-8287b8f5db97e746a1562fbca0c9d29b.sdkstatcache -Xcc -I/Users/admin/builder/spi-builder-workspace/.derivedData/Build/Intermediates.noindex/ConstraintsOperators.build/Debug/ConstraintsOperators.build/swift-overrides.hmap -Xcc -I/Users/admin/builder/spi-builder-workspace/.derivedData/Build/Products/Debug/include -Xcc -I/Users/admin/builder/spi-builder-workspace/.derivedData/Build/Intermediates.noindex/ConstraintsOperators.build/Debug/ConstraintsOperators.build/DerivedSources-normal/arm64 -Xcc -I/Users/admin/builder/spi-builder-workspace/.derivedData/Build/Intermediates.noindex/ConstraintsOperators.build/Debug/ConstraintsOperators.build/DerivedSources/arm64 -Xcc -I/Users/admin/builder/spi-builder-workspace/.derivedData/Build/Intermediates.noindex/ConstraintsOperators.build/Debug/ConstraintsOperators.build/DerivedSources -Xcc -DSWIFT_PACKAGE -Xcc -DDEBUG\=1 -module-name ConstraintsOperators -frontend-parseable-output -disable-clang-spi -target-sdk-version 15.4 -target-sdk-name macosx15.4 -external-plugin-path /Applications/Xcode-16.3.0.app/Contents/Developer/Platforms/MacOSX.platform/Developer/usr/lib/swift/host/plugins\#/Applications/Xcode-16.3.0.app/Contents/Developer/Platforms/MacOSX.platform/Developer/usr/bin/swift-plugin-server -external-plugin-path /Applications/Xcode-16.3.0.app/Contents/Developer/Platforms/MacOSX.platform/Developer/usr/local/lib/swift/host/plugins\#/Applications/Xcode-16.3.0.app/Contents/Developer/Platforms/MacOSX.platform/Developer/usr/bin/swift-plugin-server -in-process-plugin-server-path /Applications/Xcode-16.3.0.app/Contents/Developer/Toolchains/XcodeDefault.xctoolchain/usr/lib/swift/host/libSwiftInProcPluginServer.dylib -plugin-path /Applications/Xcode-16.3.0.app/Contents/Developer/Toolchains/XcodeDefault.xctoolchain/usr/lib/swift/host/plugins -plugin-path /Applications/Xcode-16.3.0.app/Contents/Developer/Toolchains/XcodeDefault.xctoolchain/usr/local/lib/swift/host/plugins -emit-module-doc-path /Users/admin/builder/spi-builder-workspace/.derivedData/Build/Intermediates.noindex/ConstraintsOperators.build/Debug/ConstraintsOperators.build/Objects-normal/arm64/ConstraintsOperators.swiftdoc -emit-module-source-info-path /Users/admin/builder/spi-builder-workspace/.derivedData/Build/Intermediates.noindex/ConstraintsOperators.build/Debug/ConstraintsOperators.build/Objects-normal/arm64/ConstraintsOperators.swiftsourceinfo -emit-objc-header-path /Users/admin/builder/spi-builder-workspace/.derivedData/Build/Intermediates.noindex/ConstraintsOperators.build/Debug/ConstraintsOperators.build/Objects-normal/arm64/ConstraintsOperators-Swift.h -serialize-diagnostics-path /Users/admin/builder/spi-builder-workspace/.derivedData/Build/Intermediates.noindex/ConstraintsOperators.build/Debug/ConstraintsOperators.build/Objects-normal/arm64/ConstraintsOperators-master-emit-module.dia -emit-dependencies-path /Users/admin/builder/spi-builder-workspace/.derivedData/Build/Intermediates.noindex/ConstraintsOperators.build/Debug/ConstraintsOperators.build/Objects-normal/arm64/ConstraintsOperators-master-emit-module.d -o /Users/admin/builder/spi-builder-workspace/.derivedData/Build/Intermediates.noindex/ConstraintsOperators.build/Debug/ConstraintsOperators.build/Objects-normal/arm64/ConstraintsOperators.swiftmodule -emit-abi-descriptor-path /Users/admin/builder/spi-builder-workspace/.derivedData/Build/Intermediates.noindex/ConstraintsOperators.build/Debug/ConstraintsOperators.build/Objects-normal/arm64/ConstraintsOperators.abi.json
EmitSwiftModule normal arm64 (in target 'ConstraintsOperators' from project 'ConstraintsOperators')
    cd /Users/admin/builder/spi-builder-workspace/.swiftpm/xcode

/Users/admin/builder/spi-builder-workspace/Sources/ConstraintsOperators/Constraints.swift:8:8: error: no such module 'UIKit'
import UIKit
       ^
SwiftCompile normal arm64 Compiling\ Operators.swift /Users/admin/builder/spi-builder-workspace/Sources/ConstraintsOperators/Operators.swift (in target 'ConstraintsOperators' from project 'ConstraintsOperators')
Command SwiftCompile failed with a nonzero exit code
--- xcodebuild: WARNING: Using the first of multiple matching destinations:
{ platform:macOS, arch:arm64, id:25515a6f1489a0bfd7afc372b247fdc9753b2c74, name:My Mac }
{ platform:macOS, arch:arm64, variant:Mac Catalyst, id:25515a6f1489a0bfd7afc372b247fdc9753b2c74, name:My Mac }
{ platform:macOS, arch:arm64, variant:DriverKit, id:25515a6f1489a0bfd7afc372b247fdc9753b2c74, name:My Mac }
{ platform:macOS, arch:arm64, variant:Designed for [iPad,iPhone], id:25515a6f1489a0bfd7afc372b247fdc9753b2c74, name:My Mac }
** BUILD FAILED **
The following build commands failed:
	SwiftEmitModule normal arm64 Emitting\ module\ for\ ConstraintsOperators (in target 'ConstraintsOperators' from project 'ConstraintsOperators')
	EmitSwiftModule normal arm64 (in target 'ConstraintsOperators' from project 'ConstraintsOperators')
	SwiftCompile normal arm64 Compiling\ Operators.swift /Users/admin/builder/spi-builder-workspace/Sources/ConstraintsOperators/Operators.swift (in target 'ConstraintsOperators' from project 'ConstraintsOperators')
	Building workspace spi-builder-workspace with scheme ConstraintsOperators
(4 failures)
BUILD FAILURE 6.1 macosXcodebuild