The Swift Package Index logo.Swift Package Index

Track the adoption of Swift 6 strict concurrency checks for data race safety. How many packages are Ready for Swift 6?

Build Information

Failed to build Placard, reference main (03a288), with Swift 6.1 for tvOS using Xcode 16.3 on 29 Apr 2025 15:41:25 UTC.

Build Command

env DEVELOPER_DIR=/Applications/Xcode-16.3.0.app xcrun xcodebuild -IDEClonedSourcePackagesDirPathOverride=$PWD/.dependencies -skipMacroValidation -skipPackagePluginValidation -derivedDataPath $PWD/.derivedData build -scheme Placard -destination generic/platform=tvOS

Build Log

========================================
RunAll
========================================
Builder version: 4.61.1
Interrupt handler set up.
========================================
Checkout
========================================
Clone URL: https://github.com/ccavnor/Placard.git
Reference: main
Initialized empty Git repository in /Users/admin/builder/spi-builder-workspace/.git/
From https://github.com/ccavnor/Placard
 * branch            main       -> FETCH_HEAD
 * [new branch]      main       -> origin/main
HEAD is now at 03a2881 Update README.md
Cloned https://github.com/ccavnor/Placard.git
Revision (git rev-parse @):
03a288147ddb3a63e29c90e973070351ee97c277
SUCCESS checkout https://github.com/ccavnor/Placard.git at main
========================================
Build
========================================
Selected platform:         tvOS
Swift version:             6.1
Building package at path:  $PWD
https://github.com/ccavnor/Placard.git
https://github.com/ccavnor/Placard.git
{
  "dependencies" : [
  ],
  "manifest_display_name" : "Placard",
  "name" : "Placard",
  "path" : "/Users/admin/builder/spi-builder-workspace",
  "platforms" : [
    {
      "name" : "ios",
      "version" : "17.0"
    }
  ],
  "products" : [
    {
      "name" : "Placard",
      "targets" : [
        "Placard"
      ],
      "type" : {
        "library" : [
          "automatic"
        ]
      }
    }
  ],
  "targets" : [
    {
      "c99name" : "Placard",
      "module_type" : "SwiftTarget",
      "name" : "Placard",
      "path" : "Sources/Placard",
      "product_memberships" : [
        "Placard"
      ],
      "sources" : [
        "Placard+Constraints.swift",
        "Placard+DeviceOrientation.swift",
        "Placard+Layout.swift",
        "Placard.swift",
        "PlacardConfig.swift",
        "PlacardView.swift",
        "UIView+Animations.swift"
      ],
      "type" : "library"
    }
  ],
  "tools_version" : "5.9"
}
Command line invocation:
    /Applications/Xcode-16.3.0.app/Contents/Developer/usr/bin/xcodebuild -IDEClonedSourcePackagesDirPathOverride=/Users/admin/builder/spi-builder-workspace/.dependencies -resolvePackageDependencies
Resolve Package Graph
Resolve Package Graph
Resolved source packages:
  Placard: /Users/admin/builder/spi-builder-workspace
resolved source packages: Placard
{
  "dependencies" : [
  ],
  "manifest_display_name" : "Placard",
  "name" : "Placard",
  "path" : "/Users/admin/builder/spi-builder-workspace",
  "platforms" : [
    {
      "name" : "ios",
      "version" : "17.0"
    }
  ],
  "products" : [
    {
      "name" : "Placard",
      "targets" : [
        "Placard"
      ],
      "type" : {
        "library" : [
          "automatic"
        ]
      }
    }
  ],
  "targets" : [
    {
      "c99name" : "Placard",
      "module_type" : "SwiftTarget",
      "name" : "Placard",
      "path" : "Sources/Placard",
      "product_memberships" : [
        "Placard"
      ],
      "sources" : [
        "Placard+Constraints.swift",
        "Placard+DeviceOrientation.swift",
        "Placard+Layout.swift",
        "Placard.swift",
        "PlacardConfig.swift",
        "PlacardView.swift",
        "UIView+Animations.swift"
      ],
      "type" : "library"
    }
  ],
  "tools_version" : "5.9"
}
{
  "workspace" : {
    "name" : "spi-builder-workspace",
    "schemes" : [
      "Placard"
    ]
  }
}
Running build ...
env DEVELOPER_DIR=/Applications/Xcode-16.3.0.app xcrun xcodebuild -IDEClonedSourcePackagesDirPathOverride=$PWD/.dependencies -skipMacroValidation -skipPackagePluginValidation -derivedDataPath $PWD/.derivedData build -scheme Placard -destination generic/platform=tvOS OTHER_SWIFT_FLAGS=-stats-output-dir .stats -strict-concurrency=complete -enable-upcoming-feature StrictConcurrency -enable-upcoming-feature DisableOutwardActorInference -enable-upcoming-feature GlobalActorIsolatedTypesUsability -enable-upcoming-feature InferSendableFromCaptures
Command line invocation:
    /Applications/Xcode-16.3.0.app/Contents/Developer/usr/bin/xcodebuild -IDEClonedSourcePackagesDirPathOverride=/Users/admin/builder/spi-builder-workspace/.dependencies -skipMacroValidation -skipPackagePluginValidation -derivedDataPath /Users/admin/builder/spi-builder-workspace/.derivedData build -scheme Placard -destination generic/platform=tvOS "OTHER_SWIFT_FLAGS=-stats-output-dir .stats -strict-concurrency=complete -enable-upcoming-feature StrictConcurrency -enable-upcoming-feature DisableOutwardActorInference -enable-upcoming-feature GlobalActorIsolatedTypesUsability -enable-upcoming-feature InferSendableFromCaptures"
Build settings from command line:
    OTHER_SWIFT_FLAGS = -stats-output-dir .stats -strict-concurrency=complete -enable-upcoming-feature StrictConcurrency -enable-upcoming-feature DisableOutwardActorInference -enable-upcoming-feature GlobalActorIsolatedTypesUsability -enable-upcoming-feature InferSendableFromCaptures
Resolve Package Graph
Resolved source packages:
  Placard: /Users/admin/builder/spi-builder-workspace
ComputePackagePrebuildTargetDependencyGraph
Prepare packages
CreateBuildRequest
SendProjectDescription
CreateBuildOperation
ComputeTargetDependencyGraph
note: Building targets in dependency order
note: Target dependency graph (2 targets)
    Target 'Placard' in project 'Placard'
        ➜ Explicit dependency on target 'Placard' in project 'Placard'
    Target 'Placard' in project 'Placard' (no dependencies)
GatherProvisioningInputs
CreateBuildDescription
ExecuteExternalTool /Applications/Xcode-16.3.0.app/Contents/Developer/Toolchains/XcodeDefault.xctoolchain/usr/bin/clang -v -E -dM -isysroot /Applications/Xcode-16.3.0.app/Contents/Developer/Platforms/AppleTVOS.platform/Developer/SDKs/AppleTVOS18.4.sdk -x c -c /dev/null
ExecuteExternalTool /Applications/Xcode-16.3.0.app/Contents/Developer/Toolchains/XcodeDefault.xctoolchain/usr/bin/swiftc --version
ExecuteExternalTool /Applications/Xcode-16.3.0.app/Contents/Developer/Toolchains/XcodeDefault.xctoolchain/usr/bin/ld -version_details
Build description signature: 270721bb8818b9afca34ccd4f9a95090
Build description path: /Users/admin/builder/spi-builder-workspace/.derivedData/Build/Intermediates.noindex/XCBuildData/270721bb8818b9afca34ccd4f9a95090.xcbuilddata
ClangStatCache /Applications/Xcode-16.3.0.app/Contents/Developer/Toolchains/XcodeDefault.xctoolchain/usr/bin/clang-stat-cache /Applications/Xcode-16.3.0.app/Contents/Developer/Platforms/AppleTVOS.platform/Developer/SDKs/AppleTVOS18.4.sdk /Users/admin/builder/spi-builder-workspace/.derivedData/SDKStatCaches.noindex/appletvos18.4-22L251-271d326055c85f9856fa135c41255102.sdkstatcache
    cd /Users/admin/builder/spi-builder-workspace/.swiftpm/xcode
    /Applications/Xcode-16.3.0.app/Contents/Developer/Toolchains/XcodeDefault.xctoolchain/usr/bin/clang-stat-cache /Applications/Xcode-16.3.0.app/Contents/Developer/Platforms/AppleTVOS.platform/Developer/SDKs/AppleTVOS18.4.sdk -o /Users/admin/builder/spi-builder-workspace/.derivedData/SDKStatCaches.noindex/appletvos18.4-22L251-271d326055c85f9856fa135c41255102.sdkstatcache
CreateBuildDirectory /Users/admin/builder/spi-builder-workspace/.derivedData/Build/Intermediates.noindex
    cd /Users/admin/builder/spi-builder-workspace/.swiftpm/xcode
    builtin-create-build-directory /Users/admin/builder/spi-builder-workspace/.derivedData/Build/Intermediates.noindex
CreateBuildDirectory /Users/admin/builder/spi-builder-workspace/.derivedData/Build/Products
    cd /Users/admin/builder/spi-builder-workspace/.swiftpm/xcode
    builtin-create-build-directory /Users/admin/builder/spi-builder-workspace/.derivedData/Build/Products
CreateBuildDirectory /Users/admin/builder/spi-builder-workspace/.derivedData/Build/Intermediates.noindex/EagerLinkingTBDs/Debug-appletvos
    cd /Users/admin/builder/spi-builder-workspace/.swiftpm/xcode
    builtin-create-build-directory /Users/admin/builder/spi-builder-workspace/.derivedData/Build/Intermediates.noindex/EagerLinkingTBDs/Debug-appletvos
CreateBuildDirectory /Users/admin/builder/spi-builder-workspace/.derivedData/Build/Products/Debug-appletvos
    cd /Users/admin/builder/spi-builder-workspace/.swiftpm/xcode
    builtin-create-build-directory /Users/admin/builder/spi-builder-workspace/.derivedData/Build/Products/Debug-appletvos
CreateBuildDirectory /Users/admin/builder/spi-builder-workspace/.derivedData/Build/Products/Debug-appletvos/PackageFrameworks
    cd /Users/admin/builder/spi-builder-workspace/.swiftpm/xcode
    builtin-create-build-directory /Users/admin/builder/spi-builder-workspace/.derivedData/Build/Products/Debug-appletvos/PackageFrameworks
WriteAuxiliaryFile /Users/admin/builder/spi-builder-workspace/.derivedData/Build/Intermediates.noindex/Placard.build/Debug-appletvos/Placard.build/Placard.modulemap (in target 'Placard' from project 'Placard')
    cd /Users/admin/builder/spi-builder-workspace
    write-file /Users/admin/builder/spi-builder-workspace/.derivedData/Build/Intermediates.noindex/Placard.build/Debug-appletvos/Placard.build/Placard.modulemap
WriteAuxiliaryFile /Users/admin/builder/spi-builder-workspace/.derivedData/Build/Intermediates.noindex/Placard.build/Debug-appletvos/Placard.build/Placard.DependencyStaticMetadataFileList (in target 'Placard' from project 'Placard')
    cd /Users/admin/builder/spi-builder-workspace
    write-file /Users/admin/builder/spi-builder-workspace/.derivedData/Build/Intermediates.noindex/Placard.build/Debug-appletvos/Placard.build/Placard.DependencyStaticMetadataFileList
WriteAuxiliaryFile /Users/admin/builder/spi-builder-workspace/.derivedData/Build/Intermediates.noindex/Placard.build/Debug-appletvos/Placard.build/Placard.DependencyMetadataFileList (in target 'Placard' from project 'Placard')
    cd /Users/admin/builder/spi-builder-workspace
    write-file /Users/admin/builder/spi-builder-workspace/.derivedData/Build/Intermediates.noindex/Placard.build/Debug-appletvos/Placard.build/Placard.DependencyMetadataFileList
WriteAuxiliaryFile /Users/admin/builder/spi-builder-workspace/.derivedData/Build/Intermediates.noindex/Placard.build/Debug-appletvos/Placard.build/Objects-normal/arm64/Placard.LinkFileList (in target 'Placard' from project 'Placard')
    cd /Users/admin/builder/spi-builder-workspace
    write-file /Users/admin/builder/spi-builder-workspace/.derivedData/Build/Intermediates.noindex/Placard.build/Debug-appletvos/Placard.build/Objects-normal/arm64/Placard.LinkFileList
WriteAuxiliaryFile /Users/admin/builder/spi-builder-workspace/.derivedData/Build/Intermediates.noindex/Placard.build/Debug-appletvos/Placard.build/Objects-normal/arm64/Placard.SwiftFileList (in target 'Placard' from project 'Placard')
    cd /Users/admin/builder/spi-builder-workspace
    write-file /Users/admin/builder/spi-builder-workspace/.derivedData/Build/Intermediates.noindex/Placard.build/Debug-appletvos/Placard.build/Objects-normal/arm64/Placard.SwiftFileList
WriteAuxiliaryFile /Users/admin/builder/spi-builder-workspace/.derivedData/Build/Intermediates.noindex/Placard.build/Debug-appletvos/Placard.build/Objects-normal/arm64/Placard-OutputFileMap.json (in target 'Placard' from project 'Placard')
    cd /Users/admin/builder/spi-builder-workspace
    write-file /Users/admin/builder/spi-builder-workspace/.derivedData/Build/Intermediates.noindex/Placard.build/Debug-appletvos/Placard.build/Objects-normal/arm64/Placard-OutputFileMap.json
WriteAuxiliaryFile /Users/admin/builder/spi-builder-workspace/.derivedData/Build/Intermediates.noindex/Placard.build/Debug-appletvos/Placard.build/Objects-normal/arm64/Placard.SwiftConstValuesFileList (in target 'Placard' from project 'Placard')
    cd /Users/admin/builder/spi-builder-workspace
    write-file /Users/admin/builder/spi-builder-workspace/.derivedData/Build/Intermediates.noindex/Placard.build/Debug-appletvos/Placard.build/Objects-normal/arm64/Placard.SwiftConstValuesFileList
WriteAuxiliaryFile /Users/admin/builder/spi-builder-workspace/.derivedData/Build/Intermediates.noindex/Placard.build/Debug-appletvos/Placard.build/Objects-normal/arm64/Placard_const_extract_protocols.json (in target 'Placard' from project 'Placard')
    cd /Users/admin/builder/spi-builder-workspace
    write-file /Users/admin/builder/spi-builder-workspace/.derivedData/Build/Intermediates.noindex/Placard.build/Debug-appletvos/Placard.build/Objects-normal/arm64/Placard_const_extract_protocols.json
Copy /Users/admin/builder/spi-builder-workspace/.derivedData/Build/Intermediates.noindex/GeneratedModuleMaps-appletvos/Placard.modulemap /Users/admin/builder/spi-builder-workspace/.derivedData/Build/Intermediates.noindex/Placard.build/Debug-appletvos/Placard.build/Placard.modulemap (in target 'Placard' from project 'Placard')
    cd /Users/admin/builder/spi-builder-workspace
    builtin-copy -exclude .DS_Store -exclude CVS -exclude .svn -exclude .git -exclude .hg -resolve-src-symlinks /Users/admin/builder/spi-builder-workspace/.derivedData/Build/Intermediates.noindex/Placard.build/Debug-appletvos/Placard.build/Placard.modulemap /Users/admin/builder/spi-builder-workspace/.derivedData/Build/Intermediates.noindex/GeneratedModuleMaps-appletvos
SwiftDriver Placard normal arm64 com.apple.xcode.tools.swift.compiler (in target 'Placard' from project 'Placard')
    cd /Users/admin/builder/spi-builder-workspace/.swiftpm/xcode
    builtin-SwiftDriver -- /Applications/Xcode-16.3.0.app/Contents/Developer/Toolchains/XcodeDefault.xctoolchain/usr/bin/swiftc -module-name Placard -Onone -enforce-exclusivity\=checked @/Users/admin/builder/spi-builder-workspace/.derivedData/Build/Intermediates.noindex/Placard.build/Debug-appletvos/Placard.build/Objects-normal/arm64/Placard.SwiftFileList -DSWIFT_PACKAGE -DDEBUG -stats-output-dir .stats -strict-concurrency\=complete -enable-upcoming-feature StrictConcurrency -enable-upcoming-feature DisableOutwardActorInference -enable-upcoming-feature GlobalActorIsolatedTypesUsability -enable-upcoming-feature InferSendableFromCaptures -plugin-path /Applications/Xcode-16.3.0.app/Contents/Developer/Toolchains/XcodeDefault.xctoolchain/usr/lib/swift/host/plugins/testing -enable-experimental-feature DebugDescriptionMacro -sdk /Applications/Xcode-16.3.0.app/Contents/Developer/Platforms/AppleTVOS.platform/Developer/SDKs/AppleTVOS18.4.sdk -target arm64-apple-tvos17.0 -g -module-cache-path /Users/admin/builder/spi-builder-workspace/.derivedData/ModuleCache.noindex -Xfrontend -serialize-debugging-options -enable-testing -index-store-path /Users/admin/builder/spi-builder-workspace/.derivedData/Index.noindex/DataStore -swift-version 5 -I /Users/admin/builder/spi-builder-workspace/.derivedData/Build/Products/Debug-appletvos -I /Applications/Xcode-16.3.0.app/Contents/Developer/Platforms/AppleTVOS.platform/Developer/usr/lib -F /Users/admin/builder/spi-builder-workspace/.derivedData/Build/Products/Debug-appletvos -F /Applications/Xcode-16.3.0.app/Contents/Developer/Platforms/AppleTVOS.platform/Developer/Library/Frameworks -F /Applications/Xcode-16.3.0.app/Contents/Developer/Platforms/AppleTVOS.platform/Developer/SDKs/AppleTVOS18.4.sdk/Developer/Library/Frameworks -c -j10 -enable-batch-mode -incremental -Xcc -ivfsstatcache -Xcc /Users/admin/builder/spi-builder-workspace/.derivedData/SDKStatCaches.noindex/appletvos18.4-22L251-271d326055c85f9856fa135c41255102.sdkstatcache -output-file-map /Users/admin/builder/spi-builder-workspace/.derivedData/Build/Intermediates.noindex/Placard.build/Debug-appletvos/Placard.build/Objects-normal/arm64/Placard-OutputFileMap.json -use-frontend-parseable-output -save-temps -no-color-diagnostics -serialize-diagnostics -emit-dependencies -emit-module -emit-module-path /Users/admin/builder/spi-builder-workspace/.derivedData/Build/Intermediates.noindex/Placard.build/Debug-appletvos/Placard.build/Objects-normal/arm64/Placard.swiftmodule -validate-clang-modules-once -clang-build-session-file /Users/admin/builder/spi-builder-workspace/.derivedData/ModuleCache.noindex/Session.modulevalidation -package-name spi_builder_workspace -Xcc -I/Users/admin/builder/spi-builder-workspace/.derivedData/Build/Intermediates.noindex/Placard.build/Debug-appletvos/Placard.build/swift-overrides.hmap -emit-const-values -Xfrontend -const-gather-protocols-file -Xfrontend /Users/admin/builder/spi-builder-workspace/.derivedData/Build/Intermediates.noindex/Placard.build/Debug-appletvos/Placard.build/Objects-normal/arm64/Placard_const_extract_protocols.json -Xcc -I/Users/admin/builder/spi-builder-workspace/.derivedData/Build/Products/Debug-appletvos/include -Xcc -I/Users/admin/builder/spi-builder-workspace/.derivedData/Build/Intermediates.noindex/Placard.build/Debug-appletvos/Placard.build/DerivedSources-normal/arm64 -Xcc -I/Users/admin/builder/spi-builder-workspace/.derivedData/Build/Intermediates.noindex/Placard.build/Debug-appletvos/Placard.build/DerivedSources/arm64 -Xcc -I/Users/admin/builder/spi-builder-workspace/.derivedData/Build/Intermediates.noindex/Placard.build/Debug-appletvos/Placard.build/DerivedSources -Xcc -DSWIFT_PACKAGE -Xcc -DDEBUG\=1 -emit-objc-header -emit-objc-header-path /Users/admin/builder/spi-builder-workspace/.derivedData/Build/Intermediates.noindex/Placard.build/Debug-appletvos/Placard.build/Objects-normal/arm64/Placard-Swift.h -working-directory /Users/admin/builder/spi-builder-workspace/.swiftpm/xcode -experimental-emit-module-separately -disable-cmo
SwiftCompile normal arm64 Compiling\ Placard+Constraints.swift /Users/admin/builder/spi-builder-workspace/Sources/Placard/Placard+Constraints.swift (in target 'Placard' from project 'Placard')
SwiftCompile normal arm64 /Users/admin/builder/spi-builder-workspace/Sources/Placard/Placard+Constraints.swift (in target 'Placard' from project 'Placard')
    cd /Users/admin/builder/spi-builder-workspace/.swiftpm/xcode

SwiftCompile normal arm64 Compiling\ Placard+Layout.swift /Users/admin/builder/spi-builder-workspace/Sources/Placard/Placard+Layout.swift (in target 'Placard' from project 'Placard')
SwiftCompile normal arm64 /Users/admin/builder/spi-builder-workspace/Sources/Placard/Placard+Layout.swift (in target 'Placard' from project 'Placard')
    cd /Users/admin/builder/spi-builder-workspace/.swiftpm/xcode

SwiftEmitModule normal arm64 Emitting\ module\ for\ Placard (in target 'Placard' from project 'Placard')
Failed frontend command:
/Applications/Xcode-16.3.0.app/Contents/Developer/Toolchains/XcodeDefault.xctoolchain/usr/bin/swift-frontend -frontend -emit-module -experimental-skip-non-inlinable-function-bodies-without-types /Users/admin/builder/spi-builder-workspace/Sources/Placard/Placard+Constraints.swift /Users/admin/builder/spi-builder-workspace/Sources/Placard/Placard+DeviceOrientation.swift /Users/admin/builder/spi-builder-workspace/Sources/Placard/Placard+Layout.swift /Users/admin/builder/spi-builder-workspace/Sources/Placard/Placard.swift /Users/admin/builder/spi-builder-workspace/Sources/Placard/PlacardConfig.swift /Users/admin/builder/spi-builder-workspace/Sources/Placard/PlacardView.swift /Users/admin/builder/spi-builder-workspace/Sources/Placard/UIView+Animations.swift -target arm64-apple-tvos17.0 -Xllvm -aarch64-use-tbi -enable-objc-interop -stack-check -sdk /Applications/Xcode-16.3.0.app/Contents/Developer/Platforms/AppleTVOS.platform/Developer/SDKs/AppleTVOS18.4.sdk -I /Users/admin/builder/spi-builder-workspace/.derivedData/Build/Products/Debug-appletvos -I /Applications/Xcode-16.3.0.app/Contents/Developer/Platforms/AppleTVOS.platform/Developer/usr/lib -F /Users/admin/builder/spi-builder-workspace/.derivedData/Build/Products/Debug-appletvos -F /Applications/Xcode-16.3.0.app/Contents/Developer/Platforms/AppleTVOS.platform/Developer/Library/Frameworks -F /Applications/Xcode-16.3.0.app/Contents/Developer/Platforms/AppleTVOS.platform/Developer/SDKs/AppleTVOS18.4.sdk/Developer/Library/Frameworks -no-color-diagnostics -enable-testing -g -debug-info-format\=dwarf -dwarf-version\=4 -module-cache-path /Users/admin/builder/spi-builder-workspace/.derivedData/ModuleCache.noindex -swift-version 5 -enforce-exclusivity\=checked -stats-output-dir /Users/admin/builder/spi-builder-workspace/.swiftpm/xcode/.stats -Onone -D SWIFT_PACKAGE -D DEBUG -serialize-debugging-options -const-gather-protocols-file /Users/admin/builder/spi-builder-workspace/.derivedData/Build/Intermediates.noindex/Placard.build/Debug-appletvos/Placard.build/Objects-normal/arm64/Placard_const_extract_protocols.json -enable-upcoming-feature StrictConcurrency -enable-upcoming-feature DisableOutwardActorInference -enable-upcoming-feature GlobalActorIsolatedTypesUsability -enable-upcoming-feature InferSendableFromCaptures -enable-experimental-feature DebugDescriptionMacro -strict-concurrency\=complete -empty-abi-descriptor -plugin-path /Applications/Xcode-16.3.0.app/Contents/Developer/Toolchains/XcodeDefault.xctoolchain/usr/lib/swift/host/plugins/testing -validate-clang-modules-once -clang-build-session-file /Users/admin/builder/spi-builder-workspace/.derivedData/ModuleCache.noindex/Session.modulevalidation -Xcc -working-directory -Xcc /Users/admin/builder/spi-builder-workspace/.swiftpm/xcode -resource-dir /Applications/Xcode-16.3.0.app/Contents/Developer/Toolchains/XcodeDefault.xctoolchain/usr/lib/swift -enable-anonymous-context-mangled-names -file-compilation-dir /Users/admin/builder/spi-builder-workspace/.swiftpm/xcode -Xcc -ivfsstatcache -Xcc /Users/admin/builder/spi-builder-workspace/.derivedData/SDKStatCaches.noindex/appletvos18.4-22L251-271d326055c85f9856fa135c41255102.sdkstatcache -Xcc -I/Users/admin/builder/spi-builder-workspace/.derivedData/Build/Intermediates.noindex/Placard.build/Debug-appletvos/Placard.build/swift-overrides.hmap -Xcc -I/Users/admin/builder/spi-builder-workspace/.derivedData/Build/Products/Debug-appletvos/include -Xcc -I/Users/admin/builder/spi-builder-workspace/.derivedData/Build/Intermediates.noindex/Placard.build/Debug-appletvos/Placard.build/DerivedSources-normal/arm64 -Xcc -I/Users/admin/builder/spi-builder-workspace/.derivedData/Build/Intermediates.noindex/Placard.build/Debug-appletvos/Placard.build/DerivedSources/arm64 -Xcc -I/Users/admin/builder/spi-builder-workspace/.derivedData/Build/Intermediates.noindex/Placard.build/Debug-appletvos/Placard.build/DerivedSources -Xcc -DSWIFT_PACKAGE -Xcc -DDEBUG\=1 -module-name Placard -package-name spi_builder_workspace -frontend-parseable-output -disable-clang-spi -target-sdk-version 18.4 -target-sdk-name appletvos18.4 -external-plugin-path /Applications/Xcode-16.3.0.app/Contents/Developer/Platforms/AppleTVOS.platform/Developer/usr/lib/swift/host/plugins\#/Applications/Xcode-16.3.0.app/Contents/Developer/Platforms/AppleTVOS.platform/Developer/usr/bin/swift-plugin-server -external-plugin-path /Applications/Xcode-16.3.0.app/Contents/Developer/Platforms/AppleTVOS.platform/Developer/usr/local/lib/swift/host/plugins\#/Applications/Xcode-16.3.0.app/Contents/Developer/Platforms/AppleTVOS.platform/Developer/usr/bin/swift-plugin-server -in-process-plugin-server-path /Applications/Xcode-16.3.0.app/Contents/Developer/Toolchains/XcodeDefault.xctoolchain/usr/lib/swift/host/libSwiftInProcPluginServer.dylib -plugin-path /Applications/Xcode-16.3.0.app/Contents/Developer/Toolchains/XcodeDefault.xctoolchain/usr/lib/swift/host/plugins -plugin-path /Applications/Xcode-16.3.0.app/Contents/Developer/Toolchains/XcodeDefault.xctoolchain/usr/local/lib/swift/host/plugins -emit-module-doc-path /Users/admin/builder/spi-builder-workspace/.derivedData/Build/Intermediates.noindex/Placard.build/Debug-appletvos/Placard.build/Objects-normal/arm64/Placard.swiftdoc -emit-module-source-info-path /Users/admin/builder/spi-builder-workspace/.derivedData/Build/Intermediates.noindex/Placard.build/Debug-appletvos/Placard.build/Objects-normal/arm64/Placard.swiftsourceinfo -emit-objc-header-path /Users/admin/builder/spi-builder-workspace/.derivedData/Build/Intermediates.noindex/Placard.build/Debug-appletvos/Placard.build/Objects-normal/arm64/Placard-Swift.h -serialize-diagnostics-path /Users/admin/builder/spi-builder-workspace/.derivedData/Build/Intermediates.noindex/Placard.build/Debug-appletvos/Placard.build/Objects-normal/arm64/Placard-master-emit-module.dia -emit-dependencies-path /Users/admin/builder/spi-builder-workspace/.derivedData/Build/Intermediates.noindex/Placard.build/Debug-appletvos/Placard.build/Objects-normal/arm64/Placard-master-emit-module.d -o /Users/admin/builder/spi-builder-workspace/.derivedData/Build/Intermediates.noindex/Placard.build/Debug-appletvos/Placard.build/Objects-normal/arm64/Placard.swiftmodule -emit-abi-descriptor-path /Users/admin/builder/spi-builder-workspace/.derivedData/Build/Intermediates.noindex/Placard.build/Debug-appletvos/Placard.build/Objects-normal/arm64/Placard.abi.json
EmitSwiftModule normal arm64 (in target 'Placard' from project 'Placard')
    cd /Users/admin/builder/spi-builder-workspace/.swiftpm/xcode

/Users/admin/builder/spi-builder-workspace/Sources/Placard/Placard+DeviceOrientation.swift:13:16: warning: static property 'subsystem' is not concurrency-safe because it is nonisolated global shared mutable state; this is an error in the Swift 6 language mode
    static var subsystem = Bundle.main.bundleIdentifier!
               ^
/Users/admin/builder/spi-builder-workspace/Sources/Placard/Placard+DeviceOrientation.swift:13:16: note: convert 'subsystem' to a 'let' constant to make 'Sendable' shared state immutable
    static var subsystem = Bundle.main.bundleIdentifier!
           ~~~ ^
           let
/Users/admin/builder/spi-builder-workspace/Sources/Placard/Placard+DeviceOrientation.swift:13:16: note: add '@MainActor' to make static property 'subsystem' part of global actor 'MainActor'
    static var subsystem = Bundle.main.bundleIdentifier!
               ^
    @MainActor
/Users/admin/builder/spi-builder-workspace/Sources/Placard/Placard+DeviceOrientation.swift:13:16: note: disable concurrency-safety checks if accesses are protected by an external synchronization mechanism
    static var subsystem = Bundle.main.bundleIdentifier!
               ^
    nonisolated(unsafe)
/Users/admin/builder/spi-builder-workspace/Sources/Placard/Placard+DeviceOrientation.swift:38:36: error: 'UIDeviceOrientation' is unavailable in tvOS
    func getDeviceOrientation() -> UIDeviceOrientation {
                                   ^~~~~~~~~~~~~~~~~~~
/Applications/Xcode-16.3.0.app/Contents/Developer/Platforms/AppleTVOS.platform/Developer/SDKs/AppleTVOS18.4.sdk/System/Library/Frameworks/UIKit.framework/Headers/UIOrientation.h:13:28: note: 'UIDeviceOrientation' has been explicitly marked unavailable here
typedef NS_ENUM(NSInteger, UIDeviceOrientation) {
                           ^
SwiftCompile normal arm64 Compiling\ PlacardConfig.swift /Users/admin/builder/spi-builder-workspace/Sources/Placard/PlacardConfig.swift (in target 'Placard' from project 'Placard')
SwiftCompile normal arm64 /Users/admin/builder/spi-builder-workspace/Sources/Placard/PlacardConfig.swift (in target 'Placard' from project 'Placard')
    cd /Users/admin/builder/spi-builder-workspace/.swiftpm/xcode

SwiftCompile normal arm64 Compiling\ Placard+DeviceOrientation.swift /Users/admin/builder/spi-builder-workspace/Sources/Placard/Placard+DeviceOrientation.swift (in target 'Placard' from project 'Placard')
SwiftCompile normal arm64 /Users/admin/builder/spi-builder-workspace/Sources/Placard/Placard+DeviceOrientation.swift (in target 'Placard' from project 'Placard')
    cd /Users/admin/builder/spi-builder-workspace/.swiftpm/xcode

SwiftCompile normal arm64 Compiling\ UIView+Animations.swift /Users/admin/builder/spi-builder-workspace/Sources/Placard/UIView+Animations.swift (in target 'Placard' from project 'Placard')
SwiftCompile normal arm64 /Users/admin/builder/spi-builder-workspace/Sources/Placard/UIView+Animations.swift (in target 'Placard' from project 'Placard')
    cd /Users/admin/builder/spi-builder-workspace/.swiftpm/xcode

SwiftCompile normal arm64 Compiling\ PlacardView.swift /Users/admin/builder/spi-builder-workspace/Sources/Placard/PlacardView.swift (in target 'Placard' from project 'Placard')
SwiftCompile normal arm64 /Users/admin/builder/spi-builder-workspace/Sources/Placard/PlacardView.swift (in target 'Placard' from project 'Placard')
    cd /Users/admin/builder/spi-builder-workspace/.swiftpm/xcode

SwiftCompile normal arm64 Compiling\ Placard.swift /Users/admin/builder/spi-builder-workspace/Sources/Placard/Placard.swift (in target 'Placard' from project 'Placard')
SwiftCompile normal arm64 /Users/admin/builder/spi-builder-workspace/Sources/Placard/Placard.swift (in target 'Placard' from project 'Placard')
    cd /Users/admin/builder/spi-builder-workspace/.swiftpm/xcode

** BUILD FAILED **
The following build commands failed:
	SwiftEmitModule normal arm64 Emitting\ module\ for\ Placard (in target 'Placard' from project 'Placard')
	EmitSwiftModule normal arm64 (in target 'Placard' from project 'Placard')
	Building workspace spi-builder-workspace with scheme Placard
(3 failures)
Command line invocation:
    /Applications/Xcode-16.3.0.app/Contents/Developer/usr/bin/xcodebuild -IDEClonedSourcePackagesDirPathOverride=/Users/admin/builder/spi-builder-workspace/.dependencies -resolvePackageDependencies
Resolve Package Graph
Resolved source packages:
  Placard: /Users/admin/builder/spi-builder-workspace
resolved source packages: Placard
{
  "dependencies" : [
  ],
  "manifest_display_name" : "Placard",
  "name" : "Placard",
  "path" : "/Users/admin/builder/spi-builder-workspace",
  "platforms" : [
    {
      "name" : "ios",
      "version" : "17.0"
    }
  ],
  "products" : [
    {
      "name" : "Placard",
      "targets" : [
        "Placard"
      ],
      "type" : {
        "library" : [
          "automatic"
        ]
      }
    }
  ],
  "targets" : [
    {
      "c99name" : "Placard",
      "module_type" : "SwiftTarget",
      "name" : "Placard",
      "path" : "Sources/Placard",
      "product_memberships" : [
        "Placard"
      ],
      "sources" : [
        "Placard+Constraints.swift",
        "Placard+DeviceOrientation.swift",
        "Placard+Layout.swift",
        "Placard.swift",
        "PlacardConfig.swift",
        "PlacardView.swift",
        "UIView+Animations.swift"
      ],
      "type" : "library"
    }
  ],
  "tools_version" : "5.9"
}
{
  "workspace" : {
    "name" : "spi-builder-workspace",
    "schemes" : [
      "Placard"
    ]
  }
}
Running build ...
env DEVELOPER_DIR=/Applications/Xcode-16.3.0.app xcrun xcodebuild -IDEClonedSourcePackagesDirPathOverride=$PWD/.dependencies -skipMacroValidation -skipPackagePluginValidation -derivedDataPath $PWD/.derivedData build -scheme Placard -destination generic/platform=tvOS
Command line invocation:
    /Applications/Xcode-16.3.0.app/Contents/Developer/usr/bin/xcodebuild -IDEClonedSourcePackagesDirPathOverride=/Users/admin/builder/spi-builder-workspace/.dependencies -skipMacroValidation -skipPackagePluginValidation -derivedDataPath /Users/admin/builder/spi-builder-workspace/.derivedData build -scheme Placard -destination generic/platform=tvOS
Resolve Package Graph
Resolved source packages:
  Placard: /Users/admin/builder/spi-builder-workspace
ComputePackagePrebuildTargetDependencyGraph
Prepare packages
CreateBuildRequest
SendProjectDescription
CreateBuildOperation
ComputeTargetDependencyGraph
note: Building targets in dependency order
note: Target dependency graph (2 targets)
    Target 'Placard' in project 'Placard'
        ➜ Explicit dependency on target 'Placard' in project 'Placard'
    Target 'Placard' in project 'Placard' (no dependencies)
GatherProvisioningInputs
CreateBuildDescription
ExecuteExternalTool /Applications/Xcode-16.3.0.app/Contents/Developer/Toolchains/XcodeDefault.xctoolchain/usr/bin/clang -v -E -dM -isysroot /Applications/Xcode-16.3.0.app/Contents/Developer/Platforms/AppleTVOS.platform/Developer/SDKs/AppleTVOS18.4.sdk -x c -c /dev/null
ExecuteExternalTool /Applications/Xcode-16.3.0.app/Contents/Developer/Toolchains/XcodeDefault.xctoolchain/usr/bin/swiftc --version
ExecuteExternalTool /Applications/Xcode-16.3.0.app/Contents/Developer/Toolchains/XcodeDefault.xctoolchain/usr/bin/ld -version_details
Build description signature: 769faf36d1cd373de8707fb1facdb9ff
Build description path: /Users/admin/builder/spi-builder-workspace/.derivedData/Build/Intermediates.noindex/XCBuildData/769faf36d1cd373de8707fb1facdb9ff.xcbuilddata
ClangStatCache /Applications/Xcode-16.3.0.app/Contents/Developer/Toolchains/XcodeDefault.xctoolchain/usr/bin/clang-stat-cache /Applications/Xcode-16.3.0.app/Contents/Developer/Platforms/AppleTVOS.platform/Developer/SDKs/AppleTVOS18.4.sdk /Users/admin/builder/spi-builder-workspace/.derivedData/SDKStatCaches.noindex/appletvos18.4-22L251-271d326055c85f9856fa135c41255102.sdkstatcache
    cd /Users/admin/builder/spi-builder-workspace/.swiftpm/xcode
    /Applications/Xcode-16.3.0.app/Contents/Developer/Toolchains/XcodeDefault.xctoolchain/usr/bin/clang-stat-cache /Applications/Xcode-16.3.0.app/Contents/Developer/Platforms/AppleTVOS.platform/Developer/SDKs/AppleTVOS18.4.sdk -o /Users/admin/builder/spi-builder-workspace/.derivedData/SDKStatCaches.noindex/appletvos18.4-22L251-271d326055c85f9856fa135c41255102.sdkstatcache
SwiftDriver Placard normal arm64 com.apple.xcode.tools.swift.compiler (in target 'Placard' from project 'Placard')
    cd /Users/admin/builder/spi-builder-workspace/.swiftpm/xcode
    builtin-SwiftDriver -- /Applications/Xcode-16.3.0.app/Contents/Developer/Toolchains/XcodeDefault.xctoolchain/usr/bin/swiftc -module-name Placard -Onone -enforce-exclusivity\=checked @/Users/admin/builder/spi-builder-workspace/.derivedData/Build/Intermediates.noindex/Placard.build/Debug-appletvos/Placard.build/Objects-normal/arm64/Placard.SwiftFileList -DSWIFT_PACKAGE -DDEBUG -DXcode -plugin-path /Applications/Xcode-16.3.0.app/Contents/Developer/Toolchains/XcodeDefault.xctoolchain/usr/lib/swift/host/plugins/testing -enable-experimental-feature DebugDescriptionMacro -sdk /Applications/Xcode-16.3.0.app/Contents/Developer/Platforms/AppleTVOS.platform/Developer/SDKs/AppleTVOS18.4.sdk -target arm64-apple-tvos17.0 -g -module-cache-path /Users/admin/builder/spi-builder-workspace/.derivedData/ModuleCache.noindex -Xfrontend -serialize-debugging-options -enable-testing -index-store-path /Users/admin/builder/spi-builder-workspace/.derivedData/Index.noindex/DataStore -swift-version 5 -I /Users/admin/builder/spi-builder-workspace/.derivedData/Build/Products/Debug-appletvos -I /Applications/Xcode-16.3.0.app/Contents/Developer/Platforms/AppleTVOS.platform/Developer/usr/lib -F /Users/admin/builder/spi-builder-workspace/.derivedData/Build/Products/Debug-appletvos -F /Applications/Xcode-16.3.0.app/Contents/Developer/Platforms/AppleTVOS.platform/Developer/Library/Frameworks -F /Applications/Xcode-16.3.0.app/Contents/Developer/Platforms/AppleTVOS.platform/Developer/SDKs/AppleTVOS18.4.sdk/Developer/Library/Frameworks -c -j10 -enable-batch-mode -incremental -Xcc -ivfsstatcache -Xcc /Users/admin/builder/spi-builder-workspace/.derivedData/SDKStatCaches.noindex/appletvos18.4-22L251-271d326055c85f9856fa135c41255102.sdkstatcache -output-file-map /Users/admin/builder/spi-builder-workspace/.derivedData/Build/Intermediates.noindex/Placard.build/Debug-appletvos/Placard.build/Objects-normal/arm64/Placard-OutputFileMap.json -use-frontend-parseable-output -save-temps -no-color-diagnostics -serialize-diagnostics -emit-dependencies -emit-module -emit-module-path /Users/admin/builder/spi-builder-workspace/.derivedData/Build/Intermediates.noindex/Placard.build/Debug-appletvos/Placard.build/Objects-normal/arm64/Placard.swiftmodule -validate-clang-modules-once -clang-build-session-file /Users/admin/builder/spi-builder-workspace/.derivedData/ModuleCache.noindex/Session.modulevalidation -package-name spi_builder_workspace -Xcc -I/Users/admin/builder/spi-builder-workspace/.derivedData/Build/Intermediates.noindex/Placard.build/Debug-appletvos/Placard.build/swift-overrides.hmap -emit-const-values -Xfrontend -const-gather-protocols-file -Xfrontend /Users/admin/builder/spi-builder-workspace/.derivedData/Build/Intermediates.noindex/Placard.build/Debug-appletvos/Placard.build/Objects-normal/arm64/Placard_const_extract_protocols.json -Xcc -I/Users/admin/builder/spi-builder-workspace/.derivedData/Build/Products/Debug-appletvos/include -Xcc -I/Users/admin/builder/spi-builder-workspace/.derivedData/Build/Intermediates.noindex/Placard.build/Debug-appletvos/Placard.build/DerivedSources-normal/arm64 -Xcc -I/Users/admin/builder/spi-builder-workspace/.derivedData/Build/Intermediates.noindex/Placard.build/Debug-appletvos/Placard.build/DerivedSources/arm64 -Xcc -I/Users/admin/builder/spi-builder-workspace/.derivedData/Build/Intermediates.noindex/Placard.build/Debug-appletvos/Placard.build/DerivedSources -Xcc -DSWIFT_PACKAGE -Xcc -DDEBUG\=1 -emit-objc-header -emit-objc-header-path /Users/admin/builder/spi-builder-workspace/.derivedData/Build/Intermediates.noindex/Placard.build/Debug-appletvos/Placard.build/Objects-normal/arm64/Placard-Swift.h -working-directory /Users/admin/builder/spi-builder-workspace/.swiftpm/xcode -experimental-emit-module-separately -disable-cmo
SwiftCompile normal arm64 Compiling\ Placard+Constraints.swift /Users/admin/builder/spi-builder-workspace/Sources/Placard/Placard+Constraints.swift (in target 'Placard' from project 'Placard')
SwiftCompile normal arm64 /Users/admin/builder/spi-builder-workspace/Sources/Placard/Placard+Constraints.swift (in target 'Placard' from project 'Placard')
    cd /Users/admin/builder/spi-builder-workspace/.swiftpm/xcode

SwiftEmitModule normal arm64 Emitting\ module\ for\ Placard (in target 'Placard' from project 'Placard')
Failed frontend command:
/Applications/Xcode-16.3.0.app/Contents/Developer/Toolchains/XcodeDefault.xctoolchain/usr/bin/swift-frontend -frontend -emit-module -experimental-skip-non-inlinable-function-bodies-without-types /Users/admin/builder/spi-builder-workspace/Sources/Placard/Placard+Constraints.swift /Users/admin/builder/spi-builder-workspace/Sources/Placard/Placard+DeviceOrientation.swift /Users/admin/builder/spi-builder-workspace/Sources/Placard/Placard+Layout.swift /Users/admin/builder/spi-builder-workspace/Sources/Placard/Placard.swift /Users/admin/builder/spi-builder-workspace/Sources/Placard/PlacardConfig.swift /Users/admin/builder/spi-builder-workspace/Sources/Placard/PlacardView.swift /Users/admin/builder/spi-builder-workspace/Sources/Placard/UIView+Animations.swift -target arm64-apple-tvos17.0 -Xllvm -aarch64-use-tbi -enable-objc-interop -stack-check -sdk /Applications/Xcode-16.3.0.app/Contents/Developer/Platforms/AppleTVOS.platform/Developer/SDKs/AppleTVOS18.4.sdk -I /Users/admin/builder/spi-builder-workspace/.derivedData/Build/Products/Debug-appletvos -I /Applications/Xcode-16.3.0.app/Contents/Developer/Platforms/AppleTVOS.platform/Developer/usr/lib -F /Users/admin/builder/spi-builder-workspace/.derivedData/Build/Products/Debug-appletvos -F /Applications/Xcode-16.3.0.app/Contents/Developer/Platforms/AppleTVOS.platform/Developer/Library/Frameworks -F /Applications/Xcode-16.3.0.app/Contents/Developer/Platforms/AppleTVOS.platform/Developer/SDKs/AppleTVOS18.4.sdk/Developer/Library/Frameworks -no-color-diagnostics -enable-testing -g -debug-info-format\=dwarf -dwarf-version\=4 -module-cache-path /Users/admin/builder/spi-builder-workspace/.derivedData/ModuleCache.noindex -swift-version 5 -enforce-exclusivity\=checked -Onone -D SWIFT_PACKAGE -D DEBUG -D Xcode -serialize-debugging-options -const-gather-protocols-file /Users/admin/builder/spi-builder-workspace/.derivedData/Build/Intermediates.noindex/Placard.build/Debug-appletvos/Placard.build/Objects-normal/arm64/Placard_const_extract_protocols.json -enable-experimental-feature DebugDescriptionMacro -empty-abi-descriptor -plugin-path /Applications/Xcode-16.3.0.app/Contents/Developer/Toolchains/XcodeDefault.xctoolchain/usr/lib/swift/host/plugins/testing -validate-clang-modules-once -clang-build-session-file /Users/admin/builder/spi-builder-workspace/.derivedData/ModuleCache.noindex/Session.modulevalidation -Xcc -working-directory -Xcc /Users/admin/builder/spi-builder-workspace/.swiftpm/xcode -resource-dir /Applications/Xcode-16.3.0.app/Contents/Developer/Toolchains/XcodeDefault.xctoolchain/usr/lib/swift -enable-anonymous-context-mangled-names -file-compilation-dir /Users/admin/builder/spi-builder-workspace/.swiftpm/xcode -Xcc -ivfsstatcache -Xcc /Users/admin/builder/spi-builder-workspace/.derivedData/SDKStatCaches.noindex/appletvos18.4-22L251-271d326055c85f9856fa135c41255102.sdkstatcache -Xcc -I/Users/admin/builder/spi-builder-workspace/.derivedData/Build/Intermediates.noindex/Placard.build/Debug-appletvos/Placard.build/swift-overrides.hmap -Xcc -I/Users/admin/builder/spi-builder-workspace/.derivedData/Build/Products/Debug-appletvos/include -Xcc -I/Users/admin/builder/spi-builder-workspace/.derivedData/Build/Intermediates.noindex/Placard.build/Debug-appletvos/Placard.build/DerivedSources-normal/arm64 -Xcc -I/Users/admin/builder/spi-builder-workspace/.derivedData/Build/Intermediates.noindex/Placard.build/Debug-appletvos/Placard.build/DerivedSources/arm64 -Xcc -I/Users/admin/builder/spi-builder-workspace/.derivedData/Build/Intermediates.noindex/Placard.build/Debug-appletvos/Placard.build/DerivedSources -Xcc -DSWIFT_PACKAGE -Xcc -DDEBUG\=1 -module-name Placard -package-name spi_builder_workspace -frontend-parseable-output -disable-clang-spi -target-sdk-version 18.4 -target-sdk-name appletvos18.4 -external-plugin-path /Applications/Xcode-16.3.0.app/Contents/Developer/Platforms/AppleTVOS.platform/Developer/usr/lib/swift/host/plugins\#/Applications/Xcode-16.3.0.app/Contents/Developer/Platforms/AppleTVOS.platform/Developer/usr/bin/swift-plugin-server -external-plugin-path /Applications/Xcode-16.3.0.app/Contents/Developer/Platforms/AppleTVOS.platform/Developer/usr/local/lib/swift/host/plugins\#/Applications/Xcode-16.3.0.app/Contents/Developer/Platforms/AppleTVOS.platform/Developer/usr/bin/swift-plugin-server -in-process-plugin-server-path /Applications/Xcode-16.3.0.app/Contents/Developer/Toolchains/XcodeDefault.xctoolchain/usr/lib/swift/host/libSwiftInProcPluginServer.dylib -plugin-path /Applications/Xcode-16.3.0.app/Contents/Developer/Toolchains/XcodeDefault.xctoolchain/usr/lib/swift/host/plugins -plugin-path /Applications/Xcode-16.3.0.app/Contents/Developer/Toolchains/XcodeDefault.xctoolchain/usr/local/lib/swift/host/plugins -emit-module-doc-path /Users/admin/builder/spi-builder-workspace/.derivedData/Build/Intermediates.noindex/Placard.build/Debug-appletvos/Placard.build/Objects-normal/arm64/Placard.swiftdoc -emit-module-source-info-path /Users/admin/builder/spi-builder-workspace/.derivedData/Build/Intermediates.noindex/Placard.build/Debug-appletvos/Placard.build/Objects-normal/arm64/Placard.swiftsourceinfo -emit-objc-header-path /Users/admin/builder/spi-builder-workspace/.derivedData/Build/Intermediates.noindex/Placard.build/Debug-appletvos/Placard.build/Objects-normal/arm64/Placard-Swift.h -serialize-diagnostics-path /Users/admin/builder/spi-builder-workspace/.derivedData/Build/Intermediates.noindex/Placard.build/Debug-appletvos/Placard.build/Objects-normal/arm64/Placard-master-emit-module.dia -emit-dependencies-path /Users/admin/builder/spi-builder-workspace/.derivedData/Build/Intermediates.noindex/Placard.build/Debug-appletvos/Placard.build/Objects-normal/arm64/Placard-master-emit-module.d -o /Users/admin/builder/spi-builder-workspace/.derivedData/Build/Intermediates.noindex/Placard.build/Debug-appletvos/Placard.build/Objects-normal/arm64/Placard.swiftmodule -emit-abi-descriptor-path /Users/admin/builder/spi-builder-workspace/.derivedData/Build/Intermediates.noindex/Placard.build/Debug-appletvos/Placard.build/Objects-normal/arm64/Placard.abi.json
EmitSwiftModule normal arm64 (in target 'Placard' from project 'Placard')
    cd /Users/admin/builder/spi-builder-workspace/.swiftpm/xcode

/Users/admin/builder/spi-builder-workspace/Sources/Placard/Placard+DeviceOrientation.swift:38:36: error: 'UIDeviceOrientation' is unavailable in tvOS
    func getDeviceOrientation() -> UIDeviceOrientation {
                                   ^~~~~~~~~~~~~~~~~~~
/Applications/Xcode-16.3.0.app/Contents/Developer/Platforms/AppleTVOS.platform/Developer/SDKs/AppleTVOS18.4.sdk/System/Library/Frameworks/UIKit.framework/Headers/UIOrientation.h:13:28: note: 'UIDeviceOrientation' has been explicitly marked unavailable here
typedef NS_ENUM(NSInteger, UIDeviceOrientation) {
                           ^
SwiftCompile normal arm64 Compiling\ PlacardView.swift /Users/admin/builder/spi-builder-workspace/Sources/Placard/PlacardView.swift (in target 'Placard' from project 'Placard')
SwiftCompile normal arm64 /Users/admin/builder/spi-builder-workspace/Sources/Placard/PlacardView.swift (in target 'Placard' from project 'Placard')
    cd /Users/admin/builder/spi-builder-workspace/.swiftpm/xcode

SwiftCompile normal arm64 Compiling\ UIView+Animations.swift /Users/admin/builder/spi-builder-workspace/Sources/Placard/UIView+Animations.swift (in target 'Placard' from project 'Placard')
SwiftCompile normal arm64 /Users/admin/builder/spi-builder-workspace/Sources/Placard/UIView+Animations.swift (in target 'Placard' from project 'Placard')
    cd /Users/admin/builder/spi-builder-workspace/.swiftpm/xcode

SwiftCompile normal arm64 Compiling\ Placard+DeviceOrientation.swift /Users/admin/builder/spi-builder-workspace/Sources/Placard/Placard+DeviceOrientation.swift (in target 'Placard' from project 'Placard')
SwiftCompile normal arm64 /Users/admin/builder/spi-builder-workspace/Sources/Placard/Placard+DeviceOrientation.swift (in target 'Placard' from project 'Placard')
    cd /Users/admin/builder/spi-builder-workspace/.swiftpm/xcode

SwiftCompile normal arm64 Compiling\ Placard+Layout.swift /Users/admin/builder/spi-builder-workspace/Sources/Placard/Placard+Layout.swift (in target 'Placard' from project 'Placard')
SwiftCompile normal arm64 /Users/admin/builder/spi-builder-workspace/Sources/Placard/Placard+Layout.swift (in target 'Placard' from project 'Placard')
    cd /Users/admin/builder/spi-builder-workspace/.swiftpm/xcode

SwiftCompile normal arm64 Compiling\ Placard.swift /Users/admin/builder/spi-builder-workspace/Sources/Placard/Placard.swift (in target 'Placard' from project 'Placard')
SwiftCompile normal arm64 /Users/admin/builder/spi-builder-workspace/Sources/Placard/Placard.swift (in target 'Placard' from project 'Placard')
    cd /Users/admin/builder/spi-builder-workspace/.swiftpm/xcode

SwiftCompile normal arm64 Compiling\ PlacardConfig.swift /Users/admin/builder/spi-builder-workspace/Sources/Placard/PlacardConfig.swift (in target 'Placard' from project 'Placard')
SwiftCompile normal arm64 /Users/admin/builder/spi-builder-workspace/Sources/Placard/PlacardConfig.swift (in target 'Placard' from project 'Placard')
    cd /Users/admin/builder/spi-builder-workspace/.swiftpm/xcode

** BUILD FAILED **
The following build commands failed:
	SwiftEmitModule normal arm64 Emitting\ module\ for\ Placard (in target 'Placard' from project 'Placard')
	EmitSwiftModule normal arm64 (in target 'Placard' from project 'Placard')
	Building workspace spi-builder-workspace with scheme Placard
(3 failures)
BUILD FAILURE 6.1 tvOS