The Swift Package Index logo.Swift Package Index

Track the adoption of Swift 6 strict concurrency checks for data race safety. How many packages are Ready for Swift 6?

Build Information

Failed to build NWWebSocket, reference main (1e545f), with Swift 6.1 for Linux on 28 Apr 2025 08:39:37 UTC.

Build Command

bash -c docker run --pull=always --rm -v "checkouts-4606859-0":/host -w "$PWD" registry.gitlab.com/finestructure/spi-images:basic-6.1-latest swift build --triple x86_64-unknown-linux-gnu 2>&1

Build Log

========================================
RunAll
========================================
Builder version: 4.61.0
Interrupt handler set up.
========================================
Checkout
========================================
Clone URL: https://github.com/pusher/NWWebSocket.git
Reference: main
Initialized empty Git repository in /host/spi-builder-workspace/.git/
hint: Using 'master' as the name for the initial branch. This default branch name
hint: is subject to change. To configure the initial branch name to use in all
hint: of your new repositories, which will suppress this warning, call:
hint:
hint: 	git config --global init.defaultBranch <name>
hint:
hint: Names commonly chosen instead of 'master' are 'main', 'trunk' and
hint: 'development'. The just-created branch can be renamed via this command:
hint:
hint: 	git branch -m <name>
From https://github.com/pusher/NWWebSocket
 * branch            main       -> FETCH_HEAD
 * [new branch]      main       -> origin/main
HEAD is now at 1e545fc Change CocoaPods secret name to PUSHER_CI_COCOAPODS_TOKEN (#49)
Cloned https://github.com/pusher/NWWebSocket.git
Revision (git rev-parse @):
1e545fcb53966272fc042aa17ae932f11239e00f
SUCCESS checkout https://github.com/pusher/NWWebSocket.git at main
========================================
Build
========================================
Selected platform:         linux
Swift version:             6.1
Building package at path:  $PWD
https://github.com/pusher/NWWebSocket.git
https://github.com/pusher/NWWebSocket.git
WARNING: environment variable SUPPRESS_SWIFT_6_FLAGS is not set
{
  "dependencies" : [
  ],
  "manifest_display_name" : "NWWebSocket",
  "name" : "NWWebSocket",
  "path" : "/host/spi-builder-workspace",
  "platforms" : [
    {
      "name" : "ios",
      "version" : "13.0"
    },
    {
      "name" : "macos",
      "version" : "10.15"
    },
    {
      "name" : "tvos",
      "version" : "13.0"
    },
    {
      "name" : "watchos",
      "version" : "6.0"
    }
  ],
  "products" : [
    {
      "name" : "NWWebSocket",
      "targets" : [
        "NWWebSocket"
      ],
      "type" : {
        "library" : [
          "automatic"
        ]
      }
    }
  ],
  "targets" : [
    {
      "c99name" : "NWWebSocketTests",
      "module_type" : "SwiftTarget",
      "name" : "NWWebSocketTests",
      "path" : "Tests/NWWebSocketTests",
      "sources" : [
        "NWWebSocketTests.swift",
        "Server/NWServerConnection.swift",
        "Server/NWWebSocketServer.swift",
        "XCTestManifests.swift"
      ],
      "target_dependencies" : [
        "NWWebSocket"
      ],
      "type" : "test"
    },
    {
      "c99name" : "NWWebSocket",
      "module_type" : "SwiftTarget",
      "name" : "NWWebSocket",
      "path" : "Sources/NWWebSocket",
      "product_memberships" : [
        "NWWebSocket"
      ],
      "sources" : [
        "Extension/NWConnection+Extension.swift",
        "Model/Client/NWWebSocket.swift",
        "Protocol/WebSocketConnection.swift"
      ],
      "type" : "library"
    }
  ],
  "tools_version" : "5.1"
}
Running build ...
bash -c docker run --pull=always --rm -v "checkouts-4606859-0":/host -w "$PWD" registry.gitlab.com/finestructure/spi-images:basic-6.1-latest swift build --triple x86_64-unknown-linux-gnu -Xswiftc -Xfrontend -Xswiftc -stats-output-dir -Xswiftc -Xfrontend -Xswiftc .stats -Xswiftc -strict-concurrency=complete -Xswiftc -enable-upcoming-feature -Xswiftc StrictConcurrency -Xswiftc -enable-upcoming-feature -Xswiftc DisableOutwardActorInference -Xswiftc -enable-upcoming-feature -Xswiftc GlobalActorIsolatedTypesUsability -Xswiftc -enable-upcoming-feature -Xswiftc InferSendableFromCaptures 2>&1
basic-6.1-latest: Pulling from finestructure/spi-images
Digest: sha256:3bdcac04179f4ed3e5b8e9dbd6e74bbf5ebc0f4fde48bbaad7d1e5c757e65bcb
Status: Image is up to date for registry.gitlab.com/finestructure/spi-images:basic-6.1-latest
Building for debugging...
[0/2] Write sources
[1/2] Write swift-version-24593BA9C3E375BF.txt
[3/6] Compiling NWWebSocket NWConnection+Extension.swift
/host/spi-builder-workspace/Sources/NWWebSocket/Extension/NWConnection+Extension.swift:1:8: error: no such module 'Network'
 1 | import Network
   |        `- error: no such module 'Network'
 2 |
 3 | fileprivate var _intentionalDisconnection: Bool = false
error: emit-module command failed with exit code 1 (use -v to see invocation)
[4/6] Emitting module NWWebSocket
/host/spi-builder-workspace/Sources/NWWebSocket/Extension/NWConnection+Extension.swift:1:8: error: no such module 'Network'
 1 | import Network
   |        `- error: no such module 'Network'
 2 |
 3 | fileprivate var _intentionalDisconnection: Bool = false
[5/6] Compiling NWWebSocket WebSocketConnection.swift
/host/spi-builder-workspace/Sources/NWWebSocket/Extension/NWConnection+Extension.swift:1:8: error: no such module 'Network'
 1 | import Network
   |        `- error: no such module 'Network'
 2 |
 3 | fileprivate var _intentionalDisconnection: Bool = false
[6/6] Compiling NWWebSocket NWWebSocket.swift
/host/spi-builder-workspace/Sources/NWWebSocket/Extension/NWConnection+Extension.swift:1:8: error: no such module 'Network'
 1 | import Network
   |        `- error: no such module 'Network'
 2 |
 3 | fileprivate var _intentionalDisconnection: Bool = false
Running build ...
bash -c docker run --pull=always --rm -v "checkouts-4606859-0":/host -w "$PWD" registry.gitlab.com/finestructure/spi-images:basic-6.1-latest swift build --triple x86_64-unknown-linux-gnu 2>&1
basic-6.1-latest: Pulling from finestructure/spi-images
Digest: sha256:3bdcac04179f4ed3e5b8e9dbd6e74bbf5ebc0f4fde48bbaad7d1e5c757e65bcb
Status: Image is up to date for registry.gitlab.com/finestructure/spi-images:basic-6.1-latest
[0/1] Planning build
Building for debugging...
[0/1] Write swift-version-24593BA9C3E375BF.txt
error: emit-module command failed with exit code 1 (use -v to see invocation)
[2/5] Emitting module NWWebSocket
/host/spi-builder-workspace/Sources/NWWebSocket/Extension/NWConnection+Extension.swift:1:8: error: no such module 'Network'
 1 | import Network
   |        `- error: no such module 'Network'
 2 |
 3 | fileprivate var _intentionalDisconnection: Bool = false
[3/5] Compiling NWWebSocket NWWebSocket.swift
/host/spi-builder-workspace/Sources/NWWebSocket/Extension/NWConnection+Extension.swift:1:8: error: no such module 'Network'
 1 | import Network
   |        `- error: no such module 'Network'
 2 |
 3 | fileprivate var _intentionalDisconnection: Bool = false
[4/5] Compiling NWWebSocket WebSocketConnection.swift
/host/spi-builder-workspace/Sources/NWWebSocket/Extension/NWConnection+Extension.swift:1:8: error: no such module 'Network'
 1 | import Network
   |        `- error: no such module 'Network'
 2 |
 3 | fileprivate var _intentionalDisconnection: Bool = false
[5/5] Compiling NWWebSocket NWConnection+Extension.swift
/host/spi-builder-workspace/Sources/NWWebSocket/Extension/NWConnection+Extension.swift:1:8: error: no such module 'Network'
 1 | import Network
   |        `- error: no such module 'Network'
 2 |
 3 | fileprivate var _intentionalDisconnection: Bool = false
BUILD FAILURE 6.1 linux