Build Information
Failed to build SwiftTrace, reference 8.6.1 (589f37
), with Swift 6.1 for macOS (Xcode) using Xcode 16.3 on 29 Apr 2025 00:08:17 UTC.
Build Command
env DEVELOPER_DIR=/Applications/Xcode-16.3.0.app xcrun xcodebuild -IDEClonedSourcePackagesDirPathOverride=$PWD/.dependencies -skipMacroValidation -skipPackagePluginValidation -derivedDataPath $PWD/.derivedData build -scheme SwiftTrace-Package -destination platform=macOS,arch=arm64
Build Log
PrecompileModule /Users/admin/builder/spi-builder-workspace/.derivedData/Build/Intermediates.noindex/ExplicitPrecompiledModules/_wctype-7ZL5DYY8P34VLTQMKO86RFLMT.scan
cd /Users/admin/builder/spi-builder-workspace/.swiftpm/xcode
builtin-precompileModule /Users/admin/builder/spi-builder-workspace/.derivedData/Build/Intermediates.noindex/ExplicitPrecompiledModules/_wctype-7ZL5DYY8P34VLTQMKO86RFLMT.scan
PrecompileModule /Users/admin/builder/spi-builder-workspace/.derivedData/Build/Intermediates.noindex/ExplicitPrecompiledModules/_strings-X9B4MPXOKKUVMY37E2S42XV8.scan
cd /Users/admin/builder/spi-builder-workspace/.swiftpm/xcode
builtin-precompileModule /Users/admin/builder/spi-builder-workspace/.derivedData/Build/Intermediates.noindex/ExplicitPrecompiledModules/_strings-X9B4MPXOKKUVMY37E2S42XV8.scan
PrecompileModule /Users/admin/builder/spi-builder-workspace/.derivedData/Build/Intermediates.noindex/ExplicitPrecompiledModules/_locale-BBDV30BNI12J01ILFZYD8TUFU.scan
cd /Users/admin/builder/spi-builder-workspace/.swiftpm/xcode
builtin-precompileModule /Users/admin/builder/spi-builder-workspace/.derivedData/Build/Intermediates.noindex/ExplicitPrecompiledModules/_locale-BBDV30BNI12J01ILFZYD8TUFU.scan
PrecompileModule /Users/admin/builder/spi-builder-workspace/.derivedData/Build/Intermediates.noindex/ExplicitPrecompiledModules/sys_types-5KC597ZMYRHPIB6WFQGD4NZEN.scan
cd /Users/admin/builder/spi-builder-workspace/.swiftpm/xcode
builtin-precompileModule /Users/admin/builder/spi-builder-workspace/.derivedData/Build/Intermediates.noindex/ExplicitPrecompiledModules/sys_types-5KC597ZMYRHPIB6WFQGD4NZEN.scan
PrecompileModule /Users/admin/builder/spi-builder-workspace/.derivedData/Build/Intermediates.noindex/ExplicitPrecompiledModules/xlocale-4U3SHGOSYLPDUVLQ5U0AUZRAY.scan
cd /Users/admin/builder/spi-builder-workspace/.swiftpm/xcode
builtin-precompileModule /Users/admin/builder/spi-builder-workspace/.derivedData/Build/Intermediates.noindex/ExplicitPrecompiledModules/xlocale-4U3SHGOSYLPDUVLQ5U0AUZRAY.scan
PrecompileModule /Users/admin/builder/spi-builder-workspace/.derivedData/Build/Intermediates.noindex/ExplicitPrecompiledModules/nl_types-E3675O00R8HMKBUPDAT1L6YYD.scan
cd /Users/admin/builder/spi-builder-workspace/.swiftpm/xcode
builtin-precompileModule /Users/admin/builder/spi-builder-workspace/.derivedData/Build/Intermediates.noindex/ExplicitPrecompiledModules/nl_types-E3675O00R8HMKBUPDAT1L6YYD.scan
PrecompileModule /Users/admin/builder/spi-builder-workspace/.derivedData/Build/Intermediates.noindex/ExplicitPrecompiledModules/_time-4J346L3XXEH4VOFHYVD9BP3E8.scan
cd /Users/admin/builder/spi-builder-workspace/.swiftpm/xcode
builtin-precompileModule /Users/admin/builder/spi-builder-workspace/.derivedData/Build/Intermediates.noindex/ExplicitPrecompiledModules/_time-4J346L3XXEH4VOFHYVD9BP3E8.scan
PrecompileModule /Users/admin/builder/spi-builder-workspace/.derivedData/Build/Intermediates.noindex/ExplicitPrecompiledModules/TargetConditionals-EUX6C4YMWTU2CF613SPIIUA7U.scan
cd /Users/admin/builder/spi-builder-workspace/.swiftpm/xcode
builtin-precompileModule /Users/admin/builder/spi-builder-workspace/.derivedData/Build/Intermediates.noindex/ExplicitPrecompiledModules/TargetConditionals-EUX6C4YMWTU2CF613SPIIUA7U.scan
PrecompileModule /Users/admin/builder/spi-builder-workspace/.derivedData/Build/Intermediates.noindex/ExplicitPrecompiledModules/gethostuuid-94CCV7PU0J71P7G89BWTU3VGL.scan
cd /Users/admin/builder/spi-builder-workspace/.swiftpm/xcode
builtin-precompileModule /Users/admin/builder/spi-builder-workspace/.derivedData/Build/Intermediates.noindex/ExplicitPrecompiledModules/gethostuuid-94CCV7PU0J71P7G89BWTU3VGL.scan
PrecompileModule /Users/admin/builder/spi-builder-workspace/.derivedData/Build/Intermediates.noindex/ExplicitPrecompiledModules/sys_time-7UEE2RD1DO77WDL31DERH3L37.scan
cd /Users/admin/builder/spi-builder-workspace/.swiftpm/xcode
builtin-precompileModule /Users/admin/builder/spi-builder-workspace/.derivedData/Build/Intermediates.noindex/ExplicitPrecompiledModules/sys_time-7UEE2RD1DO77WDL31DERH3L37.scan
PrecompileModule /Users/admin/builder/spi-builder-workspace/.derivedData/Build/Intermediates.noindex/ExplicitPrecompiledModules/AvailabilityMacros-6VF0ASEDFGPOQMV7TUZS2PPDM.scan
cd /Users/admin/builder/spi-builder-workspace/.swiftpm/xcode
builtin-precompileModule /Users/admin/builder/spi-builder-workspace/.derivedData/Build/Intermediates.noindex/ExplicitPrecompiledModules/AvailabilityMacros-6VF0ASEDFGPOQMV7TUZS2PPDM.scan
PrecompileModule /Users/admin/builder/spi-builder-workspace/.derivedData/Build/Intermediates.noindex/ExplicitPrecompiledModules/_string-2GHKCTFVP75PDG54LL2GQA6N6.scan
cd /Users/admin/builder/spi-builder-workspace/.swiftpm/xcode
builtin-precompileModule /Users/admin/builder/spi-builder-workspace/.derivedData/Build/Intermediates.noindex/ExplicitPrecompiledModules/_string-2GHKCTFVP75PDG54LL2GQA6N6.scan
PrecompileModule /Users/admin/builder/spi-builder-workspace/.derivedData/Build/Intermediates.noindex/ExplicitPrecompiledModules/mach-38SEVOE1DCX375MV35EBXTLX6.scan
cd /Users/admin/builder/spi-builder-workspace/.swiftpm/xcode
builtin-precompileModule /Users/admin/builder/spi-builder-workspace/.derivedData/Build/Intermediates.noindex/ExplicitPrecompiledModules/mach-38SEVOE1DCX375MV35EBXTLX6.scan
PrecompileModule /Users/admin/builder/spi-builder-workspace/.derivedData/Build/Intermediates.noindex/ExplicitPrecompiledModules/_Builtin_float-1U8P5J8BRL0FMZ8ZJCJ0Y025.scan
cd /Users/admin/builder/spi-builder-workspace/.swiftpm/xcode
builtin-precompileModule /Users/admin/builder/spi-builder-workspace/.derivedData/Build/Intermediates.noindex/ExplicitPrecompiledModules/_Builtin_float-1U8P5J8BRL0FMZ8ZJCJ0Y025.scan
PrecompileModule /Users/admin/builder/spi-builder-workspace/.derivedData/Build/Intermediates.noindex/ExplicitPrecompiledModules/_signal-9BSIWDRP7VT0YLFSH85XLJ41D.scan
cd /Users/admin/builder/spi-builder-workspace/.swiftpm/xcode
builtin-precompileModule /Users/admin/builder/spi-builder-workspace/.derivedData/Build/Intermediates.noindex/ExplicitPrecompiledModules/_signal-9BSIWDRP7VT0YLFSH85XLJ41D.scan
PrecompileModule /Users/admin/builder/spi-builder-workspace/.derivedData/Build/Intermediates.noindex/ExplicitPrecompiledModules/os_availability-6JKKVIMP36T16421CM173RK71.scan
cd /Users/admin/builder/spi-builder-workspace/.swiftpm/xcode
builtin-precompileModule /Users/admin/builder/spi-builder-workspace/.derivedData/Build/Intermediates.noindex/ExplicitPrecompiledModules/os_availability-6JKKVIMP36T16421CM173RK71.scan
PrecompileModule /Users/admin/builder/spi-builder-workspace/.derivedData/Build/Intermediates.noindex/ExplicitPrecompiledModules/pthread-3BZ1DW4VC6BT79N9BGU2E6UHZ.scan
cd /Users/admin/builder/spi-builder-workspace/.swiftpm/xcode
builtin-precompileModule /Users/admin/builder/spi-builder-workspace/.derivedData/Build/Intermediates.noindex/ExplicitPrecompiledModules/pthread-3BZ1DW4VC6BT79N9BGU2E6UHZ.scan
PrecompileModule /Users/admin/builder/spi-builder-workspace/.derivedData/Build/Intermediates.noindex/ExplicitPrecompiledModules/DarwinFoundation-7K01H3NXA163FQT0CKS0VLLYA.scan
cd /Users/admin/builder/spi-builder-workspace/.swiftpm/xcode
builtin-precompileModule /Users/admin/builder/spi-builder-workspace/.derivedData/Build/Intermediates.noindex/ExplicitPrecompiledModules/DarwinFoundation-7K01H3NXA163FQT0CKS0VLLYA.scan
PrecompileModule /Users/admin/builder/spi-builder-workspace/.derivedData/Build/Intermediates.noindex/ExplicitPrecompiledModules/AvailabilityMacros-XNF2SKKROZAO9P0FFOKDASO2.scan
cd /Users/admin/builder/spi-builder-workspace/.swiftpm/xcode
builtin-precompileModule /Users/admin/builder/spi-builder-workspace/.derivedData/Build/Intermediates.noindex/ExplicitPrecompiledModules/AvailabilityMacros-XNF2SKKROZAO9P0FFOKDASO2.scan
PrecompileModule /Users/admin/builder/spi-builder-workspace/.derivedData/Build/Intermediates.noindex/ExplicitPrecompiledModules/_useconds_t-2RGO7S4JBHD65BDZEHE1Q27EF.scan
cd /Users/admin/builder/spi-builder-workspace/.swiftpm/xcode
builtin-precompileModule /Users/admin/builder/spi-builder-workspace/.derivedData/Build/Intermediates.noindex/ExplicitPrecompiledModules/_useconds_t-2RGO7S4JBHD65BDZEHE1Q27EF.scan
PrecompileModule /Users/admin/builder/spi-builder-workspace/.derivedData/Build/Intermediates.noindex/ExplicitPrecompiledModules/mach-3QI4T9P7Y69E0FI38QI2S8NZC.scan
cd /Users/admin/builder/spi-builder-workspace/.swiftpm/xcode
builtin-precompileModule /Users/admin/builder/spi-builder-workspace/.derivedData/Build/Intermediates.noindex/ExplicitPrecompiledModules/mach-3QI4T9P7Y69E0FI38QI2S8NZC.scan
PrecompileModule /Users/admin/builder/spi-builder-workspace/.derivedData/Build/Intermediates.noindex/ExplicitPrecompiledModules/_locale-1RIS2BGUZL94CISHUW4ST05GX.scan
cd /Users/admin/builder/spi-builder-workspace/.swiftpm/xcode
builtin-precompileModule /Users/admin/builder/spi-builder-workspace/.derivedData/Build/Intermediates.noindex/ExplicitPrecompiledModules/_locale-1RIS2BGUZL94CISHUW4ST05GX.scan
PrecompileModule /Users/admin/builder/spi-builder-workspace/.derivedData/Build/Intermediates.noindex/ExplicitPrecompiledModules/_assert-63J1ZVO9NG3SXBZWPHGPNZPJS.scan
cd /Users/admin/builder/spi-builder-workspace/.swiftpm/xcode
builtin-precompileModule /Users/admin/builder/spi-builder-workspace/.derivedData/Build/Intermediates.noindex/ExplicitPrecompiledModules/_assert-63J1ZVO9NG3SXBZWPHGPNZPJS.scan
PrecompileModule /Users/admin/builder/spi-builder-workspace/.derivedData/Build/Intermediates.noindex/ExplicitPrecompiledModules/_strings-5EFLIP89Z30QYOJAPKBD3KNJT.scan
cd /Users/admin/builder/spi-builder-workspace/.swiftpm/xcode
builtin-precompileModule /Users/admin/builder/spi-builder-workspace/.derivedData/Build/Intermediates.noindex/ExplicitPrecompiledModules/_strings-5EFLIP89Z30QYOJAPKBD3KNJT.scan
PrecompileModule /Users/admin/builder/spi-builder-workspace/.derivedData/Build/Intermediates.noindex/ExplicitPrecompiledModules/uuid-78V5HLXVR2P19TVUCZ36ZNB0T.scan
cd /Users/admin/builder/spi-builder-workspace/.swiftpm/xcode
builtin-precompileModule /Users/admin/builder/spi-builder-workspace/.derivedData/Build/Intermediates.noindex/ExplicitPrecompiledModules/uuid-78V5HLXVR2P19TVUCZ36ZNB0T.scan
PrecompileModule /Users/admin/builder/spi-builder-workspace/.derivedData/Build/Intermediates.noindex/ExplicitPrecompiledModules/_complex-CIN05U62JCWKL1CF7JG5QBWIJ.scan
cd /Users/admin/builder/spi-builder-workspace/.swiftpm/xcode
builtin-precompileModule /Users/admin/builder/spi-builder-workspace/.derivedData/Build/Intermediates.noindex/ExplicitPrecompiledModules/_complex-CIN05U62JCWKL1CF7JG5QBWIJ.scan
PrecompileModule /Users/admin/builder/spi-builder-workspace/.derivedData/Build/Intermediates.noindex/ExplicitPrecompiledModules/_math-BHZM6Z2JZUQI7WR4FJKJ0RZK6.scan
cd /Users/admin/builder/spi-builder-workspace/.swiftpm/xcode
builtin-precompileModule /Users/admin/builder/spi-builder-workspace/.derivedData/Build/Intermediates.noindex/ExplicitPrecompiledModules/_math-BHZM6Z2JZUQI7WR4FJKJ0RZK6.scan
PrecompileModule /Users/admin/builder/spi-builder-workspace/.derivedData/Build/Intermediates.noindex/ExplicitPrecompiledModules/_setjmp-1BBH79QAHR320S23DQJM0FPII.scan
cd /Users/admin/builder/spi-builder-workspace/.swiftpm/xcode
builtin-precompileModule /Users/admin/builder/spi-builder-workspace/.derivedData/Build/Intermediates.noindex/ExplicitPrecompiledModules/_setjmp-1BBH79QAHR320S23DQJM0FPII.scan
PrecompileModule /Users/admin/builder/spi-builder-workspace/.derivedData/Build/Intermediates.noindex/ExplicitPrecompiledModules/_tgmath-BCE8UWUU3LTCXIVTF9WP2IO7B.scan
cd /Users/admin/builder/spi-builder-workspace/.swiftpm/xcode
builtin-precompileModule /Users/admin/builder/spi-builder-workspace/.derivedData/Build/Intermediates.noindex/ExplicitPrecompiledModules/_tgmath-BCE8UWUU3LTCXIVTF9WP2IO7B.scan
PrecompileModule /Users/admin/builder/spi-builder-workspace/.derivedData/Build/Intermediates.noindex/ExplicitPrecompiledModules/_stdint-2ERPWHQGL4KIL5WKQDIFC698.scan
cd /Users/admin/builder/spi-builder-workspace/.swiftpm/xcode
builtin-precompileModule /Users/admin/builder/spi-builder-workspace/.derivedData/Build/Intermediates.noindex/ExplicitPrecompiledModules/_stdint-2ERPWHQGL4KIL5WKQDIFC698.scan
PrecompileModule /Users/admin/builder/spi-builder-workspace/.derivedData/Build/Intermediates.noindex/ExplicitPrecompiledModules/netinet_in-51CAHN7ETJV241FZL3ZE6967X.scan
cd /Users/admin/builder/spi-builder-workspace/.swiftpm/xcode
builtin-precompileModule /Users/admin/builder/spi-builder-workspace/.derivedData/Build/Intermediates.noindex/ExplicitPrecompiledModules/netinet_in-51CAHN7ETJV241FZL3ZE6967X.scan
PrecompileModule /Users/admin/builder/spi-builder-workspace/.derivedData/Build/Intermediates.noindex/ExplicitPrecompiledModules/_limits-EJHWN4ODK4NM8BIJBHQ2KOU74.scan
cd /Users/admin/builder/spi-builder-workspace/.swiftpm/xcode
builtin-precompileModule /Users/admin/builder/spi-builder-workspace/.derivedData/Build/Intermediates.noindex/ExplicitPrecompiledModules/_limits-EJHWN4ODK4NM8BIJBHQ2KOU74.scan
PrecompileModule /Users/admin/builder/spi-builder-workspace/.derivedData/Build/Intermediates.noindex/ExplicitPrecompiledModules/alloca-A3UU0GL5DAUM4AB2EM6RIQMDQ.scan
cd /Users/admin/builder/spi-builder-workspace/.swiftpm/xcode
builtin-precompileModule /Users/admin/builder/spi-builder-workspace/.derivedData/Build/Intermediates.noindex/ExplicitPrecompiledModules/alloca-A3UU0GL5DAUM4AB2EM6RIQMDQ.scan
PrecompileModule /Users/admin/builder/spi-builder-workspace/.derivedData/Build/Intermediates.noindex/ExplicitPrecompiledModules/_Builtin_limits-6C6E68ZHFO29JE4GAYLR5URF3.scan
cd /Users/admin/builder/spi-builder-workspace/.swiftpm/xcode
builtin-precompileModule /Users/admin/builder/spi-builder-workspace/.derivedData/Build/Intermediates.noindex/ExplicitPrecompiledModules/_Builtin_limits-6C6E68ZHFO29JE4GAYLR5URF3.scan
PrecompileModule /Users/admin/builder/spi-builder-workspace/.derivedData/Build/Intermediates.noindex/ExplicitPrecompiledModules/_Builtin_stdint-70JXDRWTOXIS7N4CC659TT62.scan
cd /Users/admin/builder/spi-builder-workspace/.swiftpm/xcode
builtin-precompileModule /Users/admin/builder/spi-builder-workspace/.derivedData/Build/Intermediates.noindex/ExplicitPrecompiledModules/_Builtin_stdint-70JXDRWTOXIS7N4CC659TT62.scan
PrecompileModule /Users/admin/builder/spi-builder-workspace/.derivedData/Build/Intermediates.noindex/ExplicitPrecompiledModules/runetype-C2LGSW529EDFFUEYLZEGHWYD0.scan
cd /Users/admin/builder/spi-builder-workspace/.swiftpm/xcode
builtin-precompileModule /Users/admin/builder/spi-builder-workspace/.derivedData/Build/Intermediates.noindex/ExplicitPrecompiledModules/runetype-C2LGSW529EDFFUEYLZEGHWYD0.scan
PrecompileModule /Users/admin/builder/spi-builder-workspace/.derivedData/Build/Intermediates.noindex/ExplicitPrecompiledModules/_Builtin_tgmath-3K3TBPKCEZ501BS22XP5WMRPX.scan
cd /Users/admin/builder/spi-builder-workspace/.swiftpm/xcode
builtin-precompileModule /Users/admin/builder/spi-builder-workspace/.derivedData/Build/Intermediates.noindex/ExplicitPrecompiledModules/_Builtin_tgmath-3K3TBPKCEZ501BS22XP5WMRPX.scan
PrecompileModule /Users/admin/builder/spi-builder-workspace/.derivedData/Build/Intermediates.noindex/ExplicitPrecompiledModules/_ctype-D7ZL4FG6IC1Y3GAMDR83TK3UX.scan
cd /Users/admin/builder/spi-builder-workspace/.swiftpm/xcode
builtin-precompileModule /Users/admin/builder/spi-builder-workspace/.derivedData/Build/Intermediates.noindex/ExplicitPrecompiledModules/_ctype-D7ZL4FG6IC1Y3GAMDR83TK3UX.scan
PrecompileModule /Users/admin/builder/spi-builder-workspace/.derivedData/Build/Intermediates.noindex/ExplicitPrecompiledModules/_Builtin_stdatomic-3SDG6EFB2CZW1YI6B42RK9L3P.scan
cd /Users/admin/builder/spi-builder-workspace/.swiftpm/xcode
builtin-precompileModule /Users/admin/builder/spi-builder-workspace/.derivedData/Build/Intermediates.noindex/ExplicitPrecompiledModules/_Builtin_stdatomic-3SDG6EFB2CZW1YI6B42RK9L3P.scan
PrecompileModule /Users/admin/builder/spi-builder-workspace/.derivedData/Build/Intermediates.noindex/ExplicitPrecompiledModules/__wctype-CLQMM642E5O3IHCGCZFAY5880.scan
cd /Users/admin/builder/spi-builder-workspace/.swiftpm/xcode
builtin-precompileModule /Users/admin/builder/spi-builder-workspace/.derivedData/Build/Intermediates.noindex/ExplicitPrecompiledModules/__wctype-CLQMM642E5O3IHCGCZFAY5880.scan
PrecompileModule /Users/admin/builder/spi-builder-workspace/.derivedData/Build/Intermediates.noindex/ExplicitPrecompiledModules/_sys_select-392AMN978KR0ZN2NTUOAISIA.scan
cd /Users/admin/builder/spi-builder-workspace/.swiftpm/xcode
builtin-precompileModule /Users/admin/builder/spi-builder-workspace/.derivedData/Build/Intermediates.noindex/ExplicitPrecompiledModules/_sys_select-392AMN978KR0ZN2NTUOAISIA.scan
PrecompileModule /Users/admin/builder/spi-builder-workspace/.derivedData/Build/Intermediates.noindex/ExplicitPrecompiledModules/_inttypes-4L8CF2VS7G6OLVJOK5J3J16B2.scan
cd /Users/admin/builder/spi-builder-workspace/.swiftpm/xcode
builtin-precompileModule /Users/admin/builder/spi-builder-workspace/.derivedData/Build/Intermediates.noindex/ExplicitPrecompiledModules/_inttypes-4L8CF2VS7G6OLVJOK5J3J16B2.scan
PrecompileModule /Users/admin/builder/spi-builder-workspace/.derivedData/Build/Intermediates.noindex/ExplicitPrecompiledModules/sys_time-7G0D0ENFTFABBUF51JZ1CXGP9.scan
cd /Users/admin/builder/spi-builder-workspace/.swiftpm/xcode
builtin-precompileModule /Users/admin/builder/spi-builder-workspace/.derivedData/Build/Intermediates.noindex/ExplicitPrecompiledModules/sys_time-7G0D0ENFTFABBUF51JZ1CXGP9.scan
PrecompileModule /Users/admin/builder/spi-builder-workspace/.derivedData/Build/Intermediates.noindex/ExplicitPrecompiledModules/_Builtin_inttypes-56V376QLAHF1JSA78M0TDSS0T.scan
cd /Users/admin/builder/spi-builder-workspace/.swiftpm/xcode
builtin-precompileModule /Users/admin/builder/spi-builder-workspace/.derivedData/Build/Intermediates.noindex/ExplicitPrecompiledModules/_Builtin_inttypes-56V376QLAHF1JSA78M0TDSS0T.scan
PrecompileModule /Users/admin/builder/spi-builder-workspace/.derivedData/Build/Intermediates.noindex/ExplicitPrecompiledModules/_errno-98UJ7F96E9OVAKIZ8GCVQCABW.scan
cd /Users/admin/builder/spi-builder-workspace/.swiftpm/xcode
builtin-precompileModule /Users/admin/builder/spi-builder-workspace/.derivedData/Build/Intermediates.noindex/ExplicitPrecompiledModules/_errno-98UJ7F96E9OVAKIZ8GCVQCABW.scan
PrecompileModule /Users/admin/builder/spi-builder-workspace/.derivedData/Build/Intermediates.noindex/ExplicitPrecompiledModules/xlocale-EP9TKROP2T2IUIS19YTC6EOKH.scan
cd /Users/admin/builder/spi-builder-workspace/.swiftpm/xcode
builtin-precompileModule /Users/admin/builder/spi-builder-workspace/.derivedData/Build/Intermediates.noindex/ExplicitPrecompiledModules/xlocale-EP9TKROP2T2IUIS19YTC6EOKH.scan
PrecompileModule /Users/admin/builder/spi-builder-workspace/.derivedData/Build/Intermediates.noindex/ExplicitPrecompiledModules/sys_types-8S6V8DQOMI4LV44HLASLM3EML.scan
cd /Users/admin/builder/spi-builder-workspace/.swiftpm/xcode
builtin-precompileModule /Users/admin/builder/spi-builder-workspace/.derivedData/Build/Intermediates.noindex/ExplicitPrecompiledModules/sys_types-8S6V8DQOMI4LV44HLASLM3EML.scan
PrecompileModule /Users/admin/builder/spi-builder-workspace/.derivedData/Build/Intermediates.noindex/ExplicitPrecompiledModules/_wctype-EA1MU8FKTO0HTGIF4KRAYXE40.scan
cd /Users/admin/builder/spi-builder-workspace/.swiftpm/xcode
builtin-precompileModule /Users/admin/builder/spi-builder-workspace/.derivedData/Build/Intermediates.noindex/ExplicitPrecompiledModules/_wctype-EA1MU8FKTO0HTGIF4KRAYXE40.scan
PrecompileModule /Users/admin/builder/spi-builder-workspace/.derivedData/Build/Intermediates.noindex/ExplicitPrecompiledModules/_stdio-3PHSS1VU2P9O6GMDFOIGYSO0H.scan
cd /Users/admin/builder/spi-builder-workspace/.swiftpm/xcode
builtin-precompileModule /Users/admin/builder/spi-builder-workspace/.derivedData/Build/Intermediates.noindex/ExplicitPrecompiledModules/_stdio-3PHSS1VU2P9O6GMDFOIGYSO0H.scan
PrecompileModule /Users/admin/builder/spi-builder-workspace/.derivedData/Build/Intermediates.noindex/ExplicitPrecompiledModules/sys_resource-21ZQ93KPA7SYOH6822MTGWS88.scan
cd /Users/admin/builder/spi-builder-workspace/.swiftpm/xcode
builtin-precompileModule /Users/admin/builder/spi-builder-workspace/.derivedData/Build/Intermediates.noindex/ExplicitPrecompiledModules/sys_resource-21ZQ93KPA7SYOH6822MTGWS88.scan
PrecompileModule /Users/admin/builder/spi-builder-workspace/.derivedData/Build/Intermediates.noindex/ExplicitPrecompiledModules/_signal-MX4KB38X6HSA16VDL23YA6CW.scan
cd /Users/admin/builder/spi-builder-workspace/.swiftpm/xcode
builtin-precompileModule /Users/admin/builder/spi-builder-workspace/.derivedData/Build/Intermediates.noindex/ExplicitPrecompiledModules/_signal-MX4KB38X6HSA16VDL23YA6CW.scan
PrecompileModule /Users/admin/builder/spi-builder-workspace/.derivedData/Build/Intermediates.noindex/ExplicitPrecompiledModules/_time-BCHP08DXCUCI175I2OUFXR4TE.scan
cd /Users/admin/builder/spi-builder-workspace/.swiftpm/xcode
builtin-precompileModule /Users/admin/builder/spi-builder-workspace/.derivedData/Build/Intermediates.noindex/ExplicitPrecompiledModules/_time-BCHP08DXCUCI175I2OUFXR4TE.scan
PrecompileModule /Users/admin/builder/spi-builder-workspace/.derivedData/Build/Intermediates.noindex/ExplicitPrecompiledModules/sys_wait-DHR399PRBL9L1LRC24VZMUHBJ.scan
cd /Users/admin/builder/spi-builder-workspace/.swiftpm/xcode
builtin-precompileModule /Users/admin/builder/spi-builder-workspace/.derivedData/Build/Intermediates.noindex/ExplicitPrecompiledModules/sys_wait-DHR399PRBL9L1LRC24VZMUHBJ.scan
PrecompileModule /Users/admin/builder/spi-builder-workspace/.derivedData/Build/Intermediates.noindex/ExplicitPrecompiledModules/gethostuuid-6PFNIVVB3QX4OOHYTDZFK8PL6.scan
cd /Users/admin/builder/spi-builder-workspace/.swiftpm/xcode
builtin-precompileModule /Users/admin/builder/spi-builder-workspace/.derivedData/Build/Intermediates.noindex/ExplicitPrecompiledModules/gethostuuid-6PFNIVVB3QX4OOHYTDZFK8PL6.scan
PrecompileModule /Users/admin/builder/spi-builder-workspace/.derivedData/Build/Intermediates.noindex/ExplicitPrecompiledModules/_stdlib-BYZCWF3J2RQ5O1JJWJQXJIWUZ.scan
cd /Users/admin/builder/spi-builder-workspace/.swiftpm/xcode
builtin-precompileModule /Users/admin/builder/spi-builder-workspace/.derivedData/Build/Intermediates.noindex/ExplicitPrecompiledModules/_stdlib-BYZCWF3J2RQ5O1JJWJQXJIWUZ.scan
PrecompileModule /Users/admin/builder/spi-builder-workspace/.derivedData/Build/Intermediates.noindex/ExplicitPrecompiledModules/nl_types-1158Z5MYDTZ0KLRSYCHWG6WM.scan
cd /Users/admin/builder/spi-builder-workspace/.swiftpm/xcode
builtin-precompileModule /Users/admin/builder/spi-builder-workspace/.derivedData/Build/Intermediates.noindex/ExplicitPrecompiledModules/nl_types-1158Z5MYDTZ0KLRSYCHWG6WM.scan
PrecompileModule /Users/admin/builder/spi-builder-workspace/.derivedData/Build/Intermediates.noindex/ExplicitPrecompiledModules/pthread-2RWO2P55XK6O3XUV9UBXWTRDJ.scan
cd /Users/admin/builder/spi-builder-workspace/.swiftpm/xcode
builtin-precompileModule /Users/admin/builder/spi-builder-workspace/.derivedData/Build/Intermediates.noindex/ExplicitPrecompiledModules/pthread-2RWO2P55XK6O3XUV9UBXWTRDJ.scan
PrecompileModule /Users/admin/builder/spi-builder-workspace/.derivedData/Build/Intermediates.noindex/ExplicitPrecompiledModules/sys_select-1XJEQAQI65QZSXXW1Y8V7YP8X.scan
cd /Users/admin/builder/spi-builder-workspace/.swiftpm/xcode
builtin-precompileModule /Users/admin/builder/spi-builder-workspace/.derivedData/Build/Intermediates.noindex/ExplicitPrecompiledModules/sys_select-1XJEQAQI65QZSXXW1Y8V7YP8X.scan
PrecompileModule /Users/admin/builder/spi-builder-workspace/.derivedData/Build/Intermediates.noindex/ExplicitPrecompiledModules/_string-6T3HJ42BUGIMWEI00JM6HGYFG.scan
cd /Users/admin/builder/spi-builder-workspace/.swiftpm/xcode
builtin-precompileModule /Users/admin/builder/spi-builder-workspace/.derivedData/Build/Intermediates.noindex/ExplicitPrecompiledModules/_string-6T3HJ42BUGIMWEI00JM6HGYFG.scan
PrecompileModule /Users/admin/builder/spi-builder-workspace/.derivedData/Build/Intermediates.noindex/ExplicitPrecompiledModules/unistd-7Y1OFDIKP52J7BS9XOMZCCXFT.scan
cd /Users/admin/builder/spi-builder-workspace/.swiftpm/xcode
builtin-precompileModule /Users/admin/builder/spi-builder-workspace/.derivedData/Build/Intermediates.noindex/ExplicitPrecompiledModules/unistd-7Y1OFDIKP52J7BS9XOMZCCXFT.scan
PrecompileModule /Users/admin/builder/spi-builder-workspace/.derivedData/Build/Intermediates.noindex/ExplicitPrecompiledModules/_stdio-XBCPAUDQ42P9CTD0PNXDQ3SE.scan
cd /Users/admin/builder/spi-builder-workspace/.swiftpm/xcode
builtin-precompileModule /Users/admin/builder/spi-builder-workspace/.derivedData/Build/Intermediates.noindex/ExplicitPrecompiledModules/_stdio-XBCPAUDQ42P9CTD0PNXDQ3SE.scan
PrecompileModule /Users/admin/builder/spi-builder-workspace/.derivedData/Build/Intermediates.noindex/ExplicitPrecompiledModules/_Builtin_stdint-6NEPY4UZ9AHQ2YD85XADMX164.scan
cd /Users/admin/builder/spi-builder-workspace/.swiftpm/xcode
builtin-precompileModule /Users/admin/builder/spi-builder-workspace/.derivedData/Build/Intermediates.noindex/ExplicitPrecompiledModules/_Builtin_stdint-6NEPY4UZ9AHQ2YD85XADMX164.scan
PrecompileModule /Users/admin/builder/spi-builder-workspace/.derivedData/Build/Intermediates.noindex/ExplicitPrecompiledModules/_wchar-9S076HSRS5QBSOBAXO7GXSKPC.scan
cd /Users/admin/builder/spi-builder-workspace/.swiftpm/xcode
builtin-precompileModule /Users/admin/builder/spi-builder-workspace/.derivedData/Build/Intermediates.noindex/ExplicitPrecompiledModules/_wchar-9S076HSRS5QBSOBAXO7GXSKPC.scan
PrecompileModule /Users/admin/builder/spi-builder-workspace/.derivedData/Build/Intermediates.noindex/ExplicitPrecompiledModules/_Builtin_stdatomic-5J9LWI9PAB246JS8UZ7K9TW8L.scan
cd /Users/admin/builder/spi-builder-workspace/.swiftpm/xcode
builtin-precompileModule /Users/admin/builder/spi-builder-workspace/.derivedData/Build/Intermediates.noindex/ExplicitPrecompiledModules/_Builtin_stdatomic-5J9LWI9PAB246JS8UZ7K9TW8L.scan
PrecompileModule /Users/admin/builder/spi-builder-workspace/.derivedData/Build/Intermediates.noindex/ExplicitPrecompiledModules/_inttypes-72F24TMQZ8TVGBWCZLXJRHU3Y.scan
cd /Users/admin/builder/spi-builder-workspace/.swiftpm/xcode
builtin-precompileModule /Users/admin/builder/spi-builder-workspace/.derivedData/Build/Intermediates.noindex/ExplicitPrecompiledModules/_inttypes-72F24TMQZ8TVGBWCZLXJRHU3Y.scan
PrecompileModule /Users/admin/builder/spi-builder-workspace/.derivedData/Build/Intermediates.noindex/ExplicitPrecompiledModules/sys_resource-9EKFK9S7M16U2NSX8QWSIV0TE.scan
cd /Users/admin/builder/spi-builder-workspace/.swiftpm/xcode
builtin-precompileModule /Users/admin/builder/spi-builder-workspace/.derivedData/Build/Intermediates.noindex/ExplicitPrecompiledModules/sys_resource-9EKFK9S7M16U2NSX8QWSIV0TE.scan
PrecompileModule /Users/admin/builder/spi-builder-workspace/.derivedData/Build/Intermediates.noindex/ExplicitPrecompiledModules/_Builtin_inttypes-4Z3P633PKQN9RR728ISMPGWI3.scan
cd /Users/admin/builder/spi-builder-workspace/.swiftpm/xcode
builtin-precompileModule /Users/admin/builder/spi-builder-workspace/.derivedData/Build/Intermediates.noindex/ExplicitPrecompiledModules/_Builtin_inttypes-4Z3P633PKQN9RR728ISMPGWI3.scan
PrecompileModule /Users/admin/builder/spi-builder-workspace/.derivedData/Build/Intermediates.noindex/ExplicitPrecompiledModules/sys_wait-F0ENM2Y7P9EN8S5V36HMX3SML.scan
cd /Users/admin/builder/spi-builder-workspace/.swiftpm/xcode
builtin-precompileModule /Users/admin/builder/spi-builder-workspace/.derivedData/Build/Intermediates.noindex/ExplicitPrecompiledModules/sys_wait-F0ENM2Y7P9EN8S5V36HMX3SML.scan
PrecompileModule /Users/admin/builder/spi-builder-workspace/.derivedData/Build/Intermediates.noindex/ExplicitPrecompiledModules/sys_select-8URNUOWSZIW55H7EZ30CUDORW.scan
cd /Users/admin/builder/spi-builder-workspace/.swiftpm/xcode
builtin-precompileModule /Users/admin/builder/spi-builder-workspace/.derivedData/Build/Intermediates.noindex/ExplicitPrecompiledModules/sys_select-8URNUOWSZIW55H7EZ30CUDORW.scan
PrecompileModule /Users/admin/builder/spi-builder-workspace/.derivedData/Build/Intermediates.noindex/ExplicitPrecompiledModules/_stdlib-56UP93PR5RL8KSENZMWHOPSI7.scan
cd /Users/admin/builder/spi-builder-workspace/.swiftpm/xcode
builtin-precompileModule /Users/admin/builder/spi-builder-workspace/.derivedData/Build/Intermediates.noindex/ExplicitPrecompiledModules/_stdlib-56UP93PR5RL8KSENZMWHOPSI7.scan
PrecompileModule /Users/admin/builder/spi-builder-workspace/.derivedData/Build/Intermediates.noindex/ExplicitPrecompiledModules/unistd-D792MJ3ZATJLQIW2PZ743II1T.scan
cd /Users/admin/builder/spi-builder-workspace/.swiftpm/xcode
builtin-precompileModule /Users/admin/builder/spi-builder-workspace/.derivedData/Build/Intermediates.noindex/ExplicitPrecompiledModules/unistd-D792MJ3ZATJLQIW2PZ743II1T.scan
PrecompileModule /Users/admin/builder/spi-builder-workspace/.derivedData/Build/Intermediates.noindex/ExplicitPrecompiledModules/_Builtin_limits-99PQNMCKCCPMUN3LQOFLTSK1W.scan
cd /Users/admin/builder/spi-builder-workspace/.swiftpm/xcode
builtin-precompileModule /Users/admin/builder/spi-builder-workspace/.derivedData/Build/Intermediates.noindex/ExplicitPrecompiledModules/_Builtin_limits-99PQNMCKCCPMUN3LQOFLTSK1W.scan
PrecompileModule /Users/admin/builder/spi-builder-workspace/.derivedData/Build/Intermediates.noindex/ExplicitPrecompiledModules/_wchar-AKECJ1J2J273GJLV6YNHKHH1Y.scan
cd /Users/admin/builder/spi-builder-workspace/.swiftpm/xcode
builtin-precompileModule /Users/admin/builder/spi-builder-workspace/.derivedData/Build/Intermediates.noindex/ExplicitPrecompiledModules/_wchar-AKECJ1J2J273GJLV6YNHKHH1Y.scan
PrecompileModule /Users/admin/builder/spi-builder-workspace/.derivedData/Build/Intermediates.noindex/ExplicitPrecompiledModules/_complex-963WTV01GQT402TT7JBL4NQHL.scan
cd /Users/admin/builder/spi-builder-workspace/.swiftpm/xcode
builtin-precompileModule /Users/admin/builder/spi-builder-workspace/.derivedData/Build/Intermediates.noindex/ExplicitPrecompiledModules/_complex-963WTV01GQT402TT7JBL4NQHL.scan
PrecompileModule /Users/admin/builder/spi-builder-workspace/.derivedData/Build/Intermediates.noindex/ExplicitPrecompiledModules/Darwin-7DUHOMVBVR3BC9SOWJH6OO7LD.scan
cd /Users/admin/builder/spi-builder-workspace/.swiftpm/xcode
builtin-precompileModule /Users/admin/builder/spi-builder-workspace/.derivedData/Build/Intermediates.noindex/ExplicitPrecompiledModules/Darwin-7DUHOMVBVR3BC9SOWJH6OO7LD.scan
PrecompileModule /Users/admin/builder/spi-builder-workspace/.derivedData/Build/Intermediates.noindex/ExplicitPrecompiledModules/_tgmath-4TE0ZK4F52UPFLDHYY5G75EMQ.scan
cd /Users/admin/builder/spi-builder-workspace/.swiftpm/xcode
builtin-precompileModule /Users/admin/builder/spi-builder-workspace/.derivedData/Build/Intermediates.noindex/ExplicitPrecompiledModules/_tgmath-4TE0ZK4F52UPFLDHYY5G75EMQ.scan
PrecompileModule /Users/admin/builder/spi-builder-workspace/.derivedData/Build/Intermediates.noindex/ExplicitPrecompiledModules/MachO-3B1D11U2HMV7QRRKB97Q5P2MY.scan
cd /Users/admin/builder/spi-builder-workspace/.swiftpm/xcode
builtin-precompileModule /Users/admin/builder/spi-builder-workspace/.derivedData/Build/Intermediates.noindex/ExplicitPrecompiledModules/MachO-3B1D11U2HMV7QRRKB97Q5P2MY.scan
PrecompileModule /Users/admin/builder/spi-builder-workspace/.derivedData/Build/Intermediates.noindex/ExplicitPrecompiledModules/_Builtin_tgmath-4A4QUDMTS3W2T4EZ5UQIXOHQL.scan
cd /Users/admin/builder/spi-builder-workspace/.swiftpm/xcode
builtin-precompileModule /Users/admin/builder/spi-builder-workspace/.derivedData/Build/Intermediates.noindex/ExplicitPrecompiledModules/_Builtin_tgmath-4A4QUDMTS3W2T4EZ5UQIXOHQL.scan
CompileC /Users/admin/builder/spi-builder-workspace/.derivedData/Build/Intermediates.noindex/SwiftTrace.build/Debug/SwiftTraceGuts.build/Objects-normal/arm64/fishhook.o /Users/admin/builder/spi-builder-workspace/SwiftTraceGuts/fishhook.c normal arm64 c com.apple.compilers.llvm.clang.1_0.compiler (in target 'SwiftTraceGuts' from project 'SwiftTrace')
cd /Users/admin/builder/spi-builder-workspace/.swiftpm/xcode
Using response file: /Users/admin/builder/spi-builder-workspace/.derivedData/Build/Intermediates.noindex/SwiftTrace.build/Debug/SwiftTraceGuts.build/Objects-normal/arm64/7187679823f38a2a940e0043cdf9d637-common-args.resp
/Applications/Xcode-16.3.0.app/Contents/Developer/Toolchains/XcodeDefault.xctoolchain/usr/bin/clang -x c -ivfsstatcache /Users/admin/builder/spi-builder-workspace/.derivedData/SDKStatCaches.noindex/macosx15.4-24E241-8287b8f5db97e746a1562fbca0c9d29b.sdkstatcache -fmessage-length\=0 -fdiagnostics-show-note-include-stack -fmacro-backtrace-limit\=0 -fno-color-diagnostics -fmodules-prune-interval\=86400 -fmodules-prune-after\=345600 -fbuild-session-file\=/Users/admin/builder/spi-builder-workspace/.derivedData/ModuleCache.noindex/Session.modulevalidation -fmodules-validate-once-per-build-session -Wnon-modular-include-in-framework-module -Werror\=non-modular-include-in-framework-module -Wno-trigraphs -Wno-missing-field-initializers -Wno-missing-prototypes -Wno-return-type -Wno-missing-braces -Wparentheses -Wswitch -Wno-unused-function -Wno-unused-label -Wno-unused-parameter -Wno-unused-variable -Wunused-value -Wno-empty-body -Wno-uninitialized -Wno-unknown-pragmas -Wno-shadow -Wno-four-char-constants -Wno-conversion -Wno-constant-conversion -Wno-int-conversion -Wno-bool-conversion -Wno-enum-conversion -Wno-float-conversion -Wno-non-literal-null-conversion -Wno-objc-literal-conversion -Wshorten-64-to-32 -Wpointer-sign -Wno-newline-eof -Wno-implicit-fallthrough -fstrict-aliasing -Wdeprecated-declarations -Wno-sign-conversion -Wno-infinite-recursion -Wno-comma -Wno-block-capture-autoreleasing -Wno-strict-prototypes -Wno-semicolon-before-method-body -index-store-path /Users/admin/builder/spi-builder-workspace/.derivedData/Index.noindex/DataStore @/Users/admin/builder/spi-builder-workspace/.derivedData/Build/Intermediates.noindex/SwiftTrace.build/Debug/SwiftTraceGuts.build/Objects-normal/arm64/7187679823f38a2a940e0043cdf9d637-common-args.resp -MMD -MT dependencies -MF /Users/admin/builder/spi-builder-workspace/.derivedData/Build/Intermediates.noindex/SwiftTrace.build/Debug/SwiftTraceGuts.build/Objects-normal/arm64/fishhook.d --serialize-diagnostics /Users/admin/builder/spi-builder-workspace/.derivedData/Build/Intermediates.noindex/SwiftTrace.build/Debug/SwiftTraceGuts.build/Objects-normal/arm64/fishhook.dia -c /Users/admin/builder/spi-builder-workspace/SwiftTraceGuts/fishhook.c -o /Users/admin/builder/spi-builder-workspace/.derivedData/Build/Intermediates.noindex/SwiftTrace.build/Debug/SwiftTraceGuts.build/Objects-normal/arm64/fishhook.o -index-unit-output-path /SwiftTrace.build/Debug/SwiftTraceGuts.build/Objects-normal/arm64/fishhook.o
PrecompileModule /Users/admin/builder/spi-builder-workspace/.derivedData/Build/Intermediates.noindex/ExplicitPrecompiledModules/Darwin-BAUHFKJ0LVHPJG5D5ASZWJL91.scan
cd /Users/admin/builder/spi-builder-workspace/.swiftpm/xcode
builtin-precompileModule /Users/admin/builder/spi-builder-workspace/.derivedData/Build/Intermediates.noindex/ExplicitPrecompiledModules/Darwin-BAUHFKJ0LVHPJG5D5ASZWJL91.scan
Ld /Users/admin/builder/spi-builder-workspace/.derivedData/Build/Products/Debug/SwiftTraceGuts.o normal (in target 'SwiftTraceGuts' from project 'SwiftTrace')
cd /Users/admin/builder/spi-builder-workspace
/Applications/Xcode-16.3.0.app/Contents/Developer/Toolchains/XcodeDefault.xctoolchain/usr/bin/clang++ -Xlinker -reproducible -target arm64-apple-macos10.13 -r -isysroot /Applications/Xcode-16.3.0.app/Contents/Developer/Platforms/MacOSX.platform/Developer/SDKs/MacOSX15.4.sdk -O0 -L/Users/admin/builder/spi-builder-workspace/.derivedData/Build/Intermediates.noindex/EagerLinkingTBDs/Debug -L/Users/admin/builder/spi-builder-workspace/.derivedData/Build/Products/Debug -L/Applications/Xcode-16.3.0.app/Contents/Developer/Platforms/MacOSX.platform/Developer/usr/lib -F/Users/admin/builder/spi-builder-workspace/.derivedData/Build/Intermediates.noindex/EagerLinkingTBDs/Debug -F/Users/admin/builder/spi-builder-workspace/.derivedData/Build/Products/Debug -iframework /Applications/Xcode-16.3.0.app/Contents/Developer/Platforms/MacOSX.platform/Developer/Library/Frameworks -filelist /Users/admin/builder/spi-builder-workspace/.derivedData/Build/Intermediates.noindex/SwiftTrace.build/Debug/SwiftTraceGuts.build/Objects-normal/arm64/SwiftTraceGuts.LinkFileList -nostdlib -Xlinker -object_path_lto -Xlinker /Users/admin/builder/spi-builder-workspace/.derivedData/Build/Intermediates.noindex/SwiftTrace.build/Debug/SwiftTraceGuts.build/Objects-normal/arm64/SwiftTraceGuts_lto.o -rdynamic -Xlinker -no_deduplicate -Xlinker -dependency_info -Xlinker /Users/admin/builder/spi-builder-workspace/.derivedData/Build/Intermediates.noindex/SwiftTrace.build/Debug/SwiftTraceGuts.build/Objects-normal/arm64/SwiftTraceGuts_dependency_info.dat -fobjc-arc -fobjc-link-runtime -o /Users/admin/builder/spi-builder-workspace/.derivedData/Build/Products/Debug/SwiftTraceGuts.o
SwiftDriverJobDiscovery normal arm64 Emitting module for SwiftTraceD (in target 'SwiftTraceD' from project 'SwiftTrace')
SwiftDriver\ Compilation\ Requirements SwiftTraceD normal arm64 com.apple.xcode.tools.swift.compiler (in target 'SwiftTraceD' from project 'SwiftTrace')
cd /Users/admin/builder/spi-builder-workspace/.swiftpm/xcode
builtin-Swift-Compilation-Requirements -- /Applications/Xcode-16.3.0.app/Contents/Developer/Toolchains/XcodeDefault.xctoolchain/usr/bin/swiftc -module-name SwiftTraceD -Onone -enforce-exclusivity\=checked @/Users/admin/builder/spi-builder-workspace/.derivedData/Build/Intermediates.noindex/SwiftTrace.build/Debug/SwiftTraceD.build/Objects-normal/arm64/SwiftTraceD.SwiftFileList -DSWIFT_PACKAGE -DDEBUG -DDEBUG_ONLY -Xcc -fmodule-map-file\=/Users/admin/builder/spi-builder-workspace/.derivedData/Build/Intermediates.noindex/GeneratedModuleMaps/SwiftTraceGutsD.modulemap -stats-output-dir .stats -strict-concurrency\=complete -enable-upcoming-feature StrictConcurrency -enable-upcoming-feature DisableOutwardActorInference -enable-upcoming-feature GlobalActorIsolatedTypesUsability -enable-upcoming-feature InferSendableFromCaptures -plugin-path /Applications/Xcode-16.3.0.app/Contents/Developer/Toolchains/XcodeDefault.xctoolchain/usr/lib/swift/host/plugins/testing -enable-experimental-feature DebugDescriptionMacro -sdk /Applications/Xcode-16.3.0.app/Contents/Developer/Platforms/MacOSX.platform/Developer/SDKs/MacOSX15.4.sdk -target arm64-apple-macos10.13 -g -module-cache-path /Users/admin/builder/spi-builder-workspace/.derivedData/ModuleCache.noindex -Xfrontend -serialize-debugging-options -enable-testing -index-store-path /Users/admin/builder/spi-builder-workspace/.derivedData/Index.noindex/DataStore -swift-version 5 -I /Users/admin/builder/spi-builder-workspace/.derivedData/Build/Products/Debug -I /Applications/Xcode-16.3.0.app/Contents/Developer/Platforms/MacOSX.platform/Developer/usr/lib -F /Users/admin/builder/spi-builder-workspace/.derivedData/Build/Products/Debug/PackageFrameworks -F /Users/admin/builder/spi-builder-workspace/.derivedData/Build/Products/Debug -F /Applications/Xcode-16.3.0.app/Contents/Developer/Platforms/MacOSX.platform/Developer/Library/Frameworks -c -j10 -enable-batch-mode -incremental -Xcc -ivfsstatcache -Xcc /Users/admin/builder/spi-builder-workspace/.derivedData/SDKStatCaches.noindex/macosx15.4-24E241-8287b8f5db97e746a1562fbca0c9d29b.sdkstatcache -output-file-map /Users/admin/builder/spi-builder-workspace/.derivedData/Build/Intermediates.noindex/SwiftTrace.build/Debug/SwiftTraceD.build/Objects-normal/arm64/SwiftTraceD-OutputFileMap.json -use-frontend-parseable-output -save-temps -no-color-diagnostics -serialize-diagnostics -emit-dependencies -emit-module -emit-module-path /Users/admin/builder/spi-builder-workspace/.derivedData/Build/Intermediates.noindex/SwiftTrace.build/Debug/SwiftTraceD.build/Objects-normal/arm64/SwiftTraceD.swiftmodule -validate-clang-modules-once -clang-build-session-file /Users/admin/builder/spi-builder-workspace/.derivedData/ModuleCache.noindex/Session.modulevalidation -Xcc -I/Users/admin/builder/spi-builder-workspace/.derivedData/Build/Intermediates.noindex/SwiftTrace.build/Debug/SwiftTraceD.build/swift-overrides.hmap -emit-const-values -Xfrontend -const-gather-protocols-file -Xfrontend /Users/admin/builder/spi-builder-workspace/.derivedData/Build/Intermediates.noindex/SwiftTrace.build/Debug/SwiftTraceD.build/Objects-normal/arm64/SwiftTraceD_const_extract_protocols.json -Xcc -I/Users/admin/builder/spi-builder-workspace/SwiftTraceGutsD/include -Xcc -I/Users/admin/builder/spi-builder-workspace/.derivedData/Build/Products/Debug/include -Xcc -I/Users/admin/builder/spi-builder-workspace/.derivedData/Build/Intermediates.noindex/SwiftTrace.build/Debug/SwiftTraceD.build/DerivedSources-normal/arm64 -Xcc -I/Users/admin/builder/spi-builder-workspace/.derivedData/Build/Intermediates.noindex/SwiftTrace.build/Debug/SwiftTraceD.build/DerivedSources/arm64 -Xcc -I/Users/admin/builder/spi-builder-workspace/.derivedData/Build/Intermediates.noindex/SwiftTrace.build/Debug/SwiftTraceD.build/DerivedSources -Xcc -DSWIFT_PACKAGE -Xcc -DDEBUG\=1 -emit-objc-header -emit-objc-header-path /Users/admin/builder/spi-builder-workspace/.derivedData/Build/Intermediates.noindex/SwiftTrace.build/Debug/SwiftTraceD.build/Objects-normal/arm64/SwiftTraceD-Swift.h -working-directory /Users/admin/builder/spi-builder-workspace/.swiftpm/xcode -experimental-emit-module-separately -disable-cmo
SwiftDriverJobDiscovery normal arm64 Emitting module for SwiftTrace (in target 'SwiftTrace' from project 'SwiftTrace')
SwiftCompile normal arm64 Compiling\ SwiftStack.swift /Users/admin/builder/spi-builder-workspace/SwiftTrace/SwiftStack.swift (in target 'SwiftTraceD' from project 'SwiftTrace')
SwiftCompile normal arm64 /Users/admin/builder/spi-builder-workspace/SwiftTrace/SwiftStack.swift (in target 'SwiftTraceD' from project 'SwiftTrace')
cd /Users/admin/builder/spi-builder-workspace/.swiftpm/xcode
SwiftMergeGeneratedHeaders /Users/admin/builder/spi-builder-workspace/.derivedData/Build/Intermediates.noindex/GeneratedModuleMaps/SwiftTraceD-Swift.h /Users/admin/builder/spi-builder-workspace/.derivedData/Build/Intermediates.noindex/SwiftTrace.build/Debug/SwiftTraceD.build/Objects-normal/arm64/SwiftTraceD-Swift.h (in target 'SwiftTraceD' from project 'SwiftTrace')
cd /Users/admin/builder/spi-builder-workspace
builtin-swiftHeaderTool -arch arm64 /Users/admin/builder/spi-builder-workspace/.derivedData/Build/Intermediates.noindex/SwiftTrace.build/Debug/SwiftTraceD.build/Objects-normal/arm64/SwiftTraceD-Swift.h -o /Users/admin/builder/spi-builder-workspace/.derivedData/Build/Intermediates.noindex/GeneratedModuleMaps/SwiftTraceD-Swift.h
Copy /Users/admin/builder/spi-builder-workspace/.derivedData/Build/Products/Debug/SwiftTraceD.swiftmodule/arm64-apple-macos.swiftmodule /Users/admin/builder/spi-builder-workspace/.derivedData/Build/Intermediates.noindex/SwiftTrace.build/Debug/SwiftTraceD.build/Objects-normal/arm64/SwiftTraceD.swiftmodule (in target 'SwiftTraceD' from project 'SwiftTrace')
cd /Users/admin/builder/spi-builder-workspace
builtin-copy -exclude .DS_Store -exclude CVS -exclude .svn -exclude .git -exclude .hg -resolve-src-symlinks -rename /Users/admin/builder/spi-builder-workspace/.derivedData/Build/Intermediates.noindex/SwiftTrace.build/Debug/SwiftTraceD.build/Objects-normal/arm64/SwiftTraceD.swiftmodule /Users/admin/builder/spi-builder-workspace/.derivedData/Build/Products/Debug/SwiftTraceD.swiftmodule/arm64-apple-macos.swiftmodule
Copy /Users/admin/builder/spi-builder-workspace/.derivedData/Build/Products/Debug/SwiftTraceD.swiftmodule/arm64-apple-macos.swiftdoc /Users/admin/builder/spi-builder-workspace/.derivedData/Build/Intermediates.noindex/SwiftTrace.build/Debug/SwiftTraceD.build/Objects-normal/arm64/SwiftTraceD.swiftdoc (in target 'SwiftTraceD' from project 'SwiftTrace')
cd /Users/admin/builder/spi-builder-workspace
builtin-copy -exclude .DS_Store -exclude CVS -exclude .svn -exclude .git -exclude .hg -resolve-src-symlinks -rename /Users/admin/builder/spi-builder-workspace/.derivedData/Build/Intermediates.noindex/SwiftTrace.build/Debug/SwiftTraceD.build/Objects-normal/arm64/SwiftTraceD.swiftdoc /Users/admin/builder/spi-builder-workspace/.derivedData/Build/Products/Debug/SwiftTraceD.swiftmodule/arm64-apple-macos.swiftdoc
Copy /Users/admin/builder/spi-builder-workspace/.derivedData/Build/Products/Debug/SwiftTraceD.swiftmodule/arm64-apple-macos.abi.json /Users/admin/builder/spi-builder-workspace/.derivedData/Build/Intermediates.noindex/SwiftTrace.build/Debug/SwiftTraceD.build/Objects-normal/arm64/SwiftTraceD.abi.json (in target 'SwiftTraceD' from project 'SwiftTrace')
cd /Users/admin/builder/spi-builder-workspace
builtin-copy -exclude .DS_Store -exclude CVS -exclude .svn -exclude .git -exclude .hg -resolve-src-symlinks -rename /Users/admin/builder/spi-builder-workspace/.derivedData/Build/Intermediates.noindex/SwiftTrace.build/Debug/SwiftTraceD.build/Objects-normal/arm64/SwiftTraceD.abi.json /Users/admin/builder/spi-builder-workspace/.derivedData/Build/Products/Debug/SwiftTraceD.swiftmodule/arm64-apple-macos.abi.json
Copy /Users/admin/builder/spi-builder-workspace/.derivedData/Build/Products/Debug/SwiftTraceD.swiftmodule/Project/arm64-apple-macos.swiftsourceinfo /Users/admin/builder/spi-builder-workspace/.derivedData/Build/Intermediates.noindex/SwiftTrace.build/Debug/SwiftTraceD.build/Objects-normal/arm64/SwiftTraceD.swiftsourceinfo (in target 'SwiftTraceD' from project 'SwiftTrace')
cd /Users/admin/builder/spi-builder-workspace
builtin-copy -exclude .DS_Store -exclude CVS -exclude .svn -exclude .git -exclude .hg -resolve-src-symlinks -rename /Users/admin/builder/spi-builder-workspace/.derivedData/Build/Intermediates.noindex/SwiftTrace.build/Debug/SwiftTraceD.build/Objects-normal/arm64/SwiftTraceD.swiftsourceinfo /Users/admin/builder/spi-builder-workspace/.derivedData/Build/Products/Debug/SwiftTraceD.swiftmodule/Project/arm64-apple-macos.swiftsourceinfo
SwiftDriver\ Compilation\ Requirements SwiftTrace normal arm64 com.apple.xcode.tools.swift.compiler (in target 'SwiftTrace' from project 'SwiftTrace')
cd /Users/admin/builder/spi-builder-workspace/.swiftpm/xcode
builtin-Swift-Compilation-Requirements -- /Applications/Xcode-16.3.0.app/Contents/Developer/Toolchains/XcodeDefault.xctoolchain/usr/bin/swiftc -module-name SwiftTrace -Onone -enforce-exclusivity\=checked @/Users/admin/builder/spi-builder-workspace/.derivedData/Build/Intermediates.noindex/SwiftTrace.build/Debug/SwiftTrace.build/Objects-normal/arm64/SwiftTrace.SwiftFileList -DSWIFT_PACKAGE -DDEBUG -Xcc -fmodule-map-file\=/Users/admin/builder/spi-builder-workspace/.derivedData/Build/Intermediates.noindex/GeneratedModuleMaps/SwiftTraceGuts.modulemap -stats-output-dir .stats -strict-concurrency\=complete -enable-upcoming-feature StrictConcurrency -enable-upcoming-feature DisableOutwardActorInference -enable-upcoming-feature GlobalActorIsolatedTypesUsability -enable-upcoming-feature InferSendableFromCaptures -plugin-path /Applications/Xcode-16.3.0.app/Contents/Developer/Toolchains/XcodeDefault.xctoolchain/usr/lib/swift/host/plugins/testing -enable-experimental-feature DebugDescriptionMacro -sdk /Applications/Xcode-16.3.0.app/Contents/Developer/Platforms/MacOSX.platform/Developer/SDKs/MacOSX15.4.sdk -target arm64-apple-macos10.13 -g -module-cache-path /Users/admin/builder/spi-builder-workspace/.derivedData/ModuleCache.noindex -Xfrontend -serialize-debugging-options -enable-testing -index-store-path /Users/admin/builder/spi-builder-workspace/.derivedData/Index.noindex/DataStore -swift-version 5 -I /Users/admin/builder/spi-builder-workspace/.derivedData/Build/Products/Debug -I /Applications/Xcode-16.3.0.app/Contents/Developer/Platforms/MacOSX.platform/Developer/usr/lib -F /Users/admin/builder/spi-builder-workspace/.derivedData/Build/Products/Debug/PackageFrameworks -F /Users/admin/builder/spi-builder-workspace/.derivedData/Build/Products/Debug -F /Applications/Xcode-16.3.0.app/Contents/Developer/Platforms/MacOSX.platform/Developer/Library/Frameworks -c -j10 -enable-batch-mode -incremental -Xcc -ivfsstatcache -Xcc /Users/admin/builder/spi-builder-workspace/.derivedData/SDKStatCaches.noindex/macosx15.4-24E241-8287b8f5db97e746a1562fbca0c9d29b.sdkstatcache -output-file-map /Users/admin/builder/spi-builder-workspace/.derivedData/Build/Intermediates.noindex/SwiftTrace.build/Debug/SwiftTrace.build/Objects-normal/arm64/SwiftTrace-OutputFileMap.json -use-frontend-parseable-output -save-temps -no-color-diagnostics -serialize-diagnostics -emit-dependencies -emit-module -emit-module-path /Users/admin/builder/spi-builder-workspace/.derivedData/Build/Intermediates.noindex/SwiftTrace.build/Debug/SwiftTrace.build/Objects-normal/arm64/SwiftTrace.swiftmodule -validate-clang-modules-once -clang-build-session-file /Users/admin/builder/spi-builder-workspace/.derivedData/ModuleCache.noindex/Session.modulevalidation -Xcc -I/Users/admin/builder/spi-builder-workspace/.derivedData/Build/Intermediates.noindex/SwiftTrace.build/Debug/SwiftTrace.build/swift-overrides.hmap -emit-const-values -Xfrontend -const-gather-protocols-file -Xfrontend /Users/admin/builder/spi-builder-workspace/.derivedData/Build/Intermediates.noindex/SwiftTrace.build/Debug/SwiftTrace.build/Objects-normal/arm64/SwiftTrace_const_extract_protocols.json -Xcc -I/Users/admin/builder/spi-builder-workspace/SwiftTraceGuts/include -Xcc -I/Users/admin/builder/spi-builder-workspace/.derivedData/Build/Products/Debug/include -Xcc -I/Users/admin/builder/spi-builder-workspace/.derivedData/Build/Intermediates.noindex/SwiftTrace.build/Debug/SwiftTrace.build/DerivedSources-normal/arm64 -Xcc -I/Users/admin/builder/spi-builder-workspace/.derivedData/Build/Intermediates.noindex/SwiftTrace.build/Debug/SwiftTrace.build/DerivedSources/arm64 -Xcc -I/Users/admin/builder/spi-builder-workspace/.derivedData/Build/Intermediates.noindex/SwiftTrace.build/Debug/SwiftTrace.build/DerivedSources -Xcc -DSWIFT_PACKAGE -Xcc -DDEBUG\=1 -emit-objc-header -emit-objc-header-path /Users/admin/builder/spi-builder-workspace/.derivedData/Build/Intermediates.noindex/SwiftTrace.build/Debug/SwiftTrace.build/Objects-normal/arm64/SwiftTrace-Swift.h -working-directory /Users/admin/builder/spi-builder-workspace/.swiftpm/xcode -experimental-emit-module-separately -disable-cmo
SwiftCompile normal arm64 Compiling\ SwiftLifetime.swift /Users/admin/builder/spi-builder-workspace/SwiftTrace/SwiftLifetime.swift (in target 'SwiftTraceD' from project 'SwiftTrace')
SwiftCompile normal arm64 /Users/admin/builder/spi-builder-workspace/SwiftTrace/SwiftLifetime.swift (in target 'SwiftTraceD' from project 'SwiftTrace')
cd /Users/admin/builder/spi-builder-workspace/.swiftpm/xcode
/Users/admin/builder/spi-builder-workspace/SwiftTrace/SwiftLifetime.swift:32:23: warning: static property 'liveObjects' is not concurrency-safe because it is nonisolated global shared mutable state; this is an error in the Swift 6 language mode
public static var liveObjects = [UnsafeRawPointer: Set<UnsafeRawPointer>]()
^
/Users/admin/builder/spi-builder-workspace/SwiftTrace/SwiftLifetime.swift:32:23: note: convert 'liveObjects' to a 'let' constant to make 'Sendable' shared state immutable
public static var liveObjects = [UnsafeRawPointer: Set<UnsafeRawPointer>]()
~~~ ^
let
/Users/admin/builder/spi-builder-workspace/SwiftTrace/SwiftLifetime.swift:32:23: note: add '@MainActor' to make static property 'liveObjects' part of global actor 'MainActor'
public static var liveObjects = [UnsafeRawPointer: Set<UnsafeRawPointer>]()
^
@MainActor
/Users/admin/builder/spi-builder-workspace/SwiftTrace/SwiftLifetime.swift:32:23: note: disable concurrency-safety checks if accesses are protected by an external synchronization mechanism
public static var liveObjects = [UnsafeRawPointer: Set<UnsafeRawPointer>]()
^
nonisolated(unsafe)
/Users/admin/builder/spi-builder-workspace/SwiftTrace/SwiftLifetime.swift:33:23: warning: static property 'liveObjectsLock' is not concurrency-safe because it is nonisolated global shared mutable state; this is an error in the Swift 6 language mode
public static var liveObjectsLock = OS_SPINLOCK_INIT
^
/Users/admin/builder/spi-builder-workspace/SwiftTrace/SwiftLifetime.swift:33:23: note: convert 'liveObjectsLock' to a 'let' constant to make 'Sendable' shared state immutable
public static var liveObjectsLock = OS_SPINLOCK_INIT
~~~ ^
let
/Users/admin/builder/spi-builder-workspace/SwiftTrace/SwiftLifetime.swift:33:23: note: add '@MainActor' to make static property 'liveObjectsLock' part of global actor 'MainActor'
public static var liveObjectsLock = OS_SPINLOCK_INIT
^
@MainActor
/Users/admin/builder/spi-builder-workspace/SwiftTrace/SwiftLifetime.swift:33:23: note: disable concurrency-safety checks if accesses are protected by an external synchronization mechanism
public static var liveObjectsLock = OS_SPINLOCK_INIT
^
nonisolated(unsafe)
/Users/admin/builder/spi-builder-workspace/SwiftTrace/SwiftLifetime.swift:34:24: warning: static property 'reaperKey' is not concurrency-safe because it is nonisolated global shared mutable state; this is an error in the Swift 6 language mode
private static var reaperKey = strdup("_reaper_")!
^
/Users/admin/builder/spi-builder-workspace/SwiftTrace/SwiftLifetime.swift:34:24: note: convert 'reaperKey' to a 'let' constant to make 'Sendable' shared state immutable
private static var reaperKey = strdup("_reaper_")!
~~~ ^
let
/Users/admin/builder/spi-builder-workspace/SwiftTrace/SwiftLifetime.swift:34:24: note: add '@MainActor' to make static property 'reaperKey' part of global actor 'MainActor'
private static var reaperKey = strdup("_reaper_")!
^
@MainActor
/Users/admin/builder/spi-builder-workspace/SwiftTrace/SwiftLifetime.swift:34:24: note: disable concurrency-safety checks if accesses are protected by an external synchronization mechanism
private static var reaperKey = strdup("_reaper_")!
^
nonisolated(unsafe)
SwiftMergeGeneratedHeaders /Users/admin/builder/spi-builder-workspace/.derivedData/Build/Intermediates.noindex/GeneratedModuleMaps/SwiftTrace-Swift.h /Users/admin/builder/spi-builder-workspace/.derivedData/Build/Intermediates.noindex/SwiftTrace.build/Debug/SwiftTrace.build/Objects-normal/arm64/SwiftTrace-Swift.h (in target 'SwiftTrace' from project 'SwiftTrace')
cd /Users/admin/builder/spi-builder-workspace
builtin-swiftHeaderTool -arch arm64 /Users/admin/builder/spi-builder-workspace/.derivedData/Build/Intermediates.noindex/SwiftTrace.build/Debug/SwiftTrace.build/Objects-normal/arm64/SwiftTrace-Swift.h -o /Users/admin/builder/spi-builder-workspace/.derivedData/Build/Intermediates.noindex/GeneratedModuleMaps/SwiftTrace-Swift.h
Copy /Users/admin/builder/spi-builder-workspace/.derivedData/Build/Products/Debug/SwiftTrace.swiftmodule/arm64-apple-macos.swiftmodule /Users/admin/builder/spi-builder-workspace/.derivedData/Build/Intermediates.noindex/SwiftTrace.build/Debug/SwiftTrace.build/Objects-normal/arm64/SwiftTrace.swiftmodule (in target 'SwiftTrace' from project 'SwiftTrace')
cd /Users/admin/builder/spi-builder-workspace
builtin-copy -exclude .DS_Store -exclude CVS -exclude .svn -exclude .git -exclude .hg -resolve-src-symlinks -rename /Users/admin/builder/spi-builder-workspace/.derivedData/Build/Intermediates.noindex/SwiftTrace.build/Debug/SwiftTrace.build/Objects-normal/arm64/SwiftTrace.swiftmodule /Users/admin/builder/spi-builder-workspace/.derivedData/Build/Products/Debug/SwiftTrace.swiftmodule/arm64-apple-macos.swiftmodule
Copy /Users/admin/builder/spi-builder-workspace/.derivedData/Build/Products/Debug/SwiftTrace.swiftmodule/arm64-apple-macos.swiftdoc /Users/admin/builder/spi-builder-workspace/.derivedData/Build/Intermediates.noindex/SwiftTrace.build/Debug/SwiftTrace.build/Objects-normal/arm64/SwiftTrace.swiftdoc (in target 'SwiftTrace' from project 'SwiftTrace')
cd /Users/admin/builder/spi-builder-workspace
builtin-copy -exclude .DS_Store -exclude CVS -exclude .svn -exclude .git -exclude .hg -resolve-src-symlinks -rename /Users/admin/builder/spi-builder-workspace/.derivedData/Build/Intermediates.noindex/SwiftTrace.build/Debug/SwiftTrace.build/Objects-normal/arm64/SwiftTrace.swiftdoc /Users/admin/builder/spi-builder-workspace/.derivedData/Build/Products/Debug/SwiftTrace.swiftmodule/arm64-apple-macos.swiftdoc
Copy /Users/admin/builder/spi-builder-workspace/.derivedData/Build/Products/Debug/SwiftTrace.swiftmodule/arm64-apple-macos.abi.json /Users/admin/builder/spi-builder-workspace/.derivedData/Build/Intermediates.noindex/SwiftTrace.build/Debug/SwiftTrace.build/Objects-normal/arm64/SwiftTrace.abi.json (in target 'SwiftTrace' from project 'SwiftTrace')
cd /Users/admin/builder/spi-builder-workspace
builtin-copy -exclude .DS_Store -exclude CVS -exclude .svn -exclude .git -exclude .hg -resolve-src-symlinks -rename /Users/admin/builder/spi-builder-workspace/.derivedData/Build/Intermediates.noindex/SwiftTrace.build/Debug/SwiftTrace.build/Objects-normal/arm64/SwiftTrace.abi.json /Users/admin/builder/spi-builder-workspace/.derivedData/Build/Products/Debug/SwiftTrace.swiftmodule/arm64-apple-macos.abi.json
Copy /Users/admin/builder/spi-builder-workspace/.derivedData/Build/Products/Debug/SwiftTrace.swiftmodule/Project/arm64-apple-macos.swiftsourceinfo /Users/admin/builder/spi-builder-workspace/.derivedData/Build/Intermediates.noindex/SwiftTrace.build/Debug/SwiftTrace.build/Objects-normal/arm64/SwiftTrace.swiftsourceinfo (in target 'SwiftTrace' from project 'SwiftTrace')
cd /Users/admin/builder/spi-builder-workspace
builtin-copy -exclude .DS_Store -exclude CVS -exclude .svn -exclude .git -exclude .hg -resolve-src-symlinks -rename /Users/admin/builder/spi-builder-workspace/.derivedData/Build/Intermediates.noindex/SwiftTrace.build/Debug/SwiftTrace.build/Objects-normal/arm64/SwiftTrace.swiftsourceinfo /Users/admin/builder/spi-builder-workspace/.derivedData/Build/Products/Debug/SwiftTrace.swiftmodule/Project/arm64-apple-macos.swiftsourceinfo
PrecompileModule /Users/admin/builder/spi-builder-workspace/.derivedData/Build/Intermediates.noindex/ExplicitPrecompiledModules/MachO-4UY6YZTUIL63S9M0RH8X2YVE6.scan
cd /Users/admin/builder/spi-builder-workspace/.swiftpm/xcode
builtin-precompileModule /Users/admin/builder/spi-builder-workspace/.derivedData/Build/Intermediates.noindex/ExplicitPrecompiledModules/MachO-4UY6YZTUIL63S9M0RH8X2YVE6.scan
SwiftCompile normal arm64 Compiling\ SwiftMeta.swift /Users/admin/builder/spi-builder-workspace/SwiftTrace/SwiftMeta.swift (in target 'SwiftTraceD' from project 'SwiftTrace')
SwiftCompile normal arm64 /Users/admin/builder/spi-builder-workspace/SwiftTrace/SwiftMeta.swift (in target 'SwiftTraceD' from project 'SwiftTrace')
cd /Users/admin/builder/spi-builder-workspace/.swiftpm/xcode
/Users/admin/builder/spi-builder-workspace/SwiftTrace/SwiftMeta.swift:147:23: warning: static property 'RTLD_NEXT' is not concurrency-safe because non-'Sendable' type 'UnsafeMutableRawPointer' may have shared mutable state; this is an error in the Swift 6 language mode
public static let RTLD_NEXT = UnsafeMutableRawPointer(bitPattern: -1)!
^
Swift.UnsafeMutableRawPointer:1:23: note: struct 'UnsafeMutableRawPointer' does not conform to the 'Sendable' protocol
@frozen public struct UnsafeMutableRawPointer : _Pointer {
^
/Users/admin/builder/spi-builder-workspace/SwiftTrace/SwiftMeta.swift:147:23: note: add '@MainActor' to make static property 'RTLD_NEXT' part of global actor 'MainActor'
public static let RTLD_NEXT = UnsafeMutableRawPointer(bitPattern: -1)!
^
@MainActor
/Users/admin/builder/spi-builder-workspace/SwiftTrace/SwiftMeta.swift:147:23: note: disable concurrency-safety checks if accesses are protected by an external synchronization mechanism
public static let RTLD_NEXT = UnsafeMutableRawPointer(bitPattern: -1)!
^
nonisolated(unsafe)
/Users/admin/builder/spi-builder-workspace/SwiftTrace/SwiftMeta.swift:148:23: warning: static property 'RTLD_DEFAULT' is not concurrency-safe because non-'Sendable' type 'UnsafeMutableRawPointer' may have shared mutable state; this is an error in the Swift 6 language mode
public static let RTLD_DEFAULT = UnsafeMutableRawPointer(bitPattern: -2)!
^
Swift.UnsafeMutableRawPointer:1:23: note: struct 'UnsafeMutableRawPointer' does not conform to the 'Sendable' protocol
@frozen public struct UnsafeMutableRawPointer : _Pointer {
^
/Users/admin/builder/spi-builder-workspace/SwiftTrace/SwiftMeta.swift:148:23: note: add '@MainActor' to make static property 'RTLD_DEFAULT' part of global actor 'MainActor'
public static let RTLD_DEFAULT = UnsafeMutableRawPointer(bitPattern: -2)!
^
@MainActor
/Users/admin/builder/spi-builder-workspace/SwiftTrace/SwiftMeta.swift:148:23: note: disable concurrency-safety checks if accesses are protected by an external synchronization mechanism
public static let RTLD_DEFAULT = UnsafeMutableRawPointer(bitPattern: -2)!
^
nonisolated(unsafe)
/Users/admin/builder/spi-builder-workspace/SwiftTrace/SwiftMeta.swift:149:23: warning: static property 'RTLD_SELF' is not concurrency-safe because non-'Sendable' type 'UnsafeMutableRawPointer' may have shared mutable state; this is an error in the Swift 6 language mode
public static let RTLD_SELF = UnsafeMutableRawPointer(bitPattern: -3)!
^
Swift.UnsafeMutableRawPointer:1:23: note: struct 'UnsafeMutableRawPointer' does not conform to the 'Sendable' protocol
@frozen public struct UnsafeMutableRawPointer : _Pointer {
^
/Users/admin/builder/spi-builder-workspace/SwiftTrace/SwiftMeta.swift:149:23: note: add '@MainActor' to make static property 'RTLD_SELF' part of global actor 'MainActor'
public static let RTLD_SELF = UnsafeMutableRawPointer(bitPattern: -3)!
^
@MainActor
/Users/admin/builder/spi-builder-workspace/SwiftTrace/SwiftMeta.swift:149:23: note: disable concurrency-safety checks if accesses are protected by an external synchronization mechanism
public static let RTLD_SELF = UnsafeMutableRawPointer(bitPattern: -3)!
^
nonisolated(unsafe)
/Users/admin/builder/spi-builder-workspace/SwiftTrace/SwiftMeta.swift:150:23: warning: static property 'RTLD_MAIN_ONLY' is not concurrency-safe because non-'Sendable' type 'UnsafeMutableRawPointer' may have shared mutable state; this is an error in the Swift 6 language mode
public static let RTLD_MAIN_ONLY = UnsafeMutableRawPointer(bitPattern: -5)!
^
Swift.UnsafeMutableRawPointer:1:23: note: struct 'UnsafeMutableRawPointer' does not conform to the 'Sendable' protocol
@frozen public struct UnsafeMutableRawPointer : _Pointer {
^
/Users/admin/builder/spi-builder-workspace/SwiftTrace/SwiftMeta.swift:150:23: note: add '@MainActor' to make static property 'RTLD_MAIN_ONLY' part of global actor 'MainActor'
public static let RTLD_MAIN_ONLY = UnsafeMutableRawPointer(bitPattern: -5)!
^
@MainActor
/Users/admin/builder/spi-builder-workspace/SwiftTrace/SwiftMeta.swift:150:23: note: disable concurrency-safety checks if accesses are protected by an external synchronization mechanism
public static let RTLD_MAIN_ONLY = UnsafeMutableRawPointer(bitPattern: -5)!
^
nonisolated(unsafe)
/Users/admin/builder/spi-builder-workspace/SwiftTrace/SwiftMeta.swift:176:16: warning: static property 'getOptionalTypeFptr' is not concurrency-safe because it is nonisolated global shared mutable state; this is an error in the Swift 6 language mode
static var getOptionalTypeFptr = bindGeneric(name: "getOptionalType")
^
/Users/admin/builder/spi-builder-workspace/SwiftTrace/SwiftMeta.swift:176:16: note: convert 'getOptionalTypeFptr' to a 'let' constant to make 'Sendable' shared state immutable
static var getOptionalTypeFptr = bindGeneric(name: "getOptionalType")
~~~ ^
let
/Users/admin/builder/spi-builder-workspace/SwiftTrace/SwiftMeta.swift:176:16: note: add '@MainActor' to make static property 'getOptionalTypeFptr' part of global actor 'MainActor'
static var getOptionalTypeFptr = bindGeneric(name: "getOptionalType")
^
@MainActor
/Users/admin/builder/spi-builder-workspace/SwiftTrace/SwiftMeta.swift:176:16: note: disable concurrency-safety checks if accesses are protected by an external synchronization mechanism
static var getOptionalTypeFptr = bindGeneric(name: "getOptionalType")
^
nonisolated(unsafe)
/Users/admin/builder/spi-builder-workspace/SwiftTrace/SwiftMeta.swift:177:16: warning: static property 'getMixedTypeFptr' is not concurrency-safe because it is nonisolated global shared mutable state; this is an error in the Swift 6 language mode
static var getMixedTypeFptr = bindGeneric(name: "getMixedType")
^
/Users/admin/builder/spi-builder-workspace/SwiftTrace/SwiftMeta.swift:177:16: note: convert 'getMixedTypeFptr' to a 'let' constant to make 'Sendable' shared state immutable
static var getMixedTypeFptr = bindGeneric(name: "getMixedType")
~~~ ^
let
/Users/admin/builder/spi-builder-workspace/SwiftTrace/SwiftMeta.swift:177:16: note: add '@MainActor' to make static property 'getMixedTypeFptr' part of global actor 'MainActor'
static var getMixedTypeFptr = bindGeneric(name: "getMixedType")
^
@MainActor
/Users/admin/builder/spi-builder-workspace/SwiftTrace/SwiftMeta.swift:177:16: note: disable concurrency-safety checks if accesses are protected by an external synchronization mechanism
static var getMixedTypeFptr = bindGeneric(name: "getMixedType")
^
nonisolated(unsafe)
/Users/admin/builder/spi-builder-workspace/SwiftTrace/SwiftMeta.swift:178:16: warning: static property 'getEnumTypeFptr' is not concurrency-safe because it is nonisolated global shared mutable state; this is an error in the Swift 6 language mode
static var getEnumTypeFptr = bindGeneric(name: "getEnumType")
^
/Users/admin/builder/spi-builder-workspace/SwiftTrace/SwiftMeta.swift:178:16: note: convert 'getEnumTypeFptr' to a 'let' constant to make 'Sendable' shared state immutable
static var getEnumTypeFptr = bindGeneric(name: "getEnumType")
~~~ ^
let
/Users/admin/builder/spi-builder-workspace/SwiftTrace/SwiftMeta.swift:178:16: note: add '@MainActor' to make static property 'getEnumTypeFptr' part of global actor 'MainActor'
static var getEnumTypeFptr = bindGeneric(name: "getEnumType")
^
@MainActor
/Users/admin/builder/spi-builder-workspace/SwiftTrace/SwiftMeta.swift:178:16: note: disable concurrency-safety checks if accesses are protected by an external synchronization mechanism
static var getEnumTypeFptr = bindGeneric(name: "getEnumType")
^
nonisolated(unsafe)
/Users/admin/builder/spi-builder-workspace/SwiftTrace/SwiftMeta.swift:179:16: warning: static property 'getMetaTypeFptr' is not concurrency-safe because it is nonisolated global shared mutable state; this is an error in the Swift 6 language mode
static var getMetaTypeFptr = bindGeneric(name: "getMetaType")
^
/Users/admin/builder/spi-builder-workspace/SwiftTrace/SwiftMeta.swift:179:16: note: convert 'getMetaTypeFptr' to a 'let' constant to make 'Sendable' shared state immutable
static var getMetaTypeFptr = bindGeneric(name: "getMetaType")
~~~ ^
let
/Users/admin/builder/spi-builder-workspace/SwiftTrace/SwiftMeta.swift:179:16: note: add '@MainActor' to make static property 'getMetaTypeFptr' part of global actor 'MainActor'
static var getMetaTypeFptr = bindGeneric(name: "getMetaType")
^
@MainActor
/Users/admin/builder/spi-builder-workspace/SwiftTrace/SwiftMeta.swift:179:16: note: disable concurrency-safety checks if accesses are protected by an external synchronization mechanism
static var getMetaTypeFptr = bindGeneric(name: "getMetaType")
^
nonisolated(unsafe)
/Users/admin/builder/spi-builder-workspace/SwiftTrace/SwiftMeta.swift:182:23: warning: static property 'wrapperHandlers' is not concurrency-safe because it is nonisolated global shared mutable state; this is an error in the Swift 6 language mode
public static var wrapperHandlers = [
^
/Users/admin/builder/spi-builder-workspace/SwiftTrace/SwiftMeta.swift:182:23: note: convert 'wrapperHandlers' to a 'let' constant to make 'Sendable' shared state immutable
public static var wrapperHandlers = [
~~~ ^
let
/Users/admin/builder/spi-builder-workspace/SwiftTrace/SwiftMeta.swift:182:23: note: add '@MainActor' to make static property 'wrapperHandlers' part of global actor 'MainActor'
public static var wrapperHandlers = [
^
@MainActor
/Users/admin/builder/spi-builder-workspace/SwiftTrace/SwiftMeta.swift:182:23: note: disable concurrency-safety checks if accesses are protected by an external synchronization mechanism
public static var wrapperHandlers = [
^
nonisolated(unsafe)
/Users/admin/builder/spi-builder-workspace/SwiftTrace/SwiftMeta.swift:197:23: warning: static property 'conformanceManglings' is not concurrency-safe because it is nonisolated global shared mutable state; this is an error in the Swift 6 language mode
public static var conformanceManglings = [
^
/Users/admin/builder/spi-builder-workspace/SwiftTrace/SwiftMeta.swift:197:23: note: convert 'conformanceManglings' to a 'let' constant to make 'Sendable' shared state immutable
public static var conformanceManglings = [
~~~ ^
let
/Users/admin/builder/spi-builder-workspace/SwiftTrace/SwiftMeta.swift:197:23: note: add '@MainActor' to make static property 'conformanceManglings' part of global actor 'MainActor'
public static var conformanceManglings = [
^
@MainActor
/Users/admin/builder/spi-builder-workspace/SwiftTrace/SwiftMeta.swift:197:23: note: disable concurrency-safety checks if accesses are protected by an external synchronization mechanism
public static var conformanceManglings = [
^
nonisolated(unsafe)
/Users/admin/builder/spi-builder-workspace/SwiftTrace/SwiftMeta.swift:210:23: warning: static property 'nameAbbreviations' is not concurrency-safe because it is nonisolated global shared mutable state; this is an error in the Swift 6 language mode
public static var nameAbbreviations = [
^
/Users/admin/builder/spi-builder-workspace/SwiftTrace/SwiftMeta.swift:210:23: note: convert 'nameAbbreviations' to a 'let' constant to make 'Sendable' shared state immutable
public static var nameAbbreviations = [
~~~ ^
let
/Users/admin/builder/spi-builder-workspace/SwiftTrace/SwiftMeta.swift:210:23: note: add '@MainActor' to make static property 'nameAbbreviations' part of global actor 'MainActor'
public static var nameAbbreviations = [
^
@MainActor
/Users/admin/builder/spi-builder-workspace/SwiftTrace/SwiftMeta.swift:210:23: note: disable concurrency-safety checks if accesses are protected by an external synchronization mechanism
public static var nameAbbreviations = [
^
nonisolated(unsafe)
/Users/admin/builder/spi-builder-workspace/SwiftTrace/SwiftMeta.swift:214:23: warning: static property 'typeLookupCache' is not concurrency-safe because it is nonisolated global shared mutable state; this is an error in the Swift 6 language mode
public static var typeLookupCache: [String: Any.Type?] = [
^
/Users/admin/builder/spi-builder-workspace/SwiftTrace/SwiftMeta.swift:214:23: note: convert 'typeLookupCache' to a 'let' constant to make 'Sendable' shared state immutable
public static var typeLookupCache: [String: Any.Type?] = [
~~~ ^
let
/Users/admin/builder/spi-builder-workspace/SwiftTrace/SwiftMeta.swift:214:23: note: add '@MainActor' to make static property 'typeLookupCache' part of global actor 'MainActor'
public static var typeLookupCache: [String: Any.Type?] = [
^
@MainActor
/Users/admin/builder/spi-builder-workspace/SwiftTrace/SwiftMeta.swift:214:23: note: disable concurrency-safety checks if accesses are protected by an external synchronization mechanism
public static var typeLookupCache: [String: Any.Type?] = [
^
nonisolated(unsafe)
/Users/admin/builder/spi-builder-workspace/SwiftTrace/SwiftMeta.swift:239:16: warning: static property 'typeLookupCacheLock' is not concurrency-safe because it is nonisolated global shared mutable state; this is an error in the Swift 6 language mode
static var typeLookupCacheLock = OS_SPINLOCK_INIT
^
/Users/admin/builder/spi-builder-workspace/SwiftTrace/SwiftMeta.swift:239:16: note: convert 'typeLookupCacheLock' to a 'let' constant to make 'Sendable' shared state immutable
static var typeLookupCacheLock = OS_SPINLOCK_INIT
~~~ ^
let
/Users/admin/builder/spi-builder-workspace/SwiftTrace/SwiftMeta.swift:239:16: note: add '@MainActor' to make static property 'typeLookupCacheLock' part of global actor 'MainActor'
static var typeLookupCacheLock = OS_SPINLOCK_INIT
^
@MainActor
/Users/admin/builder/spi-builder-workspace/SwiftTrace/SwiftMeta.swift:239:16: note: disable concurrency-safety checks if accesses are protected by an external synchronization mechanism
static var typeLookupCacheLock = OS_SPINLOCK_INIT
^
nonisolated(unsafe)
/Users/admin/builder/spi-builder-workspace/SwiftTrace/SwiftMeta.swift:387:16: warning: static property 'approximateFieldInfoByTypeName' is not concurrency-safe because it is nonisolated global shared mutable state; this is an error in the Swift 6 language mode
static var approximateFieldInfoByTypeName = [String: [FieldInfo]]()
^
/Users/admin/builder/spi-builder-workspace/SwiftTrace/SwiftMeta.swift:387:16: note: convert 'approximateFieldInfoByTypeName' to a 'let' constant to make 'Sendable' shared state immutable
static var approximateFieldInfoByTypeName = [String: [FieldInfo]]()
~~~ ^
let
/Users/admin/builder/spi-builder-workspace/SwiftTrace/SwiftMeta.swift:387:16: note: add '@MainActor' to make static property 'approximateFieldInfoByTypeName' part of global actor 'MainActor'
static var approximateFieldInfoByTypeName = [String: [FieldInfo]]()
^
@MainActor
/Users/admin/builder/spi-builder-workspace/SwiftTrace/SwiftMeta.swift:387:16: note: disable concurrency-safety checks if accesses are protected by an external synchronization mechanism
static var approximateFieldInfoByTypeName = [String: [FieldInfo]]()
^
nonisolated(unsafe)
/Users/admin/builder/spi-builder-workspace/SwiftTrace/SwiftMeta.swift:388:16: warning: static property 'doesntHaveStorage' is not concurrency-safe because it is nonisolated global shared mutable state; this is an error in the Swift 6 language mode
static var doesntHaveStorage = Set<String>()
^
/Users/admin/builder/spi-builder-workspace/SwiftTrace/SwiftMeta.swift:388:16: note: convert 'doesntHaveStorage' to a 'let' constant to make 'Sendable' shared state immutable
static var doesntHaveStorage = Set<String>()
~~~ ^
let
/Users/admin/builder/spi-builder-workspace/SwiftTrace/SwiftMeta.swift:388:16: note: add '@MainActor' to make static property 'doesntHaveStorage' part of global actor 'MainActor'
static var doesntHaveStorage = Set<String>()
^
@MainActor
/Users/admin/builder/spi-builder-workspace/SwiftTrace/SwiftMeta.swift:388:16: note: disable concurrency-safety checks if accesses are protected by an external synchronization mechanism
static var doesntHaveStorage = Set<String>()
^
nonisolated(unsafe)
/Users/admin/builder/spi-builder-workspace/SwiftTrace/SwiftMeta.swift:390:23: warning: static property 'structsPassedByReference' is not concurrency-safe because it is nonisolated global shared mutable state; this is an error in the Swift 6 language mode
public static var structsPassedByReference: Set<UnsafeRawPointer> = {
^
/Users/admin/builder/spi-builder-workspace/SwiftTrace/SwiftMeta.swift:390:23: note: convert 'structsPassedByReference' to a 'let' constant to make 'Sendable' shared state immutable
public static var structsPassedByReference: Set<UnsafeRawPointer> = {
~~~ ^
let
/Users/admin/builder/spi-builder-workspace/SwiftTrace/SwiftMeta.swift:390:23: note: add '@MainActor' to make static property 'structsPassedByReference' part of global actor 'MainActor'
public static var structsPassedByReference: Set<UnsafeRawPointer> = {
^
@MainActor
/Users/admin/builder/spi-builder-workspace/SwiftTrace/SwiftMeta.swift:390:23: note: disable concurrency-safety checks if accesses are protected by an external synchronization mechanism
public static var structsPassedByReference: Set<UnsafeRawPointer> = {
^
nonisolated(unsafe)
/Users/admin/builder/spi-builder-workspace/SwiftTrace/SwiftMeta.swift:447:16: warning: static property 'structsAllFloats' is not concurrency-safe because it is nonisolated global shared mutable state; this is an error in the Swift 6 language mode
static var structsAllFloats = Set<UnsafeRawPointer>()
^
/Users/admin/builder/spi-builder-workspace/SwiftTrace/SwiftMeta.swift:447:16: note: convert 'structsAllFloats' to a 'let' constant to make 'Sendable' shared state immutable
static var structsAllFloats = Set<UnsafeRawPointer>()
~~~ ^
let
/Users/admin/builder/spi-builder-workspace/SwiftTrace/SwiftMeta.swift:447:16: note: add '@MainActor' to make static property 'structsAllFloats' part of global actor 'MainActor'
static var structsAllFloats = Set<UnsafeRawPointer>()
^
@MainActor
/Users/admin/builder/spi-builder-workspace/SwiftTrace/SwiftMeta.swift:447:16: note: disable concurrency-safety checks if accesses are protected by an external synchronization mechanism
static var structsAllFloats = Set<UnsafeRawPointer>()
^
nonisolated(unsafe)
/Users/admin/builder/spi-builder-workspace/SwiftTrace/SwiftMeta.swift:682:43: warning: forming 'UnsafeRawPointer' to a variable of type 'Wrapped'; this is likely incorrect because 'Wrapped' may contain an object reference.
SwiftTrace.Decorated.describe(&value, type: Wrapped.self, out: &out)
^
CompileC /Users/admin/builder/spi-builder-workspace/.derivedData/Build/Intermediates.noindex/SwiftTrace.build/Debug/SwiftTraceGutsD.build/Objects-normal/arm64/fishhook.o /Users/admin/builder/spi-builder-workspace/SwiftTraceGutsD/fishhook.c normal arm64 c com.apple.compilers.llvm.clang.1_0.compiler (in target 'SwiftTraceGutsD' from project 'SwiftTrace')
cd /Users/admin/builder/spi-builder-workspace/.swiftpm/xcode
Using response file: /Users/admin/builder/spi-builder-workspace/.derivedData/Build/Intermediates.noindex/SwiftTrace.build/Debug/SwiftTraceGutsD.build/Objects-normal/arm64/7187679823f38a2a940e0043cdf9d637-common-args.resp
/Applications/Xcode-16.3.0.app/Contents/Developer/Toolchains/XcodeDefault.xctoolchain/usr/bin/clang -x c -ivfsstatcache /Users/admin/builder/spi-builder-workspace/.derivedData/SDKStatCaches.noindex/macosx15.4-24E241-8287b8f5db97e746a1562fbca0c9d29b.sdkstatcache -fmessage-length\=0 -fdiagnostics-show-note-include-stack -fmacro-backtrace-limit\=0 -fno-color-diagnostics -fmodules-prune-interval\=86400 -fmodules-prune-after\=345600 -fbuild-session-file\=/Users/admin/builder/spi-builder-workspace/.derivedData/ModuleCache.noindex/Session.modulevalidation -fmodules-validate-once-per-build-session -Wnon-modular-include-in-framework-module -Werror\=non-modular-include-in-framework-module -Wno-trigraphs -Wno-missing-field-initializers -Wno-missing-prototypes -Wno-return-type -Wno-missing-braces -Wparentheses -Wswitch -Wno-unused-function -Wno-unused-label -Wno-unused-parameter -Wno-unused-variable -Wunused-value -Wno-empty-body -Wno-uninitialized -Wno-unknown-pragmas -Wno-shadow -Wno-four-char-constants -Wno-conversion -Wno-constant-conversion -Wno-int-conversion -Wno-bool-conversion -Wno-enum-conversion -Wno-float-conversion -Wno-non-literal-null-conversion -Wno-objc-literal-conversion -Wshorten-64-to-32 -Wpointer-sign -Wno-newline-eof -Wno-implicit-fallthrough -fstrict-aliasing -Wdeprecated-declarations -Wno-sign-conversion -Wno-infinite-recursion -Wno-comma -Wno-block-capture-autoreleasing -Wno-strict-prototypes -Wno-semicolon-before-method-body -index-store-path /Users/admin/builder/spi-builder-workspace/.derivedData/Index.noindex/DataStore @/Users/admin/builder/spi-builder-workspace/.derivedData/Build/Intermediates.noindex/SwiftTrace.build/Debug/SwiftTraceGutsD.build/Objects-normal/arm64/7187679823f38a2a940e0043cdf9d637-common-args.resp -MMD -MT dependencies -MF /Users/admin/builder/spi-builder-workspace/.derivedData/Build/Intermediates.noindex/SwiftTrace.build/Debug/SwiftTraceGutsD.build/Objects-normal/arm64/fishhook.d --serialize-diagnostics /Users/admin/builder/spi-builder-workspace/.derivedData/Build/Intermediates.noindex/SwiftTrace.build/Debug/SwiftTraceGutsD.build/Objects-normal/arm64/fishhook.dia -c /Users/admin/builder/spi-builder-workspace/SwiftTraceGutsD/fishhook.c -o /Users/admin/builder/spi-builder-workspace/.derivedData/Build/Intermediates.noindex/SwiftTrace.build/Debug/SwiftTraceGutsD.build/Objects-normal/arm64/fishhook.o -index-unit-output-path /SwiftTrace.build/Debug/SwiftTraceGutsD.build/Objects-normal/arm64/fishhook.o
SwiftDriverJobDiscovery normal arm64 Compiling SwiftInvoke.swift (in target 'SwiftTraceD' from project 'SwiftTrace')
SwiftCompile normal arm64 Compiling\ SwiftMeta.swift /Users/admin/builder/spi-builder-workspace/SwiftTrace/SwiftMeta.swift (in target 'SwiftTrace' from project 'SwiftTrace')
SwiftCompile normal arm64 /Users/admin/builder/spi-builder-workspace/SwiftTrace/SwiftMeta.swift (in target 'SwiftTrace' from project 'SwiftTrace')
cd /Users/admin/builder/spi-builder-workspace/.swiftpm/xcode
/Users/admin/builder/spi-builder-workspace/SwiftTrace/SwiftMeta.swift:147:23: warning: static property 'RTLD_NEXT' is not concurrency-safe because non-'Sendable' type 'UnsafeMutableRawPointer' may have shared mutable state; this is an error in the Swift 6 language mode
public static let RTLD_NEXT = UnsafeMutableRawPointer(bitPattern: -1)!
^
Swift.UnsafeMutableRawPointer:1:23: note: struct 'UnsafeMutableRawPointer' does not conform to the 'Sendable' protocol
@frozen public struct UnsafeMutableRawPointer : _Pointer {
^
/Users/admin/builder/spi-builder-workspace/SwiftTrace/SwiftMeta.swift:147:23: note: add '@MainActor' to make static property 'RTLD_NEXT' part of global actor 'MainActor'
public static let RTLD_NEXT = UnsafeMutableRawPointer(bitPattern: -1)!
^
@MainActor
/Users/admin/builder/spi-builder-workspace/SwiftTrace/SwiftMeta.swift:147:23: note: disable concurrency-safety checks if accesses are protected by an external synchronization mechanism
public static let RTLD_NEXT = UnsafeMutableRawPointer(bitPattern: -1)!
^
nonisolated(unsafe)
/Users/admin/builder/spi-builder-workspace/SwiftTrace/SwiftMeta.swift:148:23: warning: static property 'RTLD_DEFAULT' is not concurrency-safe because non-'Sendable' type 'UnsafeMutableRawPointer' may have shared mutable state; this is an error in the Swift 6 language mode
public static let RTLD_DEFAULT = UnsafeMutableRawPointer(bitPattern: -2)!
^
Swift.UnsafeMutableRawPointer:1:23: note: struct 'UnsafeMutableRawPointer' does not conform to the 'Sendable' protocol
@frozen public struct UnsafeMutableRawPointer : _Pointer {
^
/Users/admin/builder/spi-builder-workspace/SwiftTrace/SwiftMeta.swift:148:23: note: add '@MainActor' to make static property 'RTLD_DEFAULT' part of global actor 'MainActor'
public static let RTLD_DEFAULT = UnsafeMutableRawPointer(bitPattern: -2)!
^
@MainActor
/Users/admin/builder/spi-builder-workspace/SwiftTrace/SwiftMeta.swift:148:23: note: disable concurrency-safety checks if accesses are protected by an external synchronization mechanism
public static let RTLD_DEFAULT = UnsafeMutableRawPointer(bitPattern: -2)!
^
nonisolated(unsafe)
/Users/admin/builder/spi-builder-workspace/SwiftTrace/SwiftMeta.swift:149:23: warning: static property 'RTLD_SELF' is not concurrency-safe because non-'Sendable' type 'UnsafeMutableRawPointer' may have shared mutable state; this is an error in the Swift 6 language mode
public static let RTLD_SELF = UnsafeMutableRawPointer(bitPattern: -3)!
^
Swift.UnsafeMutableRawPointer:1:23: note: struct 'UnsafeMutableRawPointer' does not conform to the 'Sendable' protocol
@frozen public struct UnsafeMutableRawPointer : _Pointer {
^
/Users/admin/builder/spi-builder-workspace/SwiftTrace/SwiftMeta.swift:149:23: note: add '@MainActor' to make static property 'RTLD_SELF' part of global actor 'MainActor'
public static let RTLD_SELF = UnsafeMutableRawPointer(bitPattern: -3)!
^
@MainActor
/Users/admin/builder/spi-builder-workspace/SwiftTrace/SwiftMeta.swift:149:23: note: disable concurrency-safety checks if accesses are protected by an external synchronization mechanism
public static let RTLD_SELF = UnsafeMutableRawPointer(bitPattern: -3)!
^
nonisolated(unsafe)
/Users/admin/builder/spi-builder-workspace/SwiftTrace/SwiftMeta.swift:150:23: warning: static property 'RTLD_MAIN_ONLY' is not concurrency-safe because non-'Sendable' type 'UnsafeMutableRawPointer' may have shared mutable state; this is an error in the Swift 6 language mode
public static let RTLD_MAIN_ONLY = UnsafeMutableRawPointer(bitPattern: -5)!
^
Swift.UnsafeMutableRawPointer:1:23: note: struct 'UnsafeMutableRawPointer' does not conform to the 'Sendable' protocol
@frozen public struct UnsafeMutableRawPointer : _Pointer {
^
/Users/admin/builder/spi-builder-workspace/SwiftTrace/SwiftMeta.swift:150:23: note: add '@MainActor' to make static property 'RTLD_MAIN_ONLY' part of global actor 'MainActor'
public static let RTLD_MAIN_ONLY = UnsafeMutableRawPointer(bitPattern: -5)!
^
@MainActor
/Users/admin/builder/spi-builder-workspace/SwiftTrace/SwiftMeta.swift:150:23: note: disable concurrency-safety checks if accesses are protected by an external synchronization mechanism
public static let RTLD_MAIN_ONLY = UnsafeMutableRawPointer(bitPattern: -5)!
^
nonisolated(unsafe)
/Users/admin/builder/spi-builder-workspace/SwiftTrace/SwiftMeta.swift:176:16: warning: static property 'getOptionalTypeFptr' is not concurrency-safe because it is nonisolated global shared mutable state; this is an error in the Swift 6 language mode
static var getOptionalTypeFptr = bindGeneric(name: "getOptionalType")
^
/Users/admin/builder/spi-builder-workspace/SwiftTrace/SwiftMeta.swift:176:16: note: convert 'getOptionalTypeFptr' to a 'let' constant to make 'Sendable' shared state immutable
static var getOptionalTypeFptr = bindGeneric(name: "getOptionalType")
~~~ ^
let
/Users/admin/builder/spi-builder-workspace/SwiftTrace/SwiftMeta.swift:176:16: note: add '@MainActor' to make static property 'getOptionalTypeFptr' part of global actor 'MainActor'
static var getOptionalTypeFptr = bindGeneric(name: "getOptionalType")
^
@MainActor
/Users/admin/builder/spi-builder-workspace/SwiftTrace/SwiftMeta.swift:176:16: note: disable concurrency-safety checks if accesses are protected by an external synchronization mechanism
static var getOptionalTypeFptr = bindGeneric(name: "getOptionalType")
^
nonisolated(unsafe)
/Users/admin/builder/spi-builder-workspace/SwiftTrace/SwiftMeta.swift:177:16: warning: static property 'getMixedTypeFptr' is not concurrency-safe because it is nonisolated global shared mutable state; this is an error in the Swift 6 language mode
static var getMixedTypeFptr = bindGeneric(name: "getMixedType")
^
/Users/admin/builder/spi-builder-workspace/SwiftTrace/SwiftMeta.swift:177:16: note: convert 'getMixedTypeFptr' to a 'let' constant to make 'Sendable' shared state immutable
static var getMixedTypeFptr = bindGeneric(name: "getMixedType")
~~~ ^
let
/Users/admin/builder/spi-builder-workspace/SwiftTrace/SwiftMeta.swift:177:16: note: add '@MainActor' to make static property 'getMixedTypeFptr' part of global actor 'MainActor'
static var getMixedTypeFptr = bindGeneric(name: "getMixedType")
^
@MainActor
/Users/admin/builder/spi-builder-workspace/SwiftTrace/SwiftMeta.swift:177:16: note: disable concurrency-safety checks if accesses are protected by an external synchronization mechanism
static var getMixedTypeFptr = bindGeneric(name: "getMixedType")
^
nonisolated(unsafe)
/Users/admin/builder/spi-builder-workspace/SwiftTrace/SwiftMeta.swift:178:16: warning: static property 'getEnumTypeFptr' is not concurrency-safe because it is nonisolated global shared mutable state; this is an error in the Swift 6 language mode
static var getEnumTypeFptr = bindGeneric(name: "getEnumType")
^
/Users/admin/builder/spi-builder-workspace/SwiftTrace/SwiftMeta.swift:178:16: note: convert 'getEnumTypeFptr' to a 'let' constant to make 'Sendable' shared state immutable
static var getEnumTypeFptr = bindGeneric(name: "getEnumType")
~~~ ^
let
/Users/admin/builder/spi-builder-workspace/SwiftTrace/SwiftMeta.swift:178:16: note: add '@MainActor' to make static property 'getEnumTypeFptr' part of global actor 'MainActor'
static var getEnumTypeFptr = bindGeneric(name: "getEnumType")
^
@MainActor
/Users/admin/builder/spi-builder-workspace/SwiftTrace/SwiftMeta.swift:178:16: note: disable concurrency-safety checks if accesses are protected by an external synchronization mechanism
static var getEnumTypeFptr = bindGeneric(name: "getEnumType")
^
nonisolated(unsafe)
/Users/admin/builder/spi-builder-workspace/SwiftTrace/SwiftMeta.swift:179:16: warning: static property 'getMetaTypeFptr' is not concurrency-safe because it is nonisolated global shared mutable state; this is an error in the Swift 6 language mode
static var getMetaTypeFptr = bindGeneric(name: "getMetaType")
^
/Users/admin/builder/spi-builder-workspace/SwiftTrace/SwiftMeta.swift:179:16: note: convert 'getMetaTypeFptr' to a 'let' constant to make 'Sendable' shared state immutable
static var getMetaTypeFptr = bindGeneric(name: "getMetaType")
~~~ ^
let
/Users/admin/builder/spi-builder-workspace/SwiftTrace/SwiftMeta.swift:179:16: note: add '@MainActor' to make static property 'getMetaTypeFptr' part of global actor 'MainActor'
static var getMetaTypeFptr = bindGeneric(name: "getMetaType")
^
@MainActor
/Users/admin/builder/spi-builder-workspace/SwiftTrace/SwiftMeta.swift:179:16: note: disable concurrency-safety checks if accesses are protected by an external synchronization mechanism
static var getMetaTypeFptr = bindGeneric(name: "getMetaType")
^
nonisolated(unsafe)
/Users/admin/builder/spi-builder-workspace/SwiftTrace/SwiftMeta.swift:182:23: warning: static property 'wrapperHandlers' is not concurrency-safe because it is nonisolated global shared mutable state; this is an error in the Swift 6 language mode
public static var wrapperHandlers = [
^
/Users/admin/builder/spi-builder-workspace/SwiftTrace/SwiftMeta.swift:182:23: note: convert 'wrapperHandlers' to a 'let' constant to make 'Sendable' shared state immutable
public static var wrapperHandlers = [
~~~ ^
let
/Users/admin/builder/spi-builder-workspace/SwiftTrace/SwiftMeta.swift:182:23: note: add '@MainActor' to make static property 'wrapperHandlers' part of global actor 'MainActor'
public static var wrapperHandlers = [
^
@MainActor
/Users/admin/builder/spi-builder-workspace/SwiftTrace/SwiftMeta.swift:182:23: note: disable concurrency-safety checks if accesses are protected by an external synchronization mechanism
public static var wrapperHandlers = [
^
nonisolated(unsafe)
/Users/admin/builder/spi-builder-workspace/SwiftTrace/SwiftMeta.swift:197:23: warning: static property 'conformanceManglings' is not concurrency-safe because it is nonisolated global shared mutable state; this is an error in the Swift 6 language mode
public static var conformanceManglings = [
^
/Users/admin/builder/spi-builder-workspace/SwiftTrace/SwiftMeta.swift:197:23: note: convert 'conformanceManglings' to a 'let' constant to make 'Sendable' shared state immutable
public static var conformanceManglings = [
~~~ ^
let
/Users/admin/builder/spi-builder-workspace/SwiftTrace/SwiftMeta.swift:197:23: note: add '@MainActor' to make static property 'conformanceManglings' part of global actor 'MainActor'
public static var conformanceManglings = [
^
@MainActor
/Users/admin/builder/spi-builder-workspace/SwiftTrace/SwiftMeta.swift:197:23: note: disable concurrency-safety checks if accesses are protected by an external synchronization mechanism
public static var conformanceManglings = [
^
nonisolated(unsafe)
/Users/admin/builder/spi-builder-workspace/SwiftTrace/SwiftMeta.swift:210:23: warning: static property 'nameAbbreviations' is not concurrency-safe because it is nonisolated global shared mutable state; this is an error in the Swift 6 language mode
public static var nameAbbreviations = [
^
/Users/admin/builder/spi-builder-workspace/SwiftTrace/SwiftMeta.swift:210:23: note: convert 'nameAbbreviations' to a 'let' constant to make 'Sendable' shared state immutable
public static var nameAbbreviations = [
~~~ ^
let
/Users/admin/builder/spi-builder-workspace/SwiftTrace/SwiftMeta.swift:210:23: note: add '@MainActor' to make static property 'nameAbbreviations' part of global actor 'MainActor'
public static var nameAbbreviations = [
^
@MainActor
/Users/admin/builder/spi-builder-workspace/SwiftTrace/SwiftMeta.swift:210:23: note: disable concurrency-safety checks if accesses are protected by an external synchronization mechanism
public static var nameAbbreviations = [
^
nonisolated(unsafe)
/Users/admin/builder/spi-builder-workspace/SwiftTrace/SwiftMeta.swift:214:23: warning: static property 'typeLookupCache' is not concurrency-safe because it is nonisolated global shared mutable state; this is an error in the Swift 6 language mode
public static var typeLookupCache: [String: Any.Type?] = [
^
/Users/admin/builder/spi-builder-workspace/SwiftTrace/SwiftMeta.swift:214:23: note: convert 'typeLookupCache' to a 'let' constant to make 'Sendable' shared state immutable
public static var typeLookupCache: [String: Any.Type?] = [
~~~ ^
let
/Users/admin/builder/spi-builder-workspace/SwiftTrace/SwiftMeta.swift:214:23: note: add '@MainActor' to make static property 'typeLookupCache' part of global actor 'MainActor'
public static var typeLookupCache: [String: Any.Type?] = [
^
@MainActor
/Users/admin/builder/spi-builder-workspace/SwiftTrace/SwiftMeta.swift:214:23: note: disable concurrency-safety checks if accesses are protected by an external synchronization mechanism
public static var typeLookupCache: [String: Any.Type?] = [
^
nonisolated(unsafe)
/Users/admin/builder/spi-builder-workspace/SwiftTrace/SwiftMeta.swift:239:16: warning: static property 'typeLookupCacheLock' is not concurrency-safe because it is nonisolated global shared mutable state; this is an error in the Swift 6 language mode
static var typeLookupCacheLock = OS_SPINLOCK_INIT
^
/Users/admin/builder/spi-builder-workspace/SwiftTrace/SwiftMeta.swift:239:16: note: convert 'typeLookupCacheLock' to a 'let' constant to make 'Sendable' shared state immutable
static var typeLookupCacheLock = OS_SPINLOCK_INIT
~~~ ^
let
/Users/admin/builder/spi-builder-workspace/SwiftTrace/SwiftMeta.swift:239:16: note: add '@MainActor' to make static property 'typeLookupCacheLock' part of global actor 'MainActor'
static var typeLookupCacheLock = OS_SPINLOCK_INIT
^
@MainActor
/Users/admin/builder/spi-builder-workspace/SwiftTrace/SwiftMeta.swift:239:16: note: disable concurrency-safety checks if accesses are protected by an external synchronization mechanism
static var typeLookupCacheLock = OS_SPINLOCK_INIT
^
nonisolated(unsafe)
/Users/admin/builder/spi-builder-workspace/SwiftTrace/SwiftMeta.swift:387:16: warning: static property 'approximateFieldInfoByTypeName' is not concurrency-safe because it is nonisolated global shared mutable state; this is an error in the Swift 6 language mode
static var approximateFieldInfoByTypeName = [String: [FieldInfo]]()
^
/Users/admin/builder/spi-builder-workspace/SwiftTrace/SwiftMeta.swift:387:16: note: convert 'approximateFieldInfoByTypeName' to a 'let' constant to make 'Sendable' shared state immutable
static var approximateFieldInfoByTypeName = [String: [FieldInfo]]()
~~~ ^
let
/Users/admin/builder/spi-builder-workspace/SwiftTrace/SwiftMeta.swift:387:16: note: add '@MainActor' to make static property 'approximateFieldInfoByTypeName' part of global actor 'MainActor'
static var approximateFieldInfoByTypeName = [String: [FieldInfo]]()
^
@MainActor
/Users/admin/builder/spi-builder-workspace/SwiftTrace/SwiftMeta.swift:387:16: note: disable concurrency-safety checks if accesses are protected by an external synchronization mechanism
static var approximateFieldInfoByTypeName = [String: [FieldInfo]]()
^
nonisolated(unsafe)
/Users/admin/builder/spi-builder-workspace/SwiftTrace/SwiftMeta.swift:388:16: warning: static property 'doesntHaveStorage' is not concurrency-safe because it is nonisolated global shared mutable state; this is an error in the Swift 6 language mode
static var doesntHaveStorage = Set<String>()
^
/Users/admin/builder/spi-builder-workspace/SwiftTrace/SwiftMeta.swift:388:16: note: convert 'doesntHaveStorage' to a 'let' constant to make 'Sendable' shared state immutable
static var doesntHaveStorage = Set<String>()
~~~ ^
let
/Users/admin/builder/spi-builder-workspace/SwiftTrace/SwiftMeta.swift:388:16: note: add '@MainActor' to make static property 'doesntHaveStorage' part of global actor 'MainActor'
static var doesntHaveStorage = Set<String>()
^
@MainActor
/Users/admin/builder/spi-builder-workspace/SwiftTrace/SwiftMeta.swift:388:16: note: disable concurrency-safety checks if accesses are protected by an external synchronization mechanism
static var doesntHaveStorage = Set<String>()
^
nonisolated(unsafe)
/Users/admin/builder/spi-builder-workspace/SwiftTrace/SwiftMeta.swift:390:23: warning: static property 'structsPassedByReference' is not concurrency-safe because it is nonisolated global shared mutable state; this is an error in the Swift 6 language mode
public static var structsPassedByReference: Set<UnsafeRawPointer> = {
^
/Users/admin/builder/spi-builder-workspace/SwiftTrace/SwiftMeta.swift:390:23: note: convert 'structsPassedByReference' to a 'let' constant to make 'Sendable' shared state immutable
public static var structsPassedByReference: Set<UnsafeRawPointer> = {
~~~ ^
let
/Users/admin/builder/spi-builder-workspace/SwiftTrace/SwiftMeta.swift:390:23: note: add '@MainActor' to make static property 'structsPassedByReference' part of global actor 'MainActor'
public static var structsPassedByReference: Set<UnsafeRawPointer> = {
^
@MainActor
/Users/admin/builder/spi-builder-workspace/SwiftTrace/SwiftMeta.swift:390:23: note: disable concurrency-safety checks if accesses are protected by an external synchronization mechanism
public static var structsPassedByReference: Set<UnsafeRawPointer> = {
^
nonisolated(unsafe)
/Users/admin/builder/spi-builder-workspace/SwiftTrace/SwiftMeta.swift:447:16: warning: static property 'structsAllFloats' is not concurrency-safe because it is nonisolated global shared mutable state; this is an error in the Swift 6 language mode
static var structsAllFloats = Set<UnsafeRawPointer>()
^
/Users/admin/builder/spi-builder-workspace/SwiftTrace/SwiftMeta.swift:447:16: note: convert 'structsAllFloats' to a 'let' constant to make 'Sendable' shared state immutable
static var structsAllFloats = Set<UnsafeRawPointer>()
~~~ ^
let
/Users/admin/builder/spi-builder-workspace/SwiftTrace/SwiftMeta.swift:447:16: note: add '@MainActor' to make static property 'structsAllFloats' part of global actor 'MainActor'
static var structsAllFloats = Set<UnsafeRawPointer>()
^
@MainActor
/Users/admin/builder/spi-builder-workspace/SwiftTrace/SwiftMeta.swift:447:16: note: disable concurrency-safety checks if accesses are protected by an external synchronization mechanism
static var structsAllFloats = Set<UnsafeRawPointer>()
^
nonisolated(unsafe)
/Users/admin/builder/spi-builder-workspace/SwiftTrace/SwiftMeta.swift:682:43: warning: forming 'UnsafeRawPointer' to a variable of type 'Wrapped'; this is likely incorrect because 'Wrapped' may contain an object reference.
SwiftTrace.Decorated.describe(&value, type: Wrapped.self, out: &out)
^
Ld /Users/admin/builder/spi-builder-workspace/.derivedData/Build/Products/Debug/SwiftTraceGutsD.o normal (in target 'SwiftTraceGutsD' from project 'SwiftTrace')
cd /Users/admin/builder/spi-builder-workspace
/Applications/Xcode-16.3.0.app/Contents/Developer/Toolchains/XcodeDefault.xctoolchain/usr/bin/clang++ -Xlinker -reproducible -target arm64-apple-macos10.13 -r -isysroot /Applications/Xcode-16.3.0.app/Contents/Developer/Platforms/MacOSX.platform/Developer/SDKs/MacOSX15.4.sdk -O0 -L/Users/admin/builder/spi-builder-workspace/.derivedData/Build/Intermediates.noindex/EagerLinkingTBDs/Debug -L/Users/admin/builder/spi-builder-workspace/.derivedData/Build/Products/Debug -L/Applications/Xcode-16.3.0.app/Contents/Developer/Platforms/MacOSX.platform/Developer/usr/lib -F/Users/admin/builder/spi-builder-workspace/.derivedData/Build/Intermediates.noindex/EagerLinkingTBDs/Debug -F/Users/admin/builder/spi-builder-workspace/.derivedData/Build/Products/Debug -iframework /Applications/Xcode-16.3.0.app/Contents/Developer/Platforms/MacOSX.platform/Developer/Library/Frameworks -filelist /Users/admin/builder/spi-builder-workspace/.derivedData/Build/Intermediates.noindex/SwiftTrace.build/Debug/SwiftTraceGutsD.build/Objects-normal/arm64/SwiftTraceGutsD.LinkFileList -nostdlib -Xlinker -object_path_lto -Xlinker /Users/admin/builder/spi-builder-workspace/.derivedData/Build/Intermediates.noindex/SwiftTrace.build/Debug/SwiftTraceGutsD.build/Objects-normal/arm64/SwiftTraceGutsD_lto.o -rdynamic -Xlinker -no_deduplicate -Xlinker -dependency_info -Xlinker /Users/admin/builder/spi-builder-workspace/.derivedData/Build/Intermediates.noindex/SwiftTrace.build/Debug/SwiftTraceGutsD.build/Objects-normal/arm64/SwiftTraceGutsD_dependency_info.dat -fobjc-arc -fobjc-link-runtime -o /Users/admin/builder/spi-builder-workspace/.derivedData/Build/Products/Debug/SwiftTraceGutsD.o
SwiftDriverJobDiscovery normal arm64 Compiling SwiftStack.swift (in target 'SwiftTraceD' from project 'SwiftTrace')
SwiftCompile normal arm64 Compiling\ SwiftArgs.swift,\ SwiftAspects.swift /Users/admin/builder/spi-builder-workspace/SwiftTrace/SwiftArgs.swift /Users/admin/builder/spi-builder-workspace/SwiftTrace/SwiftAspects.swift (in target 'SwiftTrace' from project 'SwiftTrace')
SwiftCompile normal arm64 /Users/admin/builder/spi-builder-workspace/SwiftTrace/SwiftArgs.swift (in target 'SwiftTrace' from project 'SwiftTrace')
cd /Users/admin/builder/spi-builder-workspace/.swiftpm/xcode
SwiftCompile normal arm64 /Users/admin/builder/spi-builder-workspace/SwiftTrace/SwiftAspects.swift (in target 'SwiftTrace' from project 'SwiftTrace')
cd /Users/admin/builder/spi-builder-workspace/.swiftpm/xcode
SwiftCompile normal arm64 Compiling\ EasyPointer.swift,\ StringIndex.swift /Users/admin/builder/spi-builder-workspace/SwiftTrace/EasyPointer.swift /Users/admin/builder/spi-builder-workspace/SwiftTrace/StringIndex.swift (in target 'SwiftTrace' from project 'SwiftTrace')
SwiftCompile normal arm64 /Users/admin/builder/spi-builder-workspace/SwiftTrace/EasyPointer.swift (in target 'SwiftTrace' from project 'SwiftTrace')
cd /Users/admin/builder/spi-builder-workspace/.swiftpm/xcode
SwiftCompile normal arm64 /Users/admin/builder/spi-builder-workspace/SwiftTrace/StringIndex.swift (in target 'SwiftTrace' from project 'SwiftTrace')
cd /Users/admin/builder/spi-builder-workspace/.swiftpm/xcode
SwiftDriverJobDiscovery normal arm64 Compiling SwiftLifetime.swift (in target 'SwiftTraceD' from project 'SwiftTrace')
SwiftCompile normal arm64 Compiling\ SwiftLifetime.swift /Users/admin/builder/spi-builder-workspace/SwiftTrace/SwiftLifetime.swift (in target 'SwiftTrace' from project 'SwiftTrace')
SwiftCompile normal arm64 /Users/admin/builder/spi-builder-workspace/SwiftTrace/SwiftLifetime.swift (in target 'SwiftTrace' from project 'SwiftTrace')
cd /Users/admin/builder/spi-builder-workspace/.swiftpm/xcode
/Users/admin/builder/spi-builder-workspace/SwiftTrace/SwiftLifetime.swift:32:23: warning: static property 'liveObjects' is not concurrency-safe because it is nonisolated global shared mutable state; this is an error in the Swift 6 language mode
public static var liveObjects = [UnsafeRawPointer: Set<UnsafeRawPointer>]()
^
/Users/admin/builder/spi-builder-workspace/SwiftTrace/SwiftLifetime.swift:32:23: note: convert 'liveObjects' to a 'let' constant to make 'Sendable' shared state immutable
public static var liveObjects = [UnsafeRawPointer: Set<UnsafeRawPointer>]()
~~~ ^
let
/Users/admin/builder/spi-builder-workspace/SwiftTrace/SwiftLifetime.swift:32:23: note: add '@MainActor' to make static property 'liveObjects' part of global actor 'MainActor'
public static var liveObjects = [UnsafeRawPointer: Set<UnsafeRawPointer>]()
^
@MainActor
/Users/admin/builder/spi-builder-workspace/SwiftTrace/SwiftLifetime.swift:32:23: note: disable concurrency-safety checks if accesses are protected by an external synchronization mechanism
public static var liveObjects = [UnsafeRawPointer: Set<UnsafeRawPointer>]()
^
nonisolated(unsafe)
/Users/admin/builder/spi-builder-workspace/SwiftTrace/SwiftLifetime.swift:33:23: warning: static property 'liveObjectsLock' is not concurrency-safe because it is nonisolated global shared mutable state; this is an error in the Swift 6 language mode
public static var liveObjectsLock = OS_SPINLOCK_INIT
^
/Users/admin/builder/spi-builder-workspace/SwiftTrace/SwiftLifetime.swift:33:23: note: convert 'liveObjectsLock' to a 'let' constant to make 'Sendable' shared state immutable
public static var liveObjectsLock = OS_SPINLOCK_INIT
~~~ ^
let
/Users/admin/builder/spi-builder-workspace/SwiftTrace/SwiftLifetime.swift:33:23: note: add '@MainActor' to make static property 'liveObjectsLock' part of global actor 'MainActor'
public static var liveObjectsLock = OS_SPINLOCK_INIT
^
@MainActor
/Users/admin/builder/spi-builder-workspace/SwiftTrace/SwiftLifetime.swift:33:23: note: disable concurrency-safety checks if accesses are protected by an external synchronization mechanism
public static var liveObjectsLock = OS_SPINLOCK_INIT
^
nonisolated(unsafe)
/Users/admin/builder/spi-builder-workspace/SwiftTrace/SwiftLifetime.swift:34:24: warning: static property 'reaperKey' is not concurrency-safe because it is nonisolated global shared mutable state; this is an error in the Swift 6 language mode
private static var reaperKey = strdup("_reaper_")!
^
/Users/admin/builder/spi-builder-workspace/SwiftTrace/SwiftLifetime.swift:34:24: note: convert 'reaperKey' to a 'let' constant to make 'Sendable' shared state immutable
private static var reaperKey = strdup("_reaper_")!
~~~ ^
let
/Users/admin/builder/spi-builder-workspace/SwiftTrace/SwiftLifetime.swift:34:24: note: add '@MainActor' to make static property 'reaperKey' part of global actor 'MainActor'
private static var reaperKey = strdup("_reaper_")!
^
@MainActor
/Users/admin/builder/spi-builder-workspace/SwiftTrace/SwiftLifetime.swift:34:24: note: disable concurrency-safety checks if accesses are protected by an external synchronization mechanism
private static var reaperKey = strdup("_reaper_")!
^
nonisolated(unsafe)
SwiftDriverJobDiscovery normal arm64 Compiling SwiftMeta.swift (in target 'SwiftTraceD' from project 'SwiftTrace')
SwiftCompile normal arm64 Compiling\ SwiftInterpose.swift /Users/admin/builder/spi-builder-workspace/SwiftTrace/SwiftInterpose.swift (in target 'SwiftTrace' from project 'SwiftTrace')
SwiftCompile normal arm64 /Users/admin/builder/spi-builder-workspace/SwiftTrace/SwiftInterpose.swift (in target 'SwiftTrace' from project 'SwiftTrace')
cd /Users/admin/builder/spi-builder-workspace/.swiftpm/xcode
SwiftDriverJobDiscovery normal arm64 Compiling SwiftStats.swift (in target 'SwiftTraceD' from project 'SwiftTrace')
SwiftCompile normal arm64 Compiling\ SwiftStats.swift /Users/admin/builder/spi-builder-workspace/SwiftTrace/SwiftStats.swift (in target 'SwiftTrace' from project 'SwiftTrace')
SwiftCompile normal arm64 /Users/admin/builder/spi-builder-workspace/SwiftTrace/SwiftStats.swift (in target 'SwiftTrace' from project 'SwiftTrace')
cd /Users/admin/builder/spi-builder-workspace/.swiftpm/xcode
SwiftDriverJobDiscovery normal arm64 Compiling SwiftMeta.swift (in target 'SwiftTrace' from project 'SwiftTrace')
SwiftCompile normal arm64 Compiling\ SwiftStack.swift /Users/admin/builder/spi-builder-workspace/SwiftTrace/SwiftStack.swift (in target 'SwiftTrace' from project 'SwiftTrace')
SwiftCompile normal arm64 /Users/admin/builder/spi-builder-workspace/SwiftTrace/SwiftStack.swift (in target 'SwiftTrace' from project 'SwiftTrace')
cd /Users/admin/builder/spi-builder-workspace/.swiftpm/xcode
SwiftCompile normal arm64 Compiling\ SwiftSwizzle.swift /Users/admin/builder/spi-builder-workspace/SwiftTrace/SwiftSwizzle.swift (in target 'SwiftTrace' from project 'SwiftTrace')
SwiftCompile normal arm64 /Users/admin/builder/spi-builder-workspace/SwiftTrace/SwiftSwizzle.swift (in target 'SwiftTrace' from project 'SwiftTrace')
cd /Users/admin/builder/spi-builder-workspace/.swiftpm/xcode
SwiftCompile normal arm64 Compiling\ SwiftInvoke.swift /Users/admin/builder/spi-builder-workspace/SwiftTrace/SwiftInvoke.swift (in target 'SwiftTrace' from project 'SwiftTrace')
SwiftCompile normal arm64 /Users/admin/builder/spi-builder-workspace/SwiftTrace/SwiftInvoke.swift (in target 'SwiftTrace' from project 'SwiftTrace')
cd /Users/admin/builder/spi-builder-workspace/.swiftpm/xcode
SwiftCompile normal arm64 Compiling\ SwiftTrace.swift /Users/admin/builder/spi-builder-workspace/SwiftTrace/SwiftTrace.swift (in target 'SwiftTrace' from project 'SwiftTrace')
SwiftCompile normal arm64 /Users/admin/builder/spi-builder-workspace/SwiftTrace/SwiftTrace.swift (in target 'SwiftTrace' from project 'SwiftTrace')
cd /Users/admin/builder/spi-builder-workspace/.swiftpm/xcode
SwiftDriverJobDiscovery normal arm64 Compiling SwiftTrace.swift (in target 'SwiftTraceD' from project 'SwiftTrace')
SwiftDriverJobDiscovery normal arm64 Compiling SwiftSwizzle.swift (in target 'SwiftTraceD' from project 'SwiftTrace')
SwiftDriverJobDiscovery normal arm64 Compiling EasyPointer.swift, StringIndex.swift (in target 'SwiftTraceD' from project 'SwiftTrace')
SwiftDriverJobDiscovery normal arm64 Compiling SwiftInterpose.swift (in target 'SwiftTraceD' from project 'SwiftTrace')
SwiftDriverJobDiscovery normal arm64 Compiling SwiftStats.swift (in target 'SwiftTrace' from project 'SwiftTrace')
RegisterExecutionPolicyException /Users/admin/builder/spi-builder-workspace/.derivedData/Build/Products/Debug/SwiftTraceGutsD.o (in target 'SwiftTraceGutsD' from project 'SwiftTrace')
cd /Users/admin/builder/spi-builder-workspace
builtin-RegisterExecutionPolicyException /Users/admin/builder/spi-builder-workspace/.derivedData/Build/Products/Debug/SwiftTraceGutsD.o
RegisterExecutionPolicyException /Users/admin/builder/spi-builder-workspace/.derivedData/Build/Products/Debug/SwiftTraceGuts.o (in target 'SwiftTraceGuts' from project 'SwiftTrace')
cd /Users/admin/builder/spi-builder-workspace
builtin-RegisterExecutionPolicyException /Users/admin/builder/spi-builder-workspace/.derivedData/Build/Products/Debug/SwiftTraceGuts.o
Ld /Users/admin/builder/spi-builder-workspace/.derivedData/Build/Products/Debug/PackageFrameworks/SwiftTraceGutsD.framework/Versions/A/SwiftTraceGutsD normal (in target 'SwiftTraceGutsD' from project 'SwiftTrace')
cd /Users/admin/builder/spi-builder-workspace
/Applications/Xcode-16.3.0.app/Contents/Developer/Toolchains/XcodeDefault.xctoolchain/usr/bin/clang -Xlinker -reproducible -target arm64-apple-macos10.13 -dynamiclib -isysroot /Applications/Xcode-16.3.0.app/Contents/Developer/Platforms/MacOSX.platform/Developer/SDKs/MacOSX15.4.sdk -O0 -L/Users/admin/builder/spi-builder-workspace/.derivedData/Build/Intermediates.noindex/EagerLinkingTBDs/Debug -L/Users/admin/builder/spi-builder-workspace/.derivedData/Build/Products/Debug -L/Applications/Xcode-16.3.0.app/Contents/Developer/Platforms/MacOSX.platform/Developer/usr/lib -F/Users/admin/builder/spi-builder-workspace/.derivedData/Build/Intermediates.noindex/EagerLinkingTBDs/Debug -F/Users/admin/builder/spi-builder-workspace/.derivedData/Build/Products/Debug/PackageFrameworks -F/Users/admin/builder/spi-builder-workspace/.derivedData/Build/Products/Debug -iframework /Applications/Xcode-16.3.0.app/Contents/Developer/Platforms/MacOSX.platform/Developer/Library/Frameworks -filelist /Users/admin/builder/spi-builder-workspace/.derivedData/Build/Intermediates.noindex/SwiftTrace.build/Debug/SwiftTraceGutsD\ product.build/Objects-normal/arm64/SwiftTraceGutsD.LinkFileList -install_name @rpath/SwiftTraceGutsD.framework/Versions/A/SwiftTraceGutsD -Xlinker -rpath -Xlinker /Users/admin/builder/spi-builder-workspace/.derivedData/Build/Products/Debug/PackageFrameworks -Xlinker -object_path_lto -Xlinker /Users/admin/builder/spi-builder-workspace/.derivedData/Build/Intermediates.noindex/SwiftTrace.build/Debug/SwiftTraceGutsD\ product.build/Objects-normal/arm64/SwiftTraceGutsD_lto.o -rdynamic -Xlinker -no_deduplicate -Xlinker -dependency_info -Xlinker /Users/admin/builder/spi-builder-workspace/.derivedData/Build/Intermediates.noindex/SwiftTrace.build/Debug/SwiftTraceGutsD\ product.build/Objects-normal/arm64/SwiftTraceGutsD_dependency_info.dat -lc++ -Wl,-no_warn_duplicate_libraries -o /Users/admin/builder/spi-builder-workspace/.derivedData/Build/Products/Debug/PackageFrameworks/SwiftTraceGutsD.framework/Versions/A/SwiftTraceGutsD
Undefined symbols for architecture arm64:
"_NSLog", referenced from:
+[NSObject(SwiftTrace) swiftTraceDefaultMethodExclusions] in SwiftTraceGutsD.o
+[NSObject(SwiftTrace) swiftTraceDefaultMethodExclusions] in SwiftTraceGutsD.o
+[NSObject(SwiftTrace) swiftTraceDefaultMethodExclusions] in SwiftTraceGutsD.o
+[NSObject(SwiftTrace) swiftTraceDefaultMethodExclusions] in SwiftTraceGutsD.o
"_OBJC_CLASS_$_NSAssertionHandler", referenced from:
in SwiftTraceGutsD.o
"_OBJC_CLASS_$_NSBundle", referenced from:
in SwiftTraceGutsD.o
"_OBJC_CLASS_$_NSMethodSignature", referenced from:
in SwiftTraceGutsD.o
"_OBJC_CLASS_$_NSMutableArray", referenced from:
in SwiftTraceGutsD.o
"_OBJC_CLASS_$_NSObject", referenced from:
__OBJC_$_CATEGORY_NSObject_$_SwiftTrace in SwiftTraceGutsD.o
in SwiftTraceGutsD.o
"_OBJC_CLASS_$_NSString", referenced from:
in SwiftTraceGutsD.o
"_OBJC_CLASS_$_NSThread", referenced from:
in SwiftTraceGutsD.o
"_OBJC_CLASS_$_NSValue", referenced from:
in SwiftTraceGutsD.o
"_OBJC_CLASS_$_SwiftMeta", referenced from:
in SwiftTraceGutsD.o
"_OBJC_CLASS_$_SwiftTrace", referenced from:
in SwiftTraceGutsD.o
"_OBJC_EHTYPE_$_NSException", referenced from:
GCC_except_table2 in SwiftTraceGutsD.o
"___CFConstantStringClassReference", referenced from:
in SwiftTraceGutsD.o
in SwiftTraceGutsD.o
in SwiftTraceGutsD.o
in SwiftTraceGutsD.o
in SwiftTraceGutsD.o
in SwiftTraceGutsD.o
in SwiftTraceGutsD.o
...
"___objc_personality_v0", referenced from:
/Users/admin/builder/spi-builder-workspace/.derivedData/Build/Products/Debug/SwiftTraceGutsD.o
"_class_getImageName", referenced from:
+[NSObject(SwiftTrace) swiftTraceDefaultMethodExclusions] in SwiftTraceGutsD.o
"_class_getSuperclass", referenced from:
+[NSObject(SwiftTrace) swiftTraceDefaultMethodExclusions] in SwiftTraceGutsD.o
"_method_getTypeEncoding", referenced from:
+[NSObject(SwiftTrace) swiftTraceDefaultMethodExclusions] in SwiftTraceGutsD.o
"_objc_autoreleasePoolPop", referenced from:
___cxx_global_var_init in SwiftTraceGutsD.o
"_objc_autoreleasePoolPush", referenced from:
___cxx_global_var_init in SwiftTraceGutsD.o
"_objc_autoreleaseReturnValue", referenced from:
+[NSObject(SwiftTrace) swiftTraceDefaultMethodExclusions] in SwiftTraceGutsD.o
+[NSObject(SwiftTrace) swiftTraceDefaultMethodExclusions] in SwiftTraceGutsD.o
+[NSObject(SwiftTrace) swiftTraceDefaultMethodExclusions] in SwiftTraceGutsD.o
+[NSObject(SwiftTrace) swiftTraceDefaultMethodExclusions] in SwiftTraceGutsD.o
+[NSObject(SwiftTrace) swiftTraceDefaultMethodExclusions] in SwiftTraceGutsD.o
+[NSObject(SwiftTrace) swiftTraceDefaultMethodExclusions] in SwiftTraceGutsD.o
"_objc_begin_catch", referenced from:
+[NSObject(SwiftTrace) swiftTraceDefaultMethodExclusions] in SwiftTraceGutsD.o
"_objc_copyClassList", referenced from:
+[NSObject(SwiftTrace) swiftTraceDefaultMethodExclusions] in SwiftTraceGutsD.o
"_objc_end_catch", referenced from:
+[NSObject(SwiftTrace) swiftTraceDefaultMethodExclusions] in SwiftTraceGutsD.o
+[NSObject(SwiftTrace) swiftTraceDefaultMethodExclusions] in SwiftTraceGutsD.o
"_objc_enumerationMutation", referenced from:
+[NSObject(SwiftTrace) swiftTraceDefaultMethodExclusions] in SwiftTraceGutsD.o
+[NSObject(SwiftTrace) swiftTraceDefaultMethodExclusions] in SwiftTraceGutsD.o
"_objc_msgSend", referenced from:
in objc-stubs-file
"_objc_release", referenced from:
+[NSObject(SwiftTrace) swiftTraceDefaultMethodExclusions] in SwiftTraceGutsD.o
+[NSObject(SwiftTrace) swiftTraceDefaultMethodExclusions] in SwiftTraceGutsD.o
+[NSObject(SwiftTrace) swiftTraceDefaultMethodExclusions] in SwiftTraceGutsD.o
+[NSObject(SwiftTrace) swiftTraceDefaultMethodExclusions] in SwiftTraceGutsD.o
+[NSObject(SwiftTrace) swiftTraceDefaultMethodExclusions] in SwiftTraceGutsD.o
+[NSObject(SwiftTrace) swiftTraceDefaultMethodExclusions] in SwiftTraceGutsD.o
+[NSObject(SwiftTrace) swiftTraceDefaultMethodExclusions] in SwiftTraceGutsD.o
+[NSObject(SwiftTrace) swiftTraceDefaultMethodExclusions] in SwiftTraceGutsD.o
+[NSObject(SwiftTrace) swiftTraceDefaultMethodExclusions] in SwiftTraceGutsD.o
+[NSObject(SwiftTrace) swiftTraceDefaultMethodExclusions] in SwiftTraceGutsD.o
+[NSObject(SwiftTrace) swiftTraceDefaultMethodExclusions] in SwiftTraceGutsD.o
+[NSObject(SwiftTrace) swiftTraceDefaultMethodExclusions] in SwiftTraceGutsD.o
+[NSObject(SwiftTrace) swiftTraceDefaultMethodExclusions] in SwiftTraceGutsD.o
+[NSObject(SwiftTrace) swiftTraceDefaultMethodExclusions] in SwiftTraceGutsD.o
+[NSObject(SwiftTrace) swiftTraceDefaultMethodExclusions] in SwiftTraceGutsD.o
+[NSObject(SwiftTrace) swiftTraceDefaultMethodExclusions] in SwiftTraceGutsD.o
+[NSObject(SwiftTrace) swiftTraceDefaultMethodExclusions] in SwiftTraceGutsD.o
+[NSObject(SwiftTrace) swiftTraceDefaultMethodExclusions] in SwiftTraceGutsD.o
+[NSObject(SwiftTrace) swiftTraceDefaultMethodExclusions] in SwiftTraceGutsD.o
+[NSObject(SwiftTrace) swiftTraceDefaultMethodExclusions] in SwiftTraceGutsD.o
+[NSObject(SwiftTrace) swiftTraceDefaultMethodExclusions] in SwiftTraceGutsD.o
+[NSObject(SwiftTrace) swiftTraceDefaultMethodExclusions] in SwiftTraceGutsD.o
+[NSObject(SwiftTrace) swiftTraceDefaultMethodExclusions] in SwiftTraceGutsD.o
+[NSObject(SwiftTrace) swiftTraceDefaultMethodExclusions] in SwiftTraceGutsD.o
+[NSObject(SwiftTrace) swiftTraceDefaultMethodExclusions] in SwiftTraceGutsD.o
+[NSObject(SwiftTrace) swiftTraceDefaultMethodExclusions] in SwiftTraceGutsD.o
+[NSObject(SwiftTrace) swiftTraceDefaultMethodExclusions] in SwiftTraceGutsD.o
+[NSObject(SwiftTrace) swiftTraceDefaultMethodExclusions] in SwiftTraceGutsD.o
+[NSObject(SwiftTrace) swiftTraceDefaultMethodExclusions] in SwiftTraceGutsD.o
+[NSObject(SwiftTrace) swiftTraceDefaultMethodExclusions] in SwiftTraceGutsD.o
+[NSObject(SwiftTrace) swiftTraceDefaultMethodExclusions] in SwiftTraceGutsD.o
+[NSObject(SwiftTrace) swiftTraceDefaultMethodExclusions] in SwiftTraceGutsD.o
+[NSObject(SwiftTrace) swiftTraceDefaultMethodExclusions] in SwiftTraceGutsD.o
+[NSObject(SwiftTrace) swiftTraceDefaultMethodExclusions] in SwiftTraceGutsD.o
+[NSObject(SwiftTrace) swiftTraceDefaultMethodExclusions] in SwiftTraceGutsD.o
+[NSObject(SwiftTrace) swiftTraceDefaultMethodExclusions] in SwiftTraceGutsD.o
+[NSObject(SwiftTrace) swiftTraceDefaultMethodExclusions] in SwiftTraceGutsD.o
+[NSObject(SwiftTrace) swiftTraceDefaultMethodExclusions] in SwiftTraceGutsD.o
+[NSObject(SwiftTrace) swiftTraceDefaultMethodExclusions] in SwiftTraceGutsD.o
...
"_objc_retain", referenced from:
+[NSObject(SwiftTrace) swiftTraceDefaultMethodExclusions] in SwiftTraceGutsD.o
+[NSObject(SwiftTrace) swiftTraceDefaultMethodExclusions] in SwiftTraceGutsD.o
+[NSObject(SwiftTrace) swiftTraceDefaultMethodExclusions] in SwiftTraceGutsD.o
+[NSObject(SwiftTrace) swiftTraceDefaultMethodExclusions] in SwiftTraceGutsD.o
+[NSObject(SwiftTrace) swiftTraceDefaultMethodExclusions] in SwiftTraceGutsD.o
"_objc_retainAutorelease", referenced from:
+[NSObject(SwiftTrace) swiftTraceDefaultMethodExclusions] in SwiftTraceGutsD.o
+[NSObject(SwiftTrace) swiftTraceDefaultMethodExclusions] in SwiftTraceGutsD.o
+[NSObject(SwiftTrace) swiftTraceDefaultMethodExclusions] in SwiftTraceGutsD.o
+[NSObject(SwiftTrace) swiftTraceDefaultMethodExclusions] in SwiftTraceGutsD.o
+[NSObject(SwiftTrace) swiftTraceDefaultMethodExclusions] in SwiftTraceGutsD.o
+[NSObject(SwiftTrace) swiftTraceDefaultMethodExclusions] in SwiftTraceGutsD.o
+[NSObject(SwiftTrace) swiftTraceDefaultMethodExclusions] in SwiftTraceGutsD.o
...
"_objc_retainAutoreleasedReturnValue", referenced from:
+[NSObject(SwiftTrace) swiftTraceDefaultMethodExclusions] in SwiftTraceGutsD.o
+[NSObject(SwiftTrace) swiftTraceDefaultMethodExclusions] in SwiftTraceGutsD.o
+[NSObject(SwiftTrace) swiftTraceDefaultMethodExclusions] in SwiftTraceGutsD.o
+[NSObject(SwiftTrace) swiftTraceDefaultMethodExclusions] in SwiftTraceGutsD.o
+[NSObject(SwiftTrace) swiftTraceDefaultMethodExclusions] in SwiftTraceGutsD.o
+[NSObject(SwiftTrace) swiftTraceDefaultMethodExclusions] in SwiftTraceGutsD.o
+[NSObject(SwiftTrace) swiftTraceDefaultMethodExclusions] in SwiftTraceGutsD.o
+[NSObject(SwiftTrace) swiftTraceDefaultMethodExclusions] in SwiftTraceGutsD.o
+[NSObject(SwiftTrace) swiftTraceDefaultMethodExclusions] in SwiftTraceGutsD.o
+[NSObject(SwiftTrace) swiftTraceDefaultMethodExclusions] in SwiftTraceGutsD.o
+[NSObject(SwiftTrace) swiftTraceDefaultMethodExclusions] in SwiftTraceGutsD.o
+[NSObject(SwiftTrace) swiftTraceDefaultMethodExclusions] in SwiftTraceGutsD.o
+[NSObject(SwiftTrace) swiftTraceDefaultMethodExclusions] in SwiftTraceGutsD.o
+[NSObject(SwiftTrace) swiftTraceDefaultMethodExclusions] in SwiftTraceGutsD.o
+[NSObject(SwiftTrace) swiftTraceDefaultMethodExclusions] in SwiftTraceGutsD.o
+[NSObject(SwiftTrace) swiftTraceDefaultMethodExclusions] in SwiftTraceGutsD.o
+[NSObject(SwiftTrace) swiftTraceDefaultMethodExclusions] in SwiftTraceGutsD.o
+[NSObject(SwiftTrace) swiftTraceDefaultMethodExclusions] in SwiftTraceGutsD.o
+[NSObject(SwiftTrace) swiftTraceDefaultMethodExclusions] in SwiftTraceGutsD.o
+[NSObject(SwiftTrace) swiftTraceDefaultMethodExclusions] in SwiftTraceGutsD.o
+[NSObject(SwiftTrace) swiftTraceDefaultMethodExclusions] in SwiftTraceGutsD.o
+[NSObject(SwiftTrace) swiftTraceDefaultMethodExclusions] in SwiftTraceGutsD.o
+[NSObject(SwiftTrace) swiftTraceDefaultMethodExclusions] in SwiftTraceGutsD.o
+[NSObject(SwiftTrace) swiftTraceDefaultMethodExclusions] in SwiftTraceGutsD.o
+[NSObject(SwiftTrace) swiftTraceDefaultMethodExclusions] in SwiftTraceGutsD.o
+[NSObject(SwiftTrace) swiftTraceDefaultMethodExclusions] in SwiftTraceGutsD.o
+[NSObject(SwiftTrace) swiftTraceDefaultMethodExclusions] in SwiftTraceGutsD.o
...
"_objc_retainBlock", referenced from:
+[NSObject(SwiftTrace) swiftTraceDefaultMethodExclusions] in SwiftTraceGutsD.o
"_objc_storeStrong", referenced from:
+[NSObject(SwiftTrace) swiftTraceDefaultMethodExclusions] in SwiftTraceGutsD.o
+[NSObject(SwiftTrace) swiftTraceDefaultMethodExclusions] in SwiftTraceGutsD.o
+[NSObject(SwiftTrace) swiftTraceDefaultMethodExclusions] in SwiftTraceGutsD.o
+[NSObject(SwiftTrace) swiftTraceDefaultMethodExclusions] in SwiftTraceGutsD.o
+[NSObject(SwiftTrace) swiftTraceDefaultMethodExclusions] in SwiftTraceGutsD.o
+[NSObject(SwiftTrace) swiftTraceDefaultMethodExclusions] in SwiftTraceGutsD.o
+[NSObject(SwiftTrace) swiftTraceDefaultMethodExclusions] in SwiftTraceGutsD.o
+[NSObject(SwiftTrace) swiftTraceDefaultMethodExclusions] in SwiftTraceGutsD.o
+[NSObject(SwiftTrace) swiftTraceDefaultMethodExclusions] in SwiftTraceGutsD.o
+[NSObject(SwiftTrace) swiftTraceDefaultMethodExclusions] in SwiftTraceGutsD.o
+[NSObject(SwiftTrace) swiftTraceDefaultMethodExclusions] in SwiftTraceGutsD.o
+[NSObject(SwiftTrace) swiftTraceDefaultMethodExclusions] in SwiftTraceGutsD.o
+[NSObject(SwiftTrace) swiftTraceDefaultMethodExclusions] in SwiftTraceGutsD.o
+[NSObject(SwiftTrace) swiftTraceDefaultMethodExclusions] in SwiftTraceGutsD.o
+[NSObject(SwiftTrace) swiftTraceDefaultMethodExclusions] in SwiftTraceGutsD.o
+[NSObject(SwiftTrace) swiftTraceDefaultMethodExclusions] in SwiftTraceGutsD.o
+[NSObject(SwiftTrace) swiftTraceDefaultMethodExclusions] in SwiftTraceGutsD.o
+[NSObject(SwiftTrace) swiftTraceDefaultMethodExclusions] in SwiftTraceGutsD.o
+[NSObject(SwiftTrace) swiftTraceDefaultMethodExclusions] in SwiftTraceGutsD.o
+[NSObject(SwiftTrace) swiftTraceDefaultMethodExclusions] in SwiftTraceGutsD.o
+[NSObject(SwiftTrace) swiftTraceDefaultMethodExclusions] in SwiftTraceGutsD.o
+[NSObject(SwiftTrace) swiftTraceDefaultMethodExclusions] in SwiftTraceGutsD.o
+[NSObject(SwiftTrace) swiftTraceDefaultMethodExclusions] in SwiftTraceGutsD.o
+[NSObject(SwiftTrace) swiftTraceDefaultMethodExclusions] in SwiftTraceGutsD.o
+[NSObject(SwiftTrace) swiftTraceDefaultMethodExclusions] in SwiftTraceGutsD.o
+[NSObject(SwiftTrace) swiftTraceDefaultMethodExclusions] in SwiftTraceGutsD.o
+[NSObject(SwiftTrace) swiftTraceDefaultMethodExclusions] in SwiftTraceGutsD.o
+[NSObject(SwiftTrace) swiftTraceDefaultMethodExclusions] in SwiftTraceGutsD.o
+[NSObject(SwiftTrace) swiftTraceDefaultMethodExclusions] in SwiftTraceGutsD.o
+[NSObject(SwiftTrace) swiftTraceDefaultMethodExclusions] in SwiftTraceGutsD.o
+[NSObject(SwiftTrace) swiftTraceDefaultMethodExclusions] in SwiftTraceGutsD.o
+[NSObject(SwiftTrace) swiftTraceDefaultMethodExclusions] in SwiftTraceGutsD.o
+[NSObject(SwiftTrace) swiftTraceDefaultMethodExclusions] in SwiftTraceGutsD.o
+[NSObject(SwiftTrace) swiftTraceDefaultMethodExclusions] in SwiftTraceGutsD.o
+[NSObject(SwiftTrace) swiftTraceDefaultMethodExclusions] in SwiftTraceGutsD.o
+[NSObject(SwiftTrace) swiftTraceDefaultMethodExclusions] in SwiftTraceGutsD.o
+[NSObject(SwiftTrace) swiftTraceDefaultMethodExclusions] in SwiftTraceGutsD.o
+[NSObject(SwiftTrace) swiftTraceDefaultMethodExclusions] in SwiftTraceGutsD.o
+[NSObject(SwiftTrace) swiftTraceDefaultMethodExclusions] in SwiftTraceGutsD.o
+[NSObject(SwiftTrace) swiftTraceDefaultMethodExclusions] in SwiftTraceGutsD.o
+[NSObject(SwiftTrace) swiftTraceDefaultMethodExclusions] in SwiftTraceGutsD.o
+[NSObject(SwiftTrace) swiftTraceDefaultMethodExclusions] in SwiftTraceGutsD.o
+[NSObject(SwiftTrace) swiftTraceDefaultMethodExclusions] in SwiftTraceGutsD.o
+[NSObject(SwiftTrace) swiftTraceDefaultMethodExclusions] in SwiftTraceGutsD.o
+[NSObject(SwiftTrace) swiftTraceDefaultMethodExclusions] in SwiftTraceGutsD.o
+[NSObject(SwiftTrace) swiftTraceDefaultMethodExclusions] in SwiftTraceGutsD.o
+[NSObject(SwiftTrace) swiftTraceDefaultMethodExclusions] in SwiftTraceGutsD.o
+[NSObject(SwiftTrace) swiftTraceDefaultMethodExclusions] in SwiftTraceGutsD.o
+[NSObject(SwiftTrace) swiftTraceDefaultMethodExclusions] in SwiftTraceGutsD.o
+[NSObject(SwiftTrace) swiftTraceDefaultMethodExclusions] in SwiftTraceGutsD.o
+[NSObject(SwiftTrace) swiftTraceDefaultMethodExclusions] in SwiftTraceGutsD.o
+[NSObject(SwiftTrace) swiftTraceDefaultMethodExclusions] in SwiftTraceGutsD.o
+[NSObject(SwiftTrace) swiftTraceDefaultMethodExclusions] in SwiftTraceGutsD.o
+[NSObject(SwiftTrace) swiftTraceDefaultMethodExclusions] in SwiftTraceGutsD.o
+[NSObject(SwiftTrace) swiftTraceDefaultMethodExclusions] in SwiftTraceGutsD.o
+[NSObject(SwiftTrace) swiftTraceDefaultMethodExclusions] in SwiftTraceGutsD.o
+[NSObject(SwiftTrace) swiftTraceDefaultMethodExclusions] in SwiftTraceGutsD.o
+[NSObject(SwiftTrace) swiftTraceDefaultMethodExclusions] in SwiftTraceGutsD.o
+[NSObject(SwiftTrace) swiftTraceDefaultMethodExclusions] in SwiftTraceGutsD.o
+[NSObject(SwiftTrace) swiftTraceDefaultMethodExclusions] in SwiftTraceGutsD.o
+[NSObject(SwiftTrace) swiftTraceDefaultMethodExclusions] in SwiftTraceGutsD.o
+[NSObject(SwiftTrace) swiftTraceDefaultMethodExclusions] in SwiftTraceGutsD.o
+[NSObject(SwiftTrace) swiftTraceDefaultMethodExclusions] in SwiftTraceGutsD.o
+[NSObject(SwiftTrace) swiftTraceDefaultMethodExclusions] in SwiftTraceGutsD.o
+[NSObject(SwiftTrace) swiftTraceDefaultMethodExclusions] in SwiftTraceGutsD.o
+[NSObject(SwiftTrace) swiftTraceDefaultMethodExclusions] in SwiftTraceGutsD.o
+[NSObject(SwiftTrace) swiftTraceDefaultMethodExclusions] in SwiftTraceGutsD.o
+[NSObject(SwiftTrace) swiftTraceDefaultMethodExclusions] in SwiftTraceGutsD.o
+[NSObject(SwiftTrace) swiftTraceDefaultMethodExclusions] in SwiftTraceGutsD.o
+[NSObject(SwiftTrace) swiftTraceDefaultMethodExclusions] in SwiftTraceGutsD.o
+[NSObject(SwiftTrace) swiftTraceDefaultMethodExclusions] in SwiftTraceGutsD.o
+[NSObject(SwiftTrace) swiftTraceDefaultMethodExclusions] in SwiftTraceGutsD.o
+[NSObject(SwiftTrace) swiftTraceDefaultMethodExclusions] in SwiftTraceGutsD.o
+[NSObject(SwiftTrace) swiftTraceDefaultMethodExclusions] in SwiftTraceGutsD.o
+[NSObject(SwiftTrace) swiftTraceDefaultMethodExclusions] in SwiftTraceGutsD.o
+[NSObject(SwiftTrace) swiftTraceDefaultMethodExclusions] in SwiftTraceGutsD.o
+[NSObject(SwiftTrace) swiftTraceDefaultMethodExclusions] in SwiftTraceGutsD.o
+[NSObject(SwiftTrace) swiftTraceDefaultMethodExclusions] in SwiftTraceGutsD.o
+[NSObject(SwiftTrace) swiftTraceDefaultMethodExclusions] in SwiftTraceGutsD.o
+[NSObject(SwiftTrace) swiftTraceDefaultMethodExclusions] in SwiftTraceGutsD.o
...
ld: symbol(s) not found for architecture arm64
clang: error: linker command failed with exit code 1 (use -v to see invocation)
ProcessInfoPlistFile /Users/admin/builder/spi-builder-workspace/.derivedData/Build/Products/Debug/PackageFrameworks/SwiftTraceGutsD.framework/Versions/A/Resources/Info.plist /Users/admin/builder/spi-builder-workspace/.derivedData/Build/Intermediates.noindex/SwiftTrace.build/Debug/SwiftTraceGutsD\ product.build/empty-SwiftTraceGutsD.plist (in target 'SwiftTraceGutsD' from project 'SwiftTrace')
cd /Users/admin/builder/spi-builder-workspace
builtin-infoPlistUtility /Users/admin/builder/spi-builder-workspace/.derivedData/Build/Intermediates.noindex/SwiftTrace.build/Debug/SwiftTraceGutsD\ product.build/empty-SwiftTraceGutsD.plist -producttype com.apple.product-type.framework -expandbuildsettings -platform macosx -o /Users/admin/builder/spi-builder-workspace/.derivedData/Build/Products/Debug/PackageFrameworks/SwiftTraceGutsD.framework/Versions/A/Resources/Info.plist
SwiftDriverJobDiscovery normal arm64 Compiling SwiftStack.swift (in target 'SwiftTrace' from project 'SwiftTrace')
Ld /Users/admin/builder/spi-builder-workspace/.derivedData/Build/Products/Debug/PackageFrameworks/SwiftTraceGuts.framework/Versions/A/SwiftTraceGuts normal (in target 'SwiftTraceGuts' from project 'SwiftTrace')
cd /Users/admin/builder/spi-builder-workspace
/Applications/Xcode-16.3.0.app/Contents/Developer/Toolchains/XcodeDefault.xctoolchain/usr/bin/clang -Xlinker -reproducible -target arm64-apple-macos10.13 -dynamiclib -isysroot /Applications/Xcode-16.3.0.app/Contents/Developer/Platforms/MacOSX.platform/Developer/SDKs/MacOSX15.4.sdk -O0 -L/Users/admin/builder/spi-builder-workspace/.derivedData/Build/Intermediates.noindex/EagerLinkingTBDs/Debug -L/Users/admin/builder/spi-builder-workspace/.derivedData/Build/Products/Debug -L/Applications/Xcode-16.3.0.app/Contents/Developer/Platforms/MacOSX.platform/Developer/usr/lib -F/Users/admin/builder/spi-builder-workspace/.derivedData/Build/Intermediates.noindex/EagerLinkingTBDs/Debug -F/Users/admin/builder/spi-builder-workspace/.derivedData/Build/Products/Debug/PackageFrameworks -F/Users/admin/builder/spi-builder-workspace/.derivedData/Build/Products/Debug -iframework /Applications/Xcode-16.3.0.app/Contents/Developer/Platforms/MacOSX.platform/Developer/Library/Frameworks -filelist /Users/admin/builder/spi-builder-workspace/.derivedData/Build/Intermediates.noindex/SwiftTrace.build/Debug/SwiftTraceGuts\ product.build/Objects-normal/arm64/SwiftTraceGuts.LinkFileList -install_name @rpath/SwiftTraceGuts.framework/Versions/A/SwiftTraceGuts -Xlinker -rpath -Xlinker /Users/admin/builder/spi-builder-workspace/.derivedData/Build/Products/Debug/PackageFrameworks -Xlinker -object_path_lto -Xlinker /Users/admin/builder/spi-builder-workspace/.derivedData/Build/Intermediates.noindex/SwiftTrace.build/Debug/SwiftTraceGuts\ product.build/Objects-normal/arm64/SwiftTraceGuts_lto.o -rdynamic -Xlinker -no_deduplicate -Xlinker -dependency_info -Xlinker /Users/admin/builder/spi-builder-workspace/.derivedData/Build/Intermediates.noindex/SwiftTrace.build/Debug/SwiftTraceGuts\ product.build/Objects-normal/arm64/SwiftTraceGuts_dependency_info.dat -lc++ -Wl,-no_warn_duplicate_libraries -o /Users/admin/builder/spi-builder-workspace/.derivedData/Build/Products/Debug/PackageFrameworks/SwiftTraceGuts.framework/Versions/A/SwiftTraceGuts
ProcessInfoPlistFile /Users/admin/builder/spi-builder-workspace/.derivedData/Build/Products/Debug/PackageFrameworks/SwiftTraceGuts.framework/Versions/A/Resources/Info.plist /Users/admin/builder/spi-builder-workspace/.derivedData/Build/Intermediates.noindex/SwiftTrace.build/Debug/SwiftTraceGuts\ product.build/empty-SwiftTraceGuts.plist (in target 'SwiftTraceGuts' from project 'SwiftTrace')
cd /Users/admin/builder/spi-builder-workspace
builtin-infoPlistUtility /Users/admin/builder/spi-builder-workspace/.derivedData/Build/Intermediates.noindex/SwiftTrace.build/Debug/SwiftTraceGuts\ product.build/empty-SwiftTraceGuts.plist -producttype com.apple.product-type.framework -expandbuildsettings -platform macosx -o /Users/admin/builder/spi-builder-workspace/.derivedData/Build/Products/Debug/PackageFrameworks/SwiftTraceGuts.framework/Versions/A/Resources/Info.plist
SwiftDriverJobDiscovery normal arm64 Compiling SwiftLifetime.swift (in target 'SwiftTrace' from project 'SwiftTrace')
SwiftDriverJobDiscovery normal arm64 Compiling SwiftInvoke.swift (in target 'SwiftTrace' from project 'SwiftTrace')
--- xcodebuild: WARNING: Using the first of multiple matching destinations:
{ platform:macOS, arch:arm64, id:0fdd555cdc2e3410af5a304247942a6f63a1d2d9, name:My Mac }
{ platform:macOS, arch:arm64, variant:Mac Catalyst, id:0fdd555cdc2e3410af5a304247942a6f63a1d2d9, name:My Mac }
{ platform:macOS, arch:arm64, variant:DriverKit, id:0fdd555cdc2e3410af5a304247942a6f63a1d2d9, name:My Mac }
{ platform:macOS, arch:arm64, variant:Designed for [iPad,iPhone], id:0fdd555cdc2e3410af5a304247942a6f63a1d2d9, name:My Mac }
** BUILD FAILED **
The following build commands failed:
Ld /Users/admin/builder/spi-builder-workspace/.derivedData/Build/Products/Debug/PackageFrameworks/SwiftTraceGutsD.framework/Versions/A/SwiftTraceGutsD normal (in target 'SwiftTraceGutsD' from project 'SwiftTrace')
Building workspace spi-builder-workspace with scheme SwiftTrace-Package
(2 failures)
Command line invocation:
/Applications/Xcode-16.3.0.app/Contents/Developer/usr/bin/xcodebuild -IDEClonedSourcePackagesDirPathOverride=/Users/admin/builder/spi-builder-workspace/.dependencies -resolvePackageDependencies
Resolve Package Graph
Resolved source packages:
SwiftTrace: /Users/admin/builder/spi-builder-workspace
resolved source packages: SwiftTrace
{
"cxx_language_standard" : "c++11",
"dependencies" : [
],
"manifest_display_name" : "SwiftTrace",
"name" : "SwiftTrace",
"path" : "/Users/admin/builder/spi-builder-workspace",
"platforms" : [
{
"name" : "macos",
"version" : "10.12"
},
{
"name" : "ios",
"version" : "10.0"
}
],
"products" : [
{
"name" : "SwiftTrace",
"targets" : [
"SwiftTrace"
],
"type" : {
"library" : [
"dynamic"
]
}
},
{
"name" : "SwiftTraceGuts",
"targets" : [
"SwiftTraceGuts"
],
"type" : {
"library" : [
"dynamic"
]
}
},
{
"name" : "SwiftTraceD",
"targets" : [
"SwiftTraceD"
],
"type" : {
"library" : [
"dynamic"
]
}
},
{
"name" : "SwiftTraceGutsD",
"targets" : [
"SwiftTraceGutsD"
],
"type" : {
"library" : [
"dynamic"
]
}
}
],
"targets" : [
{
"c99name" : "SwiftTraceGutsD",
"module_type" : "ClangTarget",
"name" : "SwiftTraceGutsD",
"path" : "SwiftTraceGutsD",
"product_memberships" : [
"SwiftTraceD",
"SwiftTraceGutsD"
],
"sources" : [
"ObjCBridge.mm",
"SwiftTrace.mm",
"Trampolines.mm",
"fast_dladdr.mm",
"fishhook.c",
"xt_forwarding_trampoline_arm64.s",
"xt_forwarding_trampoline_arm7.s",
"xt_forwarding_trampoline_x64.s",
"xt_forwarding_trampoline_x86.s"
],
"type" : "library"
},
{
"c99name" : "SwiftTraceGuts",
"module_type" : "ClangTarget",
"name" : "SwiftTraceGuts",
"path" : "SwiftTraceGuts",
"product_memberships" : [
"SwiftTrace",
"SwiftTraceGuts"
],
"sources" : [
"ObjCBridge.mm",
"SwiftTrace.mm",
"Trampolines.mm",
"fast_dladdr.mm",
"fishhook.c",
"xt_forwarding_trampoline_arm64.s",
"xt_forwarding_trampoline_arm7.s",
"xt_forwarding_trampoline_x64.s",
"xt_forwarding_trampoline_x86.s"
],
"type" : "library"
},
{
"c99name" : "SwiftTraceD",
"module_type" : "SwiftTarget",
"name" : "SwiftTraceD",
"path" : "SwiftTraceD",
"product_memberships" : [
"SwiftTraceD"
],
"sources" : [
"EasyPointer.swift",
"StringIndex.swift",
"SwiftArgs.swift",
"SwiftAspects.swift",
"SwiftInterpose.swift",
"SwiftInvoke.swift",
"SwiftLifetime.swift",
"SwiftMeta.swift",
"SwiftStack.swift",
"SwiftStats.swift",
"SwiftSwizzle.swift",
"SwiftTrace.swift"
],
"target_dependencies" : [
"SwiftTraceGutsD"
],
"type" : "library"
},
{
"c99name" : "SwiftTrace",
"module_type" : "SwiftTarget",
"name" : "SwiftTrace",
"path" : "SwiftTrace",
"product_memberships" : [
"SwiftTrace"
],
"sources" : [
"EasyPointer.swift",
"StringIndex.swift",
"SwiftArgs.swift",
"SwiftAspects.swift",
"SwiftInterpose.swift",
"SwiftInvoke.swift",
"SwiftLifetime.swift",
"SwiftMeta.swift",
"SwiftStack.swift",
"SwiftStats.swift",
"SwiftSwizzle.swift",
"SwiftTrace.swift"
],
"target_dependencies" : [
"SwiftTraceGuts"
],
"type" : "library"
}
],
"tools_version" : "5.0"
}
{
"workspace" : {
"name" : "spi-builder-workspace",
"schemes" : [
"SwiftTrace",
"SwiftTrace-Package",
"SwiftTraceD",
"SwiftTraceGuts",
"SwiftTraceGutsD"
]
}
}
Running build ...
env DEVELOPER_DIR=/Applications/Xcode-16.3.0.app xcrun xcodebuild -IDEClonedSourcePackagesDirPathOverride=$PWD/.dependencies -skipMacroValidation -skipPackagePluginValidation -derivedDataPath $PWD/.derivedData build -scheme SwiftTrace-Package -destination platform=macOS,arch=arm64
Command line invocation:
/Applications/Xcode-16.3.0.app/Contents/Developer/usr/bin/xcodebuild -IDEClonedSourcePackagesDirPathOverride=/Users/admin/builder/spi-builder-workspace/.dependencies -skipMacroValidation -skipPackagePluginValidation -derivedDataPath /Users/admin/builder/spi-builder-workspace/.derivedData build -scheme SwiftTrace-Package -destination platform=macOS,arch=arm64
Resolve Package Graph
Resolved source packages:
SwiftTrace: /Users/admin/builder/spi-builder-workspace
ComputePackagePrebuildTargetDependencyGraph
Prepare packages
CreateBuildRequest
SendProjectDescription
CreateBuildOperation
ComputeTargetDependencyGraph
note: Building targets in dependency order
note: Target dependency graph (8 targets)
Target 'SwiftTraceGutsD' in project 'SwiftTrace'
➜ Explicit dependency on target 'SwiftTraceGutsD' in project 'SwiftTrace'
Target 'SwiftTraceGuts' in project 'SwiftTrace'
➜ Explicit dependency on target 'SwiftTraceGuts' in project 'SwiftTrace'
Target 'SwiftTraceD' in project 'SwiftTrace'
➜ Explicit dependency on target 'SwiftTraceD' in project 'SwiftTrace'
➜ Explicit dependency on target 'SwiftTraceGutsD' in project 'SwiftTrace'
Target 'SwiftTraceD' in project 'SwiftTrace'
➜ Explicit dependency on target 'SwiftTraceGutsD' in project 'SwiftTrace'
Target 'SwiftTraceGutsD' in project 'SwiftTrace' (no dependencies)
Target 'SwiftTrace' in project 'SwiftTrace'
➜ Explicit dependency on target 'SwiftTrace' in project 'SwiftTrace'
➜ Explicit dependency on target 'SwiftTraceGuts' in project 'SwiftTrace'
Target 'SwiftTrace' in project 'SwiftTrace'
➜ Explicit dependency on target 'SwiftTraceGuts' in project 'SwiftTrace'
Target 'SwiftTraceGuts' in project 'SwiftTrace' (no dependencies)
GatherProvisioningInputs
CreateBuildDescription
ExecuteExternalTool /Applications/Xcode-16.3.0.app/Contents/Developer/Toolchains/XcodeDefault.xctoolchain/usr/bin/swiftc --version
ExecuteExternalTool /Applications/Xcode-16.3.0.app/Contents/Developer/Toolchains/XcodeDefault.xctoolchain/usr/bin/clang -v -E -dM -arch arm64 -isysroot /Applications/Xcode-16.3.0.app/Contents/Developer/Platforms/MacOSX.platform/Developer/SDKs/MacOSX15.4.sdk -x objective-c++ -c /dev/null
ExecuteExternalTool /Applications/Xcode-16.3.0.app/Contents/Developer/Toolchains/XcodeDefault.xctoolchain/usr/bin/ld -version_details
ExecuteExternalTool /Applications/Xcode-16.3.0.app/Contents/Developer/Toolchains/XcodeDefault.xctoolchain/usr/bin/clang -v -E -dM -isysroot /Applications/Xcode-16.3.0.app/Contents/Developer/Platforms/MacOSX.platform/Developer/SDKs/MacOSX15.4.sdk -x c -c /dev/null
ExecuteExternalTool /Applications/Xcode-16.3.0.app/Contents/Developer/Toolchains/XcodeDefault.xctoolchain/usr/bin/clang -v -E -dM -arch arm64 -isysroot /Applications/Xcode-16.3.0.app/Contents/Developer/Platforms/MacOSX.platform/Developer/SDKs/MacOSX15.4.sdk -x c -c /dev/null
ExecuteExternalTool /Applications/Xcode-16.3.0.app/Contents/Developer/Toolchains/XcodeDefault.xctoolchain/usr/bin/clang -v -E -dM -arch arm64 -isysroot /Applications/Xcode-16.3.0.app/Contents/Developer/Platforms/MacOSX.platform/Developer/SDKs/MacOSX15.4.sdk -x assembler-with-cpp -c /dev/null
Build description signature: 399c093793711e3bd01e5f4ef09e83cf
Build description path: /Users/admin/builder/spi-builder-workspace/.derivedData/Build/Intermediates.noindex/XCBuildData/399c093793711e3bd01e5f4ef09e83cf.xcbuilddata
ClangStatCache /Applications/Xcode-16.3.0.app/Contents/Developer/Toolchains/XcodeDefault.xctoolchain/usr/bin/clang-stat-cache /Applications/Xcode-16.3.0.app/Contents/Developer/Platforms/MacOSX.platform/Developer/SDKs/MacOSX15.4.sdk /Users/admin/builder/spi-builder-workspace/.derivedData/SDKStatCaches.noindex/macosx15.4-24E241-8287b8f5db97e746a1562fbca0c9d29b.sdkstatcache
cd /Users/admin/builder/spi-builder-workspace/.swiftpm/xcode
/Applications/Xcode-16.3.0.app/Contents/Developer/Toolchains/XcodeDefault.xctoolchain/usr/bin/clang-stat-cache /Applications/Xcode-16.3.0.app/Contents/Developer/Platforms/MacOSX.platform/Developer/SDKs/MacOSX15.4.sdk -o /Users/admin/builder/spi-builder-workspace/.derivedData/SDKStatCaches.noindex/macosx15.4-24E241-8287b8f5db97e746a1562fbca0c9d29b.sdkstatcache
Ld /Users/admin/builder/spi-builder-workspace/.derivedData/Build/Products/Debug/PackageFrameworks/SwiftTraceGutsD.framework/Versions/A/SwiftTraceGutsD normal (in target 'SwiftTraceGutsD' from project 'SwiftTrace')
cd /Users/admin/builder/spi-builder-workspace
/Applications/Xcode-16.3.0.app/Contents/Developer/Toolchains/XcodeDefault.xctoolchain/usr/bin/clang -Xlinker -reproducible -target arm64-apple-macos10.13 -dynamiclib -isysroot /Applications/Xcode-16.3.0.app/Contents/Developer/Platforms/MacOSX.platform/Developer/SDKs/MacOSX15.4.sdk -O0 -L/Users/admin/builder/spi-builder-workspace/.derivedData/Build/Intermediates.noindex/EagerLinkingTBDs/Debug -L/Users/admin/builder/spi-builder-workspace/.derivedData/Build/Products/Debug -L/Applications/Xcode-16.3.0.app/Contents/Developer/Platforms/MacOSX.platform/Developer/usr/lib -F/Users/admin/builder/spi-builder-workspace/.derivedData/Build/Intermediates.noindex/EagerLinkingTBDs/Debug -F/Users/admin/builder/spi-builder-workspace/.derivedData/Build/Products/Debug/PackageFrameworks -F/Users/admin/builder/spi-builder-workspace/.derivedData/Build/Products/Debug -iframework /Applications/Xcode-16.3.0.app/Contents/Developer/Platforms/MacOSX.platform/Developer/Library/Frameworks -filelist /Users/admin/builder/spi-builder-workspace/.derivedData/Build/Intermediates.noindex/SwiftTrace.build/Debug/SwiftTraceGutsD\ product.build/Objects-normal/arm64/SwiftTraceGutsD.LinkFileList -install_name @rpath/SwiftTraceGutsD.framework/Versions/A/SwiftTraceGutsD -Xlinker -rpath -Xlinker /Users/admin/builder/spi-builder-workspace/.derivedData/Build/Products/Debug/PackageFrameworks -Xlinker -object_path_lto -Xlinker /Users/admin/builder/spi-builder-workspace/.derivedData/Build/Intermediates.noindex/SwiftTrace.build/Debug/SwiftTraceGutsD\ product.build/Objects-normal/arm64/SwiftTraceGutsD_lto.o -rdynamic -Xlinker -no_deduplicate -Xlinker -dependency_info -Xlinker /Users/admin/builder/spi-builder-workspace/.derivedData/Build/Intermediates.noindex/SwiftTrace.build/Debug/SwiftTraceGutsD\ product.build/Objects-normal/arm64/SwiftTraceGutsD_dependency_info.dat -lc++ -Wl,-no_warn_duplicate_libraries -o /Users/admin/builder/spi-builder-workspace/.derivedData/Build/Products/Debug/PackageFrameworks/SwiftTraceGutsD.framework/Versions/A/SwiftTraceGutsD
Undefined symbols for architecture arm64:
"_NSLog", referenced from:
+[NSObject(SwiftTrace) swiftTraceDefaultMethodExclusions] in SwiftTraceGutsD.o
+[NSObject(SwiftTrace) swiftTraceDefaultMethodExclusions] in SwiftTraceGutsD.o
+[NSObject(SwiftTrace) swiftTraceDefaultMethodExclusions] in SwiftTraceGutsD.o
+[NSObject(SwiftTrace) swiftTraceDefaultMethodExclusions] in SwiftTraceGutsD.o
"_OBJC_CLASS_$_NSAssertionHandler", referenced from:
in SwiftTraceGutsD.o
"_OBJC_CLASS_$_NSBundle", referenced from:
in SwiftTraceGutsD.o
"_OBJC_CLASS_$_NSMethodSignature", referenced from:
in SwiftTraceGutsD.o
"_OBJC_CLASS_$_NSMutableArray", referenced from:
in SwiftTraceGutsD.o
"_OBJC_CLASS_$_NSObject", referenced from:
__OBJC_$_CATEGORY_NSObject_$_SwiftTrace in SwiftTraceGutsD.o
in SwiftTraceGutsD.o
"_OBJC_CLASS_$_NSString", referenced from:
in SwiftTraceGutsD.o
"_OBJC_CLASS_$_NSThread", referenced from:
in SwiftTraceGutsD.o
"_OBJC_CLASS_$_NSValue", referenced from:
in SwiftTraceGutsD.o
"_OBJC_CLASS_$_SwiftMeta", referenced from:
in SwiftTraceGutsD.o
"_OBJC_CLASS_$_SwiftTrace", referenced from:
in SwiftTraceGutsD.o
"_OBJC_EHTYPE_$_NSException", referenced from:
GCC_except_table2 in SwiftTraceGutsD.o
"___CFConstantStringClassReference", referenced from:
in SwiftTraceGutsD.o
in SwiftTraceGutsD.o
in SwiftTraceGutsD.o
in SwiftTraceGutsD.o
in SwiftTraceGutsD.o
in SwiftTraceGutsD.o
in SwiftTraceGutsD.o
...
"___objc_personality_v0", referenced from:
/Users/admin/builder/spi-builder-workspace/.derivedData/Build/Products/Debug/SwiftTraceGutsD.o
"_class_getImageName", referenced from:
+[NSObject(SwiftTrace) swiftTraceDefaultMethodExclusions] in SwiftTraceGutsD.o
"_class_getSuperclass", referenced from:
+[NSObject(SwiftTrace) swiftTraceDefaultMethodExclusions] in SwiftTraceGutsD.o
"_method_getTypeEncoding", referenced from:
+[NSObject(SwiftTrace) swiftTraceDefaultMethodExclusions] in SwiftTraceGutsD.o
"_objc_autoreleasePoolPop", referenced from:
___cxx_global_var_init in SwiftTraceGutsD.o
"_objc_autoreleasePoolPush", referenced from:
___cxx_global_var_init in SwiftTraceGutsD.o
"_objc_autoreleaseReturnValue", referenced from:
+[NSObject(SwiftTrace) swiftTraceDefaultMethodExclusions] in SwiftTraceGutsD.o
+[NSObject(SwiftTrace) swiftTraceDefaultMethodExclusions] in SwiftTraceGutsD.o
+[NSObject(SwiftTrace) swiftTraceDefaultMethodExclusions] in SwiftTraceGutsD.o
+[NSObject(SwiftTrace) swiftTraceDefaultMethodExclusions] in SwiftTraceGutsD.o
+[NSObject(SwiftTrace) swiftTraceDefaultMethodExclusions] in SwiftTraceGutsD.o
+[NSObject(SwiftTrace) swiftTraceDefaultMethodExclusions] in SwiftTraceGutsD.o
"_objc_begin_catch", referenced from:
+[NSObject(SwiftTrace) swiftTraceDefaultMethodExclusions] in SwiftTraceGutsD.o
"_objc_copyClassList", referenced from:
+[NSObject(SwiftTrace) swiftTraceDefaultMethodExclusions] in SwiftTraceGutsD.o
"_objc_end_catch", referenced from:
+[NSObject(SwiftTrace) swiftTraceDefaultMethodExclusions] in SwiftTraceGutsD.o
+[NSObject(SwiftTrace) swiftTraceDefaultMethodExclusions] in SwiftTraceGutsD.o
"_objc_enumerationMutation", referenced from:
+[NSObject(SwiftTrace) swiftTraceDefaultMethodExclusions] in SwiftTraceGutsD.o
+[NSObject(SwiftTrace) swiftTraceDefaultMethodExclusions] in SwiftTraceGutsD.o
"_objc_msgSend", referenced from:
in objc-stubs-file
"_objc_release", referenced from:
+[NSObject(SwiftTrace) swiftTraceDefaultMethodExclusions] in SwiftTraceGutsD.o
+[NSObject(SwiftTrace) swiftTraceDefaultMethodExclusions] in SwiftTraceGutsD.o
+[NSObject(SwiftTrace) swiftTraceDefaultMethodExclusions] in SwiftTraceGutsD.o
+[NSObject(SwiftTrace) swiftTraceDefaultMethodExclusions] in SwiftTraceGutsD.o
+[NSObject(SwiftTrace) swiftTraceDefaultMethodExclusions] in SwiftTraceGutsD.o
+[NSObject(SwiftTrace) swiftTraceDefaultMethodExclusions] in SwiftTraceGutsD.o
+[NSObject(SwiftTrace) swiftTraceDefaultMethodExclusions] in SwiftTraceGutsD.o
+[NSObject(SwiftTrace) swiftTraceDefaultMethodExclusions] in SwiftTraceGutsD.o
+[NSObject(SwiftTrace) swiftTraceDefaultMethodExclusions] in SwiftTraceGutsD.o
+[NSObject(SwiftTrace) swiftTraceDefaultMethodExclusions] in SwiftTraceGutsD.o
+[NSObject(SwiftTrace) swiftTraceDefaultMethodExclusions] in SwiftTraceGutsD.o
+[NSObject(SwiftTrace) swiftTraceDefaultMethodExclusions] in SwiftTraceGutsD.o
+[NSObject(SwiftTrace) swiftTraceDefaultMethodExclusions] in SwiftTraceGutsD.o
+[NSObject(SwiftTrace) swiftTraceDefaultMethodExclusions] in SwiftTraceGutsD.o
+[NSObject(SwiftTrace) swiftTraceDefaultMethodExclusions] in SwiftTraceGutsD.o
+[NSObject(SwiftTrace) swiftTraceDefaultMethodExclusions] in SwiftTraceGutsD.o
+[NSObject(SwiftTrace) swiftTraceDefaultMethodExclusions] in SwiftTraceGutsD.o
+[NSObject(SwiftTrace) swiftTraceDefaultMethodExclusions] in SwiftTraceGutsD.o
+[NSObject(SwiftTrace) swiftTraceDefaultMethodExclusions] in SwiftTraceGutsD.o
+[NSObject(SwiftTrace) swiftTraceDefaultMethodExclusions] in SwiftTraceGutsD.o
+[NSObject(SwiftTrace) swiftTraceDefaultMethodExclusions] in SwiftTraceGutsD.o
+[NSObject(SwiftTrace) swiftTraceDefaultMethodExclusions] in SwiftTraceGutsD.o
+[NSObject(SwiftTrace) swiftTraceDefaultMethodExclusions] in SwiftTraceGutsD.o
+[NSObject(SwiftTrace) swiftTraceDefaultMethodExclusions] in SwiftTraceGutsD.o
+[NSObject(SwiftTrace) swiftTraceDefaultMethodExclusions] in SwiftTraceGutsD.o
+[NSObject(SwiftTrace) swiftTraceDefaultMethodExclusions] in SwiftTraceGutsD.o
+[NSObject(SwiftTrace) swiftTraceDefaultMethodExclusions] in SwiftTraceGutsD.o
+[NSObject(SwiftTrace) swiftTraceDefaultMethodExclusions] in SwiftTraceGutsD.o
+[NSObject(SwiftTrace) swiftTraceDefaultMethodExclusions] in SwiftTraceGutsD.o
+[NSObject(SwiftTrace) swiftTraceDefaultMethodExclusions] in SwiftTraceGutsD.o
+[NSObject(SwiftTrace) swiftTraceDefaultMethodExclusions] in SwiftTraceGutsD.o
+[NSObject(SwiftTrace) swiftTraceDefaultMethodExclusions] in SwiftTraceGutsD.o
+[NSObject(SwiftTrace) swiftTraceDefaultMethodExclusions] in SwiftTraceGutsD.o
+[NSObject(SwiftTrace) swiftTraceDefaultMethodExclusions] in SwiftTraceGutsD.o
+[NSObject(SwiftTrace) swiftTraceDefaultMethodExclusions] in SwiftTraceGutsD.o
+[NSObject(SwiftTrace) swiftTraceDefaultMethodExclusions] in SwiftTraceGutsD.o
+[NSObject(SwiftTrace) swiftTraceDefaultMethodExclusions] in SwiftTraceGutsD.o
+[NSObject(SwiftTrace) swiftTraceDefaultMethodExclusions] in SwiftTraceGutsD.o
+[NSObject(SwiftTrace) swiftTraceDefaultMethodExclusions] in SwiftTraceGutsD.o
...
"_objc_retain", referenced from:
+[NSObject(SwiftTrace) swiftTraceDefaultMethodExclusions] in SwiftTraceGutsD.o
+[NSObject(SwiftTrace) swiftTraceDefaultMethodExclusions] in SwiftTraceGutsD.o
+[NSObject(SwiftTrace) swiftTraceDefaultMethodExclusions] in SwiftTraceGutsD.o
+[NSObject(SwiftTrace) swiftTraceDefaultMethodExclusions] in SwiftTraceGutsD.o
+[NSObject(SwiftTrace) swiftTraceDefaultMethodExclusions] in SwiftTraceGutsD.o
"_objc_retainAutorelease", referenced from:
+[NSObject(SwiftTrace) swiftTraceDefaultMethodExclusions] in SwiftTraceGutsD.o
+[NSObject(SwiftTrace) swiftTraceDefaultMethodExclusions] in SwiftTraceGutsD.o
+[NSObject(SwiftTrace) swiftTraceDefaultMethodExclusions] in SwiftTraceGutsD.o
+[NSObject(SwiftTrace) swiftTraceDefaultMethodExclusions] in SwiftTraceGutsD.o
+[NSObject(SwiftTrace) swiftTraceDefaultMethodExclusions] in SwiftTraceGutsD.o
+[NSObject(SwiftTrace) swiftTraceDefaultMethodExclusions] in SwiftTraceGutsD.o
+[NSObject(SwiftTrace) swiftTraceDefaultMethodExclusions] in SwiftTraceGutsD.o
...
"_objc_retainAutoreleasedReturnValue", referenced from:
+[NSObject(SwiftTrace) swiftTraceDefaultMethodExclusions] in SwiftTraceGutsD.o
+[NSObject(SwiftTrace) swiftTraceDefaultMethodExclusions] in SwiftTraceGutsD.o
+[NSObject(SwiftTrace) swiftTraceDefaultMethodExclusions] in SwiftTraceGutsD.o
+[NSObject(SwiftTrace) swiftTraceDefaultMethodExclusions] in SwiftTraceGutsD.o
+[NSObject(SwiftTrace) swiftTraceDefaultMethodExclusions] in SwiftTraceGutsD.o
+[NSObject(SwiftTrace) swiftTraceDefaultMethodExclusions] in SwiftTraceGutsD.o
+[NSObject(SwiftTrace) swiftTraceDefaultMethodExclusions] in SwiftTraceGutsD.o
+[NSObject(SwiftTrace) swiftTraceDefaultMethodExclusions] in SwiftTraceGutsD.o
+[NSObject(SwiftTrace) swiftTraceDefaultMethodExclusions] in SwiftTraceGutsD.o
+[NSObject(SwiftTrace) swiftTraceDefaultMethodExclusions] in SwiftTraceGutsD.o
+[NSObject(SwiftTrace) swiftTraceDefaultMethodExclusions] in SwiftTraceGutsD.o
+[NSObject(SwiftTrace) swiftTraceDefaultMethodExclusions] in SwiftTraceGutsD.o
+[NSObject(SwiftTrace) swiftTraceDefaultMethodExclusions] in SwiftTraceGutsD.o
+[NSObject(SwiftTrace) swiftTraceDefaultMethodExclusions] in SwiftTraceGutsD.o
+[NSObject(SwiftTrace) swiftTraceDefaultMethodExclusions] in SwiftTraceGutsD.o
+[NSObject(SwiftTrace) swiftTraceDefaultMethodExclusions] in SwiftTraceGutsD.o
+[NSObject(SwiftTrace) swiftTraceDefaultMethodExclusions] in SwiftTraceGutsD.o
+[NSObject(SwiftTrace) swiftTraceDefaultMethodExclusions] in SwiftTraceGutsD.o
+[NSObject(SwiftTrace) swiftTraceDefaultMethodExclusions] in SwiftTraceGutsD.o
+[NSObject(SwiftTrace) swiftTraceDefaultMethodExclusions] in SwiftTraceGutsD.o
+[NSObject(SwiftTrace) swiftTraceDefaultMethodExclusions] in SwiftTraceGutsD.o
+[NSObject(SwiftTrace) swiftTraceDefaultMethodExclusions] in SwiftTraceGutsD.o
+[NSObject(SwiftTrace) swiftTraceDefaultMethodExclusions] in SwiftTraceGutsD.o
+[NSObject(SwiftTrace) swiftTraceDefaultMethodExclusions] in SwiftTraceGutsD.o
+[NSObject(SwiftTrace) swiftTraceDefaultMethodExclusions] in SwiftTraceGutsD.o
+[NSObject(SwiftTrace) swiftTraceDefaultMethodExclusions] in SwiftTraceGutsD.o
+[NSObject(SwiftTrace) swiftTraceDefaultMethodExclusions] in SwiftTraceGutsD.o
...
"_objc_retainBlock", referenced from:
+[NSObject(SwiftTrace) swiftTraceDefaultMethodExclusions] in SwiftTraceGutsD.o
"_objc_storeStrong", referenced from:
+[NSObject(SwiftTrace) swiftTraceDefaultMethodExclusions] in SwiftTraceGutsD.o
+[NSObject(SwiftTrace) swiftTraceDefaultMethodExclusions] in SwiftTraceGutsD.o
+[NSObject(SwiftTrace) swiftTraceDefaultMethodExclusions] in SwiftTraceGutsD.o
+[NSObject(SwiftTrace) swiftTraceDefaultMethodExclusions] in SwiftTraceGutsD.o
+[NSObject(SwiftTrace) swiftTraceDefaultMethodExclusions] in SwiftTraceGutsD.o
+[NSObject(SwiftTrace) swiftTraceDefaultMethodExclusions] in SwiftTraceGutsD.o
+[NSObject(SwiftTrace) swiftTraceDefaultMethodExclusions] in SwiftTraceGutsD.o
+[NSObject(SwiftTrace) swiftTraceDefaultMethodExclusions] in SwiftTraceGutsD.o
+[NSObject(SwiftTrace) swiftTraceDefaultMethodExclusions] in SwiftTraceGutsD.o
+[NSObject(SwiftTrace) swiftTraceDefaultMethodExclusions] in SwiftTraceGutsD.o
+[NSObject(SwiftTrace) swiftTraceDefaultMethodExclusions] in SwiftTraceGutsD.o
+[NSObject(SwiftTrace) swiftTraceDefaultMethodExclusions] in SwiftTraceGutsD.o
+[NSObject(SwiftTrace) swiftTraceDefaultMethodExclusions] in SwiftTraceGutsD.o
+[NSObject(SwiftTrace) swiftTraceDefaultMethodExclusions] in SwiftTraceGutsD.o
+[NSObject(SwiftTrace) swiftTraceDefaultMethodExclusions] in SwiftTraceGutsD.o
+[NSObject(SwiftTrace) swiftTraceDefaultMethodExclusions] in SwiftTraceGutsD.o
+[NSObject(SwiftTrace) swiftTraceDefaultMethodExclusions] in SwiftTraceGutsD.o
+[NSObject(SwiftTrace) swiftTraceDefaultMethodExclusions] in SwiftTraceGutsD.o
+[NSObject(SwiftTrace) swiftTraceDefaultMethodExclusions] in SwiftTraceGutsD.o
+[NSObject(SwiftTrace) swiftTraceDefaultMethodExclusions] in SwiftTraceGutsD.o
+[NSObject(SwiftTrace) swiftTraceDefaultMethodExclusions] in SwiftTraceGutsD.o
+[NSObject(SwiftTrace) swiftTraceDefaultMethodExclusions] in SwiftTraceGutsD.o
+[NSObject(SwiftTrace) swiftTraceDefaultMethodExclusions] in SwiftTraceGutsD.o
+[NSObject(SwiftTrace) swiftTraceDefaultMethodExclusions] in SwiftTraceGutsD.o
+[NSObject(SwiftTrace) swiftTraceDefaultMethodExclusions] in SwiftTraceGutsD.o
+[NSObject(SwiftTrace) swiftTraceDefaultMethodExclusions] in SwiftTraceGutsD.o
+[NSObject(SwiftTrace) swiftTraceDefaultMethodExclusions] in SwiftTraceGutsD.o
+[NSObject(SwiftTrace) swiftTraceDefaultMethodExclusions] in SwiftTraceGutsD.o
+[NSObject(SwiftTrace) swiftTraceDefaultMethodExclusions] in SwiftTraceGutsD.o
+[NSObject(SwiftTrace) swiftTraceDefaultMethodExclusions] in SwiftTraceGutsD.o
+[NSObject(SwiftTrace) swiftTraceDefaultMethodExclusions] in SwiftTraceGutsD.o
+[NSObject(SwiftTrace) swiftTraceDefaultMethodExclusions] in SwiftTraceGutsD.o
+[NSObject(SwiftTrace) swiftTraceDefaultMethodExclusions] in SwiftTraceGutsD.o
+[NSObject(SwiftTrace) swiftTraceDefaultMethodExclusions] in SwiftTraceGutsD.o
+[NSObject(SwiftTrace) swiftTraceDefaultMethodExclusions] in SwiftTraceGutsD.o
+[NSObject(SwiftTrace) swiftTraceDefaultMethodExclusions] in SwiftTraceGutsD.o
+[NSObject(SwiftTrace) swiftTraceDefaultMethodExclusions] in SwiftTraceGutsD.o
+[NSObject(SwiftTrace) swiftTraceDefaultMethodExclusions] in SwiftTraceGutsD.o
+[NSObject(SwiftTrace) swiftTraceDefaultMethodExclusions] in SwiftTraceGutsD.o
+[NSObject(SwiftTrace) swiftTraceDefaultMethodExclusions] in SwiftTraceGutsD.o
+[NSObject(SwiftTrace) swiftTraceDefaultMethodExclusions] in SwiftTraceGutsD.o
+[NSObject(SwiftTrace) swiftTraceDefaultMethodExclusions] in SwiftTraceGutsD.o
+[NSObject(SwiftTrace) swiftTraceDefaultMethodExclusions] in SwiftTraceGutsD.o
+[NSObject(SwiftTrace) swiftTraceDefaultMethodExclusions] in SwiftTraceGutsD.o
+[NSObject(SwiftTrace) swiftTraceDefaultMethodExclusions] in SwiftTraceGutsD.o
+[NSObject(SwiftTrace) swiftTraceDefaultMethodExclusions] in SwiftTraceGutsD.o
+[NSObject(SwiftTrace) swiftTraceDefaultMethodExclusions] in SwiftTraceGutsD.o
+[NSObject(SwiftTrace) swiftTraceDefaultMethodExclusions] in SwiftTraceGutsD.o
+[NSObject(SwiftTrace) swiftTraceDefaultMethodExclusions] in SwiftTraceGutsD.o
+[NSObject(SwiftTrace) swiftTraceDefaultMethodExclusions] in SwiftTraceGutsD.o
+[NSObject(SwiftTrace) swiftTraceDefaultMethodExclusions] in SwiftTraceGutsD.o
+[NSObject(SwiftTrace) swiftTraceDefaultMethodExclusions] in SwiftTraceGutsD.o
+[NSObject(SwiftTrace) swiftTraceDefaultMethodExclusions] in SwiftTraceGutsD.o
+[NSObject(SwiftTrace) swiftTraceDefaultMethodExclusions] in SwiftTraceGutsD.o
+[NSObject(SwiftTrace) swiftTraceDefaultMethodExclusions] in SwiftTraceGutsD.o
+[NSObject(SwiftTrace) swiftTraceDefaultMethodExclusions] in SwiftTraceGutsD.o
+[NSObject(SwiftTrace) swiftTraceDefaultMethodExclusions] in SwiftTraceGutsD.o
+[NSObject(SwiftTrace) swiftTraceDefaultMethodExclusions] in SwiftTraceGutsD.o
+[NSObject(SwiftTrace) swiftTraceDefaultMethodExclusions] in SwiftTraceGutsD.o
+[NSObject(SwiftTrace) swiftTraceDefaultMethodExclusions] in SwiftTraceGutsD.o
+[NSObject(SwiftTrace) swiftTraceDefaultMethodExclusions] in SwiftTraceGutsD.o
+[NSObject(SwiftTrace) swiftTraceDefaultMethodExclusions] in SwiftTraceGutsD.o
+[NSObject(SwiftTrace) swiftTraceDefaultMethodExclusions] in SwiftTraceGutsD.o
+[NSObject(SwiftTrace) swiftTraceDefaultMethodExclusions] in SwiftTraceGutsD.o
+[NSObject(SwiftTrace) swiftTraceDefaultMethodExclusions] in SwiftTraceGutsD.o
+[NSObject(SwiftTrace) swiftTraceDefaultMethodExclusions] in SwiftTraceGutsD.o
+[NSObject(SwiftTrace) swiftTraceDefaultMethodExclusions] in SwiftTraceGutsD.o
+[NSObject(SwiftTrace) swiftTraceDefaultMethodExclusions] in SwiftTraceGutsD.o
+[NSObject(SwiftTrace) swiftTraceDefaultMethodExclusions] in SwiftTraceGutsD.o
+[NSObject(SwiftTrace) swiftTraceDefaultMethodExclusions] in SwiftTraceGutsD.o
+[NSObject(SwiftTrace) swiftTraceDefaultMethodExclusions] in SwiftTraceGutsD.o
+[NSObject(SwiftTrace) swiftTraceDefaultMethodExclusions] in SwiftTraceGutsD.o
+[NSObject(SwiftTrace) swiftTraceDefaultMethodExclusions] in SwiftTraceGutsD.o
+[NSObject(SwiftTrace) swiftTraceDefaultMethodExclusions] in SwiftTraceGutsD.o
+[NSObject(SwiftTrace) swiftTraceDefaultMethodExclusions] in SwiftTraceGutsD.o
+[NSObject(SwiftTrace) swiftTraceDefaultMethodExclusions] in SwiftTraceGutsD.o
+[NSObject(SwiftTrace) swiftTraceDefaultMethodExclusions] in SwiftTraceGutsD.o
+[NSObject(SwiftTrace) swiftTraceDefaultMethodExclusions] in SwiftTraceGutsD.o
+[NSObject(SwiftTrace) swiftTraceDefaultMethodExclusions] in SwiftTraceGutsD.o
+[NSObject(SwiftTrace) swiftTraceDefaultMethodExclusions] in SwiftTraceGutsD.o
...
ld: symbol(s) not found for architecture arm64
clang: error: linker command failed with exit code 1 (use -v to see invocation)
SwiftDriver SwiftTraceD normal arm64 com.apple.xcode.tools.swift.compiler (in target 'SwiftTraceD' from project 'SwiftTrace')
cd /Users/admin/builder/spi-builder-workspace/.swiftpm/xcode
builtin-SwiftDriver -- /Applications/Xcode-16.3.0.app/Contents/Developer/Toolchains/XcodeDefault.xctoolchain/usr/bin/swiftc -module-name SwiftTraceD -Onone -enforce-exclusivity\=checked @/Users/admin/builder/spi-builder-workspace/.derivedData/Build/Intermediates.noindex/SwiftTrace.build/Debug/SwiftTraceD.build/Objects-normal/arm64/SwiftTraceD.SwiftFileList -DSWIFT_PACKAGE -DDEBUG -DDEBUG_ONLY -Xcc -fmodule-map-file\=/Users/admin/builder/spi-builder-workspace/.derivedData/Build/Intermediates.noindex/GeneratedModuleMaps/SwiftTraceGutsD.modulemap -DXcode -plugin-path /Applications/Xcode-16.3.0.app/Contents/Developer/Toolchains/XcodeDefault.xctoolchain/usr/lib/swift/host/plugins/testing -enable-experimental-feature DebugDescriptionMacro -sdk /Applications/Xcode-16.3.0.app/Contents/Developer/Platforms/MacOSX.platform/Developer/SDKs/MacOSX15.4.sdk -target arm64-apple-macos10.13 -g -module-cache-path /Users/admin/builder/spi-builder-workspace/.derivedData/ModuleCache.noindex -Xfrontend -serialize-debugging-options -enable-testing -index-store-path /Users/admin/builder/spi-builder-workspace/.derivedData/Index.noindex/DataStore -swift-version 5 -I /Users/admin/builder/spi-builder-workspace/.derivedData/Build/Products/Debug -I /Applications/Xcode-16.3.0.app/Contents/Developer/Platforms/MacOSX.platform/Developer/usr/lib -F /Users/admin/builder/spi-builder-workspace/.derivedData/Build/Products/Debug/PackageFrameworks -F /Users/admin/builder/spi-builder-workspace/.derivedData/Build/Products/Debug -F /Applications/Xcode-16.3.0.app/Contents/Developer/Platforms/MacOSX.platform/Developer/Library/Frameworks -c -j10 -enable-batch-mode -incremental -Xcc -ivfsstatcache -Xcc /Users/admin/builder/spi-builder-workspace/.derivedData/SDKStatCaches.noindex/macosx15.4-24E241-8287b8f5db97e746a1562fbca0c9d29b.sdkstatcache -output-file-map /Users/admin/builder/spi-builder-workspace/.derivedData/Build/Intermediates.noindex/SwiftTrace.build/Debug/SwiftTraceD.build/Objects-normal/arm64/SwiftTraceD-OutputFileMap.json -use-frontend-parseable-output -save-temps -no-color-diagnostics -serialize-diagnostics -emit-dependencies -emit-module -emit-module-path /Users/admin/builder/spi-builder-workspace/.derivedData/Build/Intermediates.noindex/SwiftTrace.build/Debug/SwiftTraceD.build/Objects-normal/arm64/SwiftTraceD.swiftmodule -validate-clang-modules-once -clang-build-session-file /Users/admin/builder/spi-builder-workspace/.derivedData/ModuleCache.noindex/Session.modulevalidation -Xcc -I/Users/admin/builder/spi-builder-workspace/.derivedData/Build/Intermediates.noindex/SwiftTrace.build/Debug/SwiftTraceD.build/swift-overrides.hmap -emit-const-values -Xfrontend -const-gather-protocols-file -Xfrontend /Users/admin/builder/spi-builder-workspace/.derivedData/Build/Intermediates.noindex/SwiftTrace.build/Debug/SwiftTraceD.build/Objects-normal/arm64/SwiftTraceD_const_extract_protocols.json -Xcc -I/Users/admin/builder/spi-builder-workspace/SwiftTraceGutsD/include -Xcc -I/Users/admin/builder/spi-builder-workspace/.derivedData/Build/Products/Debug/include -Xcc -I/Users/admin/builder/spi-builder-workspace/.derivedData/Build/Intermediates.noindex/SwiftTrace.build/Debug/SwiftTraceD.build/DerivedSources-normal/arm64 -Xcc -I/Users/admin/builder/spi-builder-workspace/.derivedData/Build/Intermediates.noindex/SwiftTrace.build/Debug/SwiftTraceD.build/DerivedSources/arm64 -Xcc -I/Users/admin/builder/spi-builder-workspace/.derivedData/Build/Intermediates.noindex/SwiftTrace.build/Debug/SwiftTraceD.build/DerivedSources -Xcc -DSWIFT_PACKAGE -Xcc -DDEBUG\=1 -emit-objc-header -emit-objc-header-path /Users/admin/builder/spi-builder-workspace/.derivedData/Build/Intermediates.noindex/SwiftTrace.build/Debug/SwiftTraceD.build/Objects-normal/arm64/SwiftTraceD-Swift.h -working-directory /Users/admin/builder/spi-builder-workspace/.swiftpm/xcode -experimental-emit-module-separately -disable-cmo
SwiftDriver SwiftTrace normal arm64 com.apple.xcode.tools.swift.compiler (in target 'SwiftTrace' from project 'SwiftTrace')
cd /Users/admin/builder/spi-builder-workspace/.swiftpm/xcode
builtin-SwiftDriver -- /Applications/Xcode-16.3.0.app/Contents/Developer/Toolchains/XcodeDefault.xctoolchain/usr/bin/swiftc -module-name SwiftTrace -Onone -enforce-exclusivity\=checked @/Users/admin/builder/spi-builder-workspace/.derivedData/Build/Intermediates.noindex/SwiftTrace.build/Debug/SwiftTrace.build/Objects-normal/arm64/SwiftTrace.SwiftFileList -DSWIFT_PACKAGE -DDEBUG -Xcc -fmodule-map-file\=/Users/admin/builder/spi-builder-workspace/.derivedData/Build/Intermediates.noindex/GeneratedModuleMaps/SwiftTraceGuts.modulemap -DXcode -plugin-path /Applications/Xcode-16.3.0.app/Contents/Developer/Toolchains/XcodeDefault.xctoolchain/usr/lib/swift/host/plugins/testing -enable-experimental-feature DebugDescriptionMacro -sdk /Applications/Xcode-16.3.0.app/Contents/Developer/Platforms/MacOSX.platform/Developer/SDKs/MacOSX15.4.sdk -target arm64-apple-macos10.13 -g -module-cache-path /Users/admin/builder/spi-builder-workspace/.derivedData/ModuleCache.noindex -Xfrontend -serialize-debugging-options -enable-testing -index-store-path /Users/admin/builder/spi-builder-workspace/.derivedData/Index.noindex/DataStore -swift-version 5 -I /Users/admin/builder/spi-builder-workspace/.derivedData/Build/Products/Debug -I /Applications/Xcode-16.3.0.app/Contents/Developer/Platforms/MacOSX.platform/Developer/usr/lib -F /Users/admin/builder/spi-builder-workspace/.derivedData/Build/Products/Debug/PackageFrameworks -F /Users/admin/builder/spi-builder-workspace/.derivedData/Build/Products/Debug -F /Applications/Xcode-16.3.0.app/Contents/Developer/Platforms/MacOSX.platform/Developer/Library/Frameworks -c -j10 -enable-batch-mode -incremental -Xcc -ivfsstatcache -Xcc /Users/admin/builder/spi-builder-workspace/.derivedData/SDKStatCaches.noindex/macosx15.4-24E241-8287b8f5db97e746a1562fbca0c9d29b.sdkstatcache -output-file-map /Users/admin/builder/spi-builder-workspace/.derivedData/Build/Intermediates.noindex/SwiftTrace.build/Debug/SwiftTrace.build/Objects-normal/arm64/SwiftTrace-OutputFileMap.json -use-frontend-parseable-output -save-temps -no-color-diagnostics -serialize-diagnostics -emit-dependencies -emit-module -emit-module-path /Users/admin/builder/spi-builder-workspace/.derivedData/Build/Intermediates.noindex/SwiftTrace.build/Debug/SwiftTrace.build/Objects-normal/arm64/SwiftTrace.swiftmodule -validate-clang-modules-once -clang-build-session-file /Users/admin/builder/spi-builder-workspace/.derivedData/ModuleCache.noindex/Session.modulevalidation -Xcc -I/Users/admin/builder/spi-builder-workspace/.derivedData/Build/Intermediates.noindex/SwiftTrace.build/Debug/SwiftTrace.build/swift-overrides.hmap -emit-const-values -Xfrontend -const-gather-protocols-file -Xfrontend /Users/admin/builder/spi-builder-workspace/.derivedData/Build/Intermediates.noindex/SwiftTrace.build/Debug/SwiftTrace.build/Objects-normal/arm64/SwiftTrace_const_extract_protocols.json -Xcc -I/Users/admin/builder/spi-builder-workspace/SwiftTraceGuts/include -Xcc -I/Users/admin/builder/spi-builder-workspace/.derivedData/Build/Products/Debug/include -Xcc -I/Users/admin/builder/spi-builder-workspace/.derivedData/Build/Intermediates.noindex/SwiftTrace.build/Debug/SwiftTrace.build/DerivedSources-normal/arm64 -Xcc -I/Users/admin/builder/spi-builder-workspace/.derivedData/Build/Intermediates.noindex/SwiftTrace.build/Debug/SwiftTrace.build/DerivedSources/arm64 -Xcc -I/Users/admin/builder/spi-builder-workspace/.derivedData/Build/Intermediates.noindex/SwiftTrace.build/Debug/SwiftTrace.build/DerivedSources -Xcc -DSWIFT_PACKAGE -Xcc -DDEBUG\=1 -emit-objc-header -emit-objc-header-path /Users/admin/builder/spi-builder-workspace/.derivedData/Build/Intermediates.noindex/SwiftTrace.build/Debug/SwiftTrace.build/Objects-normal/arm64/SwiftTrace-Swift.h -working-directory /Users/admin/builder/spi-builder-workspace/.swiftpm/xcode -experimental-emit-module-separately -disable-cmo
ProcessInfoPlistFile /Users/admin/builder/spi-builder-workspace/.derivedData/Build/Products/Debug/PackageFrameworks/SwiftTraceGuts.framework/Versions/A/Resources/Info.plist /Users/admin/builder/spi-builder-workspace/.derivedData/Build/Intermediates.noindex/SwiftTrace.build/Debug/SwiftTraceGuts\ product.build/empty-SwiftTraceGuts.plist (in target 'SwiftTraceGuts' from project 'SwiftTrace')
cd /Users/admin/builder/spi-builder-workspace
builtin-infoPlistUtility /Users/admin/builder/spi-builder-workspace/.derivedData/Build/Intermediates.noindex/SwiftTrace.build/Debug/SwiftTraceGuts\ product.build/empty-SwiftTraceGuts.plist -producttype com.apple.product-type.framework -expandbuildsettings -platform macosx -o /Users/admin/builder/spi-builder-workspace/.derivedData/Build/Products/Debug/PackageFrameworks/SwiftTraceGuts.framework/Versions/A/Resources/Info.plist
ProcessInfoPlistFile /Users/admin/builder/spi-builder-workspace/.derivedData/Build/Products/Debug/PackageFrameworks/SwiftTraceGutsD.framework/Versions/A/Resources/Info.plist /Users/admin/builder/spi-builder-workspace/.derivedData/Build/Intermediates.noindex/SwiftTrace.build/Debug/SwiftTraceGutsD\ product.build/empty-SwiftTraceGutsD.plist (in target 'SwiftTraceGutsD' from project 'SwiftTrace')
cd /Users/admin/builder/spi-builder-workspace
builtin-infoPlistUtility /Users/admin/builder/spi-builder-workspace/.derivedData/Build/Intermediates.noindex/SwiftTrace.build/Debug/SwiftTraceGutsD\ product.build/empty-SwiftTraceGutsD.plist -producttype com.apple.product-type.framework -expandbuildsettings -platform macosx -o /Users/admin/builder/spi-builder-workspace/.derivedData/Build/Products/Debug/PackageFrameworks/SwiftTraceGutsD.framework/Versions/A/Resources/Info.plist
Ld /Users/admin/builder/spi-builder-workspace/.derivedData/Build/Products/Debug/PackageFrameworks/SwiftTraceGuts.framework/Versions/A/SwiftTraceGuts normal (in target 'SwiftTraceGuts' from project 'SwiftTrace')
cd /Users/admin/builder/spi-builder-workspace
/Applications/Xcode-16.3.0.app/Contents/Developer/Toolchains/XcodeDefault.xctoolchain/usr/bin/clang -Xlinker -reproducible -target arm64-apple-macos10.13 -dynamiclib -isysroot /Applications/Xcode-16.3.0.app/Contents/Developer/Platforms/MacOSX.platform/Developer/SDKs/MacOSX15.4.sdk -O0 -L/Users/admin/builder/spi-builder-workspace/.derivedData/Build/Intermediates.noindex/EagerLinkingTBDs/Debug -L/Users/admin/builder/spi-builder-workspace/.derivedData/Build/Products/Debug -L/Applications/Xcode-16.3.0.app/Contents/Developer/Platforms/MacOSX.platform/Developer/usr/lib -F/Users/admin/builder/spi-builder-workspace/.derivedData/Build/Intermediates.noindex/EagerLinkingTBDs/Debug -F/Users/admin/builder/spi-builder-workspace/.derivedData/Build/Products/Debug/PackageFrameworks -F/Users/admin/builder/spi-builder-workspace/.derivedData/Build/Products/Debug -iframework /Applications/Xcode-16.3.0.app/Contents/Developer/Platforms/MacOSX.platform/Developer/Library/Frameworks -filelist /Users/admin/builder/spi-builder-workspace/.derivedData/Build/Intermediates.noindex/SwiftTrace.build/Debug/SwiftTraceGuts\ product.build/Objects-normal/arm64/SwiftTraceGuts.LinkFileList -install_name @rpath/SwiftTraceGuts.framework/Versions/A/SwiftTraceGuts -Xlinker -rpath -Xlinker /Users/admin/builder/spi-builder-workspace/.derivedData/Build/Products/Debug/PackageFrameworks -Xlinker -object_path_lto -Xlinker /Users/admin/builder/spi-builder-workspace/.derivedData/Build/Intermediates.noindex/SwiftTrace.build/Debug/SwiftTraceGuts\ product.build/Objects-normal/arm64/SwiftTraceGuts_lto.o -rdynamic -Xlinker -no_deduplicate -Xlinker -dependency_info -Xlinker /Users/admin/builder/spi-builder-workspace/.derivedData/Build/Intermediates.noindex/SwiftTrace.build/Debug/SwiftTraceGuts\ product.build/Objects-normal/arm64/SwiftTraceGuts_dependency_info.dat -lc++ -Wl,-no_warn_duplicate_libraries -o /Users/admin/builder/spi-builder-workspace/.derivedData/Build/Products/Debug/PackageFrameworks/SwiftTraceGuts.framework/Versions/A/SwiftTraceGuts
Undefined symbols for architecture arm64:
"_NSLog", referenced from:
+[NSObject(SwiftTrace) swiftTraceDefaultMethodExclusions] in SwiftTraceGuts.o
+[NSObject(SwiftTrace) swiftTraceDefaultMethodExclusions] in SwiftTraceGuts.o
+[NSObject(SwiftTrace) swiftTraceDefaultMethodExclusions] in SwiftTraceGuts.o
+[NSObject(SwiftTrace) swiftTraceDefaultMethodExclusions] in SwiftTraceGuts.o
"_OBJC_CLASS_$_NSAssertionHandler", referenced from:
in SwiftTraceGuts.o
"_OBJC_CLASS_$_NSBundle", referenced from:
in SwiftTraceGuts.o
"_OBJC_CLASS_$_NSMethodSignature", referenced from:
in SwiftTraceGuts.o
"_OBJC_CLASS_$_NSMutableArray", referenced from:
in SwiftTraceGuts.o
"_OBJC_CLASS_$_NSObject", referenced from:
__OBJC_$_CATEGORY_NSObject_$_SwiftTrace in SwiftTraceGuts.o
in SwiftTraceGuts.o
"_OBJC_CLASS_$_NSString", referenced from:
in SwiftTraceGuts.o
"_OBJC_CLASS_$_NSThread", referenced from:
in SwiftTraceGuts.o
"_OBJC_CLASS_$_NSValue", referenced from:
in SwiftTraceGuts.o
"_OBJC_CLASS_$_SwiftMeta", referenced from:
in SwiftTraceGuts.o
"_OBJC_CLASS_$_SwiftTrace", referenced from:
in SwiftTraceGuts.o
"_OBJC_EHTYPE_$_NSException", referenced from:
GCC_except_table2 in SwiftTraceGuts.o
"___CFConstantStringClassReference", referenced from:
in SwiftTraceGuts.o
in SwiftTraceGuts.o
in SwiftTraceGuts.o
in SwiftTraceGuts.o
in SwiftTraceGuts.o
in SwiftTraceGuts.o
in SwiftTraceGuts.o
...
"___objc_personality_v0", referenced from:
/Users/admin/builder/spi-builder-workspace/.derivedData/Build/Products/Debug/SwiftTraceGuts.o
"_class_getImageName", referenced from:
+[NSObject(SwiftTrace) swiftTraceDefaultMethodExclusions] in SwiftTraceGuts.o
"_class_getSuperclass", referenced from:
+[NSObject(SwiftTrace) swiftTraceDefaultMethodExclusions] in SwiftTraceGuts.o
"_method_getTypeEncoding", referenced from:
+[NSObject(SwiftTrace) swiftTraceDefaultMethodExclusions] in SwiftTraceGuts.o
"_objc_autoreleasePoolPop", referenced from:
___cxx_global_var_init in SwiftTraceGuts.o
"_objc_autoreleasePoolPush", referenced from:
___cxx_global_var_init in SwiftTraceGuts.o
"_objc_autoreleaseReturnValue", referenced from:
+[NSObject(SwiftTrace) swiftTraceDefaultMethodExclusions] in SwiftTraceGuts.o
+[NSObject(SwiftTrace) swiftTraceDefaultMethodExclusions] in SwiftTraceGuts.o
+[NSObject(SwiftTrace) swiftTraceDefaultMethodExclusions] in SwiftTraceGuts.o
+[NSObject(SwiftTrace) swiftTraceDefaultMethodExclusions] in SwiftTraceGuts.o
+[NSObject(SwiftTrace) swiftTraceDefaultMethodExclusions] in SwiftTraceGuts.o
+[NSObject(SwiftTrace) swiftTraceDefaultMethodExclusions] in SwiftTraceGuts.o
"_objc_begin_catch", referenced from:
+[NSObject(SwiftTrace) swiftTraceDefaultMethodExclusions] in SwiftTraceGuts.o
"_objc_copyClassList", referenced from:
+[NSObject(SwiftTrace) swiftTraceDefaultMethodExclusions] in SwiftTraceGuts.o
"_objc_end_catch", referenced from:
+[NSObject(SwiftTrace) swiftTraceDefaultMethodExclusions] in SwiftTraceGuts.o
+[NSObject(SwiftTrace) swiftTraceDefaultMethodExclusions] in SwiftTraceGuts.o
"_objc_enumerationMutation", referenced from:
+[NSObject(SwiftTrace) swiftTraceDefaultMethodExclusions] in SwiftTraceGuts.o
+[NSObject(SwiftTrace) swiftTraceDefaultMethodExclusions] in SwiftTraceGuts.o
"_objc_msgSend", referenced from:
in objc-stubs-file
"_objc_release", referenced from:
+[NSObject(SwiftTrace) swiftTraceDefaultMethodExclusions] in SwiftTraceGuts.o
+[NSObject(SwiftTrace) swiftTraceDefaultMethodExclusions] in SwiftTraceGuts.o
+[NSObject(SwiftTrace) swiftTraceDefaultMethodExclusions] in SwiftTraceGuts.o
+[NSObject(SwiftTrace) swiftTraceDefaultMethodExclusions] in SwiftTraceGuts.o
+[NSObject(SwiftTrace) swiftTraceDefaultMethodExclusions] in SwiftTraceGuts.o
+[NSObject(SwiftTrace) swiftTraceDefaultMethodExclusions] in SwiftTraceGuts.o
+[NSObject(SwiftTrace) swiftTraceDefaultMethodExclusions] in SwiftTraceGuts.o
+[NSObject(SwiftTrace) swiftTraceDefaultMethodExclusions] in SwiftTraceGuts.o
+[NSObject(SwiftTrace) swiftTraceDefaultMethodExclusions] in SwiftTraceGuts.o
+[NSObject(SwiftTrace) swiftTraceDefaultMethodExclusions] in SwiftTraceGuts.o
+[NSObject(SwiftTrace) swiftTraceDefaultMethodExclusions] in SwiftTraceGuts.o
+[NSObject(SwiftTrace) swiftTraceDefaultMethodExclusions] in SwiftTraceGuts.o
+[NSObject(SwiftTrace) swiftTraceDefaultMethodExclusions] in SwiftTraceGuts.o
+[NSObject(SwiftTrace) swiftTraceDefaultMethodExclusions] in SwiftTraceGuts.o
+[NSObject(SwiftTrace) swiftTraceDefaultMethodExclusions] in SwiftTraceGuts.o
+[NSObject(SwiftTrace) swiftTraceDefaultMethodExclusions] in SwiftTraceGuts.o
+[NSObject(SwiftTrace) swiftTraceDefaultMethodExclusions] in SwiftTraceGuts.o
+[NSObject(SwiftTrace) swiftTraceDefaultMethodExclusions] in SwiftTraceGuts.o
+[NSObject(SwiftTrace) swiftTraceDefaultMethodExclusions] in SwiftTraceGuts.o
+[NSObject(SwiftTrace) swiftTraceDefaultMethodExclusions] in SwiftTraceGuts.o
+[NSObject(SwiftTrace) swiftTraceDefaultMethodExclusions] in SwiftTraceGuts.o
+[NSObject(SwiftTrace) swiftTraceDefaultMethodExclusions] in SwiftTraceGuts.o
+[NSObject(SwiftTrace) swiftTraceDefaultMethodExclusions] in SwiftTraceGuts.o
+[NSObject(SwiftTrace) swiftTraceDefaultMethodExclusions] in SwiftTraceGuts.o
+[NSObject(SwiftTrace) swiftTraceDefaultMethodExclusions] in SwiftTraceGuts.o
+[NSObject(SwiftTrace) swiftTraceDefaultMethodExclusions] in SwiftTraceGuts.o
+[NSObject(SwiftTrace) swiftTraceDefaultMethodExclusions] in SwiftTraceGuts.o
+[NSObject(SwiftTrace) swiftTraceDefaultMethodExclusions] in SwiftTraceGuts.o
+[NSObject(SwiftTrace) swiftTraceDefaultMethodExclusions] in SwiftTraceGuts.o
+[NSObject(SwiftTrace) swiftTraceDefaultMethodExclusions] in SwiftTraceGuts.o
+[NSObject(SwiftTrace) swiftTraceDefaultMethodExclusions] in SwiftTraceGuts.o
+[NSObject(SwiftTrace) swiftTraceDefaultMethodExclusions] in SwiftTraceGuts.o
+[NSObject(SwiftTrace) swiftTraceDefaultMethodExclusions] in SwiftTraceGuts.o
+[NSObject(SwiftTrace) swiftTraceDefaultMethodExclusions] in SwiftTraceGuts.o
+[NSObject(SwiftTrace) swiftTraceDefaultMethodExclusions] in SwiftTraceGuts.o
+[NSObject(SwiftTrace) swiftTraceDefaultMethodExclusions] in SwiftTraceGuts.o
+[NSObject(SwiftTrace) swiftTraceDefaultMethodExclusions] in SwiftTraceGuts.o
+[NSObject(SwiftTrace) swiftTraceDefaultMethodExclusions] in SwiftTraceGuts.o
+[NSObject(SwiftTrace) swiftTraceDefaultMethodExclusions] in SwiftTraceGuts.o
...
"_objc_retain", referenced from:
+[NSObject(SwiftTrace) swiftTraceDefaultMethodExclusions] in SwiftTraceGuts.o
+[NSObject(SwiftTrace) swiftTraceDefaultMethodExclusions] in SwiftTraceGuts.o
+[NSObject(SwiftTrace) swiftTraceDefaultMethodExclusions] in SwiftTraceGuts.o
+[NSObject(SwiftTrace) swiftTraceDefaultMethodExclusions] in SwiftTraceGuts.o
+[NSObject(SwiftTrace) swiftTraceDefaultMethodExclusions] in SwiftTraceGuts.o
"_objc_retainAutorelease", referenced from:
+[NSObject(SwiftTrace) swiftTraceDefaultMethodExclusions] in SwiftTraceGuts.o
+[NSObject(SwiftTrace) swiftTraceDefaultMethodExclusions] in SwiftTraceGuts.o
+[NSObject(SwiftTrace) swiftTraceDefaultMethodExclusions] in SwiftTraceGuts.o
+[NSObject(SwiftTrace) swiftTraceDefaultMethodExclusions] in SwiftTraceGuts.o
+[NSObject(SwiftTrace) swiftTraceDefaultMethodExclusions] in SwiftTraceGuts.o
+[NSObject(SwiftTrace) swiftTraceDefaultMethodExclusions] in SwiftTraceGuts.o
+[NSObject(SwiftTrace) swiftTraceDefaultMethodExclusions] in SwiftTraceGuts.o
...
"_objc_retainAutoreleasedReturnValue", referenced from:
+[NSObject(SwiftTrace) swiftTraceDefaultMethodExclusions] in SwiftTraceGuts.o
+[NSObject(SwiftTrace) swiftTraceDefaultMethodExclusions] in SwiftTraceGuts.o
+[NSObject(SwiftTrace) swiftTraceDefaultMethodExclusions] in SwiftTraceGuts.o
+[NSObject(SwiftTrace) swiftTraceDefaultMethodExclusions] in SwiftTraceGuts.o
+[NSObject(SwiftTrace) swiftTraceDefaultMethodExclusions] in SwiftTraceGuts.o
+[NSObject(SwiftTrace) swiftTraceDefaultMethodExclusions] in SwiftTraceGuts.o
+[NSObject(SwiftTrace) swiftTraceDefaultMethodExclusions] in SwiftTraceGuts.o
+[NSObject(SwiftTrace) swiftTraceDefaultMethodExclusions] in SwiftTraceGuts.o
+[NSObject(SwiftTrace) swiftTraceDefaultMethodExclusions] in SwiftTraceGuts.o
+[NSObject(SwiftTrace) swiftTraceDefaultMethodExclusions] in SwiftTraceGuts.o
+[NSObject(SwiftTrace) swiftTraceDefaultMethodExclusions] in SwiftTraceGuts.o
+[NSObject(SwiftTrace) swiftTraceDefaultMethodExclusions] in SwiftTraceGuts.o
+[NSObject(SwiftTrace) swiftTraceDefaultMethodExclusions] in SwiftTraceGuts.o
+[NSObject(SwiftTrace) swiftTraceDefaultMethodExclusions] in SwiftTraceGuts.o
+[NSObject(SwiftTrace) swiftTraceDefaultMethodExclusions] in SwiftTraceGuts.o
+[NSObject(SwiftTrace) swiftTraceDefaultMethodExclusions] in SwiftTraceGuts.o
+[NSObject(SwiftTrace) swiftTraceDefaultMethodExclusions] in SwiftTraceGuts.o
+[NSObject(SwiftTrace) swiftTraceDefaultMethodExclusions] in SwiftTraceGuts.o
+[NSObject(SwiftTrace) swiftTraceDefaultMethodExclusions] in SwiftTraceGuts.o
+[NSObject(SwiftTrace) swiftTraceDefaultMethodExclusions] in SwiftTraceGuts.o
+[NSObject(SwiftTrace) swiftTraceDefaultMethodExclusions] in SwiftTraceGuts.o
+[NSObject(SwiftTrace) swiftTraceDefaultMethodExclusions] in SwiftTraceGuts.o
+[NSObject(SwiftTrace) swiftTraceDefaultMethodExclusions] in SwiftTraceGuts.o
+[NSObject(SwiftTrace) swiftTraceDefaultMethodExclusions] in SwiftTraceGuts.o
+[NSObject(SwiftTrace) swiftTraceDefaultMethodExclusions] in SwiftTraceGuts.o
+[NSObject(SwiftTrace) swiftTraceDefaultMethodExclusions] in SwiftTraceGuts.o
+[NSObject(SwiftTrace) swiftTraceDefaultMethodExclusions] in SwiftTraceGuts.o
...
"_objc_retainBlock", referenced from:
+[NSObject(SwiftTrace) swiftTraceDefaultMethodExclusions] in SwiftTraceGuts.o
"_objc_storeStrong", referenced from:
+[NSObject(SwiftTrace) swiftTraceDefaultMethodExclusions] in SwiftTraceGuts.o
+[NSObject(SwiftTrace) swiftTraceDefaultMethodExclusions] in SwiftTraceGuts.o
+[NSObject(SwiftTrace) swiftTraceDefaultMethodExclusions] in SwiftTraceGuts.o
+[NSObject(SwiftTrace) swiftTraceDefaultMethodExclusions] in SwiftTraceGuts.o
+[NSObject(SwiftTrace) swiftTraceDefaultMethodExclusions] in SwiftTraceGuts.o
+[NSObject(SwiftTrace) swiftTraceDefaultMethodExclusions] in SwiftTraceGuts.o
+[NSObject(SwiftTrace) swiftTraceDefaultMethodExclusions] in SwiftTraceGuts.o
+[NSObject(SwiftTrace) swiftTraceDefaultMethodExclusions] in SwiftTraceGuts.o
+[NSObject(SwiftTrace) swiftTraceDefaultMethodExclusions] in SwiftTraceGuts.o
+[NSObject(SwiftTrace) swiftTraceDefaultMethodExclusions] in SwiftTraceGuts.o
+[NSObject(SwiftTrace) swiftTraceDefaultMethodExclusions] in SwiftTraceGuts.o
+[NSObject(SwiftTrace) swiftTraceDefaultMethodExclusions] in SwiftTraceGuts.o
+[NSObject(SwiftTrace) swiftTraceDefaultMethodExclusions] in SwiftTraceGuts.o
+[NSObject(SwiftTrace) swiftTraceDefaultMethodExclusions] in SwiftTraceGuts.o
+[NSObject(SwiftTrace) swiftTraceDefaultMethodExclusions] in SwiftTraceGuts.o
+[NSObject(SwiftTrace) swiftTraceDefaultMethodExclusions] in SwiftTraceGuts.o
+[NSObject(SwiftTrace) swiftTraceDefaultMethodExclusions] in SwiftTraceGuts.o
+[NSObject(SwiftTrace) swiftTraceDefaultMethodExclusions] in SwiftTraceGuts.o
+[NSObject(SwiftTrace) swiftTraceDefaultMethodExclusions] in SwiftTraceGuts.o
+[NSObject(SwiftTrace) swiftTraceDefaultMethodExclusions] in SwiftTraceGuts.o
+[NSObject(SwiftTrace) swiftTraceDefaultMethodExclusions] in SwiftTraceGuts.o
+[NSObject(SwiftTrace) swiftTraceDefaultMethodExclusions] in SwiftTraceGuts.o
+[NSObject(SwiftTrace) swiftTraceDefaultMethodExclusions] in SwiftTraceGuts.o
+[NSObject(SwiftTrace) swiftTraceDefaultMethodExclusions] in SwiftTraceGuts.o
+[NSObject(SwiftTrace) swiftTraceDefaultMethodExclusions] in SwiftTraceGuts.o
+[NSObject(SwiftTrace) swiftTraceDefaultMethodExclusions] in SwiftTraceGuts.o
+[NSObject(SwiftTrace) swiftTraceDefaultMethodExclusions] in SwiftTraceGuts.o
+[NSObject(SwiftTrace) swiftTraceDefaultMethodExclusions] in SwiftTraceGuts.o
+[NSObject(SwiftTrace) swiftTraceDefaultMethodExclusions] in SwiftTraceGuts.o
+[NSObject(SwiftTrace) swiftTraceDefaultMethodExclusions] in SwiftTraceGuts.o
+[NSObject(SwiftTrace) swiftTraceDefaultMethodExclusions] in SwiftTraceGuts.o
+[NSObject(SwiftTrace) swiftTraceDefaultMethodExclusions] in SwiftTraceGuts.o
+[NSObject(SwiftTrace) swiftTraceDefaultMethodExclusions] in SwiftTraceGuts.o
+[NSObject(SwiftTrace) swiftTraceDefaultMethodExclusions] in SwiftTraceGuts.o
+[NSObject(SwiftTrace) swiftTraceDefaultMethodExclusions] in SwiftTraceGuts.o
+[NSObject(SwiftTrace) swiftTraceDefaultMethodExclusions] in SwiftTraceGuts.o
+[NSObject(SwiftTrace) swiftTraceDefaultMethodExclusions] in SwiftTraceGuts.o
+[NSObject(SwiftTrace) swiftTraceDefaultMethodExclusions] in SwiftTraceGuts.o
+[NSObject(SwiftTrace) swiftTraceDefaultMethodExclusions] in SwiftTraceGuts.o
+[NSObject(SwiftTrace) swiftTraceDefaultMethodExclusions] in SwiftTraceGuts.o
+[NSObject(SwiftTrace) swiftTraceDefaultMethodExclusions] in SwiftTraceGuts.o
+[NSObject(SwiftTrace) swiftTraceDefaultMethodExclusions] in SwiftTraceGuts.o
+[NSObject(SwiftTrace) swiftTraceDefaultMethodExclusions] in SwiftTraceGuts.o
+[NSObject(SwiftTrace) swiftTraceDefaultMethodExclusions] in SwiftTraceGuts.o
+[NSObject(SwiftTrace) swiftTraceDefaultMethodExclusions] in SwiftTraceGuts.o
+[NSObject(SwiftTrace) swiftTraceDefaultMethodExclusions] in SwiftTraceGuts.o
+[NSObject(SwiftTrace) swiftTraceDefaultMethodExclusions] in SwiftTraceGuts.o
+[NSObject(SwiftTrace) swiftTraceDefaultMethodExclusions] in SwiftTraceGuts.o
+[NSObject(SwiftTrace) swiftTraceDefaultMethodExclusions] in SwiftTraceGuts.o
+[NSObject(SwiftTrace) swiftTraceDefaultMethodExclusions] in SwiftTraceGuts.o
+[NSObject(SwiftTrace) swiftTraceDefaultMethodExclusions] in SwiftTraceGuts.o
+[NSObject(SwiftTrace) swiftTraceDefaultMethodExclusions] in SwiftTraceGuts.o
+[NSObject(SwiftTrace) swiftTraceDefaultMethodExclusions] in SwiftTraceGuts.o
+[NSObject(SwiftTrace) swiftTraceDefaultMethodExclusions] in SwiftTraceGuts.o
+[NSObject(SwiftTrace) swiftTraceDefaultMethodExclusions] in SwiftTraceGuts.o
+[NSObject(SwiftTrace) swiftTraceDefaultMethodExclusions] in SwiftTraceGuts.o
+[NSObject(SwiftTrace) swiftTraceDefaultMethodExclusions] in SwiftTraceGuts.o
+[NSObject(SwiftTrace) swiftTraceDefaultMethodExclusions] in SwiftTraceGuts.o
+[NSObject(SwiftTrace) swiftTraceDefaultMethodExclusions] in SwiftTraceGuts.o
+[NSObject(SwiftTrace) swiftTraceDefaultMethodExclusions] in SwiftTraceGuts.o
+[NSObject(SwiftTrace) swiftTraceDefaultMethodExclusions] in SwiftTraceGuts.o
+[NSObject(SwiftTrace) swiftTraceDefaultMethodExclusions] in SwiftTraceGuts.o
+[NSObject(SwiftTrace) swiftTraceDefaultMethodExclusions] in SwiftTraceGuts.o
+[NSObject(SwiftTrace) swiftTraceDefaultMethodExclusions] in SwiftTraceGuts.o
+[NSObject(SwiftTrace) swiftTraceDefaultMethodExclusions] in SwiftTraceGuts.o
+[NSObject(SwiftTrace) swiftTraceDefaultMethodExclusions] in SwiftTraceGuts.o
+[NSObject(SwiftTrace) swiftTraceDefaultMethodExclusions] in SwiftTraceGuts.o
+[NSObject(SwiftTrace) swiftTraceDefaultMethodExclusions] in SwiftTraceGuts.o
+[NSObject(SwiftTrace) swiftTraceDefaultMethodExclusions] in SwiftTraceGuts.o
+[NSObject(SwiftTrace) swiftTraceDefaultMethodExclusions] in SwiftTraceGuts.o
+[NSObject(SwiftTrace) swiftTraceDefaultMethodExclusions] in SwiftTraceGuts.o
+[NSObject(SwiftTrace) swiftTraceDefaultMethodExclusions] in SwiftTraceGuts.o
+[NSObject(SwiftTrace) swiftTraceDefaultMethodExclusions] in SwiftTraceGuts.o
+[NSObject(SwiftTrace) swiftTraceDefaultMethodExclusions] in SwiftTraceGuts.o
+[NSObject(SwiftTrace) swiftTraceDefaultMethodExclusions] in SwiftTraceGuts.o
+[NSObject(SwiftTrace) swiftTraceDefaultMethodExclusions] in SwiftTraceGuts.o
+[NSObject(SwiftTrace) swiftTraceDefaultMethodExclusions] in SwiftTraceGuts.o
+[NSObject(SwiftTrace) swiftTraceDefaultMethodExclusions] in SwiftTraceGuts.o
+[NSObject(SwiftTrace) swiftTraceDefaultMethodExclusions] in SwiftTraceGuts.o
+[NSObject(SwiftTrace) swiftTraceDefaultMethodExclusions] in SwiftTraceGuts.o
...
ld: symbol(s) not found for architecture arm64
clang: error: linker command failed with exit code 1 (use -v to see invocation)
--- xcodebuild: WARNING: Using the first of multiple matching destinations:
{ platform:macOS, arch:arm64, id:0fdd555cdc2e3410af5a304247942a6f63a1d2d9, name:My Mac }
{ platform:macOS, arch:arm64, variant:Mac Catalyst, id:0fdd555cdc2e3410af5a304247942a6f63a1d2d9, name:My Mac }
{ platform:macOS, arch:arm64, variant:DriverKit, id:0fdd555cdc2e3410af5a304247942a6f63a1d2d9, name:My Mac }
{ platform:macOS, arch:arm64, variant:Designed for [iPad,iPhone], id:0fdd555cdc2e3410af5a304247942a6f63a1d2d9, name:My Mac }
** BUILD FAILED **
The following build commands failed:
Ld /Users/admin/builder/spi-builder-workspace/.derivedData/Build/Products/Debug/PackageFrameworks/SwiftTraceGutsD.framework/Versions/A/SwiftTraceGutsD normal (in target 'SwiftTraceGutsD' from project 'SwiftTrace')
Ld /Users/admin/builder/spi-builder-workspace/.derivedData/Build/Products/Debug/PackageFrameworks/SwiftTraceGuts.framework/Versions/A/SwiftTraceGuts normal (in target 'SwiftTraceGuts' from project 'SwiftTrace')
Building workspace spi-builder-workspace with scheme SwiftTrace-Package
(3 failures)
BUILD FAILURE 6.1 macosXcodebuild