The Swift Package Index logo.Swift Package Index

Track the adoption of Swift 6 strict concurrency checks for data race safety. How many packages are Ready for Swift 6?

Build Information

Failed to build SwiftDI, reference 1.0.1 (9fc350), with Swift 6.1 for macOS (Xcode) using Xcode 16.3 on 24 Apr 2025 21:53:11 UTC.

Build Command

env DEVELOPER_DIR=/Applications/Xcode-16.3.0.app xcrun xcodebuild -IDEClonedSourcePackagesDirPathOverride=$PWD/.dependencies -skipMacroValidation -skipPackagePluginValidation -derivedDataPath $PWD/.derivedData build -scheme SwiftDI -destination platform=macOS,arch=arm64

Build Log

========================================
RunAll
========================================
Builder version: 4.61.0
Interrupt handler set up.
========================================
Checkout
========================================
Clone URL: https://github.com/litecode/swiftdi.git
Reference: 1.0.1
Initialized empty Git repository in /Users/admin/builder/spi-builder-workspace/.git/
From https://github.com/litecode/swiftdi
 * tag               1.0.1      -> FETCH_HEAD
HEAD is now at 9fc3502 Update to new Xcode 11 beta 3 API
Cloned https://github.com/litecode/swiftdi.git
Revision (git rev-parse @):
9fc3502b1d1a48dc2d96136911f6abe279853254
SUCCESS checkout https://github.com/litecode/swiftdi.git at 1.0.1
========================================
Build
========================================
Selected platform:         macosXcodebuild
Swift version:             6.1
Building package at path:  $PWD
https://github.com/litecode/swiftdi.git
https://github.com/litecode/swiftdi.git
{
  "dependencies" : [
  ],
  "manifest_display_name" : "SwiftDI",
  "name" : "SwiftDI",
  "path" : "/Users/admin/builder/spi-builder-workspace",
  "platforms" : [
  ],
  "products" : [
    {
      "name" : "SwiftDI",
      "targets" : [
        "SwiftDI"
      ],
      "type" : {
        "library" : [
          "automatic"
        ]
      }
    }
  ],
  "targets" : [
    {
      "c99name" : "SwiftDITests",
      "module_type" : "SwiftTarget",
      "name" : "SwiftDITests",
      "path" : "Tests/SwiftDITests",
      "sources" : [
        "SwiftDITests.swift",
        "XCTestManifests.swift"
      ],
      "target_dependencies" : [
        "SwiftDI"
      ],
      "type" : "test"
    },
    {
      "c99name" : "SwiftDI",
      "module_type" : "SwiftTarget",
      "name" : "SwiftDI",
      "path" : "Sources",
      "product_memberships" : [
        "SwiftDI"
      ],
      "sources" : [
        "SwiftDI/DIComponentContext.swift",
        "SwiftDI/DIComponentManager.swift",
        "SwiftDI/DIContainer.swift",
        "SwiftDI/DIContainerConvertible.swift",
        "SwiftDI/DIObject.swift",
        "SwiftDI/DIPart.swift",
        "SwiftDI/Extensions.swift",
        "SwiftDI/Injectable.swift",
        "SwiftDI/InjectableObjectBinding.swift",
        "SwiftDI/InjectableProperty.swift",
        "SwiftDI/Resolver.swift",
        "SwiftDI/SwiftDI.swift",
        "SwiftDI/Utils.swift"
      ],
      "type" : "library"
    }
  ],
  "tools_version" : "5.1"
}
Command line invocation:
    /Applications/Xcode-16.3.0.app/Contents/Developer/usr/bin/xcodebuild -IDEClonedSourcePackagesDirPathOverride=/Users/admin/builder/spi-builder-workspace/.dependencies -resolvePackageDependencies
Resolve Package Graph
Resolved source packages:
  SwiftDI: /Users/admin/builder/spi-builder-workspace
resolved source packages: SwiftDI
{
  "dependencies" : [
  ],
  "manifest_display_name" : "SwiftDI",
  "name" : "SwiftDI",
  "path" : "/Users/admin/builder/spi-builder-workspace",
  "platforms" : [
  ],
  "products" : [
    {
      "name" : "SwiftDI",
      "targets" : [
        "SwiftDI"
      ],
      "type" : {
        "library" : [
          "automatic"
        ]
      }
    }
  ],
  "targets" : [
    {
      "c99name" : "SwiftDITests",
      "module_type" : "SwiftTarget",
      "name" : "SwiftDITests",
      "path" : "Tests/SwiftDITests",
      "sources" : [
        "SwiftDITests.swift",
        "XCTestManifests.swift"
      ],
      "target_dependencies" : [
        "SwiftDI"
      ],
      "type" : "test"
    },
    {
      "c99name" : "SwiftDI",
      "module_type" : "SwiftTarget",
      "name" : "SwiftDI",
      "path" : "Sources",
      "product_memberships" : [
        "SwiftDI"
      ],
      "sources" : [
        "SwiftDI/DIComponentContext.swift",
        "SwiftDI/DIComponentManager.swift",
        "SwiftDI/DIContainer.swift",
        "SwiftDI/DIContainerConvertible.swift",
        "SwiftDI/DIObject.swift",
        "SwiftDI/DIPart.swift",
        "SwiftDI/Extensions.swift",
        "SwiftDI/Injectable.swift",
        "SwiftDI/InjectableObjectBinding.swift",
        "SwiftDI/InjectableProperty.swift",
        "SwiftDI/Resolver.swift",
        "SwiftDI/SwiftDI.swift",
        "SwiftDI/Utils.swift"
      ],
      "type" : "library"
    }
  ],
  "tools_version" : "5.1"
}
{
  "workspace" : {
    "name" : "spi-builder-workspace",
    "schemes" : [
      "SwiftDI"
    ]
  }
}
Running build ...
env DEVELOPER_DIR=/Applications/Xcode-16.3.0.app xcrun xcodebuild -IDEClonedSourcePackagesDirPathOverride=$PWD/.dependencies -skipMacroValidation -skipPackagePluginValidation -derivedDataPath $PWD/.derivedData build -scheme SwiftDI -destination platform=macOS,arch=arm64 OTHER_SWIFT_FLAGS=-stats-output-dir .stats -strict-concurrency=complete -enable-upcoming-feature StrictConcurrency -enable-upcoming-feature DisableOutwardActorInference -enable-upcoming-feature GlobalActorIsolatedTypesUsability -enable-upcoming-feature InferSendableFromCaptures
Command line invocation:
    /Applications/Xcode-16.3.0.app/Contents/Developer/usr/bin/xcodebuild -IDEClonedSourcePackagesDirPathOverride=/Users/admin/builder/spi-builder-workspace/.dependencies -skipMacroValidation -skipPackagePluginValidation -derivedDataPath /Users/admin/builder/spi-builder-workspace/.derivedData build -scheme SwiftDI -destination platform=macOS,arch=arm64 "OTHER_SWIFT_FLAGS=-stats-output-dir .stats -strict-concurrency=complete -enable-upcoming-feature StrictConcurrency -enable-upcoming-feature DisableOutwardActorInference -enable-upcoming-feature GlobalActorIsolatedTypesUsability -enable-upcoming-feature InferSendableFromCaptures"
Build settings from command line:
    OTHER_SWIFT_FLAGS = -stats-output-dir .stats -strict-concurrency=complete -enable-upcoming-feature StrictConcurrency -enable-upcoming-feature DisableOutwardActorInference -enable-upcoming-feature GlobalActorIsolatedTypesUsability -enable-upcoming-feature InferSendableFromCaptures
Resolve Package Graph
Resolved source packages:
  SwiftDI: /Users/admin/builder/spi-builder-workspace
ComputePackagePrebuildTargetDependencyGraph
Prepare packages
CreateBuildRequest
SendProjectDescription
CreateBuildOperation
ComputeTargetDependencyGraph
note: Building targets in dependency order
note: Target dependency graph (2 targets)
    Target 'SwiftDI' in project 'SwiftDI'
        ➜ Explicit dependency on target 'SwiftDI' in project 'SwiftDI'
    Target 'SwiftDI' in project 'SwiftDI' (no dependencies)
GatherProvisioningInputs
CreateBuildDescription
ExecuteExternalTool /Applications/Xcode-16.3.0.app/Contents/Developer/Toolchains/XcodeDefault.xctoolchain/usr/bin/clang -v -E -dM -isysroot /Applications/Xcode-16.3.0.app/Contents/Developer/Platforms/MacOSX.platform/Developer/SDKs/MacOSX15.4.sdk -x c -c /dev/null
ExecuteExternalTool /Applications/Xcode-16.3.0.app/Contents/Developer/Toolchains/XcodeDefault.xctoolchain/usr/bin/swiftc --version
ExecuteExternalTool /Applications/Xcode-16.3.0.app/Contents/Developer/Toolchains/XcodeDefault.xctoolchain/usr/bin/ld -version_details
Build description signature: 5f34d9a2ece8e229c5fde325fb1f2933
Build description path: /Users/admin/builder/spi-builder-workspace/.derivedData/Build/Intermediates.noindex/XCBuildData/5f34d9a2ece8e229c5fde325fb1f2933.xcbuilddata
CreateBuildDirectory /Users/admin/builder/spi-builder-workspace/.derivedData/Build/Products
    cd /Users/admin/builder/spi-builder-workspace/.swiftpm/xcode
    builtin-create-build-directory /Users/admin/builder/spi-builder-workspace/.derivedData/Build/Products
CreateBuildDirectory /Users/admin/builder/spi-builder-workspace/.derivedData/Build/Intermediates.noindex
    cd /Users/admin/builder/spi-builder-workspace/.swiftpm/xcode
    builtin-create-build-directory /Users/admin/builder/spi-builder-workspace/.derivedData/Build/Intermediates.noindex
ClangStatCache /Applications/Xcode-16.3.0.app/Contents/Developer/Toolchains/XcodeDefault.xctoolchain/usr/bin/clang-stat-cache /Applications/Xcode-16.3.0.app/Contents/Developer/Platforms/MacOSX.platform/Developer/SDKs/MacOSX15.4.sdk /Users/admin/builder/spi-builder-workspace/.derivedData/SDKStatCaches.noindex/macosx15.4-24E241-8287b8f5db97e746a1562fbca0c9d29b.sdkstatcache
    cd /Users/admin/builder/spi-builder-workspace/.swiftpm/xcode
    /Applications/Xcode-16.3.0.app/Contents/Developer/Toolchains/XcodeDefault.xctoolchain/usr/bin/clang-stat-cache /Applications/Xcode-16.3.0.app/Contents/Developer/Platforms/MacOSX.platform/Developer/SDKs/MacOSX15.4.sdk -o /Users/admin/builder/spi-builder-workspace/.derivedData/SDKStatCaches.noindex/macosx15.4-24E241-8287b8f5db97e746a1562fbca0c9d29b.sdkstatcache
CreateBuildDirectory /Users/admin/builder/spi-builder-workspace/.derivedData/Build/Products/Debug
    cd /Users/admin/builder/spi-builder-workspace/.swiftpm/xcode
    builtin-create-build-directory /Users/admin/builder/spi-builder-workspace/.derivedData/Build/Products/Debug
CreateBuildDirectory /Users/admin/builder/spi-builder-workspace/.derivedData/Build/Intermediates.noindex/EagerLinkingTBDs/Debug
    cd /Users/admin/builder/spi-builder-workspace/.swiftpm/xcode
    builtin-create-build-directory /Users/admin/builder/spi-builder-workspace/.derivedData/Build/Intermediates.noindex/EagerLinkingTBDs/Debug
CreateBuildDirectory /Users/admin/builder/spi-builder-workspace/.derivedData/Build/Products/Debug/PackageFrameworks
    cd /Users/admin/builder/spi-builder-workspace/.swiftpm/xcode
    builtin-create-build-directory /Users/admin/builder/spi-builder-workspace/.derivedData/Build/Products/Debug/PackageFrameworks
WriteAuxiliaryFile /Users/admin/builder/spi-builder-workspace/.derivedData/Build/Intermediates.noindex/SwiftDI.build/Debug/SwiftDI.build/SwiftDI.DependencyMetadataFileList (in target 'SwiftDI' from project 'SwiftDI')
    cd /Users/admin/builder/spi-builder-workspace
    write-file /Users/admin/builder/spi-builder-workspace/.derivedData/Build/Intermediates.noindex/SwiftDI.build/Debug/SwiftDI.build/SwiftDI.DependencyMetadataFileList
WriteAuxiliaryFile /Users/admin/builder/spi-builder-workspace/.derivedData/Build/Intermediates.noindex/SwiftDI.build/Debug/SwiftDI.build/SwiftDI.modulemap (in target 'SwiftDI' from project 'SwiftDI')
    cd /Users/admin/builder/spi-builder-workspace
    write-file /Users/admin/builder/spi-builder-workspace/.derivedData/Build/Intermediates.noindex/SwiftDI.build/Debug/SwiftDI.build/SwiftDI.modulemap
WriteAuxiliaryFile /Users/admin/builder/spi-builder-workspace/.derivedData/Build/Intermediates.noindex/SwiftDI.build/Debug/SwiftDI.build/Objects-normal/arm64/SwiftDI.SwiftFileList (in target 'SwiftDI' from project 'SwiftDI')
    cd /Users/admin/builder/spi-builder-workspace
    write-file /Users/admin/builder/spi-builder-workspace/.derivedData/Build/Intermediates.noindex/SwiftDI.build/Debug/SwiftDI.build/Objects-normal/arm64/SwiftDI.SwiftFileList
WriteAuxiliaryFile /Users/admin/builder/spi-builder-workspace/.derivedData/Build/Intermediates.noindex/SwiftDI.build/Debug/SwiftDI.build/Objects-normal/arm64/SwiftDI-OutputFileMap.json (in target 'SwiftDI' from project 'SwiftDI')
    cd /Users/admin/builder/spi-builder-workspace
    write-file /Users/admin/builder/spi-builder-workspace/.derivedData/Build/Intermediates.noindex/SwiftDI.build/Debug/SwiftDI.build/Objects-normal/arm64/SwiftDI-OutputFileMap.json
WriteAuxiliaryFile /Users/admin/builder/spi-builder-workspace/.derivedData/Build/Intermediates.noindex/SwiftDI.build/Debug/SwiftDI.build/SwiftDI.DependencyStaticMetadataFileList (in target 'SwiftDI' from project 'SwiftDI')
    cd /Users/admin/builder/spi-builder-workspace
    write-file /Users/admin/builder/spi-builder-workspace/.derivedData/Build/Intermediates.noindex/SwiftDI.build/Debug/SwiftDI.build/SwiftDI.DependencyStaticMetadataFileList
WriteAuxiliaryFile /Users/admin/builder/spi-builder-workspace/.derivedData/Build/Intermediates.noindex/SwiftDI.build/Debug/SwiftDI.build/Objects-normal/arm64/SwiftDI_const_extract_protocols.json (in target 'SwiftDI' from project 'SwiftDI')
    cd /Users/admin/builder/spi-builder-workspace
    write-file /Users/admin/builder/spi-builder-workspace/.derivedData/Build/Intermediates.noindex/SwiftDI.build/Debug/SwiftDI.build/Objects-normal/arm64/SwiftDI_const_extract_protocols.json
WriteAuxiliaryFile /Users/admin/builder/spi-builder-workspace/.derivedData/Build/Intermediates.noindex/SwiftDI.build/Debug/SwiftDI.build/Objects-normal/arm64/SwiftDI.SwiftConstValuesFileList (in target 'SwiftDI' from project 'SwiftDI')
    cd /Users/admin/builder/spi-builder-workspace
    write-file /Users/admin/builder/spi-builder-workspace/.derivedData/Build/Intermediates.noindex/SwiftDI.build/Debug/SwiftDI.build/Objects-normal/arm64/SwiftDI.SwiftConstValuesFileList
WriteAuxiliaryFile /Users/admin/builder/spi-builder-workspace/.derivedData/Build/Intermediates.noindex/SwiftDI.build/Debug/SwiftDI.build/Objects-normal/arm64/SwiftDI.LinkFileList (in target 'SwiftDI' from project 'SwiftDI')
    cd /Users/admin/builder/spi-builder-workspace
    write-file /Users/admin/builder/spi-builder-workspace/.derivedData/Build/Intermediates.noindex/SwiftDI.build/Debug/SwiftDI.build/Objects-normal/arm64/SwiftDI.LinkFileList
Copy /Users/admin/builder/spi-builder-workspace/.derivedData/Build/Intermediates.noindex/GeneratedModuleMaps/SwiftDI.modulemap /Users/admin/builder/spi-builder-workspace/.derivedData/Build/Intermediates.noindex/SwiftDI.build/Debug/SwiftDI.build/SwiftDI.modulemap (in target 'SwiftDI' from project 'SwiftDI')
    cd /Users/admin/builder/spi-builder-workspace
    builtin-copy -exclude .DS_Store -exclude CVS -exclude .svn -exclude .git -exclude .hg -resolve-src-symlinks /Users/admin/builder/spi-builder-workspace/.derivedData/Build/Intermediates.noindex/SwiftDI.build/Debug/SwiftDI.build/SwiftDI.modulemap /Users/admin/builder/spi-builder-workspace/.derivedData/Build/Intermediates.noindex/GeneratedModuleMaps
SwiftDriver SwiftDI normal arm64 com.apple.xcode.tools.swift.compiler (in target 'SwiftDI' from project 'SwiftDI')
    cd /Users/admin/builder/spi-builder-workspace/.swiftpm/xcode
    builtin-SwiftDriver -- /Applications/Xcode-16.3.0.app/Contents/Developer/Toolchains/XcodeDefault.xctoolchain/usr/bin/swiftc -module-name SwiftDI -Onone -enforce-exclusivity\=checked @/Users/admin/builder/spi-builder-workspace/.derivedData/Build/Intermediates.noindex/SwiftDI.build/Debug/SwiftDI.build/Objects-normal/arm64/SwiftDI.SwiftFileList -DSWIFT_PACKAGE -DDEBUG -stats-output-dir .stats -strict-concurrency\=complete -enable-upcoming-feature StrictConcurrency -enable-upcoming-feature DisableOutwardActorInference -enable-upcoming-feature GlobalActorIsolatedTypesUsability -enable-upcoming-feature InferSendableFromCaptures -plugin-path /Applications/Xcode-16.3.0.app/Contents/Developer/Toolchains/XcodeDefault.xctoolchain/usr/lib/swift/host/plugins/testing -enable-experimental-feature DebugDescriptionMacro -sdk /Applications/Xcode-16.3.0.app/Contents/Developer/Platforms/MacOSX.platform/Developer/SDKs/MacOSX15.4.sdk -target arm64-apple-macos10.13 -g -module-cache-path /Users/admin/builder/spi-builder-workspace/.derivedData/ModuleCache.noindex -Xfrontend -serialize-debugging-options -profile-coverage-mapping -profile-generate -enable-testing -index-store-path /Users/admin/builder/spi-builder-workspace/.derivedData/Index.noindex/DataStore -swift-version 5 -I /Users/admin/builder/spi-builder-workspace/.derivedData/Build/Products/Debug -I /Applications/Xcode-16.3.0.app/Contents/Developer/Platforms/MacOSX.platform/Developer/usr/lib -F /Users/admin/builder/spi-builder-workspace/.derivedData/Build/Products/Debug -F /Applications/Xcode-16.3.0.app/Contents/Developer/Platforms/MacOSX.platform/Developer/Library/Frameworks -c -j10 -enable-batch-mode -incremental -Xcc -ivfsstatcache -Xcc /Users/admin/builder/spi-builder-workspace/.derivedData/SDKStatCaches.noindex/macosx15.4-24E241-8287b8f5db97e746a1562fbca0c9d29b.sdkstatcache -output-file-map /Users/admin/builder/spi-builder-workspace/.derivedData/Build/Intermediates.noindex/SwiftDI.build/Debug/SwiftDI.build/Objects-normal/arm64/SwiftDI-OutputFileMap.json -use-frontend-parseable-output -save-temps -no-color-diagnostics -serialize-diagnostics -emit-dependencies -emit-module -emit-module-path /Users/admin/builder/spi-builder-workspace/.derivedData/Build/Intermediates.noindex/SwiftDI.build/Debug/SwiftDI.build/Objects-normal/arm64/SwiftDI.swiftmodule -validate-clang-modules-once -clang-build-session-file /Users/admin/builder/spi-builder-workspace/.derivedData/ModuleCache.noindex/Session.modulevalidation -Xcc -I/Users/admin/builder/spi-builder-workspace/.derivedData/Build/Intermediates.noindex/SwiftDI.build/Debug/SwiftDI.build/swift-overrides.hmap -emit-const-values -Xfrontend -const-gather-protocols-file -Xfrontend /Users/admin/builder/spi-builder-workspace/.derivedData/Build/Intermediates.noindex/SwiftDI.build/Debug/SwiftDI.build/Objects-normal/arm64/SwiftDI_const_extract_protocols.json -Xcc -I/Users/admin/builder/spi-builder-workspace/.derivedData/Build/Products/Debug/include -Xcc -I/Users/admin/builder/spi-builder-workspace/.derivedData/Build/Intermediates.noindex/SwiftDI.build/Debug/SwiftDI.build/DerivedSources-normal/arm64 -Xcc -I/Users/admin/builder/spi-builder-workspace/.derivedData/Build/Intermediates.noindex/SwiftDI.build/Debug/SwiftDI.build/DerivedSources/arm64 -Xcc -I/Users/admin/builder/spi-builder-workspace/.derivedData/Build/Intermediates.noindex/SwiftDI.build/Debug/SwiftDI.build/DerivedSources -Xcc -DSWIFT_PACKAGE -Xcc -DDEBUG\=1 -emit-objc-header -emit-objc-header-path /Users/admin/builder/spi-builder-workspace/.derivedData/Build/Intermediates.noindex/SwiftDI.build/Debug/SwiftDI.build/Objects-normal/arm64/SwiftDI-Swift.h -working-directory /Users/admin/builder/spi-builder-workspace/.swiftpm/xcode -experimental-emit-module-separately -disable-cmo
SwiftCompile normal arm64 Compiling\ DIContainer.swift,\ DIContainerConvertible.swift /Users/admin/builder/spi-builder-workspace/Sources/SwiftDI/DIContainer.swift /Users/admin/builder/spi-builder-workspace/Sources/SwiftDI/DIContainerConvertible.swift (in target 'SwiftDI' from project 'SwiftDI')
SwiftCompile normal arm64 /Users/admin/builder/spi-builder-workspace/Sources/SwiftDI/DIContainer.swift (in target 'SwiftDI' from project 'SwiftDI')
    cd /Users/admin/builder/spi-builder-workspace/.swiftpm/xcode

SwiftCompile normal arm64 /Users/admin/builder/spi-builder-workspace/Sources/SwiftDI/DIContainerConvertible.swift (in target 'SwiftDI' from project 'SwiftDI')
    cd /Users/admin/builder/spi-builder-workspace/.swiftpm/xcode

SwiftCompile normal arm64 Compiling\ Extensions.swift /Users/admin/builder/spi-builder-workspace/Sources/SwiftDI/Extensions.swift (in target 'SwiftDI' from project 'SwiftDI')
SwiftCompile normal arm64 /Users/admin/builder/spi-builder-workspace/Sources/SwiftDI/Extensions.swift (in target 'SwiftDI' from project 'SwiftDI')
    cd /Users/admin/builder/spi-builder-workspace/.swiftpm/xcode

SwiftCompile normal arm64 Compiling\ DIComponentContext.swift,\ DIComponentManager.swift /Users/admin/builder/spi-builder-workspace/Sources/SwiftDI/DIComponentContext.swift /Users/admin/builder/spi-builder-workspace/Sources/SwiftDI/DIComponentManager.swift (in target 'SwiftDI' from project 'SwiftDI')
SwiftCompile normal arm64 /Users/admin/builder/spi-builder-workspace/Sources/SwiftDI/DIComponentContext.swift (in target 'SwiftDI' from project 'SwiftDI')
    cd /Users/admin/builder/spi-builder-workspace/.swiftpm/xcode

SwiftCompile normal arm64 /Users/admin/builder/spi-builder-workspace/Sources/SwiftDI/DIComponentManager.swift (in target 'SwiftDI' from project 'SwiftDI')
    cd /Users/admin/builder/spi-builder-workspace/.swiftpm/xcode

SwiftEmitModule normal arm64 Emitting\ module\ for\ SwiftDI (in target 'SwiftDI' from project 'SwiftDI')
Failed frontend command:
/Applications/Xcode-16.3.0.app/Contents/Developer/Toolchains/XcodeDefault.xctoolchain/usr/bin/swift-frontend -frontend -emit-module -experimental-skip-non-inlinable-function-bodies-without-types /Users/admin/builder/spi-builder-workspace/Sources/SwiftDI/DIComponentContext.swift /Users/admin/builder/spi-builder-workspace/Sources/SwiftDI/DIComponentManager.swift /Users/admin/builder/spi-builder-workspace/Sources/SwiftDI/DIContainer.swift /Users/admin/builder/spi-builder-workspace/Sources/SwiftDI/DIContainerConvertible.swift /Users/admin/builder/spi-builder-workspace/Sources/SwiftDI/DIObject.swift /Users/admin/builder/spi-builder-workspace/Sources/SwiftDI/DIPart.swift /Users/admin/builder/spi-builder-workspace/Sources/SwiftDI/Extensions.swift /Users/admin/builder/spi-builder-workspace/Sources/SwiftDI/Injectable.swift /Users/admin/builder/spi-builder-workspace/Sources/SwiftDI/InjectableObjectBinding.swift /Users/admin/builder/spi-builder-workspace/Sources/SwiftDI/InjectableProperty.swift /Users/admin/builder/spi-builder-workspace/Sources/SwiftDI/Resolver.swift /Users/admin/builder/spi-builder-workspace/Sources/SwiftDI/SwiftDI.swift /Users/admin/builder/spi-builder-workspace/Sources/SwiftDI/Utils.swift -target arm64-apple-macos10.13 -Xllvm -aarch64-use-tbi -enable-objc-interop -sdk /Applications/Xcode-16.3.0.app/Contents/Developer/Platforms/MacOSX.platform/Developer/SDKs/MacOSX15.4.sdk -I /Users/admin/builder/spi-builder-workspace/.derivedData/Build/Products/Debug -I /Applications/Xcode-16.3.0.app/Contents/Developer/Platforms/MacOSX.platform/Developer/usr/lib -F /Users/admin/builder/spi-builder-workspace/.derivedData/Build/Products/Debug -F /Applications/Xcode-16.3.0.app/Contents/Developer/Platforms/MacOSX.platform/Developer/Library/Frameworks -no-color-diagnostics -enable-testing -g -debug-info-format\=dwarf -dwarf-version\=4 -module-cache-path /Users/admin/builder/spi-builder-workspace/.derivedData/ModuleCache.noindex -profile-generate -profile-coverage-mapping -swift-version 5 -enforce-exclusivity\=checked -stats-output-dir /Users/admin/builder/spi-builder-workspace/.swiftpm/xcode/.stats -Onone -D SWIFT_PACKAGE -D DEBUG -serialize-debugging-options -const-gather-protocols-file /Users/admin/builder/spi-builder-workspace/.derivedData/Build/Intermediates.noindex/SwiftDI.build/Debug/SwiftDI.build/Objects-normal/arm64/SwiftDI_const_extract_protocols.json -enable-upcoming-feature StrictConcurrency -enable-upcoming-feature DisableOutwardActorInference -enable-upcoming-feature GlobalActorIsolatedTypesUsability -enable-upcoming-feature InferSendableFromCaptures -enable-experimental-feature DebugDescriptionMacro -strict-concurrency\=complete -empty-abi-descriptor -plugin-path /Applications/Xcode-16.3.0.app/Contents/Developer/Toolchains/XcodeDefault.xctoolchain/usr/lib/swift/host/plugins/testing -validate-clang-modules-once -clang-build-session-file /Users/admin/builder/spi-builder-workspace/.derivedData/ModuleCache.noindex/Session.modulevalidation -Xcc -working-directory -Xcc /Users/admin/builder/spi-builder-workspace/.swiftpm/xcode -resource-dir /Applications/Xcode-16.3.0.app/Contents/Developer/Toolchains/XcodeDefault.xctoolchain/usr/lib/swift -enable-anonymous-context-mangled-names -file-compilation-dir /Users/admin/builder/spi-builder-workspace/.swiftpm/xcode -Xcc -ivfsstatcache -Xcc /Users/admin/builder/spi-builder-workspace/.derivedData/SDKStatCaches.noindex/macosx15.4-24E241-8287b8f5db97e746a1562fbca0c9d29b.sdkstatcache -Xcc -I/Users/admin/builder/spi-builder-workspace/.derivedData/Build/Intermediates.noindex/SwiftDI.build/Debug/SwiftDI.build/swift-overrides.hmap -Xcc -I/Users/admin/builder/spi-builder-workspace/.derivedData/Build/Products/Debug/include -Xcc -I/Users/admin/builder/spi-builder-workspace/.derivedData/Build/Intermediates.noindex/SwiftDI.build/Debug/SwiftDI.build/DerivedSources-normal/arm64 -Xcc -I/Users/admin/builder/spi-builder-workspace/.derivedData/Build/Intermediates.noindex/SwiftDI.build/Debug/SwiftDI.build/DerivedSources/arm64 -Xcc -I/Users/admin/builder/spi-builder-workspace/.derivedData/Build/Intermediates.noindex/SwiftDI.build/Debug/SwiftDI.build/DerivedSources -Xcc -DSWIFT_PACKAGE -Xcc -DDEBUG\=1 -module-name SwiftDI -frontend-parseable-output -disable-clang-spi -target-sdk-version 15.4 -target-sdk-name macosx15.4 -external-plugin-path /Applications/Xcode-16.3.0.app/Contents/Developer/Platforms/MacOSX.platform/Developer/usr/lib/swift/host/plugins\#/Applications/Xcode-16.3.0.app/Contents/Developer/Platforms/MacOSX.platform/Developer/usr/bin/swift-plugin-server -external-plugin-path /Applications/Xcode-16.3.0.app/Contents/Developer/Platforms/MacOSX.platform/Developer/usr/local/lib/swift/host/plugins\#/Applications/Xcode-16.3.0.app/Contents/Developer/Platforms/MacOSX.platform/Developer/usr/bin/swift-plugin-server -in-process-plugin-server-path /Applications/Xcode-16.3.0.app/Contents/Developer/Toolchains/XcodeDefault.xctoolchain/usr/lib/swift/host/libSwiftInProcPluginServer.dylib -plugin-path /Applications/Xcode-16.3.0.app/Contents/Developer/Toolchains/XcodeDefault.xctoolchain/usr/lib/swift/host/plugins -plugin-path /Applications/Xcode-16.3.0.app/Contents/Developer/Toolchains/XcodeDefault.xctoolchain/usr/local/lib/swift/host/plugins -emit-module-doc-path /Users/admin/builder/spi-builder-workspace/.derivedData/Build/Intermediates.noindex/SwiftDI.build/Debug/SwiftDI.build/Objects-normal/arm64/SwiftDI.swiftdoc -emit-module-source-info-path /Users/admin/builder/spi-builder-workspace/.derivedData/Build/Intermediates.noindex/SwiftDI.build/Debug/SwiftDI.build/Objects-normal/arm64/SwiftDI.swiftsourceinfo -emit-objc-header-path /Users/admin/builder/spi-builder-workspace/.derivedData/Build/Intermediates.noindex/SwiftDI.build/Debug/SwiftDI.build/Objects-normal/arm64/SwiftDI-Swift.h -serialize-diagnostics-path /Users/admin/builder/spi-builder-workspace/.derivedData/Build/Intermediates.noindex/SwiftDI.build/Debug/SwiftDI.build/Objects-normal/arm64/SwiftDI-master-emit-module.dia -emit-dependencies-path /Users/admin/builder/spi-builder-workspace/.derivedData/Build/Intermediates.noindex/SwiftDI.build/Debug/SwiftDI.build/Objects-normal/arm64/SwiftDI-master-emit-module.d -o /Users/admin/builder/spi-builder-workspace/.derivedData/Build/Intermediates.noindex/SwiftDI.build/Debug/SwiftDI.build/Objects-normal/arm64/SwiftDI.swiftmodule -emit-abi-descriptor-path /Users/admin/builder/spi-builder-workspace/.derivedData/Build/Intermediates.noindex/SwiftDI.build/Debug/SwiftDI.build/Objects-normal/arm64/SwiftDI.abi.json
EmitSwiftModule normal arm64 (in target 'SwiftDI' from project 'SwiftDI')
    cd /Users/admin/builder/spi-builder-workspace/.swiftpm/xcode

/Users/admin/builder/spi-builder-workspace/Sources/SwiftDI/InjectableObjectBinding.swift:15:107: error: cannot find type 'BindableObject' in scope
public struct InjectableObjectBinding<BindableObjectType>: DynamicViewProperty where BindableObjectType : BindableObject {
                                                                                                          ^~~~~~~~~~~~~~
/Users/admin/builder/spi-builder-workspace/Sources/SwiftDI/InjectableObjectBinding.swift:30:29: warning: property wrapper's 'wrapperValue' property should be renamed to 'projectedValue'; use of 'wrapperValue' is deprecated
    public private(set) var wrapperValue: ObjectBinding<BindableObjectType>.Wrapper
                            ^~~~~~~~~~~~
                            projectedValue
/Users/admin/builder/spi-builder-workspace/Sources/SwiftDI/InjectableObjectBinding.swift:30:43: error: cannot find type 'ObjectBinding' in scope
    public private(set) var wrapperValue: ObjectBinding<BindableObjectType>.Wrapper
                                          ^~~~~~~~~~~~~
/Users/admin/builder/spi-builder-workspace/Sources/SwiftDI/InjectableObjectBinding.swift:17:24: error: cannot find type 'ObjectBinding' in scope
    var _bindingValue: ObjectBinding<BindableObjectType>
                       ^~~~~~~~~~~~~
/Users/admin/builder/spi-builder-workspace/Sources/SwiftDI/InjectableObjectBinding.swift:15:60: error: cannot find type 'DynamicViewProperty' in scope
public struct InjectableObjectBinding<BindableObjectType>: DynamicViewProperty where BindableObjectType : BindableObject {
                                                           ^~~~~~~~~~~~~~~~~~~
/Users/admin/builder/spi-builder-workspace/Sources/SwiftDI/InjectableProperty.swift:28:11: error: 'InjectableObjectBinding' is only available in macOS 10.15 or newer
extension InjectableObjectBinding: InjectableProperty {
          ^
/Users/admin/builder/spi-builder-workspace/Sources/SwiftDI/InjectableProperty.swift:28:1: note: add @available attribute to enclosing extension
extension InjectableObjectBinding: InjectableProperty {
^
/Users/admin/builder/spi-builder-workspace/Sources/SwiftDI/SwiftDI.swift:8:27: warning: static property 'lifeCycle' is not concurrency-safe because it is nonisolated global shared mutable state; this is an error in the Swift 6 language mode
        public static var lifeCycle = DILifeCycle.objectGraph
                          ^
/Users/admin/builder/spi-builder-workspace/Sources/SwiftDI/SwiftDI.swift:8:27: note: convert 'lifeCycle' to a 'let' constant to make 'Sendable' shared state immutable
        public static var lifeCycle = DILifeCycle.objectGraph
                      ~~~ ^
                      let
/Users/admin/builder/spi-builder-workspace/Sources/SwiftDI/SwiftDI.swift:8:27: note: add '@MainActor' to make static property 'lifeCycle' part of global actor 'MainActor'
        public static var lifeCycle = DILifeCycle.objectGraph
                          ^
        @MainActor
/Users/admin/builder/spi-builder-workspace/Sources/SwiftDI/SwiftDI.swift:8:27: note: disable concurrency-safety checks if accesses are protected by an external synchronization mechanism
        public static var lifeCycle = DILifeCycle.objectGraph
                          ^
        nonisolated(unsafe)
/Users/admin/builder/spi-builder-workspace/Sources/SwiftDI/SwiftDI.swift:11:38: warning: static property 'sharedContainer' is not concurrency-safe because it is nonisolated global shared mutable state; this is an error in the Swift 6 language mode
    internal private(set) static var sharedContainer: DIContainerConvertible = DIContainer()
                                     ^
/Users/admin/builder/spi-builder-workspace/Sources/SwiftDI/SwiftDI.swift:11:38: note: convert 'sharedContainer' to a 'let' constant to make 'Sendable' shared state immutable
    internal private(set) static var sharedContainer: DIContainerConvertible = DIContainer()
                                 ~~~ ^
                                 let
/Users/admin/builder/spi-builder-workspace/Sources/SwiftDI/SwiftDI.swift:11:38: note: add '@MainActor' to make static property 'sharedContainer' part of global actor 'MainActor'
    internal private(set) static var sharedContainer: DIContainerConvertible = DIContainer()
                                     ^
    @MainActor
/Users/admin/builder/spi-builder-workspace/Sources/SwiftDI/SwiftDI.swift:11:38: note: disable concurrency-safety checks if accesses are protected by an external synchronization mechanism
    internal private(set) static var sharedContainer: DIContainerConvertible = DIContainer()
                                     ^
    nonisolated(unsafe)
SwiftCompile normal arm64 Compiling\ InjectableObjectBinding.swift /Users/admin/builder/spi-builder-workspace/Sources/SwiftDI/InjectableObjectBinding.swift (in target 'SwiftDI' from project 'SwiftDI')
SwiftCompile normal arm64 /Users/admin/builder/spi-builder-workspace/Sources/SwiftDI/InjectableObjectBinding.swift (in target 'SwiftDI' from project 'SwiftDI')
    cd /Users/admin/builder/spi-builder-workspace/.swiftpm/xcode

SwiftCompile normal arm64 Compiling\ Resolver.swift /Users/admin/builder/spi-builder-workspace/Sources/SwiftDI/Resolver.swift (in target 'SwiftDI' from project 'SwiftDI')
SwiftCompile normal arm64 /Users/admin/builder/spi-builder-workspace/Sources/SwiftDI/Resolver.swift (in target 'SwiftDI' from project 'SwiftDI')
    cd /Users/admin/builder/spi-builder-workspace/.swiftpm/xcode

SwiftCompile normal arm64 Compiling\ Utils.swift /Users/admin/builder/spi-builder-workspace/Sources/SwiftDI/Utils.swift (in target 'SwiftDI' from project 'SwiftDI')
SwiftCompile normal arm64 /Users/admin/builder/spi-builder-workspace/Sources/SwiftDI/Utils.swift (in target 'SwiftDI' from project 'SwiftDI')
    cd /Users/admin/builder/spi-builder-workspace/.swiftpm/xcode

SwiftCompile normal arm64 Compiling\ InjectableProperty.swift /Users/admin/builder/spi-builder-workspace/Sources/SwiftDI/InjectableProperty.swift (in target 'SwiftDI' from project 'SwiftDI')
SwiftCompile normal arm64 /Users/admin/builder/spi-builder-workspace/Sources/SwiftDI/InjectableProperty.swift (in target 'SwiftDI' from project 'SwiftDI')
    cd /Users/admin/builder/spi-builder-workspace/.swiftpm/xcode

SwiftCompile normal arm64 Compiling\ SwiftDI.swift /Users/admin/builder/spi-builder-workspace/Sources/SwiftDI/SwiftDI.swift (in target 'SwiftDI' from project 'SwiftDI')
SwiftCompile normal arm64 /Users/admin/builder/spi-builder-workspace/Sources/SwiftDI/SwiftDI.swift (in target 'SwiftDI' from project 'SwiftDI')
    cd /Users/admin/builder/spi-builder-workspace/.swiftpm/xcode

SwiftCompile normal arm64 Compiling\ Injectable.swift /Users/admin/builder/spi-builder-workspace/Sources/SwiftDI/Injectable.swift (in target 'SwiftDI' from project 'SwiftDI')
SwiftCompile normal arm64 /Users/admin/builder/spi-builder-workspace/Sources/SwiftDI/Injectable.swift (in target 'SwiftDI' from project 'SwiftDI')
    cd /Users/admin/builder/spi-builder-workspace/.swiftpm/xcode

SwiftCompile normal arm64 Compiling\ DIObject.swift,\ DIPart.swift /Users/admin/builder/spi-builder-workspace/Sources/SwiftDI/DIObject.swift /Users/admin/builder/spi-builder-workspace/Sources/SwiftDI/DIPart.swift (in target 'SwiftDI' from project 'SwiftDI')
Command SwiftCompile failed with a nonzero exit code
--- xcodebuild: WARNING: Using the first of multiple matching destinations:
{ platform:macOS, arch:arm64, id:3678c7a802501fa94c470d9f64bd6a9c7d1927ce, name:My Mac }
{ platform:macOS, arch:arm64, variant:Mac Catalyst, id:3678c7a802501fa94c470d9f64bd6a9c7d1927ce, name:My Mac }
{ platform:macOS, arch:arm64, variant:DriverKit, id:3678c7a802501fa94c470d9f64bd6a9c7d1927ce, name:My Mac }
{ platform:macOS, arch:arm64, variant:Designed for [iPad,iPhone], id:3678c7a802501fa94c470d9f64bd6a9c7d1927ce, name:My Mac }
** BUILD FAILED **
The following build commands failed:
	SwiftEmitModule normal arm64 Emitting\ module\ for\ SwiftDI (in target 'SwiftDI' from project 'SwiftDI')
	EmitSwiftModule normal arm64 (in target 'SwiftDI' from project 'SwiftDI')
	SwiftCompile normal arm64 Compiling\ DIObject.swift,\ DIPart.swift /Users/admin/builder/spi-builder-workspace/Sources/SwiftDI/DIObject.swift /Users/admin/builder/spi-builder-workspace/Sources/SwiftDI/DIPart.swift (in target 'SwiftDI' from project 'SwiftDI')
	Building workspace spi-builder-workspace with scheme SwiftDI
(4 failures)
Command line invocation:
    /Applications/Xcode-16.3.0.app/Contents/Developer/usr/bin/xcodebuild -IDEClonedSourcePackagesDirPathOverride=/Users/admin/builder/spi-builder-workspace/.dependencies -resolvePackageDependencies
Resolve Package Graph
Resolved source packages:
  SwiftDI: /Users/admin/builder/spi-builder-workspace
resolved source packages: SwiftDI
{
  "dependencies" : [
  ],
  "manifest_display_name" : "SwiftDI",
  "name" : "SwiftDI",
  "path" : "/Users/admin/builder/spi-builder-workspace",
  "platforms" : [
  ],
  "products" : [
    {
      "name" : "SwiftDI",
      "targets" : [
        "SwiftDI"
      ],
      "type" : {
        "library" : [
          "automatic"
        ]
      }
    }
  ],
  "targets" : [
    {
      "c99name" : "SwiftDITests",
      "module_type" : "SwiftTarget",
      "name" : "SwiftDITests",
      "path" : "Tests/SwiftDITests",
      "sources" : [
        "SwiftDITests.swift",
        "XCTestManifests.swift"
      ],
      "target_dependencies" : [
        "SwiftDI"
      ],
      "type" : "test"
    },
    {
      "c99name" : "SwiftDI",
      "module_type" : "SwiftTarget",
      "name" : "SwiftDI",
      "path" : "Sources",
      "product_memberships" : [
        "SwiftDI"
      ],
      "sources" : [
        "SwiftDI/DIComponentContext.swift",
        "SwiftDI/DIComponentManager.swift",
        "SwiftDI/DIContainer.swift",
        "SwiftDI/DIContainerConvertible.swift",
        "SwiftDI/DIObject.swift",
        "SwiftDI/DIPart.swift",
        "SwiftDI/Extensions.swift",
        "SwiftDI/Injectable.swift",
        "SwiftDI/InjectableObjectBinding.swift",
        "SwiftDI/InjectableProperty.swift",
        "SwiftDI/Resolver.swift",
        "SwiftDI/SwiftDI.swift",
        "SwiftDI/Utils.swift"
      ],
      "type" : "library"
    }
  ],
  "tools_version" : "5.1"
}
{
  "workspace" : {
    "name" : "spi-builder-workspace",
    "schemes" : [
      "SwiftDI"
    ]
  }
}
Running build ...
env DEVELOPER_DIR=/Applications/Xcode-16.3.0.app xcrun xcodebuild -IDEClonedSourcePackagesDirPathOverride=$PWD/.dependencies -skipMacroValidation -skipPackagePluginValidation -derivedDataPath $PWD/.derivedData build -scheme SwiftDI -destination platform=macOS,arch=arm64
Command line invocation:
    /Applications/Xcode-16.3.0.app/Contents/Developer/usr/bin/xcodebuild -IDEClonedSourcePackagesDirPathOverride=/Users/admin/builder/spi-builder-workspace/.dependencies -skipMacroValidation -skipPackagePluginValidation -derivedDataPath /Users/admin/builder/spi-builder-workspace/.derivedData build -scheme SwiftDI -destination platform=macOS,arch=arm64
Resolve Package Graph
Resolved source packages:
  SwiftDI: /Users/admin/builder/spi-builder-workspace
ComputePackagePrebuildTargetDependencyGraph
Prepare packages
CreateBuildRequest
SendProjectDescription
CreateBuildOperation
ComputeTargetDependencyGraph
note: Building targets in dependency order
note: Target dependency graph (2 targets)
    Target 'SwiftDI' in project 'SwiftDI'
        ➜ Explicit dependency on target 'SwiftDI' in project 'SwiftDI'
    Target 'SwiftDI' in project 'SwiftDI' (no dependencies)
GatherProvisioningInputs
CreateBuildDescription
ExecuteExternalTool /Applications/Xcode-16.3.0.app/Contents/Developer/Toolchains/XcodeDefault.xctoolchain/usr/bin/clang -v -E -dM -isysroot /Applications/Xcode-16.3.0.app/Contents/Developer/Platforms/MacOSX.platform/Developer/SDKs/MacOSX15.4.sdk -x c -c /dev/null
ExecuteExternalTool /Applications/Xcode-16.3.0.app/Contents/Developer/Toolchains/XcodeDefault.xctoolchain/usr/bin/swiftc --version
ExecuteExternalTool /Applications/Xcode-16.3.0.app/Contents/Developer/Toolchains/XcodeDefault.xctoolchain/usr/bin/ld -version_details
Build description signature: cce72dd101281ac3c903a3f60c7ae115
Build description path: /Users/admin/builder/spi-builder-workspace/.derivedData/Build/Intermediates.noindex/XCBuildData/cce72dd101281ac3c903a3f60c7ae115.xcbuilddata
ClangStatCache /Applications/Xcode-16.3.0.app/Contents/Developer/Toolchains/XcodeDefault.xctoolchain/usr/bin/clang-stat-cache /Applications/Xcode-16.3.0.app/Contents/Developer/Platforms/MacOSX.platform/Developer/SDKs/MacOSX15.4.sdk /Users/admin/builder/spi-builder-workspace/.derivedData/SDKStatCaches.noindex/macosx15.4-24E241-8287b8f5db97e746a1562fbca0c9d29b.sdkstatcache
    cd /Users/admin/builder/spi-builder-workspace/.swiftpm/xcode
    /Applications/Xcode-16.3.0.app/Contents/Developer/Toolchains/XcodeDefault.xctoolchain/usr/bin/clang-stat-cache /Applications/Xcode-16.3.0.app/Contents/Developer/Platforms/MacOSX.platform/Developer/SDKs/MacOSX15.4.sdk -o /Users/admin/builder/spi-builder-workspace/.derivedData/SDKStatCaches.noindex/macosx15.4-24E241-8287b8f5db97e746a1562fbca0c9d29b.sdkstatcache
SwiftDriver SwiftDI normal arm64 com.apple.xcode.tools.swift.compiler (in target 'SwiftDI' from project 'SwiftDI')
    cd /Users/admin/builder/spi-builder-workspace/.swiftpm/xcode
    builtin-SwiftDriver -- /Applications/Xcode-16.3.0.app/Contents/Developer/Toolchains/XcodeDefault.xctoolchain/usr/bin/swiftc -module-name SwiftDI -Onone -enforce-exclusivity\=checked @/Users/admin/builder/spi-builder-workspace/.derivedData/Build/Intermediates.noindex/SwiftDI.build/Debug/SwiftDI.build/Objects-normal/arm64/SwiftDI.SwiftFileList -DSWIFT_PACKAGE -DDEBUG -DXcode -plugin-path /Applications/Xcode-16.3.0.app/Contents/Developer/Toolchains/XcodeDefault.xctoolchain/usr/lib/swift/host/plugins/testing -enable-experimental-feature DebugDescriptionMacro -sdk /Applications/Xcode-16.3.0.app/Contents/Developer/Platforms/MacOSX.platform/Developer/SDKs/MacOSX15.4.sdk -target arm64-apple-macos10.13 -g -module-cache-path /Users/admin/builder/spi-builder-workspace/.derivedData/ModuleCache.noindex -Xfrontend -serialize-debugging-options -profile-coverage-mapping -profile-generate -enable-testing -index-store-path /Users/admin/builder/spi-builder-workspace/.derivedData/Index.noindex/DataStore -swift-version 5 -I /Users/admin/builder/spi-builder-workspace/.derivedData/Build/Products/Debug -I /Applications/Xcode-16.3.0.app/Contents/Developer/Platforms/MacOSX.platform/Developer/usr/lib -F /Users/admin/builder/spi-builder-workspace/.derivedData/Build/Products/Debug -F /Applications/Xcode-16.3.0.app/Contents/Developer/Platforms/MacOSX.platform/Developer/Library/Frameworks -c -j10 -enable-batch-mode -incremental -Xcc -ivfsstatcache -Xcc /Users/admin/builder/spi-builder-workspace/.derivedData/SDKStatCaches.noindex/macosx15.4-24E241-8287b8f5db97e746a1562fbca0c9d29b.sdkstatcache -output-file-map /Users/admin/builder/spi-builder-workspace/.derivedData/Build/Intermediates.noindex/SwiftDI.build/Debug/SwiftDI.build/Objects-normal/arm64/SwiftDI-OutputFileMap.json -use-frontend-parseable-output -save-temps -no-color-diagnostics -serialize-diagnostics -emit-dependencies -emit-module -emit-module-path /Users/admin/builder/spi-builder-workspace/.derivedData/Build/Intermediates.noindex/SwiftDI.build/Debug/SwiftDI.build/Objects-normal/arm64/SwiftDI.swiftmodule -validate-clang-modules-once -clang-build-session-file /Users/admin/builder/spi-builder-workspace/.derivedData/ModuleCache.noindex/Session.modulevalidation -Xcc -I/Users/admin/builder/spi-builder-workspace/.derivedData/Build/Intermediates.noindex/SwiftDI.build/Debug/SwiftDI.build/swift-overrides.hmap -emit-const-values -Xfrontend -const-gather-protocols-file -Xfrontend /Users/admin/builder/spi-builder-workspace/.derivedData/Build/Intermediates.noindex/SwiftDI.build/Debug/SwiftDI.build/Objects-normal/arm64/SwiftDI_const_extract_protocols.json -Xcc -I/Users/admin/builder/spi-builder-workspace/.derivedData/Build/Products/Debug/include -Xcc -I/Users/admin/builder/spi-builder-workspace/.derivedData/Build/Intermediates.noindex/SwiftDI.build/Debug/SwiftDI.build/DerivedSources-normal/arm64 -Xcc -I/Users/admin/builder/spi-builder-workspace/.derivedData/Build/Intermediates.noindex/SwiftDI.build/Debug/SwiftDI.build/DerivedSources/arm64 -Xcc -I/Users/admin/builder/spi-builder-workspace/.derivedData/Build/Intermediates.noindex/SwiftDI.build/Debug/SwiftDI.build/DerivedSources -Xcc -DSWIFT_PACKAGE -Xcc -DDEBUG\=1 -emit-objc-header -emit-objc-header-path /Users/admin/builder/spi-builder-workspace/.derivedData/Build/Intermediates.noindex/SwiftDI.build/Debug/SwiftDI.build/Objects-normal/arm64/SwiftDI-Swift.h -working-directory /Users/admin/builder/spi-builder-workspace/.swiftpm/xcode -experimental-emit-module-separately -disable-cmo
SwiftCompile normal arm64 Compiling\ DIContainer.swift,\ DIContainerConvertible.swift /Users/admin/builder/spi-builder-workspace/Sources/SwiftDI/DIContainer.swift /Users/admin/builder/spi-builder-workspace/Sources/SwiftDI/DIContainerConvertible.swift (in target 'SwiftDI' from project 'SwiftDI')
SwiftCompile normal arm64 /Users/admin/builder/spi-builder-workspace/Sources/SwiftDI/DIContainer.swift (in target 'SwiftDI' from project 'SwiftDI')
    cd /Users/admin/builder/spi-builder-workspace/.swiftpm/xcode

SwiftCompile normal arm64 /Users/admin/builder/spi-builder-workspace/Sources/SwiftDI/DIContainerConvertible.swift (in target 'SwiftDI' from project 'SwiftDI')
    cd /Users/admin/builder/spi-builder-workspace/.swiftpm/xcode

SwiftCompile normal arm64 Compiling\ Injectable.swift /Users/admin/builder/spi-builder-workspace/Sources/SwiftDI/Injectable.swift (in target 'SwiftDI' from project 'SwiftDI')
SwiftCompile normal arm64 /Users/admin/builder/spi-builder-workspace/Sources/SwiftDI/Injectable.swift (in target 'SwiftDI' from project 'SwiftDI')
    cd /Users/admin/builder/spi-builder-workspace/.swiftpm/xcode

SwiftCompile normal arm64 Compiling\ Extensions.swift /Users/admin/builder/spi-builder-workspace/Sources/SwiftDI/Extensions.swift (in target 'SwiftDI' from project 'SwiftDI')
SwiftCompile normal arm64 /Users/admin/builder/spi-builder-workspace/Sources/SwiftDI/Extensions.swift (in target 'SwiftDI' from project 'SwiftDI')
    cd /Users/admin/builder/spi-builder-workspace/.swiftpm/xcode

SwiftCompile normal arm64 Compiling\ InjectableObjectBinding.swift /Users/admin/builder/spi-builder-workspace/Sources/SwiftDI/InjectableObjectBinding.swift (in target 'SwiftDI' from project 'SwiftDI')
SwiftCompile normal arm64 /Users/admin/builder/spi-builder-workspace/Sources/SwiftDI/InjectableObjectBinding.swift (in target 'SwiftDI' from project 'SwiftDI')
    cd /Users/admin/builder/spi-builder-workspace/.swiftpm/xcode

SwiftCompile normal arm64 Compiling\ DIComponentContext.swift,\ DIComponentManager.swift /Users/admin/builder/spi-builder-workspace/Sources/SwiftDI/DIComponentContext.swift /Users/admin/builder/spi-builder-workspace/Sources/SwiftDI/DIComponentManager.swift (in target 'SwiftDI' from project 'SwiftDI')
SwiftCompile normal arm64 /Users/admin/builder/spi-builder-workspace/Sources/SwiftDI/DIComponentContext.swift (in target 'SwiftDI' from project 'SwiftDI')
    cd /Users/admin/builder/spi-builder-workspace/.swiftpm/xcode

SwiftCompile normal arm64 /Users/admin/builder/spi-builder-workspace/Sources/SwiftDI/DIComponentManager.swift (in target 'SwiftDI' from project 'SwiftDI')
    cd /Users/admin/builder/spi-builder-workspace/.swiftpm/xcode

SwiftCompile normal arm64 Compiling\ Utils.swift /Users/admin/builder/spi-builder-workspace/Sources/SwiftDI/Utils.swift (in target 'SwiftDI' from project 'SwiftDI')
SwiftCompile normal arm64 /Users/admin/builder/spi-builder-workspace/Sources/SwiftDI/Utils.swift (in target 'SwiftDI' from project 'SwiftDI')
    cd /Users/admin/builder/spi-builder-workspace/.swiftpm/xcode

SwiftCompile normal arm64 Compiling\ Resolver.swift /Users/admin/builder/spi-builder-workspace/Sources/SwiftDI/Resolver.swift (in target 'SwiftDI' from project 'SwiftDI')
SwiftCompile normal arm64 /Users/admin/builder/spi-builder-workspace/Sources/SwiftDI/Resolver.swift (in target 'SwiftDI' from project 'SwiftDI')
    cd /Users/admin/builder/spi-builder-workspace/.swiftpm/xcode

SwiftCompile normal arm64 Compiling\ DIObject.swift,\ DIPart.swift /Users/admin/builder/spi-builder-workspace/Sources/SwiftDI/DIObject.swift /Users/admin/builder/spi-builder-workspace/Sources/SwiftDI/DIPart.swift (in target 'SwiftDI' from project 'SwiftDI')
SwiftCompile normal arm64 /Users/admin/builder/spi-builder-workspace/Sources/SwiftDI/DIObject.swift (in target 'SwiftDI' from project 'SwiftDI')
    cd /Users/admin/builder/spi-builder-workspace/.swiftpm/xcode

SwiftCompile normal arm64 /Users/admin/builder/spi-builder-workspace/Sources/SwiftDI/DIPart.swift (in target 'SwiftDI' from project 'SwiftDI')
    cd /Users/admin/builder/spi-builder-workspace/.swiftpm/xcode

SwiftCompile normal arm64 Compiling\ SwiftDI.swift /Users/admin/builder/spi-builder-workspace/Sources/SwiftDI/SwiftDI.swift (in target 'SwiftDI' from project 'SwiftDI')
SwiftCompile normal arm64 /Users/admin/builder/spi-builder-workspace/Sources/SwiftDI/SwiftDI.swift (in target 'SwiftDI' from project 'SwiftDI')
    cd /Users/admin/builder/spi-builder-workspace/.swiftpm/xcode

SwiftCompile normal arm64 Compiling\ InjectableProperty.swift /Users/admin/builder/spi-builder-workspace/Sources/SwiftDI/InjectableProperty.swift (in target 'SwiftDI' from project 'SwiftDI')
Failed frontend command:
/Applications/Xcode-16.3.0.app/Contents/Developer/Toolchains/XcodeDefault.xctoolchain/usr/bin/swift-frontend -frontend -c /Users/admin/builder/spi-builder-workspace/Sources/SwiftDI/DIComponentContext.swift /Users/admin/builder/spi-builder-workspace/Sources/SwiftDI/DIComponentManager.swift /Users/admin/builder/spi-builder-workspace/Sources/SwiftDI/DIContainer.swift /Users/admin/builder/spi-builder-workspace/Sources/SwiftDI/DIContainerConvertible.swift /Users/admin/builder/spi-builder-workspace/Sources/SwiftDI/DIObject.swift /Users/admin/builder/spi-builder-workspace/Sources/SwiftDI/DIPart.swift /Users/admin/builder/spi-builder-workspace/Sources/SwiftDI/Extensions.swift /Users/admin/builder/spi-builder-workspace/Sources/SwiftDI/Injectable.swift /Users/admin/builder/spi-builder-workspace/Sources/SwiftDI/InjectableObjectBinding.swift -primary-file /Users/admin/builder/spi-builder-workspace/Sources/SwiftDI/InjectableProperty.swift /Users/admin/builder/spi-builder-workspace/Sources/SwiftDI/Resolver.swift /Users/admin/builder/spi-builder-workspace/Sources/SwiftDI/SwiftDI.swift /Users/admin/builder/spi-builder-workspace/Sources/SwiftDI/Utils.swift -emit-dependencies-path /Users/admin/builder/spi-builder-workspace/.derivedData/Build/Intermediates.noindex/SwiftDI.build/Debug/SwiftDI.build/Objects-normal/arm64/InjectableProperty.d -emit-const-values-path /Users/admin/builder/spi-builder-workspace/.derivedData/Build/Intermediates.noindex/SwiftDI.build/Debug/SwiftDI.build/Objects-normal/arm64/InjectableProperty.swiftconstvalues -emit-reference-dependencies-path /Users/admin/builder/spi-builder-workspace/.derivedData/Build/Intermediates.noindex/SwiftDI.build/Debug/SwiftDI.build/Objects-normal/arm64/InjectableProperty.swiftdeps -serialize-diagnostics-path /Users/admin/builder/spi-builder-workspace/.derivedData/Build/Intermediates.noindex/SwiftDI.build/Debug/SwiftDI.build/Objects-normal/arm64/InjectableProperty.dia -target arm64-apple-macos10.13 -Xllvm -aarch64-use-tbi -enable-objc-interop -sdk /Applications/Xcode-16.3.0.app/Contents/Developer/Platforms/MacOSX.platform/Developer/SDKs/MacOSX15.4.sdk -I /Users/admin/builder/spi-builder-workspace/.derivedData/Build/Products/Debug -I /Applications/Xcode-16.3.0.app/Contents/Developer/Platforms/MacOSX.platform/Developer/usr/lib -F /Users/admin/builder/spi-builder-workspace/.derivedData/Build/Products/Debug -F /Applications/Xcode-16.3.0.app/Contents/Developer/Platforms/MacOSX.platform/Developer/Library/Frameworks -no-color-diagnostics -enable-testing -g -debug-info-format\=dwarf -dwarf-version\=4 -module-cache-path /Users/admin/builder/spi-builder-workspace/.derivedData/ModuleCache.noindex -profile-generate -profile-coverage-mapping -swift-version 5 -enforce-exclusivity\=checked -Onone -D SWIFT_PACKAGE -D DEBUG -D Xcode -serialize-debugging-options -const-gather-protocols-file /Users/admin/builder/spi-builder-workspace/.derivedData/Build/Intermediates.noindex/SwiftDI.build/Debug/SwiftDI.build/Objects-normal/arm64/SwiftDI_const_extract_protocols.json -enable-experimental-feature DebugDescriptionMacro -empty-abi-descriptor -plugin-path /Applications/Xcode-16.3.0.app/Contents/Developer/Toolchains/XcodeDefault.xctoolchain/usr/lib/swift/host/plugins/testing -validate-clang-modules-once -clang-build-session-file /Users/admin/builder/spi-builder-workspace/.derivedData/ModuleCache.noindex/Session.modulevalidation -Xcc -working-directory -Xcc /Users/admin/builder/spi-builder-workspace/.swiftpm/xcode -resource-dir /Applications/Xcode-16.3.0.app/Contents/Developer/Toolchains/XcodeDefault.xctoolchain/usr/lib/swift -enable-anonymous-context-mangled-names -file-compilation-dir /Users/admin/builder/spi-builder-workspace/.swiftpm/xcode -Xcc -ivfsstatcache -Xcc /Users/admin/builder/spi-builder-workspace/.derivedData/SDKStatCaches.noindex/macosx15.4-24E241-8287b8f5db97e746a1562fbca0c9d29b.sdkstatcache -Xcc -I/Users/admin/builder/spi-builder-workspace/.derivedData/Build/Intermediates.noindex/SwiftDI.build/Debug/SwiftDI.build/swift-overrides.hmap -Xcc -I/Users/admin/builder/spi-builder-workspace/.derivedData/Build/Products/Debug/include -Xcc -I/Users/admin/builder/spi-builder-workspace/.derivedData/Build/Intermediates.noindex/SwiftDI.build/Debug/SwiftDI.build/DerivedSources-normal/arm64 -Xcc -I/Users/admin/builder/spi-builder-workspace/.derivedData/Build/Intermediates.noindex/SwiftDI.build/Debug/SwiftDI.build/DerivedSources/arm64 -Xcc -I/Users/admin/builder/spi-builder-workspace/.derivedData/Build/Intermediates.noindex/SwiftDI.build/Debug/SwiftDI.build/DerivedSources -Xcc -DSWIFT_PACKAGE -Xcc -DDEBUG\=1 -module-name SwiftDI -frontend-parseable-output -disable-clang-spi -target-sdk-version 15.4 -target-sdk-name macosx15.4 -external-plugin-path /Applications/Xcode-16.3.0.app/Contents/Developer/Platforms/MacOSX.platform/Developer/usr/lib/swift/host/plugins\#/Applications/Xcode-16.3.0.app/Contents/Developer/Platforms/MacOSX.platform/Developer/usr/bin/swift-plugin-server -external-plugin-path /Applications/Xcode-16.3.0.app/Contents/Developer/Platforms/MacOSX.platform/Developer/usr/local/lib/swift/host/plugins\#/Applications/Xcode-16.3.0.app/Contents/Developer/Platforms/MacOSX.platform/Developer/usr/bin/swift-plugin-server -in-process-plugin-server-path /Applications/Xcode-16.3.0.app/Contents/Developer/Toolchains/XcodeDefault.xctoolchain/usr/lib/swift/host/libSwiftInProcPluginServer.dylib -plugin-path /Applications/Xcode-16.3.0.app/Contents/Developer/Toolchains/XcodeDefault.xctoolchain/usr/lib/swift/host/plugins -plugin-path /Applications/Xcode-16.3.0.app/Contents/Developer/Toolchains/XcodeDefault.xctoolchain/usr/local/lib/swift/host/plugins -o /Users/admin/builder/spi-builder-workspace/.derivedData/Build/Intermediates.noindex/SwiftDI.build/Debug/SwiftDI.build/Objects-normal/arm64/InjectableProperty.o -index-unit-output-path /SwiftDI.build/Debug/SwiftDI.build/Objects-normal/arm64/InjectableProperty.o -index-store-path /Users/admin/builder/spi-builder-workspace/.derivedData/Index.noindex/DataStore -index-system-modules
SwiftCompile normal arm64 /Users/admin/builder/spi-builder-workspace/Sources/SwiftDI/InjectableProperty.swift (in target 'SwiftDI' from project 'SwiftDI')
    cd /Users/admin/builder/spi-builder-workspace/.swiftpm/xcode

/Users/admin/builder/spi-builder-workspace/Sources/SwiftDI/InjectableObjectBinding.swift:15:107: error: cannot find type 'BindableObject' in scope
public struct InjectableObjectBinding<BindableObjectType>: DynamicViewProperty where BindableObjectType : BindableObject {
                                                                                                          ^~~~~~~~~~~~~~
/Users/admin/builder/spi-builder-workspace/Sources/SwiftDI/InjectableProperty.swift:28:11: error: 'InjectableObjectBinding' is only available in macOS 10.15 or newer
extension InjectableObjectBinding: InjectableProperty {
          ^
/Users/admin/builder/spi-builder-workspace/Sources/SwiftDI/InjectableProperty.swift:28:1: note: add @available attribute to enclosing extension
extension InjectableObjectBinding: InjectableProperty {
^
SwiftEmitModule normal arm64 Emitting\ module\ for\ SwiftDI (in target 'SwiftDI' from project 'SwiftDI')
Command SwiftEmitModule failed with a nonzero exit code
--- xcodebuild: WARNING: Using the first of multiple matching destinations:
{ platform:macOS, arch:arm64, id:3678c7a802501fa94c470d9f64bd6a9c7d1927ce, name:My Mac }
{ platform:macOS, arch:arm64, variant:Mac Catalyst, id:3678c7a802501fa94c470d9f64bd6a9c7d1927ce, name:My Mac }
{ platform:macOS, arch:arm64, variant:DriverKit, id:3678c7a802501fa94c470d9f64bd6a9c7d1927ce, name:My Mac }
{ platform:macOS, arch:arm64, variant:Designed for [iPad,iPhone], id:3678c7a802501fa94c470d9f64bd6a9c7d1927ce, name:My Mac }
** BUILD FAILED **
The following build commands failed:
	SwiftCompile normal arm64 Compiling\ InjectableProperty.swift /Users/admin/builder/spi-builder-workspace/Sources/SwiftDI/InjectableProperty.swift (in target 'SwiftDI' from project 'SwiftDI')
	SwiftCompile normal arm64 /Users/admin/builder/spi-builder-workspace/Sources/SwiftDI/InjectableProperty.swift (in target 'SwiftDI' from project 'SwiftDI')
	SwiftEmitModule normal arm64 Emitting\ module\ for\ SwiftDI (in target 'SwiftDI' from project 'SwiftDI')
	Building workspace spi-builder-workspace with scheme SwiftDI
(4 failures)
BUILD FAILURE 6.1 macosXcodebuild