The Swift Package Index logo.Swift Package Index

Track the adoption of Swift 6 strict concurrency checks for data race safety. How many packages are Ready for Swift 6?

Build Information

Failed to build CryptorECC, reference 1.2.201 (148526), with Swift 6.1 for visionOS using Xcode 16.3 on 27 Apr 2025 05:11:34 UTC.

Build Command

env DEVELOPER_DIR=/Applications/Xcode-16.3.0.app xcrun xcodebuild -IDEClonedSourcePackagesDirPathOverride=$PWD/.dependencies -skipMacroValidation -skipPackagePluginValidation -derivedDataPath $PWD/.derivedData build -scheme CryptorECC -destination generic/platform=xrOS

Build Log

========================================
RunAll
========================================
Builder version: 4.61.0
Interrupt handler set up.
========================================
Checkout
========================================
Clone URL: https://github.com/Kitura/BlueECC.git
Reference: 1.2.201
Initialized empty Git repository in /Users/admin/builder/spi-builder-workspace/.git/
From https://github.com/Kitura/BlueECC
 * tag               1.2.201    -> FETCH_HEAD
HEAD is now at 1485268 Update podspec to specify Swift 5.2 as the minimum supported
Cloned https://github.com/Kitura/BlueECC.git
Revision (git rev-parse @):
1485268a54f8135435a825a855e733f026fa6cc8
SUCCESS checkout https://github.com/Kitura/BlueECC.git at 1.2.201
========================================
Build
========================================
Selected platform:         visionOS
Swift version:             6.1
Building package at path:  $PWD
https://github.com/Kitura/BlueECC.git
https://github.com/Kitura/BlueECC.git
{
  "dependencies" : [
  ],
  "manifest_display_name" : "CryptorECC",
  "name" : "CryptorECC",
  "path" : "/Users/admin/builder/spi-builder-workspace",
  "platforms" : [
  ],
  "products" : [
    {
      "name" : "CryptorECC",
      "targets" : [
        "CryptorECC"
      ],
      "type" : {
        "library" : [
          "automatic"
        ]
      }
    }
  ],
  "targets" : [
    {
      "c99name" : "CryptorECCTests",
      "module_type" : "SwiftTarget",
      "name" : "CryptorECCTests",
      "path" : "Tests/CryptorECCTests",
      "sources" : [
        "CryptorECCTests.swift",
        "XCTestManifests.swift"
      ],
      "target_dependencies" : [
        "CryptorECC"
      ],
      "type" : "test"
    },
    {
      "c99name" : "CryptorECC",
      "module_type" : "SwiftTarget",
      "name" : "CryptorECC",
      "path" : "Sources/CryptorECC",
      "product_memberships" : [
        "CryptorECC"
      ],
      "sources" : [
        "ASN1.swift",
        "Data+Extensions.swift",
        "ECDecryptable.swift",
        "ECEncryptable.swift",
        "ECError.swift",
        "ECPrivateKey.swift",
        "ECPublicKey.swift",
        "ECSignable.swift",
        "ECSignature.swift",
        "EllipticCurve.swift",
        "SSLPointerTricks.swift"
      ],
      "type" : "library"
    }
  ],
  "tools_version" : "5.0"
}
Command line invocation:
    /Applications/Xcode-16.3.0.app/Contents/Developer/usr/bin/xcodebuild -IDEClonedSourcePackagesDirPathOverride=/Users/admin/builder/spi-builder-workspace/.dependencies -resolvePackageDependencies
Resolve Package Graph
Resolved source packages:
  CryptorECC: /Users/admin/builder/spi-builder-workspace
resolved source packages: CryptorECC
{
  "dependencies" : [
  ],
  "manifest_display_name" : "CryptorECC",
  "name" : "CryptorECC",
  "path" : "/Users/admin/builder/spi-builder-workspace",
  "platforms" : [
  ],
  "products" : [
    {
      "name" : "CryptorECC",
      "targets" : [
        "CryptorECC"
      ],
      "type" : {
        "library" : [
          "automatic"
        ]
      }
    }
  ],
  "targets" : [
    {
      "c99name" : "CryptorECCTests",
      "module_type" : "SwiftTarget",
      "name" : "CryptorECCTests",
      "path" : "Tests/CryptorECCTests",
      "sources" : [
        "CryptorECCTests.swift",
        "XCTestManifests.swift"
      ],
      "target_dependencies" : [
        "CryptorECC"
      ],
      "type" : "test"
    },
    {
      "c99name" : "CryptorECC",
      "module_type" : "SwiftTarget",
      "name" : "CryptorECC",
      "path" : "Sources/CryptorECC",
      "product_memberships" : [
        "CryptorECC"
      ],
      "sources" : [
        "ASN1.swift",
        "Data+Extensions.swift",
        "ECDecryptable.swift",
        "ECEncryptable.swift",
        "ECError.swift",
        "ECPrivateKey.swift",
        "ECPublicKey.swift",
        "ECSignable.swift",
        "ECSignature.swift",
        "EllipticCurve.swift",
        "SSLPointerTricks.swift"
      ],
      "type" : "library"
    }
  ],
  "tools_version" : "5.0"
}
{
  "workspace" : {
    "name" : "spi-builder-workspace",
    "schemes" : [
      "CryptorECC"
    ]
  }
}
Running build ...
env DEVELOPER_DIR=/Applications/Xcode-16.3.0.app xcrun xcodebuild -IDEClonedSourcePackagesDirPathOverride=$PWD/.dependencies -skipMacroValidation -skipPackagePluginValidation -derivedDataPath $PWD/.derivedData build -scheme CryptorECC -destination generic/platform=xrOS OTHER_SWIFT_FLAGS=-stats-output-dir .stats -strict-concurrency=complete -enable-upcoming-feature StrictConcurrency -enable-upcoming-feature DisableOutwardActorInference -enable-upcoming-feature GlobalActorIsolatedTypesUsability -enable-upcoming-feature InferSendableFromCaptures
Command line invocation:
    /Applications/Xcode-16.3.0.app/Contents/Developer/usr/bin/xcodebuild -IDEClonedSourcePackagesDirPathOverride=/Users/admin/builder/spi-builder-workspace/.dependencies -skipMacroValidation -skipPackagePluginValidation -derivedDataPath /Users/admin/builder/spi-builder-workspace/.derivedData build -scheme CryptorECC -destination generic/platform=xrOS "OTHER_SWIFT_FLAGS=-stats-output-dir .stats -strict-concurrency=complete -enable-upcoming-feature StrictConcurrency -enable-upcoming-feature DisableOutwardActorInference -enable-upcoming-feature GlobalActorIsolatedTypesUsability -enable-upcoming-feature InferSendableFromCaptures"
Build settings from command line:
    OTHER_SWIFT_FLAGS = -stats-output-dir .stats -strict-concurrency=complete -enable-upcoming-feature StrictConcurrency -enable-upcoming-feature DisableOutwardActorInference -enable-upcoming-feature GlobalActorIsolatedTypesUsability -enable-upcoming-feature InferSendableFromCaptures
Resolve Package Graph
Resolved source packages:
  CryptorECC: /Users/admin/builder/spi-builder-workspace
ComputePackagePrebuildTargetDependencyGraph
Prepare packages
CreateBuildRequest
SendProjectDescription
CreateBuildOperation
ComputeTargetDependencyGraph
note: Building targets in dependency order
note: Target dependency graph (2 targets)
    Target 'CryptorECC' in project 'CryptorECC'
        ➜ Explicit dependency on target 'CryptorECC' in project 'CryptorECC'
    Target 'CryptorECC' in project 'CryptorECC' (no dependencies)
GatherProvisioningInputs
CreateBuildDescription
ExecuteExternalTool /Applications/Xcode-16.3.0.app/Contents/Developer/Toolchains/XcodeDefault.xctoolchain/usr/bin/clang -v -E -dM -isysroot /Applications/Xcode-16.3.0.app/Contents/Developer/Platforms/XROS.platform/Developer/SDKs/XROS2.4.sdk -x c -c /dev/null
ExecuteExternalTool /Applications/Xcode-16.3.0.app/Contents/Developer/Toolchains/XcodeDefault.xctoolchain/usr/bin/swiftc --version
ExecuteExternalTool /Applications/Xcode-16.3.0.app/Contents/Developer/Toolchains/XcodeDefault.xctoolchain/usr/bin/ld -version_details
Build description signature: 688733d4049af1d88f9971a75140f15b
Build description path: /Users/admin/builder/spi-builder-workspace/.derivedData/Build/Intermediates.noindex/XCBuildData/688733d4049af1d88f9971a75140f15b.xcbuilddata
ClangStatCache /Applications/Xcode-16.3.0.app/Contents/Developer/Toolchains/XcodeDefault.xctoolchain/usr/bin/clang-stat-cache /Applications/Xcode-16.3.0.app/Contents/Developer/Platforms/XROS.platform/Developer/SDKs/XROS2.4.sdk /Users/admin/builder/spi-builder-workspace/.derivedData/SDKStatCaches.noindex/xros2.4-22O233-407b76dbb837030756cbe1ab3f0b01b6.sdkstatcache
    cd /Users/admin/builder/spi-builder-workspace/.swiftpm/xcode
    /Applications/Xcode-16.3.0.app/Contents/Developer/Toolchains/XcodeDefault.xctoolchain/usr/bin/clang-stat-cache /Applications/Xcode-16.3.0.app/Contents/Developer/Platforms/XROS.platform/Developer/SDKs/XROS2.4.sdk -o /Users/admin/builder/spi-builder-workspace/.derivedData/SDKStatCaches.noindex/xros2.4-22O233-407b76dbb837030756cbe1ab3f0b01b6.sdkstatcache
CreateBuildDirectory /Users/admin/builder/spi-builder-workspace/.derivedData/Build/Intermediates.noindex
    cd /Users/admin/builder/spi-builder-workspace/.swiftpm/xcode
    builtin-create-build-directory /Users/admin/builder/spi-builder-workspace/.derivedData/Build/Intermediates.noindex
CreateBuildDirectory /Users/admin/builder/spi-builder-workspace/.derivedData/Build/Products
    cd /Users/admin/builder/spi-builder-workspace/.swiftpm/xcode
    builtin-create-build-directory /Users/admin/builder/spi-builder-workspace/.derivedData/Build/Products
CreateBuildDirectory /Users/admin/builder/spi-builder-workspace/.derivedData/Build/Intermediates.noindex/EagerLinkingTBDs/Debug-xros
    cd /Users/admin/builder/spi-builder-workspace/.swiftpm/xcode
    builtin-create-build-directory /Users/admin/builder/spi-builder-workspace/.derivedData/Build/Intermediates.noindex/EagerLinkingTBDs/Debug-xros
CreateBuildDirectory /Users/admin/builder/spi-builder-workspace/.derivedData/Build/Products/Debug-xros
    cd /Users/admin/builder/spi-builder-workspace/.swiftpm/xcode
    builtin-create-build-directory /Users/admin/builder/spi-builder-workspace/.derivedData/Build/Products/Debug-xros
CreateBuildDirectory /Users/admin/builder/spi-builder-workspace/.derivedData/Build/Products/Debug-xros/PackageFrameworks
    cd /Users/admin/builder/spi-builder-workspace/.swiftpm/xcode
    builtin-create-build-directory /Users/admin/builder/spi-builder-workspace/.derivedData/Build/Products/Debug-xros/PackageFrameworks
WriteAuxiliaryFile /Users/admin/builder/spi-builder-workspace/.derivedData/Build/Intermediates.noindex/CryptorECC.build/Debug-xros/CryptorECC.build/CryptorECC.DependencyStaticMetadataFileList (in target 'CryptorECC' from project 'CryptorECC')
    cd /Users/admin/builder/spi-builder-workspace
    write-file /Users/admin/builder/spi-builder-workspace/.derivedData/Build/Intermediates.noindex/CryptorECC.build/Debug-xros/CryptorECC.build/CryptorECC.DependencyStaticMetadataFileList
WriteAuxiliaryFile /Users/admin/builder/spi-builder-workspace/.derivedData/Build/Intermediates.noindex/CryptorECC.build/Debug-xros/CryptorECC.build/CryptorECC.DependencyMetadataFileList (in target 'CryptorECC' from project 'CryptorECC')
    cd /Users/admin/builder/spi-builder-workspace
    write-file /Users/admin/builder/spi-builder-workspace/.derivedData/Build/Intermediates.noindex/CryptorECC.build/Debug-xros/CryptorECC.build/CryptorECC.DependencyMetadataFileList
WriteAuxiliaryFile /Users/admin/builder/spi-builder-workspace/.derivedData/Build/Intermediates.noindex/CryptorECC.build/Debug-xros/CryptorECC.build/CryptorECC.modulemap (in target 'CryptorECC' from project 'CryptorECC')
    cd /Users/admin/builder/spi-builder-workspace
    write-file /Users/admin/builder/spi-builder-workspace/.derivedData/Build/Intermediates.noindex/CryptorECC.build/Debug-xros/CryptorECC.build/CryptorECC.modulemap
WriteAuxiliaryFile /Users/admin/builder/spi-builder-workspace/.derivedData/Build/Intermediates.noindex/CryptorECC.build/Debug-xros/CryptorECC.build/Objects-normal/arm64/CryptorECC_const_extract_protocols.json (in target 'CryptorECC' from project 'CryptorECC')
    cd /Users/admin/builder/spi-builder-workspace
    write-file /Users/admin/builder/spi-builder-workspace/.derivedData/Build/Intermediates.noindex/CryptorECC.build/Debug-xros/CryptorECC.build/Objects-normal/arm64/CryptorECC_const_extract_protocols.json
WriteAuxiliaryFile /Users/admin/builder/spi-builder-workspace/.derivedData/Build/Intermediates.noindex/CryptorECC.build/Debug-xros/CryptorECC.build/Objects-normal/arm64/CryptorECC-OutputFileMap.json (in target 'CryptorECC' from project 'CryptorECC')
    cd /Users/admin/builder/spi-builder-workspace
    write-file /Users/admin/builder/spi-builder-workspace/.derivedData/Build/Intermediates.noindex/CryptorECC.build/Debug-xros/CryptorECC.build/Objects-normal/arm64/CryptorECC-OutputFileMap.json
WriteAuxiliaryFile /Users/admin/builder/spi-builder-workspace/.derivedData/Build/Intermediates.noindex/CryptorECC.build/Debug-xros/CryptorECC.build/Objects-normal/arm64/CryptorECC.LinkFileList (in target 'CryptorECC' from project 'CryptorECC')
    cd /Users/admin/builder/spi-builder-workspace
    write-file /Users/admin/builder/spi-builder-workspace/.derivedData/Build/Intermediates.noindex/CryptorECC.build/Debug-xros/CryptorECC.build/Objects-normal/arm64/CryptorECC.LinkFileList
WriteAuxiliaryFile /Users/admin/builder/spi-builder-workspace/.derivedData/Build/Intermediates.noindex/CryptorECC.build/Debug-xros/CryptorECC.build/Objects-normal/arm64/CryptorECC.SwiftFileList (in target 'CryptorECC' from project 'CryptorECC')
    cd /Users/admin/builder/spi-builder-workspace
    write-file /Users/admin/builder/spi-builder-workspace/.derivedData/Build/Intermediates.noindex/CryptorECC.build/Debug-xros/CryptorECC.build/Objects-normal/arm64/CryptorECC.SwiftFileList
WriteAuxiliaryFile /Users/admin/builder/spi-builder-workspace/.derivedData/Build/Intermediates.noindex/CryptorECC.build/Debug-xros/CryptorECC.build/Objects-normal/arm64/CryptorECC.SwiftConstValuesFileList (in target 'CryptorECC' from project 'CryptorECC')
    cd /Users/admin/builder/spi-builder-workspace
    write-file /Users/admin/builder/spi-builder-workspace/.derivedData/Build/Intermediates.noindex/CryptorECC.build/Debug-xros/CryptorECC.build/Objects-normal/arm64/CryptorECC.SwiftConstValuesFileList
Copy /Users/admin/builder/spi-builder-workspace/.derivedData/Build/Intermediates.noindex/GeneratedModuleMaps-xros/CryptorECC.modulemap /Users/admin/builder/spi-builder-workspace/.derivedData/Build/Intermediates.noindex/CryptorECC.build/Debug-xros/CryptorECC.build/CryptorECC.modulemap (in target 'CryptorECC' from project 'CryptorECC')
    cd /Users/admin/builder/spi-builder-workspace
    builtin-copy -exclude .DS_Store -exclude CVS -exclude .svn -exclude .git -exclude .hg -resolve-src-symlinks /Users/admin/builder/spi-builder-workspace/.derivedData/Build/Intermediates.noindex/CryptorECC.build/Debug-xros/CryptorECC.build/CryptorECC.modulemap /Users/admin/builder/spi-builder-workspace/.derivedData/Build/Intermediates.noindex/GeneratedModuleMaps-xros
SwiftDriver CryptorECC normal arm64 com.apple.xcode.tools.swift.compiler (in target 'CryptorECC' from project 'CryptorECC')
    cd /Users/admin/builder/spi-builder-workspace/.swiftpm/xcode
    builtin-SwiftDriver -- /Applications/Xcode-16.3.0.app/Contents/Developer/Toolchains/XcodeDefault.xctoolchain/usr/bin/swiftc -module-name CryptorECC -Onone -enforce-exclusivity\=checked @/Users/admin/builder/spi-builder-workspace/.derivedData/Build/Intermediates.noindex/CryptorECC.build/Debug-xros/CryptorECC.build/Objects-normal/arm64/CryptorECC.SwiftFileList -DSWIFT_PACKAGE -DDEBUG -stats-output-dir .stats -strict-concurrency\=complete -enable-upcoming-feature StrictConcurrency -enable-upcoming-feature DisableOutwardActorInference -enable-upcoming-feature GlobalActorIsolatedTypesUsability -enable-upcoming-feature InferSendableFromCaptures -plugin-path /Applications/Xcode-16.3.0.app/Contents/Developer/Toolchains/XcodeDefault.xctoolchain/usr/lib/swift/host/plugins/testing -enable-experimental-feature DebugDescriptionMacro -sdk /Applications/Xcode-16.3.0.app/Contents/Developer/Platforms/XROS.platform/Developer/SDKs/XROS2.4.sdk -target arm64-apple-xros1.0 -g -module-cache-path /Users/admin/builder/spi-builder-workspace/.derivedData/ModuleCache.noindex -Xfrontend -serialize-debugging-options -profile-coverage-mapping -profile-generate -enable-testing -index-store-path /Users/admin/builder/spi-builder-workspace/.derivedData/Index.noindex/DataStore -swift-version 5 -I /Users/admin/builder/spi-builder-workspace/.derivedData/Build/Products/Debug-xros -I /Applications/Xcode-16.3.0.app/Contents/Developer/Platforms/XROS.platform/Developer/usr/lib -F /Users/admin/builder/spi-builder-workspace/.derivedData/Build/Products/Debug-xros -F /Applications/Xcode-16.3.0.app/Contents/Developer/Platforms/XROS.platform/Developer/Library/Frameworks -F /Applications/Xcode-16.3.0.app/Contents/Developer/Platforms/XROS.platform/Developer/SDKs/XROS2.4.sdk/Developer/Library/Frameworks -c -j10 -enable-batch-mode -incremental -Xcc -ivfsstatcache -Xcc /Users/admin/builder/spi-builder-workspace/.derivedData/SDKStatCaches.noindex/xros2.4-22O233-407b76dbb837030756cbe1ab3f0b01b6.sdkstatcache -output-file-map /Users/admin/builder/spi-builder-workspace/.derivedData/Build/Intermediates.noindex/CryptorECC.build/Debug-xros/CryptorECC.build/Objects-normal/arm64/CryptorECC-OutputFileMap.json -use-frontend-parseable-output -save-temps -no-color-diagnostics -serialize-diagnostics -emit-dependencies -emit-module -emit-module-path /Users/admin/builder/spi-builder-workspace/.derivedData/Build/Intermediates.noindex/CryptorECC.build/Debug-xros/CryptorECC.build/Objects-normal/arm64/CryptorECC.swiftmodule -validate-clang-modules-once -clang-build-session-file /Users/admin/builder/spi-builder-workspace/.derivedData/ModuleCache.noindex/Session.modulevalidation -Xcc -I/Users/admin/builder/spi-builder-workspace/.derivedData/Build/Intermediates.noindex/CryptorECC.build/Debug-xros/CryptorECC.build/swift-overrides.hmap -emit-const-values -Xfrontend -const-gather-protocols-file -Xfrontend /Users/admin/builder/spi-builder-workspace/.derivedData/Build/Intermediates.noindex/CryptorECC.build/Debug-xros/CryptorECC.build/Objects-normal/arm64/CryptorECC_const_extract_protocols.json -Xcc -I/Users/admin/builder/spi-builder-workspace/.derivedData/Build/Products/Debug-xros/include -Xcc -I/Users/admin/builder/spi-builder-workspace/.derivedData/Build/Intermediates.noindex/CryptorECC.build/Debug-xros/CryptorECC.build/DerivedSources-normal/arm64 -Xcc -I/Users/admin/builder/spi-builder-workspace/.derivedData/Build/Intermediates.noindex/CryptorECC.build/Debug-xros/CryptorECC.build/DerivedSources/arm64 -Xcc -I/Users/admin/builder/spi-builder-workspace/.derivedData/Build/Intermediates.noindex/CryptorECC.build/Debug-xros/CryptorECC.build/DerivedSources -Xcc -DSWIFT_PACKAGE -Xcc -DDEBUG\=1 -emit-objc-header -emit-objc-header-path /Users/admin/builder/spi-builder-workspace/.derivedData/Build/Intermediates.noindex/CryptorECC.build/Debug-xros/CryptorECC.build/Objects-normal/arm64/CryptorECC-Swift.h -working-directory /Users/admin/builder/spi-builder-workspace/.swiftpm/xcode -experimental-emit-module-separately -disable-cmo
SwiftCompile normal arm64 Compiling\ ASN1.swift,\ Data+Extensions.swift /Users/admin/builder/spi-builder-workspace/Sources/CryptorECC/ASN1.swift /Users/admin/builder/spi-builder-workspace/Sources/CryptorECC/Data+Extensions.swift (in target 'CryptorECC' from project 'CryptorECC')
SwiftCompile normal arm64 /Users/admin/builder/spi-builder-workspace/Sources/CryptorECC/ASN1.swift (in target 'CryptorECC' from project 'CryptorECC')
    cd /Users/admin/builder/spi-builder-workspace/.swiftpm/xcode

SwiftCompile normal arm64 /Users/admin/builder/spi-builder-workspace/Sources/CryptorECC/Data+Extensions.swift (in target 'CryptorECC' from project 'CryptorECC')
    cd /Users/admin/builder/spi-builder-workspace/.swiftpm/xcode

SwiftCompile normal arm64 Compiling\ ECDecryptable.swift /Users/admin/builder/spi-builder-workspace/Sources/CryptorECC/ECDecryptable.swift (in target 'CryptorECC' from project 'CryptorECC')
SwiftCompile normal arm64 /Users/admin/builder/spi-builder-workspace/Sources/CryptorECC/ECDecryptable.swift (in target 'CryptorECC' from project 'CryptorECC')
    cd /Users/admin/builder/spi-builder-workspace/.swiftpm/xcode

SwiftCompile normal arm64 Compiling\ ECError.swift /Users/admin/builder/spi-builder-workspace/Sources/CryptorECC/ECError.swift (in target 'CryptorECC' from project 'CryptorECC')
SwiftCompile normal arm64 /Users/admin/builder/spi-builder-workspace/Sources/CryptorECC/ECError.swift (in target 'CryptorECC' from project 'CryptorECC')
    cd /Users/admin/builder/spi-builder-workspace/.swiftpm/xcode

SwiftCompile normal arm64 Compiling\ ECEncryptable.swift /Users/admin/builder/spi-builder-workspace/Sources/CryptorECC/ECEncryptable.swift (in target 'CryptorECC' from project 'CryptorECC')
SwiftCompile normal arm64 /Users/admin/builder/spi-builder-workspace/Sources/CryptorECC/ECEncryptable.swift (in target 'CryptorECC' from project 'CryptorECC')
    cd /Users/admin/builder/spi-builder-workspace/.swiftpm/xcode

SwiftCompile normal arm64 Compiling\ ECPrivateKey.swift /Users/admin/builder/spi-builder-workspace/Sources/CryptorECC/ECPrivateKey.swift (in target 'CryptorECC' from project 'CryptorECC')
SwiftCompile normal arm64 /Users/admin/builder/spi-builder-workspace/Sources/CryptorECC/ECPrivateKey.swift (in target 'CryptorECC' from project 'CryptorECC')
    cd /Users/admin/builder/spi-builder-workspace/.swiftpm/xcode

SwiftCompile normal arm64 Compiling\ SSLPointerTricks.swift /Users/admin/builder/spi-builder-workspace/Sources/CryptorECC/SSLPointerTricks.swift (in target 'CryptorECC' from project 'CryptorECC')
SwiftCompile normal arm64 /Users/admin/builder/spi-builder-workspace/Sources/CryptorECC/SSLPointerTricks.swift (in target 'CryptorECC' from project 'CryptorECC')
    cd /Users/admin/builder/spi-builder-workspace/.swiftpm/xcode

SwiftCompile normal arm64 Compiling\ EllipticCurve.swift /Users/admin/builder/spi-builder-workspace/Sources/CryptorECC/EllipticCurve.swift (in target 'CryptorECC' from project 'CryptorECC')
SwiftCompile normal arm64 /Users/admin/builder/spi-builder-workspace/Sources/CryptorECC/EllipticCurve.swift (in target 'CryptorECC' from project 'CryptorECC')
    cd /Users/admin/builder/spi-builder-workspace/.swiftpm/xcode

SwiftEmitModule normal arm64 Emitting\ module\ for\ CryptorECC (in target 'CryptorECC' from project 'CryptorECC')
Failed frontend command:
/Applications/Xcode-16.3.0.app/Contents/Developer/Toolchains/XcodeDefault.xctoolchain/usr/bin/swift-frontend -frontend -emit-module -experimental-skip-non-inlinable-function-bodies-without-types /Users/admin/builder/spi-builder-workspace/Sources/CryptorECC/ASN1.swift /Users/admin/builder/spi-builder-workspace/Sources/CryptorECC/Data+Extensions.swift /Users/admin/builder/spi-builder-workspace/Sources/CryptorECC/ECDecryptable.swift /Users/admin/builder/spi-builder-workspace/Sources/CryptorECC/ECEncryptable.swift /Users/admin/builder/spi-builder-workspace/Sources/CryptorECC/ECError.swift /Users/admin/builder/spi-builder-workspace/Sources/CryptorECC/ECPrivateKey.swift /Users/admin/builder/spi-builder-workspace/Sources/CryptorECC/ECPublicKey.swift /Users/admin/builder/spi-builder-workspace/Sources/CryptorECC/ECSignable.swift /Users/admin/builder/spi-builder-workspace/Sources/CryptorECC/ECSignature.swift /Users/admin/builder/spi-builder-workspace/Sources/CryptorECC/EllipticCurve.swift /Users/admin/builder/spi-builder-workspace/Sources/CryptorECC/SSLPointerTricks.swift -target arm64-apple-xros1.0 -Xllvm -aarch64-use-tbi -enable-objc-interop -stack-check -sdk /Applications/Xcode-16.3.0.app/Contents/Developer/Platforms/XROS.platform/Developer/SDKs/XROS2.4.sdk -I /Users/admin/builder/spi-builder-workspace/.derivedData/Build/Products/Debug-xros -I /Applications/Xcode-16.3.0.app/Contents/Developer/Platforms/XROS.platform/Developer/usr/lib -F /Users/admin/builder/spi-builder-workspace/.derivedData/Build/Products/Debug-xros -F /Applications/Xcode-16.3.0.app/Contents/Developer/Platforms/XROS.platform/Developer/Library/Frameworks -F /Applications/Xcode-16.3.0.app/Contents/Developer/Platforms/XROS.platform/Developer/SDKs/XROS2.4.sdk/Developer/Library/Frameworks -no-color-diagnostics -enable-testing -g -debug-info-format\=dwarf -dwarf-version\=4 -module-cache-path /Users/admin/builder/spi-builder-workspace/.derivedData/ModuleCache.noindex -profile-generate -profile-coverage-mapping -swift-version 5 -enforce-exclusivity\=checked -stats-output-dir /Users/admin/builder/spi-builder-workspace/.swiftpm/xcode/.stats -Onone -D SWIFT_PACKAGE -D DEBUG -serialize-debugging-options -const-gather-protocols-file /Users/admin/builder/spi-builder-workspace/.derivedData/Build/Intermediates.noindex/CryptorECC.build/Debug-xros/CryptorECC.build/Objects-normal/arm64/CryptorECC_const_extract_protocols.json -enable-upcoming-feature StrictConcurrency -enable-upcoming-feature DisableOutwardActorInference -enable-upcoming-feature GlobalActorIsolatedTypesUsability -enable-upcoming-feature InferSendableFromCaptures -enable-experimental-feature DebugDescriptionMacro -strict-concurrency\=complete -empty-abi-descriptor -plugin-path /Applications/Xcode-16.3.0.app/Contents/Developer/Toolchains/XcodeDefault.xctoolchain/usr/lib/swift/host/plugins/testing -validate-clang-modules-once -clang-build-session-file /Users/admin/builder/spi-builder-workspace/.derivedData/ModuleCache.noindex/Session.modulevalidation -Xcc -working-directory -Xcc /Users/admin/builder/spi-builder-workspace/.swiftpm/xcode -resource-dir /Applications/Xcode-16.3.0.app/Contents/Developer/Toolchains/XcodeDefault.xctoolchain/usr/lib/swift -enable-anonymous-context-mangled-names -file-compilation-dir /Users/admin/builder/spi-builder-workspace/.swiftpm/xcode -Xcc -ivfsstatcache -Xcc /Users/admin/builder/spi-builder-workspace/.derivedData/SDKStatCaches.noindex/xros2.4-22O233-407b76dbb837030756cbe1ab3f0b01b6.sdkstatcache -Xcc -I/Users/admin/builder/spi-builder-workspace/.derivedData/Build/Intermediates.noindex/CryptorECC.build/Debug-xros/CryptorECC.build/swift-overrides.hmap -Xcc -I/Users/admin/builder/spi-builder-workspace/.derivedData/Build/Products/Debug-xros/include -Xcc -I/Users/admin/builder/spi-builder-workspace/.derivedData/Build/Intermediates.noindex/CryptorECC.build/Debug-xros/CryptorECC.build/DerivedSources-normal/arm64 -Xcc -I/Users/admin/builder/spi-builder-workspace/.derivedData/Build/Intermediates.noindex/CryptorECC.build/Debug-xros/CryptorECC.build/DerivedSources/arm64 -Xcc -I/Users/admin/builder/spi-builder-workspace/.derivedData/Build/Intermediates.noindex/CryptorECC.build/Debug-xros/CryptorECC.build/DerivedSources -Xcc -DSWIFT_PACKAGE -Xcc -DDEBUG\=1 -module-name CryptorECC -frontend-parseable-output -disable-clang-spi -target-sdk-version 2.4 -target-sdk-name xros2.4 -external-plugin-path /Applications/Xcode-16.3.0.app/Contents/Developer/Platforms/XROS.platform/Developer/usr/lib/swift/host/plugins\#/Applications/Xcode-16.3.0.app/Contents/Developer/Platforms/XROS.platform/Developer/usr/bin/swift-plugin-server -external-plugin-path /Applications/Xcode-16.3.0.app/Contents/Developer/Platforms/XROS.platform/Developer/usr/local/lib/swift/host/plugins\#/Applications/Xcode-16.3.0.app/Contents/Developer/Platforms/XROS.platform/Developer/usr/bin/swift-plugin-server -in-process-plugin-server-path /Applications/Xcode-16.3.0.app/Contents/Developer/Toolchains/XcodeDefault.xctoolchain/usr/lib/swift/host/libSwiftInProcPluginServer.dylib -plugin-path /Applications/Xcode-16.3.0.app/Contents/Developer/Toolchains/XcodeDefault.xctoolchain/usr/lib/swift/host/plugins -plugin-path /Applications/Xcode-16.3.0.app/Contents/Developer/Toolchains/XcodeDefault.xctoolchain/usr/local/lib/swift/host/plugins -emit-module-doc-path /Users/admin/builder/spi-builder-workspace/.derivedData/Build/Intermediates.noindex/CryptorECC.build/Debug-xros/CryptorECC.build/Objects-normal/arm64/CryptorECC.swiftdoc -emit-module-source-info-path /Users/admin/builder/spi-builder-workspace/.derivedData/Build/Intermediates.noindex/CryptorECC.build/Debug-xros/CryptorECC.build/Objects-normal/arm64/CryptorECC.swiftsourceinfo -emit-objc-header-path /Users/admin/builder/spi-builder-workspace/.derivedData/Build/Intermediates.noindex/CryptorECC.build/Debug-xros/CryptorECC.build/Objects-normal/arm64/CryptorECC-Swift.h -serialize-diagnostics-path /Users/admin/builder/spi-builder-workspace/.derivedData/Build/Intermediates.noindex/CryptorECC.build/Debug-xros/CryptorECC.build/Objects-normal/arm64/CryptorECC-master-emit-module.dia -emit-dependencies-path /Users/admin/builder/spi-builder-workspace/.derivedData/Build/Intermediates.noindex/CryptorECC.build/Debug-xros/CryptorECC.build/Objects-normal/arm64/CryptorECC-master-emit-module.d -o /Users/admin/builder/spi-builder-workspace/.derivedData/Build/Intermediates.noindex/CryptorECC.build/Debug-xros/CryptorECC.build/Objects-normal/arm64/CryptorECC.swiftmodule -emit-abi-descriptor-path /Users/admin/builder/spi-builder-workspace/.derivedData/Build/Intermediates.noindex/CryptorECC.build/Debug-xros/CryptorECC.build/Objects-normal/arm64/CryptorECC.abi.json
EmitSwiftModule normal arm64 (in target 'CryptorECC' from project 'CryptorECC')
    cd /Users/admin/builder/spi-builder-workspace/.swiftpm/xcode

/Users/admin/builder/spi-builder-workspace/Sources/CryptorECC/EllipticCurve.swift:63:56: error: cannot find type 'CC_LONG' in scope
    let hashEngine: (_ data: UnsafeRawPointer?, _ len: CC_LONG, _ md: UnsafeMutablePointer<UInt8>?) -> UnsafeMutablePointer<UInt8>?
                                                       ^~~~~~~
/Users/admin/builder/spi-builder-workspace/Sources/CryptorECC/EllipticCurve.swift:64:21: error: cannot find type 'CC_LONG' in scope
    let hashLength: CC_LONG
                    ^~~~~~~
/Users/admin/builder/spi-builder-workspace/Sources/CryptorECC/EllipticCurve.swift:90:49: error: cannot find 'CC_SHA256' in scope
                                    hashEngine: CC_SHA256,
                                                ^~~~~~~~~
/Users/admin/builder/spi-builder-workspace/Sources/CryptorECC/EllipticCurve.swift:91:49: error: cannot find 'CC_LONG' in scope
                                    hashLength: CC_LONG(CC_SHA256_DIGEST_LENGTH),
                                                ^~~~~~~
/Users/admin/builder/spi-builder-workspace/Sources/CryptorECC/EllipticCurve.swift:91:57: error: cannot find 'CC_SHA256_DIGEST_LENGTH' in scope
                                    hashLength: CC_LONG(CC_SHA256_DIGEST_LENGTH),
                                                        ^~~~~~~~~~~~~~~~~~~~~~~
/Users/admin/builder/spi-builder-workspace/Sources/CryptorECC/EllipticCurve.swift:88:62: error: cannot infer contextual base in reference to member 'prime256v1'
    static let p256 = EllipticCurve(internalRepresentation: .prime256v1,
                                                            ~^~~~~~~~~~
/Users/admin/builder/spi-builder-workspace/Sources/CryptorECC/EllipticCurve.swift:89:56: error: cannot infer contextual base in reference to member 'ecdsaSignatureDigestX962SHA256'
                                    signingAlgorithm: .ecdsaSignatureDigestX962SHA256,
                                                      ~^~~~~~~~~~~~~~~~~~~~~~~~~~~~~~
/Users/admin/builder/spi-builder-workspace/Sources/CryptorECC/EllipticCurve.swift:97:49: error: cannot find 'CC_SHA384' in scope
                                    hashEngine: CC_SHA384,
                                                ^~~~~~~~~
/Users/admin/builder/spi-builder-workspace/Sources/CryptorECC/EllipticCurve.swift:98:49: error: cannot find 'CC_LONG' in scope
                                    hashLength: CC_LONG(CC_SHA384_DIGEST_LENGTH),
                                                ^~~~~~~
/Users/admin/builder/spi-builder-workspace/Sources/CryptorECC/EllipticCurve.swift:98:57: error: cannot find 'CC_SHA384_DIGEST_LENGTH' in scope
                                    hashLength: CC_LONG(CC_SHA384_DIGEST_LENGTH),
                                                        ^~~~~~~~~~~~~~~~~~~~~~~
/Users/admin/builder/spi-builder-workspace/Sources/CryptorECC/EllipticCurve.swift:95:62: error: cannot infer contextual base in reference to member 'secp384r1'
    static let p384 = EllipticCurve(internalRepresentation: .secp384r1,
                                                            ~^~~~~~~~~
/Users/admin/builder/spi-builder-workspace/Sources/CryptorECC/EllipticCurve.swift:96:56: error: cannot infer contextual base in reference to member 'ecdsaSignatureDigestX962SHA384'
                                    signingAlgorithm: .ecdsaSignatureDigestX962SHA384,
                                                      ~^~~~~~~~~~~~~~~~~~~~~~~~~~~~~~
/Users/admin/builder/spi-builder-workspace/Sources/CryptorECC/EllipticCurve.swift:104:49: error: cannot find 'CC_SHA512' in scope
                                    hashEngine: CC_SHA512,
                                                ^~~~~~~~~
/Users/admin/builder/spi-builder-workspace/Sources/CryptorECC/EllipticCurve.swift:105:49: error: cannot find 'CC_LONG' in scope
                                    hashLength: CC_LONG(CC_SHA512_DIGEST_LENGTH),
                                                ^~~~~~~
/Users/admin/builder/spi-builder-workspace/Sources/CryptorECC/EllipticCurve.swift:105:57: error: cannot find 'CC_SHA512_DIGEST_LENGTH' in scope
                                    hashLength: CC_LONG(CC_SHA512_DIGEST_LENGTH),
                                                        ^~~~~~~~~~~~~~~~~~~~~~~
/Users/admin/builder/spi-builder-workspace/Sources/CryptorECC/EllipticCurve.swift:102:62: error: cannot infer contextual base in reference to member 'secp521r1'
    static let p521 = EllipticCurve(internalRepresentation: .secp521r1,
                                                            ~^~~~~~~~~
/Users/admin/builder/spi-builder-workspace/Sources/CryptorECC/EllipticCurve.swift:103:56: error: cannot infer contextual base in reference to member 'ecdsaSignatureDigestX962SHA512'
                                    signingAlgorithm: .ecdsaSignatureDigestX962SHA512,
                                                      ~^~~~~~~~~~~~~~~~~~~~~~~~~~~~~~
SwiftCompile normal arm64 Compiling\ ECSignable.swift /Users/admin/builder/spi-builder-workspace/Sources/CryptorECC/ECSignable.swift (in target 'CryptorECC' from project 'CryptorECC')
SwiftCompile normal arm64 /Users/admin/builder/spi-builder-workspace/Sources/CryptorECC/ECSignable.swift (in target 'CryptorECC' from project 'CryptorECC')
    cd /Users/admin/builder/spi-builder-workspace/.swiftpm/xcode

SwiftCompile normal arm64 Compiling\ ECSignature.swift /Users/admin/builder/spi-builder-workspace/Sources/CryptorECC/ECSignature.swift (in target 'CryptorECC' from project 'CryptorECC')
SwiftCompile normal arm64 /Users/admin/builder/spi-builder-workspace/Sources/CryptorECC/ECSignature.swift (in target 'CryptorECC' from project 'CryptorECC')
    cd /Users/admin/builder/spi-builder-workspace/.swiftpm/xcode

SwiftCompile normal arm64 Compiling\ ECPublicKey.swift /Users/admin/builder/spi-builder-workspace/Sources/CryptorECC/ECPublicKey.swift (in target 'CryptorECC' from project 'CryptorECC')
Command SwiftCompile failed with a nonzero exit code
** BUILD FAILED **
The following build commands failed:
	SwiftEmitModule normal arm64 Emitting\ module\ for\ CryptorECC (in target 'CryptorECC' from project 'CryptorECC')
	EmitSwiftModule normal arm64 (in target 'CryptorECC' from project 'CryptorECC')
	SwiftCompile normal arm64 Compiling\ ECPublicKey.swift /Users/admin/builder/spi-builder-workspace/Sources/CryptorECC/ECPublicKey.swift (in target 'CryptorECC' from project 'CryptorECC')
	Building workspace spi-builder-workspace with scheme CryptorECC
(4 failures)
Command line invocation:
    /Applications/Xcode-16.3.0.app/Contents/Developer/usr/bin/xcodebuild -IDEClonedSourcePackagesDirPathOverride=/Users/admin/builder/spi-builder-workspace/.dependencies -resolvePackageDependencies
Resolve Package Graph
Resolved source packages:
  CryptorECC: /Users/admin/builder/spi-builder-workspace
resolved source packages: CryptorECC
{
  "dependencies" : [
  ],
  "manifest_display_name" : "CryptorECC",
  "name" : "CryptorECC",
  "path" : "/Users/admin/builder/spi-builder-workspace",
  "platforms" : [
  ],
  "products" : [
    {
      "name" : "CryptorECC",
      "targets" : [
        "CryptorECC"
      ],
      "type" : {
        "library" : [
          "automatic"
        ]
      }
    }
  ],
  "targets" : [
    {
      "c99name" : "CryptorECCTests",
      "module_type" : "SwiftTarget",
      "name" : "CryptorECCTests",
      "path" : "Tests/CryptorECCTests",
      "sources" : [
        "CryptorECCTests.swift",
        "XCTestManifests.swift"
      ],
      "target_dependencies" : [
        "CryptorECC"
      ],
      "type" : "test"
    },
    {
      "c99name" : "CryptorECC",
      "module_type" : "SwiftTarget",
      "name" : "CryptorECC",
      "path" : "Sources/CryptorECC",
      "product_memberships" : [
        "CryptorECC"
      ],
      "sources" : [
        "ASN1.swift",
        "Data+Extensions.swift",
        "ECDecryptable.swift",
        "ECEncryptable.swift",
        "ECError.swift",
        "ECPrivateKey.swift",
        "ECPublicKey.swift",
        "ECSignable.swift",
        "ECSignature.swift",
        "EllipticCurve.swift",
        "SSLPointerTricks.swift"
      ],
      "type" : "library"
    }
  ],
  "tools_version" : "5.0"
}
{
  "workspace" : {
    "name" : "spi-builder-workspace",
    "schemes" : [
      "CryptorECC"
    ]
  }
}
Running build ...
env DEVELOPER_DIR=/Applications/Xcode-16.3.0.app xcrun xcodebuild -IDEClonedSourcePackagesDirPathOverride=$PWD/.dependencies -skipMacroValidation -skipPackagePluginValidation -derivedDataPath $PWD/.derivedData build -scheme CryptorECC -destination generic/platform=xrOS
Command line invocation:
    /Applications/Xcode-16.3.0.app/Contents/Developer/usr/bin/xcodebuild -IDEClonedSourcePackagesDirPathOverride=/Users/admin/builder/spi-builder-workspace/.dependencies -skipMacroValidation -skipPackagePluginValidation -derivedDataPath /Users/admin/builder/spi-builder-workspace/.derivedData build -scheme CryptorECC -destination generic/platform=xrOS
Resolve Package Graph
Resolved source packages:
  CryptorECC: /Users/admin/builder/spi-builder-workspace
ComputePackagePrebuildTargetDependencyGraph
Prepare packages
CreateBuildRequest
SendProjectDescription
CreateBuildOperation
ComputeTargetDependencyGraph
note: Building targets in dependency order
note: Target dependency graph (2 targets)
    Target 'CryptorECC' in project 'CryptorECC'
        ➜ Explicit dependency on target 'CryptorECC' in project 'CryptorECC'
    Target 'CryptorECC' in project 'CryptorECC' (no dependencies)
GatherProvisioningInputs
CreateBuildDescription
ExecuteExternalTool /Applications/Xcode-16.3.0.app/Contents/Developer/Toolchains/XcodeDefault.xctoolchain/usr/bin/clang -v -E -dM -isysroot /Applications/Xcode-16.3.0.app/Contents/Developer/Platforms/XROS.platform/Developer/SDKs/XROS2.4.sdk -x c -c /dev/null
ExecuteExternalTool /Applications/Xcode-16.3.0.app/Contents/Developer/Toolchains/XcodeDefault.xctoolchain/usr/bin/swiftc --version
ExecuteExternalTool /Applications/Xcode-16.3.0.app/Contents/Developer/Toolchains/XcodeDefault.xctoolchain/usr/bin/ld -version_details
Build description signature: ef40d3093b5245fe5f57565ab4316128
Build description path: /Users/admin/builder/spi-builder-workspace/.derivedData/Build/Intermediates.noindex/XCBuildData/ef40d3093b5245fe5f57565ab4316128.xcbuilddata
ClangStatCache /Applications/Xcode-16.3.0.app/Contents/Developer/Toolchains/XcodeDefault.xctoolchain/usr/bin/clang-stat-cache /Applications/Xcode-16.3.0.app/Contents/Developer/Platforms/XROS.platform/Developer/SDKs/XROS2.4.sdk /Users/admin/builder/spi-builder-workspace/.derivedData/SDKStatCaches.noindex/xros2.4-22O233-407b76dbb837030756cbe1ab3f0b01b6.sdkstatcache
    cd /Users/admin/builder/spi-builder-workspace/.swiftpm/xcode
    /Applications/Xcode-16.3.0.app/Contents/Developer/Toolchains/XcodeDefault.xctoolchain/usr/bin/clang-stat-cache /Applications/Xcode-16.3.0.app/Contents/Developer/Platforms/XROS.platform/Developer/SDKs/XROS2.4.sdk -o /Users/admin/builder/spi-builder-workspace/.derivedData/SDKStatCaches.noindex/xros2.4-22O233-407b76dbb837030756cbe1ab3f0b01b6.sdkstatcache
SwiftDriver CryptorECC normal arm64 com.apple.xcode.tools.swift.compiler (in target 'CryptorECC' from project 'CryptorECC')
    cd /Users/admin/builder/spi-builder-workspace/.swiftpm/xcode
    builtin-SwiftDriver -- /Applications/Xcode-16.3.0.app/Contents/Developer/Toolchains/XcodeDefault.xctoolchain/usr/bin/swiftc -module-name CryptorECC -Onone -enforce-exclusivity\=checked @/Users/admin/builder/spi-builder-workspace/.derivedData/Build/Intermediates.noindex/CryptorECC.build/Debug-xros/CryptorECC.build/Objects-normal/arm64/CryptorECC.SwiftFileList -DSWIFT_PACKAGE -DDEBUG -DXcode -plugin-path /Applications/Xcode-16.3.0.app/Contents/Developer/Toolchains/XcodeDefault.xctoolchain/usr/lib/swift/host/plugins/testing -enable-experimental-feature DebugDescriptionMacro -sdk /Applications/Xcode-16.3.0.app/Contents/Developer/Platforms/XROS.platform/Developer/SDKs/XROS2.4.sdk -target arm64-apple-xros1.0 -g -module-cache-path /Users/admin/builder/spi-builder-workspace/.derivedData/ModuleCache.noindex -Xfrontend -serialize-debugging-options -profile-coverage-mapping -profile-generate -enable-testing -index-store-path /Users/admin/builder/spi-builder-workspace/.derivedData/Index.noindex/DataStore -swift-version 5 -I /Users/admin/builder/spi-builder-workspace/.derivedData/Build/Products/Debug-xros -I /Applications/Xcode-16.3.0.app/Contents/Developer/Platforms/XROS.platform/Developer/usr/lib -F /Users/admin/builder/spi-builder-workspace/.derivedData/Build/Products/Debug-xros -F /Applications/Xcode-16.3.0.app/Contents/Developer/Platforms/XROS.platform/Developer/Library/Frameworks -F /Applications/Xcode-16.3.0.app/Contents/Developer/Platforms/XROS.platform/Developer/SDKs/XROS2.4.sdk/Developer/Library/Frameworks -c -j10 -enable-batch-mode -incremental -Xcc -ivfsstatcache -Xcc /Users/admin/builder/spi-builder-workspace/.derivedData/SDKStatCaches.noindex/xros2.4-22O233-407b76dbb837030756cbe1ab3f0b01b6.sdkstatcache -output-file-map /Users/admin/builder/spi-builder-workspace/.derivedData/Build/Intermediates.noindex/CryptorECC.build/Debug-xros/CryptorECC.build/Objects-normal/arm64/CryptorECC-OutputFileMap.json -use-frontend-parseable-output -save-temps -no-color-diagnostics -serialize-diagnostics -emit-dependencies -emit-module -emit-module-path /Users/admin/builder/spi-builder-workspace/.derivedData/Build/Intermediates.noindex/CryptorECC.build/Debug-xros/CryptorECC.build/Objects-normal/arm64/CryptorECC.swiftmodule -validate-clang-modules-once -clang-build-session-file /Users/admin/builder/spi-builder-workspace/.derivedData/ModuleCache.noindex/Session.modulevalidation -Xcc -I/Users/admin/builder/spi-builder-workspace/.derivedData/Build/Intermediates.noindex/CryptorECC.build/Debug-xros/CryptorECC.build/swift-overrides.hmap -emit-const-values -Xfrontend -const-gather-protocols-file -Xfrontend /Users/admin/builder/spi-builder-workspace/.derivedData/Build/Intermediates.noindex/CryptorECC.build/Debug-xros/CryptorECC.build/Objects-normal/arm64/CryptorECC_const_extract_protocols.json -Xcc -I/Users/admin/builder/spi-builder-workspace/.derivedData/Build/Products/Debug-xros/include -Xcc -I/Users/admin/builder/spi-builder-workspace/.derivedData/Build/Intermediates.noindex/CryptorECC.build/Debug-xros/CryptorECC.build/DerivedSources-normal/arm64 -Xcc -I/Users/admin/builder/spi-builder-workspace/.derivedData/Build/Intermediates.noindex/CryptorECC.build/Debug-xros/CryptorECC.build/DerivedSources/arm64 -Xcc -I/Users/admin/builder/spi-builder-workspace/.derivedData/Build/Intermediates.noindex/CryptorECC.build/Debug-xros/CryptorECC.build/DerivedSources -Xcc -DSWIFT_PACKAGE -Xcc -DDEBUG\=1 -emit-objc-header -emit-objc-header-path /Users/admin/builder/spi-builder-workspace/.derivedData/Build/Intermediates.noindex/CryptorECC.build/Debug-xros/CryptorECC.build/Objects-normal/arm64/CryptorECC-Swift.h -working-directory /Users/admin/builder/spi-builder-workspace/.swiftpm/xcode -experimental-emit-module-separately -disable-cmo
SwiftCompile normal arm64 Compiling\ ECError.swift /Users/admin/builder/spi-builder-workspace/Sources/CryptorECC/ECError.swift (in target 'CryptorECC' from project 'CryptorECC')
SwiftCompile normal arm64 /Users/admin/builder/spi-builder-workspace/Sources/CryptorECC/ECError.swift (in target 'CryptorECC' from project 'CryptorECC')
    cd /Users/admin/builder/spi-builder-workspace/.swiftpm/xcode

SwiftCompile normal arm64 Compiling\ ECDecryptable.swift /Users/admin/builder/spi-builder-workspace/Sources/CryptorECC/ECDecryptable.swift (in target 'CryptorECC' from project 'CryptorECC')
SwiftCompile normal arm64 /Users/admin/builder/spi-builder-workspace/Sources/CryptorECC/ECDecryptable.swift (in target 'CryptorECC' from project 'CryptorECC')
    cd /Users/admin/builder/spi-builder-workspace/.swiftpm/xcode

SwiftCompile normal arm64 Compiling\ ECPrivateKey.swift /Users/admin/builder/spi-builder-workspace/Sources/CryptorECC/ECPrivateKey.swift (in target 'CryptorECC' from project 'CryptorECC')
SwiftCompile normal arm64 /Users/admin/builder/spi-builder-workspace/Sources/CryptorECC/ECPrivateKey.swift (in target 'CryptorECC' from project 'CryptorECC')
    cd /Users/admin/builder/spi-builder-workspace/.swiftpm/xcode

SwiftCompile normal arm64 Compiling\ ECPublicKey.swift /Users/admin/builder/spi-builder-workspace/Sources/CryptorECC/ECPublicKey.swift (in target 'CryptorECC' from project 'CryptorECC')
SwiftCompile normal arm64 /Users/admin/builder/spi-builder-workspace/Sources/CryptorECC/ECPublicKey.swift (in target 'CryptorECC' from project 'CryptorECC')
    cd /Users/admin/builder/spi-builder-workspace/.swiftpm/xcode

SwiftCompile normal arm64 Compiling\ ECSignable.swift /Users/admin/builder/spi-builder-workspace/Sources/CryptorECC/ECSignable.swift (in target 'CryptorECC' from project 'CryptorECC')
SwiftCompile normal arm64 /Users/admin/builder/spi-builder-workspace/Sources/CryptorECC/ECSignable.swift (in target 'CryptorECC' from project 'CryptorECC')
    cd /Users/admin/builder/spi-builder-workspace/.swiftpm/xcode

SwiftCompile normal arm64 Compiling\ ASN1.swift,\ Data+Extensions.swift /Users/admin/builder/spi-builder-workspace/Sources/CryptorECC/ASN1.swift /Users/admin/builder/spi-builder-workspace/Sources/CryptorECC/Data+Extensions.swift (in target 'CryptorECC' from project 'CryptorECC')
SwiftCompile normal arm64 /Users/admin/builder/spi-builder-workspace/Sources/CryptorECC/ASN1.swift (in target 'CryptorECC' from project 'CryptorECC')
    cd /Users/admin/builder/spi-builder-workspace/.swiftpm/xcode

SwiftCompile normal arm64 /Users/admin/builder/spi-builder-workspace/Sources/CryptorECC/Data+Extensions.swift (in target 'CryptorECC' from project 'CryptorECC')
    cd /Users/admin/builder/spi-builder-workspace/.swiftpm/xcode

SwiftCompile normal arm64 Compiling\ ECSignature.swift /Users/admin/builder/spi-builder-workspace/Sources/CryptorECC/ECSignature.swift (in target 'CryptorECC' from project 'CryptorECC')
SwiftCompile normal arm64 /Users/admin/builder/spi-builder-workspace/Sources/CryptorECC/ECSignature.swift (in target 'CryptorECC' from project 'CryptorECC')
    cd /Users/admin/builder/spi-builder-workspace/.swiftpm/xcode

SwiftEmitModule normal arm64 Emitting\ module\ for\ CryptorECC (in target 'CryptorECC' from project 'CryptorECC')
Failed frontend command:
/Applications/Xcode-16.3.0.app/Contents/Developer/Toolchains/XcodeDefault.xctoolchain/usr/bin/swift-frontend -frontend -emit-module -experimental-skip-non-inlinable-function-bodies-without-types /Users/admin/builder/spi-builder-workspace/Sources/CryptorECC/ASN1.swift /Users/admin/builder/spi-builder-workspace/Sources/CryptorECC/Data+Extensions.swift /Users/admin/builder/spi-builder-workspace/Sources/CryptorECC/ECDecryptable.swift /Users/admin/builder/spi-builder-workspace/Sources/CryptorECC/ECEncryptable.swift /Users/admin/builder/spi-builder-workspace/Sources/CryptorECC/ECError.swift /Users/admin/builder/spi-builder-workspace/Sources/CryptorECC/ECPrivateKey.swift /Users/admin/builder/spi-builder-workspace/Sources/CryptorECC/ECPublicKey.swift /Users/admin/builder/spi-builder-workspace/Sources/CryptorECC/ECSignable.swift /Users/admin/builder/spi-builder-workspace/Sources/CryptorECC/ECSignature.swift /Users/admin/builder/spi-builder-workspace/Sources/CryptorECC/EllipticCurve.swift /Users/admin/builder/spi-builder-workspace/Sources/CryptorECC/SSLPointerTricks.swift -target arm64-apple-xros1.0 -Xllvm -aarch64-use-tbi -enable-objc-interop -stack-check -sdk /Applications/Xcode-16.3.0.app/Contents/Developer/Platforms/XROS.platform/Developer/SDKs/XROS2.4.sdk -I /Users/admin/builder/spi-builder-workspace/.derivedData/Build/Products/Debug-xros -I /Applications/Xcode-16.3.0.app/Contents/Developer/Platforms/XROS.platform/Developer/usr/lib -F /Users/admin/builder/spi-builder-workspace/.derivedData/Build/Products/Debug-xros -F /Applications/Xcode-16.3.0.app/Contents/Developer/Platforms/XROS.platform/Developer/Library/Frameworks -F /Applications/Xcode-16.3.0.app/Contents/Developer/Platforms/XROS.platform/Developer/SDKs/XROS2.4.sdk/Developer/Library/Frameworks -no-color-diagnostics -enable-testing -g -debug-info-format\=dwarf -dwarf-version\=4 -module-cache-path /Users/admin/builder/spi-builder-workspace/.derivedData/ModuleCache.noindex -profile-generate -profile-coverage-mapping -swift-version 5 -enforce-exclusivity\=checked -Onone -D SWIFT_PACKAGE -D DEBUG -D Xcode -serialize-debugging-options -const-gather-protocols-file /Users/admin/builder/spi-builder-workspace/.derivedData/Build/Intermediates.noindex/CryptorECC.build/Debug-xros/CryptorECC.build/Objects-normal/arm64/CryptorECC_const_extract_protocols.json -enable-experimental-feature DebugDescriptionMacro -empty-abi-descriptor -plugin-path /Applications/Xcode-16.3.0.app/Contents/Developer/Toolchains/XcodeDefault.xctoolchain/usr/lib/swift/host/plugins/testing -validate-clang-modules-once -clang-build-session-file /Users/admin/builder/spi-builder-workspace/.derivedData/ModuleCache.noindex/Session.modulevalidation -Xcc -working-directory -Xcc /Users/admin/builder/spi-builder-workspace/.swiftpm/xcode -resource-dir /Applications/Xcode-16.3.0.app/Contents/Developer/Toolchains/XcodeDefault.xctoolchain/usr/lib/swift -enable-anonymous-context-mangled-names -file-compilation-dir /Users/admin/builder/spi-builder-workspace/.swiftpm/xcode -Xcc -ivfsstatcache -Xcc /Users/admin/builder/spi-builder-workspace/.derivedData/SDKStatCaches.noindex/xros2.4-22O233-407b76dbb837030756cbe1ab3f0b01b6.sdkstatcache -Xcc -I/Users/admin/builder/spi-builder-workspace/.derivedData/Build/Intermediates.noindex/CryptorECC.build/Debug-xros/CryptorECC.build/swift-overrides.hmap -Xcc -I/Users/admin/builder/spi-builder-workspace/.derivedData/Build/Products/Debug-xros/include -Xcc -I/Users/admin/builder/spi-builder-workspace/.derivedData/Build/Intermediates.noindex/CryptorECC.build/Debug-xros/CryptorECC.build/DerivedSources-normal/arm64 -Xcc -I/Users/admin/builder/spi-builder-workspace/.derivedData/Build/Intermediates.noindex/CryptorECC.build/Debug-xros/CryptorECC.build/DerivedSources/arm64 -Xcc -I/Users/admin/builder/spi-builder-workspace/.derivedData/Build/Intermediates.noindex/CryptorECC.build/Debug-xros/CryptorECC.build/DerivedSources -Xcc -DSWIFT_PACKAGE -Xcc -DDEBUG\=1 -module-name CryptorECC -frontend-parseable-output -disable-clang-spi -target-sdk-version 2.4 -target-sdk-name xros2.4 -external-plugin-path /Applications/Xcode-16.3.0.app/Contents/Developer/Platforms/XROS.platform/Developer/usr/lib/swift/host/plugins\#/Applications/Xcode-16.3.0.app/Contents/Developer/Platforms/XROS.platform/Developer/usr/bin/swift-plugin-server -external-plugin-path /Applications/Xcode-16.3.0.app/Contents/Developer/Platforms/XROS.platform/Developer/usr/local/lib/swift/host/plugins\#/Applications/Xcode-16.3.0.app/Contents/Developer/Platforms/XROS.platform/Developer/usr/bin/swift-plugin-server -in-process-plugin-server-path /Applications/Xcode-16.3.0.app/Contents/Developer/Toolchains/XcodeDefault.xctoolchain/usr/lib/swift/host/libSwiftInProcPluginServer.dylib -plugin-path /Applications/Xcode-16.3.0.app/Contents/Developer/Toolchains/XcodeDefault.xctoolchain/usr/lib/swift/host/plugins -plugin-path /Applications/Xcode-16.3.0.app/Contents/Developer/Toolchains/XcodeDefault.xctoolchain/usr/local/lib/swift/host/plugins -emit-module-doc-path /Users/admin/builder/spi-builder-workspace/.derivedData/Build/Intermediates.noindex/CryptorECC.build/Debug-xros/CryptorECC.build/Objects-normal/arm64/CryptorECC.swiftdoc -emit-module-source-info-path /Users/admin/builder/spi-builder-workspace/.derivedData/Build/Intermediates.noindex/CryptorECC.build/Debug-xros/CryptorECC.build/Objects-normal/arm64/CryptorECC.swiftsourceinfo -emit-objc-header-path /Users/admin/builder/spi-builder-workspace/.derivedData/Build/Intermediates.noindex/CryptorECC.build/Debug-xros/CryptorECC.build/Objects-normal/arm64/CryptorECC-Swift.h -serialize-diagnostics-path /Users/admin/builder/spi-builder-workspace/.derivedData/Build/Intermediates.noindex/CryptorECC.build/Debug-xros/CryptorECC.build/Objects-normal/arm64/CryptorECC-master-emit-module.dia -emit-dependencies-path /Users/admin/builder/spi-builder-workspace/.derivedData/Build/Intermediates.noindex/CryptorECC.build/Debug-xros/CryptorECC.build/Objects-normal/arm64/CryptorECC-master-emit-module.d -o /Users/admin/builder/spi-builder-workspace/.derivedData/Build/Intermediates.noindex/CryptorECC.build/Debug-xros/CryptorECC.build/Objects-normal/arm64/CryptorECC.swiftmodule -emit-abi-descriptor-path /Users/admin/builder/spi-builder-workspace/.derivedData/Build/Intermediates.noindex/CryptorECC.build/Debug-xros/CryptorECC.build/Objects-normal/arm64/CryptorECC.abi.json
EmitSwiftModule normal arm64 (in target 'CryptorECC' from project 'CryptorECC')
    cd /Users/admin/builder/spi-builder-workspace/.swiftpm/xcode

/Users/admin/builder/spi-builder-workspace/Sources/CryptorECC/EllipticCurve.swift:63:56: error: cannot find type 'CC_LONG' in scope
    let hashEngine: (_ data: UnsafeRawPointer?, _ len: CC_LONG, _ md: UnsafeMutablePointer<UInt8>?) -> UnsafeMutablePointer<UInt8>?
                                                       ^~~~~~~
/Users/admin/builder/spi-builder-workspace/Sources/CryptorECC/EllipticCurve.swift:64:21: error: cannot find type 'CC_LONG' in scope
    let hashLength: CC_LONG
                    ^~~~~~~
/Users/admin/builder/spi-builder-workspace/Sources/CryptorECC/EllipticCurve.swift:90:49: error: cannot find 'CC_SHA256' in scope
                                    hashEngine: CC_SHA256,
                                                ^~~~~~~~~
/Users/admin/builder/spi-builder-workspace/Sources/CryptorECC/EllipticCurve.swift:91:49: error: cannot find 'CC_LONG' in scope
                                    hashLength: CC_LONG(CC_SHA256_DIGEST_LENGTH),
                                                ^~~~~~~
/Users/admin/builder/spi-builder-workspace/Sources/CryptorECC/EllipticCurve.swift:91:57: error: cannot find 'CC_SHA256_DIGEST_LENGTH' in scope
                                    hashLength: CC_LONG(CC_SHA256_DIGEST_LENGTH),
                                                        ^~~~~~~~~~~~~~~~~~~~~~~
/Users/admin/builder/spi-builder-workspace/Sources/CryptorECC/EllipticCurve.swift:88:62: error: cannot infer contextual base in reference to member 'prime256v1'
    static let p256 = EllipticCurve(internalRepresentation: .prime256v1,
                                                            ~^~~~~~~~~~
/Users/admin/builder/spi-builder-workspace/Sources/CryptorECC/EllipticCurve.swift:89:56: error: cannot infer contextual base in reference to member 'ecdsaSignatureDigestX962SHA256'
                                    signingAlgorithm: .ecdsaSignatureDigestX962SHA256,
                                                      ~^~~~~~~~~~~~~~~~~~~~~~~~~~~~~~
/Users/admin/builder/spi-builder-workspace/Sources/CryptorECC/EllipticCurve.swift:97:49: error: cannot find 'CC_SHA384' in scope
                                    hashEngine: CC_SHA384,
                                                ^~~~~~~~~
/Users/admin/builder/spi-builder-workspace/Sources/CryptorECC/EllipticCurve.swift:98:49: error: cannot find 'CC_LONG' in scope
                                    hashLength: CC_LONG(CC_SHA384_DIGEST_LENGTH),
                                                ^~~~~~~
/Users/admin/builder/spi-builder-workspace/Sources/CryptorECC/EllipticCurve.swift:98:57: error: cannot find 'CC_SHA384_DIGEST_LENGTH' in scope
                                    hashLength: CC_LONG(CC_SHA384_DIGEST_LENGTH),
                                                        ^~~~~~~~~~~~~~~~~~~~~~~
/Users/admin/builder/spi-builder-workspace/Sources/CryptorECC/EllipticCurve.swift:95:62: error: cannot infer contextual base in reference to member 'secp384r1'
    static let p384 = EllipticCurve(internalRepresentation: .secp384r1,
                                                            ~^~~~~~~~~
/Users/admin/builder/spi-builder-workspace/Sources/CryptorECC/EllipticCurve.swift:96:56: error: cannot infer contextual base in reference to member 'ecdsaSignatureDigestX962SHA384'
                                    signingAlgorithm: .ecdsaSignatureDigestX962SHA384,
                                                      ~^~~~~~~~~~~~~~~~~~~~~~~~~~~~~~
/Users/admin/builder/spi-builder-workspace/Sources/CryptorECC/EllipticCurve.swift:104:49: error: cannot find 'CC_SHA512' in scope
                                    hashEngine: CC_SHA512,
                                                ^~~~~~~~~
/Users/admin/builder/spi-builder-workspace/Sources/CryptorECC/EllipticCurve.swift:105:49: error: cannot find 'CC_LONG' in scope
                                    hashLength: CC_LONG(CC_SHA512_DIGEST_LENGTH),
                                                ^~~~~~~
/Users/admin/builder/spi-builder-workspace/Sources/CryptorECC/EllipticCurve.swift:105:57: error: cannot find 'CC_SHA512_DIGEST_LENGTH' in scope
                                    hashLength: CC_LONG(CC_SHA512_DIGEST_LENGTH),
                                                        ^~~~~~~~~~~~~~~~~~~~~~~
/Users/admin/builder/spi-builder-workspace/Sources/CryptorECC/EllipticCurve.swift:102:62: error: cannot infer contextual base in reference to member 'secp521r1'
    static let p521 = EllipticCurve(internalRepresentation: .secp521r1,
                                                            ~^~~~~~~~~
/Users/admin/builder/spi-builder-workspace/Sources/CryptorECC/EllipticCurve.swift:103:56: error: cannot infer contextual base in reference to member 'ecdsaSignatureDigestX962SHA512'
                                    signingAlgorithm: .ecdsaSignatureDigestX962SHA512,
                                                      ~^~~~~~~~~~~~~~~~~~~~~~~~~~~~~~
SwiftCompile normal arm64 Compiling\ SSLPointerTricks.swift /Users/admin/builder/spi-builder-workspace/Sources/CryptorECC/SSLPointerTricks.swift (in target 'CryptorECC' from project 'CryptorECC')
SwiftCompile normal arm64 /Users/admin/builder/spi-builder-workspace/Sources/CryptorECC/SSLPointerTricks.swift (in target 'CryptorECC' from project 'CryptorECC')
    cd /Users/admin/builder/spi-builder-workspace/.swiftpm/xcode

SwiftCompile normal arm64 Compiling\ ECEncryptable.swift /Users/admin/builder/spi-builder-workspace/Sources/CryptorECC/ECEncryptable.swift (in target 'CryptorECC' from project 'CryptorECC')
SwiftCompile normal arm64 /Users/admin/builder/spi-builder-workspace/Sources/CryptorECC/ECEncryptable.swift (in target 'CryptorECC' from project 'CryptorECC')
    cd /Users/admin/builder/spi-builder-workspace/.swiftpm/xcode

SwiftCompile normal arm64 Compiling\ EllipticCurve.swift /Users/admin/builder/spi-builder-workspace/Sources/CryptorECC/EllipticCurve.swift (in target 'CryptorECC' from project 'CryptorECC')
Command SwiftCompile failed with a nonzero exit code
** BUILD FAILED **
The following build commands failed:
	SwiftEmitModule normal arm64 Emitting\ module\ for\ CryptorECC (in target 'CryptorECC' from project 'CryptorECC')
	EmitSwiftModule normal arm64 (in target 'CryptorECC' from project 'CryptorECC')
	SwiftCompile normal arm64 Compiling\ EllipticCurve.swift /Users/admin/builder/spi-builder-workspace/Sources/CryptorECC/EllipticCurve.swift (in target 'CryptorECC' from project 'CryptorECC')
	Building workspace spi-builder-workspace with scheme CryptorECC
(4 failures)
BUILD FAILURE 6.1 visionOS