Build Information
Failed to build NukeUI, reference 0.8.3 (db5502
), with Swift 6.1 for visionOS using Xcode 16.3 on 27 Apr 2025 01:17:05 UTC.
Build Command
env DEVELOPER_DIR=/Applications/Xcode-16.3.0.app xcrun xcodebuild -IDEClonedSourcePackagesDirPathOverride=$PWD/.dependencies -skipMacroValidation -skipPackagePluginValidation -derivedDataPath $PWD/.derivedData build -scheme NukeUI -destination generic/platform=xrOS
Build Log
========================================
RunAll
========================================
Builder version: 4.61.0
Interrupt handler set up.
========================================
Checkout
========================================
Clone URL: https://github.com/kean/NukeUI.git
Reference: 0.8.3
Initialized empty Git repository in /Users/admin/builder/spi-builder-workspace/.git/
From https://github.com/kean/NukeUI
* tag 0.8.3 -> FETCH_HEAD
HEAD is now at db55022 Merge pull request #49 from yanyin1986/main
Cloned https://github.com/kean/NukeUI.git
Revision (git rev-parse @):
db55022a8e483774ebbf3568727071477546d9ea
SUCCESS checkout https://github.com/kean/NukeUI.git at 0.8.3
========================================
Build
========================================
Selected platform: visionOS
Swift version: 6.1
Building package at path: $PWD
https://github.com/kean/NukeUI.git
https://github.com/kean/NukeUI.git
{
"dependencies" : [
{
"identity" : "nuke",
"requirement" : {
"range" : [
{
"lower_bound" : "10.5.0",
"upper_bound" : "11.0.0"
}
]
},
"type" : "sourceControl",
"url" : "https://github.com/kean/Nuke.git"
},
{
"identity" : "gifu",
"requirement" : {
"range" : [
{
"lower_bound" : "3.0.0",
"upper_bound" : "4.0.0"
}
]
},
"type" : "sourceControl",
"url" : "https://github.com/kaishin/Gifu"
}
],
"manifest_display_name" : "NukeUI",
"name" : "NukeUI",
"path" : "/Users/admin/builder/spi-builder-workspace",
"platforms" : [
{
"name" : "macos",
"version" : "10.14"
},
{
"name" : "ios",
"version" : "12.0"
},
{
"name" : "tvos",
"version" : "12.0"
},
{
"name" : "watchos",
"version" : "5.0"
}
],
"products" : [
{
"name" : "NukeUI",
"targets" : [
"NukeUI"
],
"type" : {
"library" : [
"automatic"
]
}
}
],
"targets" : [
{
"c99name" : "NukeUI",
"module_type" : "SwiftTarget",
"name" : "NukeUI",
"path" : "Sources",
"product_dependencies" : [
"Nuke",
"Gifu"
],
"product_memberships" : [
"NukeUI"
],
"sources" : [
"Image.swift",
"ImageView.swift",
"Internal.swift",
"LazyImage.swift",
"LazyImageView.swift",
"VideoPlayerView.swift"
],
"type" : "library"
}
],
"tools_version" : "5.3"
}
Command line invocation:
/Applications/Xcode-16.3.0.app/Contents/Developer/usr/bin/xcodebuild -IDEClonedSourcePackagesDirPathOverride=/Users/admin/builder/spi-builder-workspace/.dependencies -resolvePackageDependencies
Resolve Package Graph
Fetching from https://github.com/kaishin/Gifu
Fetching from https://github.com/kean/Nuke.git
Creating working copy of package ‘Nuke’
Checking out 10.11.2 of package ‘Nuke’
Creating working copy of package ‘Gifu’
Checking out 3.5.1 of package ‘Gifu’
Resolve Package Graph
Resolved source packages:
Gifu: https://github.com/kaishin/Gifu @ 3.5.1
NukeUI: /Users/admin/builder/spi-builder-workspace
Nuke: https://github.com/kean/Nuke.git @ 10.11.2
resolved source packages: Gifu, NukeUI, Nuke
{
"dependencies" : [
{
"identity" : "nuke",
"requirement" : {
"range" : [
{
"lower_bound" : "10.5.0",
"upper_bound" : "11.0.0"
}
]
},
"type" : "sourceControl",
"url" : "https://github.com/kean/Nuke.git"
},
{
"identity" : "gifu",
"requirement" : {
"range" : [
{
"lower_bound" : "3.0.0",
"upper_bound" : "4.0.0"
}
]
},
"type" : "sourceControl",
"url" : "https://github.com/kaishin/Gifu"
}
],
"manifest_display_name" : "NukeUI",
"name" : "NukeUI",
"path" : "/Users/admin/builder/spi-builder-workspace",
"platforms" : [
{
"name" : "macos",
"version" : "10.14"
},
{
"name" : "ios",
"version" : "12.0"
},
{
"name" : "tvos",
"version" : "12.0"
},
{
"name" : "watchos",
"version" : "5.0"
}
],
"products" : [
{
"name" : "NukeUI",
"targets" : [
"NukeUI"
],
"type" : {
"library" : [
"automatic"
]
}
}
],
"targets" : [
{
"c99name" : "NukeUI",
"module_type" : "SwiftTarget",
"name" : "NukeUI",
"path" : "Sources",
"product_dependencies" : [
"Nuke",
"Gifu"
],
"product_memberships" : [
"NukeUI"
],
"sources" : [
"Image.swift",
"ImageView.swift",
"Internal.swift",
"LazyImage.swift",
"LazyImageView.swift",
"VideoPlayerView.swift"
],
"type" : "library"
}
],
"tools_version" : "5.3"
}
{
"workspace" : {
"name" : "spi-builder-workspace",
"schemes" : [
"NukeUI"
]
}
}
Running build ...
env DEVELOPER_DIR=/Applications/Xcode-16.3.0.app xcrun xcodebuild -IDEClonedSourcePackagesDirPathOverride=$PWD/.dependencies -skipMacroValidation -skipPackagePluginValidation -derivedDataPath $PWD/.derivedData build -scheme NukeUI -destination generic/platform=xrOS OTHER_SWIFT_FLAGS=-stats-output-dir .stats -strict-concurrency=complete -enable-upcoming-feature StrictConcurrency -enable-upcoming-feature DisableOutwardActorInference -enable-upcoming-feature GlobalActorIsolatedTypesUsability -enable-upcoming-feature InferSendableFromCaptures
Command line invocation:
/Applications/Xcode-16.3.0.app/Contents/Developer/usr/bin/xcodebuild -IDEClonedSourcePackagesDirPathOverride=/Users/admin/builder/spi-builder-workspace/.dependencies -skipMacroValidation -skipPackagePluginValidation -derivedDataPath /Users/admin/builder/spi-builder-workspace/.derivedData build -scheme NukeUI -destination generic/platform=xrOS "OTHER_SWIFT_FLAGS=-stats-output-dir .stats -strict-concurrency=complete -enable-upcoming-feature StrictConcurrency -enable-upcoming-feature DisableOutwardActorInference -enable-upcoming-feature GlobalActorIsolatedTypesUsability -enable-upcoming-feature InferSendableFromCaptures"
Build settings from command line:
OTHER_SWIFT_FLAGS = -stats-output-dir .stats -strict-concurrency=complete -enable-upcoming-feature StrictConcurrency -enable-upcoming-feature DisableOutwardActorInference -enable-upcoming-feature GlobalActorIsolatedTypesUsability -enable-upcoming-feature InferSendableFromCaptures
Resolve Package Graph
Resolve Package Graph
Resolved source packages:
NukeUI: /Users/admin/builder/spi-builder-workspace
Nuke: https://github.com/kean/Nuke.git @ 10.11.2
Gifu: https://github.com/kaishin/Gifu @ 3.5.1
ComputePackagePrebuildTargetDependencyGraph
Prepare packages
CreateBuildRequest
SendProjectDescription
CreateBuildOperation
ComputeTargetDependencyGraph
note: Building targets in dependency order
note: Target dependency graph (4 targets)
Target 'NukeUI' in project 'NukeUI'
➜ Explicit dependency on target 'NukeUI' in project 'NukeUI'
➜ Explicit dependency on target 'Nuke' in project 'Nuke'
Target 'NukeUI' in project 'NukeUI'
➜ Explicit dependency on target 'Nuke' in project 'Nuke'
Target 'Nuke' in project 'Nuke'
➜ Explicit dependency on target 'Nuke' in project 'Nuke'
Target 'Nuke' in project 'Nuke' (no dependencies)
GatherProvisioningInputs
CreateBuildDescription
ExecuteExternalTool /Applications/Xcode-16.3.0.app/Contents/Developer/Toolchains/XcodeDefault.xctoolchain/usr/bin/clang -v -E -dM -isysroot /Applications/Xcode-16.3.0.app/Contents/Developer/Platforms/XROS.platform/Developer/SDKs/XROS2.4.sdk -x c -c /dev/null
ExecuteExternalTool /Applications/Xcode-16.3.0.app/Contents/Developer/Toolchains/XcodeDefault.xctoolchain/usr/bin/swiftc --version
ExecuteExternalTool /Applications/Xcode-16.3.0.app/Contents/Developer/Toolchains/XcodeDefault.xctoolchain/usr/bin/ld -version_details
Build description signature: 5ac75f01aa6eadaccfa767322fc3a92f
Build description path: /Users/admin/builder/spi-builder-workspace/.derivedData/Build/Intermediates.noindex/XCBuildData/5ac75f01aa6eadaccfa767322fc3a92f.xcbuilddata
ClangStatCache /Applications/Xcode-16.3.0.app/Contents/Developer/Toolchains/XcodeDefault.xctoolchain/usr/bin/clang-stat-cache /Applications/Xcode-16.3.0.app/Contents/Developer/Platforms/XROS.platform/Developer/SDKs/XROS2.4.sdk /Users/admin/builder/spi-builder-workspace/.derivedData/SDKStatCaches.noindex/xros2.4-22O233-407b76dbb837030756cbe1ab3f0b01b6.sdkstatcache
cd /Users/admin/builder/spi-builder-workspace/.swiftpm/xcode
/Applications/Xcode-16.3.0.app/Contents/Developer/Toolchains/XcodeDefault.xctoolchain/usr/bin/clang-stat-cache /Applications/Xcode-16.3.0.app/Contents/Developer/Platforms/XROS.platform/Developer/SDKs/XROS2.4.sdk -o /Users/admin/builder/spi-builder-workspace/.derivedData/SDKStatCaches.noindex/xros2.4-22O233-407b76dbb837030756cbe1ab3f0b01b6.sdkstatcache
CreateBuildDirectory /Users/admin/builder/spi-builder-workspace/.derivedData/Build/Products
cd /Users/admin/builder/spi-builder-workspace/.swiftpm/xcode
builtin-create-build-directory /Users/admin/builder/spi-builder-workspace/.derivedData/Build/Products
CreateBuildDirectory /Users/admin/builder/spi-builder-workspace/.derivedData/Build/Intermediates.noindex
cd /Users/admin/builder/spi-builder-workspace/.swiftpm/xcode
builtin-create-build-directory /Users/admin/builder/spi-builder-workspace/.derivedData/Build/Intermediates.noindex
CreateBuildDirectory /Users/admin/builder/spi-builder-workspace/.derivedData/Build/Products/Debug-xros
cd /Users/admin/builder/spi-builder-workspace/.swiftpm/xcode
builtin-create-build-directory /Users/admin/builder/spi-builder-workspace/.derivedData/Build/Products/Debug-xros
CreateBuildDirectory /Users/admin/builder/spi-builder-workspace/.derivedData/Build/Intermediates.noindex/EagerLinkingTBDs/Debug-xros
cd /Users/admin/builder/spi-builder-workspace/.swiftpm/xcode
builtin-create-build-directory /Users/admin/builder/spi-builder-workspace/.derivedData/Build/Intermediates.noindex/EagerLinkingTBDs/Debug-xros
CreateBuildDirectory /Users/admin/builder/spi-builder-workspace/.derivedData/Build/Products/Debug-xros/PackageFrameworks
cd /Users/admin/builder/spi-builder-workspace/.swiftpm/xcode
builtin-create-build-directory /Users/admin/builder/spi-builder-workspace/.derivedData/Build/Products/Debug-xros/PackageFrameworks
WriteAuxiliaryFile /Users/admin/builder/spi-builder-workspace/.derivedData/Build/Intermediates.noindex/Nuke.build/Debug-xros/Nuke.build/Objects-normal/arm64/Nuke_const_extract_protocols.json (in target 'Nuke' from project 'Nuke')
cd /Users/admin/builder/spi-builder-workspace/.dependencies/checkouts/Nuke
write-file /Users/admin/builder/spi-builder-workspace/.derivedData/Build/Intermediates.noindex/Nuke.build/Debug-xros/Nuke.build/Objects-normal/arm64/Nuke_const_extract_protocols.json
WriteAuxiliaryFile /Users/admin/builder/spi-builder-workspace/.derivedData/Build/Intermediates.noindex/NukeUI.build/Debug-xros/NukeUI.build/Objects-normal/arm64/NukeUI.SwiftConstValuesFileList (in target 'NukeUI' from project 'NukeUI')
cd /Users/admin/builder/spi-builder-workspace
write-file /Users/admin/builder/spi-builder-workspace/.derivedData/Build/Intermediates.noindex/NukeUI.build/Debug-xros/NukeUI.build/Objects-normal/arm64/NukeUI.SwiftConstValuesFileList
WriteAuxiliaryFile /Users/admin/builder/spi-builder-workspace/.derivedData/Build/Intermediates.noindex/NukeUI.build/Debug-xros/NukeUI.build/Objects-normal/arm64/NukeUI_const_extract_protocols.json (in target 'NukeUI' from project 'NukeUI')
cd /Users/admin/builder/spi-builder-workspace
write-file /Users/admin/builder/spi-builder-workspace/.derivedData/Build/Intermediates.noindex/NukeUI.build/Debug-xros/NukeUI.build/Objects-normal/arm64/NukeUI_const_extract_protocols.json
WriteAuxiliaryFile /Users/admin/builder/spi-builder-workspace/.derivedData/Build/Intermediates.noindex/NukeUI.build/Debug-xros/NukeUI.build/NukeUI.DependencyMetadataFileList (in target 'NukeUI' from project 'NukeUI')
cd /Users/admin/builder/spi-builder-workspace
write-file /Users/admin/builder/spi-builder-workspace/.derivedData/Build/Intermediates.noindex/NukeUI.build/Debug-xros/NukeUI.build/NukeUI.DependencyMetadataFileList
WriteAuxiliaryFile /Users/admin/builder/spi-builder-workspace/.derivedData/Build/Intermediates.noindex/NukeUI.build/Debug-xros/NukeUI.build/Objects-normal/arm64/NukeUI.LinkFileList (in target 'NukeUI' from project 'NukeUI')
cd /Users/admin/builder/spi-builder-workspace
write-file /Users/admin/builder/spi-builder-workspace/.derivedData/Build/Intermediates.noindex/NukeUI.build/Debug-xros/NukeUI.build/Objects-normal/arm64/NukeUI.LinkFileList
WriteAuxiliaryFile /Users/admin/builder/spi-builder-workspace/.derivedData/Build/Intermediates.noindex/NukeUI.build/Debug-xros/NukeUI.build/Objects-normal/arm64/NukeUI-OutputFileMap.json (in target 'NukeUI' from project 'NukeUI')
cd /Users/admin/builder/spi-builder-workspace
write-file /Users/admin/builder/spi-builder-workspace/.derivedData/Build/Intermediates.noindex/NukeUI.build/Debug-xros/NukeUI.build/Objects-normal/arm64/NukeUI-OutputFileMap.json
WriteAuxiliaryFile /Users/admin/builder/spi-builder-workspace/.derivedData/Build/Intermediates.noindex/NukeUI.build/Debug-xros/NukeUI.build/NukeUI.modulemap (in target 'NukeUI' from project 'NukeUI')
cd /Users/admin/builder/spi-builder-workspace
write-file /Users/admin/builder/spi-builder-workspace/.derivedData/Build/Intermediates.noindex/NukeUI.build/Debug-xros/NukeUI.build/NukeUI.modulemap
WriteAuxiliaryFile /Users/admin/builder/spi-builder-workspace/.derivedData/Build/Intermediates.noindex/NukeUI.build/Debug-xros/NukeUI.build/Objects-normal/arm64/NukeUI.SwiftFileList (in target 'NukeUI' from project 'NukeUI')
cd /Users/admin/builder/spi-builder-workspace
write-file /Users/admin/builder/spi-builder-workspace/.derivedData/Build/Intermediates.noindex/NukeUI.build/Debug-xros/NukeUI.build/Objects-normal/arm64/NukeUI.SwiftFileList
WriteAuxiliaryFile /Users/admin/builder/spi-builder-workspace/.derivedData/Build/Intermediates.noindex/NukeUI.build/Debug-xros/NukeUI.build/NukeUI.DependencyStaticMetadataFileList (in target 'NukeUI' from project 'NukeUI')
cd /Users/admin/builder/spi-builder-workspace
write-file /Users/admin/builder/spi-builder-workspace/.derivedData/Build/Intermediates.noindex/NukeUI.build/Debug-xros/NukeUI.build/NukeUI.DependencyStaticMetadataFileList
WriteAuxiliaryFile /Users/admin/builder/spi-builder-workspace/.derivedData/Build/Intermediates.noindex/Nuke.build/Debug-xros/Nuke.build/Objects-normal/arm64/Nuke.SwiftFileList (in target 'Nuke' from project 'Nuke')
cd /Users/admin/builder/spi-builder-workspace/.dependencies/checkouts/Nuke
write-file /Users/admin/builder/spi-builder-workspace/.derivedData/Build/Intermediates.noindex/Nuke.build/Debug-xros/Nuke.build/Objects-normal/arm64/Nuke.SwiftFileList
WriteAuxiliaryFile /Users/admin/builder/spi-builder-workspace/.derivedData/Build/Intermediates.noindex/Nuke.build/Debug-xros/Nuke.build/Objects-normal/arm64/Nuke.SwiftConstValuesFileList (in target 'Nuke' from project 'Nuke')
cd /Users/admin/builder/spi-builder-workspace/.dependencies/checkouts/Nuke
write-file /Users/admin/builder/spi-builder-workspace/.derivedData/Build/Intermediates.noindex/Nuke.build/Debug-xros/Nuke.build/Objects-normal/arm64/Nuke.SwiftConstValuesFileList
WriteAuxiliaryFile /Users/admin/builder/spi-builder-workspace/.derivedData/Build/Intermediates.noindex/Nuke.build/Debug-xros/Nuke.build/Objects-normal/arm64/Nuke.LinkFileList (in target 'Nuke' from project 'Nuke')
cd /Users/admin/builder/spi-builder-workspace/.dependencies/checkouts/Nuke
write-file /Users/admin/builder/spi-builder-workspace/.derivedData/Build/Intermediates.noindex/Nuke.build/Debug-xros/Nuke.build/Objects-normal/arm64/Nuke.LinkFileList
WriteAuxiliaryFile /Users/admin/builder/spi-builder-workspace/.derivedData/Build/Intermediates.noindex/Nuke.build/Debug-xros/Nuke.build/Nuke.modulemap (in target 'Nuke' from project 'Nuke')
cd /Users/admin/builder/spi-builder-workspace/.dependencies/checkouts/Nuke
write-file /Users/admin/builder/spi-builder-workspace/.derivedData/Build/Intermediates.noindex/Nuke.build/Debug-xros/Nuke.build/Nuke.modulemap
WriteAuxiliaryFile /Users/admin/builder/spi-builder-workspace/.derivedData/Build/Intermediates.noindex/Nuke.build/Debug-xros/Nuke.build/Objects-normal/arm64/Nuke-OutputFileMap.json (in target 'Nuke' from project 'Nuke')
cd /Users/admin/builder/spi-builder-workspace/.dependencies/checkouts/Nuke
write-file /Users/admin/builder/spi-builder-workspace/.derivedData/Build/Intermediates.noindex/Nuke.build/Debug-xros/Nuke.build/Objects-normal/arm64/Nuke-OutputFileMap.json
WriteAuxiliaryFile /Users/admin/builder/spi-builder-workspace/.derivedData/Build/Intermediates.noindex/Nuke.build/Debug-xros/Nuke.build/Nuke.DependencyStaticMetadataFileList (in target 'Nuke' from project 'Nuke')
cd /Users/admin/builder/spi-builder-workspace/.dependencies/checkouts/Nuke
write-file /Users/admin/builder/spi-builder-workspace/.derivedData/Build/Intermediates.noindex/Nuke.build/Debug-xros/Nuke.build/Nuke.DependencyStaticMetadataFileList
WriteAuxiliaryFile /Users/admin/builder/spi-builder-workspace/.derivedData/Build/Intermediates.noindex/Nuke.build/Debug-xros/Nuke.build/Nuke.DependencyMetadataFileList (in target 'Nuke' from project 'Nuke')
cd /Users/admin/builder/spi-builder-workspace/.dependencies/checkouts/Nuke
write-file /Users/admin/builder/spi-builder-workspace/.derivedData/Build/Intermediates.noindex/Nuke.build/Debug-xros/Nuke.build/Nuke.DependencyMetadataFileList
Copy /Users/admin/builder/spi-builder-workspace/.derivedData/Build/Intermediates.noindex/GeneratedModuleMaps-xros/NukeUI.modulemap /Users/admin/builder/spi-builder-workspace/.derivedData/Build/Intermediates.noindex/NukeUI.build/Debug-xros/NukeUI.build/NukeUI.modulemap (in target 'NukeUI' from project 'NukeUI')
cd /Users/admin/builder/spi-builder-workspace
builtin-copy -exclude .DS_Store -exclude CVS -exclude .svn -exclude .git -exclude .hg -resolve-src-symlinks /Users/admin/builder/spi-builder-workspace/.derivedData/Build/Intermediates.noindex/NukeUI.build/Debug-xros/NukeUI.build/NukeUI.modulemap /Users/admin/builder/spi-builder-workspace/.derivedData/Build/Intermediates.noindex/GeneratedModuleMaps-xros
Copy /Users/admin/builder/spi-builder-workspace/.derivedData/Build/Intermediates.noindex/GeneratedModuleMaps-xros/Nuke.modulemap /Users/admin/builder/spi-builder-workspace/.derivedData/Build/Intermediates.noindex/Nuke.build/Debug-xros/Nuke.build/Nuke.modulemap (in target 'Nuke' from project 'Nuke')
cd /Users/admin/builder/spi-builder-workspace/.dependencies/checkouts/Nuke
builtin-copy -exclude .DS_Store -exclude CVS -exclude .svn -exclude .git -exclude .hg -resolve-src-symlinks /Users/admin/builder/spi-builder-workspace/.derivedData/Build/Intermediates.noindex/Nuke.build/Debug-xros/Nuke.build/Nuke.modulemap /Users/admin/builder/spi-builder-workspace/.derivedData/Build/Intermediates.noindex/GeneratedModuleMaps-xros
SwiftDriver Nuke normal arm64 com.apple.xcode.tools.swift.compiler (in target 'Nuke' from project 'Nuke')
cd /Users/admin/builder/spi-builder-workspace/.swiftpm/xcode
builtin-SwiftDriver -- /Applications/Xcode-16.3.0.app/Contents/Developer/Toolchains/XcodeDefault.xctoolchain/usr/bin/swiftc -module-name Nuke -Onone -enforce-exclusivity\=checked @/Users/admin/builder/spi-builder-workspace/.derivedData/Build/Intermediates.noindex/Nuke.build/Debug-xros/Nuke.build/Objects-normal/arm64/Nuke.SwiftFileList -DSWIFT_PACKAGE -DDEBUG -stats-output-dir .stats -strict-concurrency\=complete -enable-upcoming-feature StrictConcurrency -enable-upcoming-feature DisableOutwardActorInference -enable-upcoming-feature GlobalActorIsolatedTypesUsability -enable-upcoming-feature InferSendableFromCaptures -plugin-path /Applications/Xcode-16.3.0.app/Contents/Developer/Toolchains/XcodeDefault.xctoolchain/usr/lib/swift/host/plugins/testing -enable-experimental-feature DebugDescriptionMacro -sdk /Applications/Xcode-16.3.0.app/Contents/Developer/Platforms/XROS.platform/Developer/SDKs/XROS2.4.sdk -target arm64-apple-xros1.0 -g -module-cache-path /Users/admin/builder/spi-builder-workspace/.derivedData/ModuleCache.noindex -Xfrontend -serialize-debugging-options -enable-testing -suppress-warnings -index-store-path /Users/admin/builder/spi-builder-workspace/.derivedData/Index.noindex/DataStore -swift-version 5 -I /Users/admin/builder/spi-builder-workspace/.derivedData/Build/Products/Debug-xros -I /Applications/Xcode-16.3.0.app/Contents/Developer/Platforms/XROS.platform/Developer/usr/lib -F /Users/admin/builder/spi-builder-workspace/.derivedData/Build/Products/Debug-xros -F /Applications/Xcode-16.3.0.app/Contents/Developer/Platforms/XROS.platform/Developer/Library/Frameworks -F /Applications/Xcode-16.3.0.app/Contents/Developer/Platforms/XROS.platform/Developer/SDKs/XROS2.4.sdk/Developer/Library/Frameworks -c -j10 -enable-batch-mode -incremental -Xcc -ivfsstatcache -Xcc /Users/admin/builder/spi-builder-workspace/.derivedData/SDKStatCaches.noindex/xros2.4-22O233-407b76dbb837030756cbe1ab3f0b01b6.sdkstatcache -output-file-map /Users/admin/builder/spi-builder-workspace/.derivedData/Build/Intermediates.noindex/Nuke.build/Debug-xros/Nuke.build/Objects-normal/arm64/Nuke-OutputFileMap.json -use-frontend-parseable-output -save-temps -no-color-diagnostics -serialize-diagnostics -emit-dependencies -emit-module -emit-module-path /Users/admin/builder/spi-builder-workspace/.derivedData/Build/Intermediates.noindex/Nuke.build/Debug-xros/Nuke.build/Objects-normal/arm64/Nuke.swiftmodule -validate-clang-modules-once -clang-build-session-file /Users/admin/builder/spi-builder-workspace/.derivedData/ModuleCache.noindex/Session.modulevalidation -Xcc -I/Users/admin/builder/spi-builder-workspace/.derivedData/Build/Intermediates.noindex/Nuke.build/Debug-xros/Nuke.build/swift-overrides.hmap -emit-const-values -Xfrontend -const-gather-protocols-file -Xfrontend /Users/admin/builder/spi-builder-workspace/.derivedData/Build/Intermediates.noindex/Nuke.build/Debug-xros/Nuke.build/Objects-normal/arm64/Nuke_const_extract_protocols.json -Xcc -I/Users/admin/builder/spi-builder-workspace/.derivedData/Build/Products/Debug-xros/include -Xcc -I/Users/admin/builder/spi-builder-workspace/.derivedData/Build/Intermediates.noindex/Nuke.build/Debug-xros/Nuke.build/DerivedSources-normal/arm64 -Xcc -I/Users/admin/builder/spi-builder-workspace/.derivedData/Build/Intermediates.noindex/Nuke.build/Debug-xros/Nuke.build/DerivedSources/arm64 -Xcc -I/Users/admin/builder/spi-builder-workspace/.derivedData/Build/Intermediates.noindex/Nuke.build/Debug-xros/Nuke.build/DerivedSources -Xcc -DSWIFT_PACKAGE -Xcc -DDEBUG\=1 -emit-objc-header -emit-objc-header-path /Users/admin/builder/spi-builder-workspace/.derivedData/Build/Intermediates.noindex/Nuke.build/Debug-xros/Nuke.build/Objects-normal/arm64/Nuke-Swift.h -working-directory /Users/admin/builder/spi-builder-workspace/.swiftpm/xcode -experimental-emit-module-separately -disable-cmo
SwiftCompile normal arm64 Compiling\ ImageEncoders+Default.swift,\ ImageEncoders+ImageIO.swift,\ ImageEncoders.swift,\ ImageEncoding.swift,\ ImagePipeline.swift,\ ImagePipelineConfiguration.swift /Users/admin/builder/spi-builder-workspace/.dependencies/checkouts/Nuke/Sources/Core/Encoding/ImageEncoders+Default.swift /Users/admin/builder/spi-builder-workspace/.dependencies/checkouts/Nuke/Sources/Core/Encoding/ImageEncoders+ImageIO.swift /Users/admin/builder/spi-builder-workspace/.dependencies/checkouts/Nuke/Sources/Core/Encoding/ImageEncoders.swift /Users/admin/builder/spi-builder-workspace/.dependencies/checkouts/Nuke/Sources/Core/Encoding/ImageEncoding.swift /Users/admin/builder/spi-builder-workspace/.dependencies/checkouts/Nuke/Sources/Core/ImagePipeline.swift /Users/admin/builder/spi-builder-workspace/.dependencies/checkouts/Nuke/Sources/Core/ImagePipelineConfiguration.swift (in target 'Nuke' from project 'Nuke')
SwiftCompile normal arm64 /Users/admin/builder/spi-builder-workspace/.dependencies/checkouts/Nuke/Sources/Core/Encoding/ImageEncoders+Default.swift (in target 'Nuke' from project 'Nuke')
cd /Users/admin/builder/spi-builder-workspace/.swiftpm/xcode
SwiftCompile normal arm64 /Users/admin/builder/spi-builder-workspace/.dependencies/checkouts/Nuke/Sources/Core/Encoding/ImageEncoders+ImageIO.swift (in target 'Nuke' from project 'Nuke')
cd /Users/admin/builder/spi-builder-workspace/.swiftpm/xcode
SwiftCompile normal arm64 /Users/admin/builder/spi-builder-workspace/.dependencies/checkouts/Nuke/Sources/Core/Encoding/ImageEncoders.swift (in target 'Nuke' from project 'Nuke')
cd /Users/admin/builder/spi-builder-workspace/.swiftpm/xcode
SwiftCompile normal arm64 /Users/admin/builder/spi-builder-workspace/.dependencies/checkouts/Nuke/Sources/Core/Encoding/ImageEncoding.swift (in target 'Nuke' from project 'Nuke')
cd /Users/admin/builder/spi-builder-workspace/.swiftpm/xcode
SwiftCompile normal arm64 /Users/admin/builder/spi-builder-workspace/.dependencies/checkouts/Nuke/Sources/Core/ImagePipeline.swift (in target 'Nuke' from project 'Nuke')
cd /Users/admin/builder/spi-builder-workspace/.swiftpm/xcode
SwiftCompile normal arm64 /Users/admin/builder/spi-builder-workspace/.dependencies/checkouts/Nuke/Sources/Core/ImagePipelineConfiguration.swift (in target 'Nuke' from project 'Nuke')
cd /Users/admin/builder/spi-builder-workspace/.swiftpm/xcode
SwiftEmitModule normal arm64 Emitting\ module\ for\ Nuke (in target 'Nuke' from project 'Nuke')
Failed frontend command:
/Applications/Xcode-16.3.0.app/Contents/Developer/Toolchains/XcodeDefault.xctoolchain/usr/bin/swift-frontend -frontend -emit-module -experimental-skip-non-inlinable-function-bodies-without-types /Users/admin/builder/spi-builder-workspace/.dependencies/checkouts/Nuke/Sources/Combine/ImagePublisher.swift /Users/admin/builder/spi-builder-workspace/.dependencies/checkouts/Nuke/Sources/Core/Caching/DataCache.swift /Users/admin/builder/spi-builder-workspace/.dependencies/checkouts/Nuke/Sources/Core/Caching/DataCaching.swift /Users/admin/builder/spi-builder-workspace/.dependencies/checkouts/Nuke/Sources/Core/Caching/ImageCache.swift /Users/admin/builder/spi-builder-workspace/.dependencies/checkouts/Nuke/Sources/Core/Caching/ImageCaching.swift /Users/admin/builder/spi-builder-workspace/.dependencies/checkouts/Nuke/Sources/Core/Caching/ImagePipelineCache.swift /Users/admin/builder/spi-builder-workspace/.dependencies/checkouts/Nuke/Sources/Core/Decoding/AssetType.swift /Users/admin/builder/spi-builder-workspace/.dependencies/checkouts/Nuke/Sources/Core/Decoding/ImageDecoderRegistry.swift /Users/admin/builder/spi-builder-workspace/.dependencies/checkouts/Nuke/Sources/Core/Decoding/ImageDecoders+Default.swift /Users/admin/builder/spi-builder-workspace/.dependencies/checkouts/Nuke/Sources/Core/Decoding/ImageDecoders+Empty.swift /Users/admin/builder/spi-builder-workspace/.dependencies/checkouts/Nuke/Sources/Core/Decoding/ImageDecoders+Video.swift /Users/admin/builder/spi-builder-workspace/.dependencies/checkouts/Nuke/Sources/Core/Decoding/ImageDecoding.swift /Users/admin/builder/spi-builder-workspace/.dependencies/checkouts/Nuke/Sources/Core/Encoding/ImageEncoders+Default.swift /Users/admin/builder/spi-builder-workspace/.dependencies/checkouts/Nuke/Sources/Core/Encoding/ImageEncoders+ImageIO.swift /Users/admin/builder/spi-builder-workspace/.dependencies/checkouts/Nuke/Sources/Core/Encoding/ImageEncoders.swift /Users/admin/builder/spi-builder-workspace/.dependencies/checkouts/Nuke/Sources/Core/Encoding/ImageEncoding.swift /Users/admin/builder/spi-builder-workspace/.dependencies/checkouts/Nuke/Sources/Core/ImagePipeline.swift /Users/admin/builder/spi-builder-workspace/.dependencies/checkouts/Nuke/Sources/Core/ImagePipelineConfiguration.swift /Users/admin/builder/spi-builder-workspace/.dependencies/checkouts/Nuke/Sources/Core/ImagePipelineDelegate.swift /Users/admin/builder/spi-builder-workspace/.dependencies/checkouts/Nuke/Sources/Core/ImageRequest.swift /Users/admin/builder/spi-builder-workspace/.dependencies/checkouts/Nuke/Sources/Core/ImageResponse.swift /Users/admin/builder/spi-builder-workspace/.dependencies/checkouts/Nuke/Sources/Core/ImageTask.swift /Users/admin/builder/spi-builder-workspace/.dependencies/checkouts/Nuke/Sources/Core/Loading/DataLoader.swift /Users/admin/builder/spi-builder-workspace/.dependencies/checkouts/Nuke/Sources/Core/Loading/DataLoading.swift /Users/admin/builder/spi-builder-workspace/.dependencies/checkouts/Nuke/Sources/Core/Prefetching/ImagePrefetcher.swift /Users/admin/builder/spi-builder-workspace/.dependencies/checkouts/Nuke/Sources/Core/Processing/ImageDecompression.swift /Users/admin/builder/spi-builder-workspace/.dependencies/checkouts/Nuke/Sources/Core/Processing/ImageProcessing.swift /Users/admin/builder/spi-builder-workspace/.dependencies/checkouts/Nuke/Sources/Core/Processing/ImageProcessingOptions.swift /Users/admin/builder/spi-builder-workspace/.dependencies/checkouts/Nuke/Sources/Core/Processing/ImageProcessors+Anonymous.swift /Users/admin/builder/spi-builder-workspace/.dependencies/checkouts/Nuke/Sources/Core/Processing/ImageProcessors+Circle.swift /Users/admin/builder/spi-builder-workspace/.dependencies/checkouts/Nuke/Sources/Core/Processing/ImageProcessors+Composition.swift /Users/admin/builder/spi-builder-workspace/.dependencies/checkouts/Nuke/Sources/Core/Processing/ImageProcessors+CoreImage.swift /Users/admin/builder/spi-builder-workspace/.dependencies/checkouts/Nuke/Sources/Core/Processing/ImageProcessors+GaussianBlur.swift /Users/admin/builder/spi-builder-workspace/.dependencies/checkouts/Nuke/Sources/Core/Processing/ImageProcessors+Resize.swift /Users/admin/builder/spi-builder-workspace/.dependencies/checkouts/Nuke/Sources/Core/Processing/ImageProcessors+RoundedCorners.swift /Users/admin/builder/spi-builder-workspace/.dependencies/checkouts/Nuke/Sources/Core/Processing/ImageProcessors.swift /Users/admin/builder/spi-builder-workspace/.dependencies/checkouts/Nuke/Sources/Core/Tasks/AsyncTask.swift /Users/admin/builder/spi-builder-workspace/.dependencies/checkouts/Nuke/Sources/Core/Tasks/ImagePipelineTask.swift /Users/admin/builder/spi-builder-workspace/.dependencies/checkouts/Nuke/Sources/Core/Tasks/OperationTask.swift /Users/admin/builder/spi-builder-workspace/.dependencies/checkouts/Nuke/Sources/Core/Tasks/TaskFetchDecodedImage.swift /Users/admin/builder/spi-builder-workspace/.dependencies/checkouts/Nuke/Sources/Core/Tasks/TaskFetchOriginalImageData.swift /Users/admin/builder/spi-builder-workspace/.dependencies/checkouts/Nuke/Sources/Core/Tasks/TaskFetchWithPublisher.swift /Users/admin/builder/spi-builder-workspace/.dependencies/checkouts/Nuke/Sources/Core/Tasks/TaskLoadData.swift /Users/admin/builder/spi-builder-workspace/.dependencies/checkouts/Nuke/Sources/Core/Tasks/TaskLoadImage.swift /Users/admin/builder/spi-builder-workspace/.dependencies/checkouts/Nuke/Sources/Internal/AVDataAsset.swift /Users/admin/builder/spi-builder-workspace/.dependencies/checkouts/Nuke/Sources/Internal/Allocations.swift /Users/admin/builder/spi-builder-workspace/.dependencies/checkouts/Nuke/Sources/Internal/Combine.swift /Users/admin/builder/spi-builder-workspace/.dependencies/checkouts/Nuke/Sources/Internal/Deprecated.swift /Users/admin/builder/spi-builder-workspace/.dependencies/checkouts/Nuke/Sources/Internal/Extensions.swift /Users/admin/builder/spi-builder-workspace/.dependencies/checkouts/Nuke/Sources/Internal/Graphics.swift /Users/admin/builder/spi-builder-workspace/.dependencies/checkouts/Nuke/Sources/Internal/ImageRequestKeys.swift /Users/admin/builder/spi-builder-workspace/.dependencies/checkouts/Nuke/Sources/Internal/LinkedList.swift /Users/admin/builder/spi-builder-workspace/.dependencies/checkouts/Nuke/Sources/Internal/Log.swift /Users/admin/builder/spi-builder-workspace/.dependencies/checkouts/Nuke/Sources/Internal/Operation.swift /Users/admin/builder/spi-builder-workspace/.dependencies/checkouts/Nuke/Sources/Internal/RateLimiter.swift /Users/admin/builder/spi-builder-workspace/.dependencies/checkouts/Nuke/Sources/Internal/ResumableData.swift /Users/admin/builder/spi-builder-workspace/.dependencies/checkouts/Nuke/Sources/UI/FetchImage.swift /Users/admin/builder/spi-builder-workspace/.dependencies/checkouts/Nuke/Sources/UI/ImageViewExtensions.swift -target arm64-apple-xros1.0 -Xllvm -aarch64-use-tbi -enable-objc-interop -stack-check -sdk /Applications/Xcode-16.3.0.app/Contents/Developer/Platforms/XROS.platform/Developer/SDKs/XROS2.4.sdk -I /Users/admin/builder/spi-builder-workspace/.derivedData/Build/Products/Debug-xros -I /Applications/Xcode-16.3.0.app/Contents/Developer/Platforms/XROS.platform/Developer/usr/lib -F /Users/admin/builder/spi-builder-workspace/.derivedData/Build/Products/Debug-xros -F /Applications/Xcode-16.3.0.app/Contents/Developer/Platforms/XROS.platform/Developer/Library/Frameworks -F /Applications/Xcode-16.3.0.app/Contents/Developer/Platforms/XROS.platform/Developer/SDKs/XROS2.4.sdk/Developer/Library/Frameworks -no-color-diagnostics -enable-testing -g -debug-info-format\=dwarf -dwarf-version\=4 -module-cache-path /Users/admin/builder/spi-builder-workspace/.derivedData/ModuleCache.noindex -suppress-warnings -swift-version 5 -enforce-exclusivity\=checked -stats-output-dir /Users/admin/builder/spi-builder-workspace/.swiftpm/xcode/.stats -Onone -D SWIFT_PACKAGE -D DEBUG -serialize-debugging-options -const-gather-protocols-file /Users/admin/builder/spi-builder-workspace/.derivedData/Build/Intermediates.noindex/Nuke.build/Debug-xros/Nuke.build/Objects-normal/arm64/Nuke_const_extract_protocols.json -enable-upcoming-feature StrictConcurrency -enable-upcoming-feature DisableOutwardActorInference -enable-upcoming-feature GlobalActorIsolatedTypesUsability -enable-upcoming-feature InferSendableFromCaptures -enable-experimental-feature DebugDescriptionMacro -strict-concurrency\=complete -empty-abi-descriptor -plugin-path /Applications/Xcode-16.3.0.app/Contents/Developer/Toolchains/XcodeDefault.xctoolchain/usr/lib/swift/host/plugins/testing -validate-clang-modules-once -clang-build-session-file /Users/admin/builder/spi-builder-workspace/.derivedData/ModuleCache.noindex/Session.modulevalidation -Xcc -working-directory -Xcc /Users/admin/builder/spi-builder-workspace/.swiftpm/xcode -resource-dir /Applications/Xcode-16.3.0.app/Contents/Developer/Toolchains/XcodeDefault.xctoolchain/usr/lib/swift -enable-anonymous-context-mangled-names -file-compilation-dir /Users/admin/builder/spi-builder-workspace/.swiftpm/xcode -Xcc -ivfsstatcache -Xcc /Users/admin/builder/spi-builder-workspace/.derivedData/SDKStatCaches.noindex/xros2.4-22O233-407b76dbb837030756cbe1ab3f0b01b6.sdkstatcache -Xcc -I/Users/admin/builder/spi-builder-workspace/.derivedData/Build/Intermediates.noindex/Nuke.build/Debug-xros/Nuke.build/swift-overrides.hmap -Xcc -I/Users/admin/builder/spi-builder-workspace/.derivedData/Build/Products/Debug-xros/include -Xcc -I/Users/admin/builder/spi-builder-workspace/.derivedData/Build/Intermediates.noindex/Nuke.build/Debug-xros/Nuke.build/DerivedSources-normal/arm64 -Xcc -I/Users/admin/builder/spi-builder-workspace/.derivedData/Build/Intermediates.noindex/Nuke.build/Debug-xros/Nuke.build/DerivedSources/arm64 -Xcc -I/Users/admin/builder/spi-builder-workspace/.derivedData/Build/Intermediates.noindex/Nuke.build/Debug-xros/Nuke.build/DerivedSources -Xcc -DSWIFT_PACKAGE -Xcc -DDEBUG\=1 -module-name Nuke -frontend-parseable-output -disable-clang-spi -target-sdk-version 2.4 -target-sdk-name xros2.4 -external-plugin-path /Applications/Xcode-16.3.0.app/Contents/Developer/Platforms/XROS.platform/Developer/usr/lib/swift/host/plugins\#/Applications/Xcode-16.3.0.app/Contents/Developer/Platforms/XROS.platform/Developer/usr/bin/swift-plugin-server -external-plugin-path /Applications/Xcode-16.3.0.app/Contents/Developer/Platforms/XROS.platform/Developer/usr/local/lib/swift/host/plugins\#/Applications/Xcode-16.3.0.app/Contents/Developer/Platforms/XROS.platform/Developer/usr/bin/swift-plugin-server -in-process-plugin-server-path /Applications/Xcode-16.3.0.app/Contents/Developer/Toolchains/XcodeDefault.xctoolchain/usr/lib/swift/host/libSwiftInProcPluginServer.dylib -plugin-path /Applications/Xcode-16.3.0.app/Contents/Developer/Toolchains/XcodeDefault.xctoolchain/usr/lib/swift/host/plugins -plugin-path /Applications/Xcode-16.3.0.app/Contents/Developer/Toolchains/XcodeDefault.xctoolchain/usr/local/lib/swift/host/plugins -emit-module-doc-path /Users/admin/builder/spi-builder-workspace/.derivedData/Build/Intermediates.noindex/Nuke.build/Debug-xros/Nuke.build/Objects-normal/arm64/Nuke.swiftdoc -emit-module-source-info-path /Users/admin/builder/spi-builder-workspace/.derivedData/Build/Intermediates.noindex/Nuke.build/Debug-xros/Nuke.build/Objects-normal/arm64/Nuke.swiftsourceinfo -emit-objc-header-path /Users/admin/builder/spi-builder-workspace/.derivedData/Build/Intermediates.noindex/Nuke.build/Debug-xros/Nuke.build/Objects-normal/arm64/Nuke-Swift.h -serialize-diagnostics-path /Users/admin/builder/spi-builder-workspace/.derivedData/Build/Intermediates.noindex/Nuke.build/Debug-xros/Nuke.build/Objects-normal/arm64/Nuke-master-emit-module.dia -emit-dependencies-path /Users/admin/builder/spi-builder-workspace/.derivedData/Build/Intermediates.noindex/Nuke.build/Debug-xros/Nuke.build/Objects-normal/arm64/Nuke-master-emit-module.d -o /Users/admin/builder/spi-builder-workspace/.derivedData/Build/Intermediates.noindex/Nuke.build/Debug-xros/Nuke.build/Objects-normal/arm64/Nuke.swiftmodule -emit-abi-descriptor-path /Users/admin/builder/spi-builder-workspace/.derivedData/Build/Intermediates.noindex/Nuke.build/Debug-xros/Nuke.build/Objects-normal/arm64/Nuke.abi.json
EmitSwiftModule normal arm64 (in target 'Nuke' from project 'Nuke')
cd /Users/admin/builder/spi-builder-workspace/.swiftpm/xcode
/Users/admin/builder/spi-builder-workspace/.dependencies/checkouts/Nuke/Sources/Core/Processing/ImageProcessingOptions.swift:55:27: error: cannot find type 'NSColor' in scope
public let color: NSColor
^~~~~~~
/Users/admin/builder/spi-builder-workspace/.dependencies/checkouts/Nuke/Sources/Core/Processing/ImageProcessingOptions.swift:60:28: error: cannot find type 'NSColor' in scope
public init(color: NSColor, width: CGFloat = 1, unit: Unit = .points) {
^~~~~~~
/Users/admin/builder/spi-builder-workspace/.dependencies/checkouts/Nuke/Sources/Core/Processing/ImageProcessingOptions.swift:41:19: error: type 'ImageProcessingOptions.Border' does not conform to protocol 'Hashable'
public struct Border: Hashable, CustomStringConvertible {
^
/Users/admin/builder/spi-builder-workspace/.dependencies/checkouts/Nuke/Sources/Core/Processing/ImageProcessingOptions.swift:55:20: note: stored property type '<<error type>>' does not conform to protocol 'Hashable', preventing synthesized conformance of 'ImageProcessingOptions.Border' to 'Hashable'
public let color: NSColor
^
/Users/admin/builder/spi-builder-workspace/.dependencies/checkouts/Nuke/Sources/Core/Processing/ImageProcessingOptions.swift:41:19: error: type 'ImageProcessingOptions.Border' does not conform to protocol 'Equatable'
public struct Border: Hashable, CustomStringConvertible {
^
/Users/admin/builder/spi-builder-workspace/.dependencies/checkouts/Nuke/Sources/Core/Processing/ImageProcessingOptions.swift:55:20: note: stored property type '<<error type>>' does not conform to protocol 'Equatable', preventing synthesized conformance of 'ImageProcessingOptions.Border' to 'Equatable'
public let color: NSColor
^
Swift.==:1:24: note: candidate would match if 'ImageProcessingOptions.Border' conformed to 'RawRepresentable'
@inlinable public func == <T>(lhs: T, rhs: T) -> Bool where T : RawRepresentable, T.RawValue : Equatable
^
Swift.FloatingPoint.==:2:20: note: candidate would match if 'ImageProcessingOptions.Border' conformed to 'FloatingPoint'
public static func == (lhs: Self, rhs: Self) -> Bool}
^
Swift.BinaryInteger.==:2:20: note: candidate would match if 'ImageProcessingOptions.Border' conformed to 'BinaryInteger'
public static func == <Other>(lhs: Self, rhs: Other) -> Bool where Other : BinaryInteger}
^
Swift._Pointer.==:2:20: note: candidate would match if 'ImageProcessingOptions.Border' conformed to '_Pointer'
public static func == (lhs: Self, rhs: Self) -> Bool}
^
Swift._Pointer.==:2:31: note: candidate would match if 'ImageProcessingOptions.Border' conformed to '_Pointer'
@inlinable public static func == <Other>(lhs: Self, rhs: Other) -> Bool where Other : _Pointer}
^
Swift.Strideable.==:2:31: note: candidate would match if 'ImageProcessingOptions.Border' conformed to 'Strideable'
@inlinable public static func == (x: Self, y: Self) -> Bool}
^
Swift.StringProtocol.==:2:31: note: candidate would match if 'ImageProcessingOptions.Border' conformed to 'StringProtocol'
@inlinable public static func == <RHS>(lhs: Self, rhs: RHS) -> Bool where RHS : StringProtocol}
^
Swift.SIMD.==:2:20: note: candidate would match if 'ImageProcessingOptions.Border' conformed to 'SIMD'
public static func == (a: Self, b: Self) -> Bool}
^
Foundation.AttributedStringProtocol.==:2:20: note: candidate would match if 'ImageProcessingOptions.Border' conformed to 'AttributedStringProtocol'
public static func == <RHS>(lhs: Self, rhs: RHS) -> Bool where RHS : AttributedStringProtocol}
^
Foundation._BridgedStoredNSError.==:2:20: note: candidate would match if 'ImageProcessingOptions.Border' conformed to '_BridgedStoredNSError'
public static func == (lhs: Self, rhs: Self) -> Bool}
^
CoreFoundation._CFObject.==:2:20: note: candidate would match if 'ImageProcessingOptions.Border' conformed to '_CFObject'
public static func == (left: Self, right: Self) -> Bool}
^
/Users/admin/builder/spi-builder-workspace/.dependencies/checkouts/Nuke/Sources/Core/Processing/ImageProcessingOptions.swift:41:19: note: add stubs for conformance
public struct Border: Hashable, CustomStringConvertible {
^
Swift.Equatable.==:2:13: note: protocol requires function '==' with type '(ImageProcessingOptions.Border, ImageProcessingOptions.Border) -> Bool'
static func == (lhs: Self, rhs: Self) -> Bool}
^
/Users/admin/builder/spi-builder-workspace/.dependencies/checkouts/Nuke/Sources/Internal/Graphics.swift:156:19: error: cannot find type 'CGContext' in scope
private extension CGContext {
^~~~~~~~~
/Users/admin/builder/spi-builder-workspace/.dependencies/checkouts/Nuke/Sources/Internal/Graphics.swift:256:11: error: cannot find type 'UIImage' in scope
extension UIImage {
^~~~~~~
/Users/admin/builder/spi-builder-workspace/.dependencies/checkouts/Nuke/Sources/Internal/Graphics.swift:263:11: error: cannot find type 'CGImage' in scope
extension CGImage {
^~~~~~~
/Users/admin/builder/spi-builder-workspace/.dependencies/checkouts/Nuke/Sources/Internal/Graphics.swift:301:19: error: cannot find type 'UIColor' in scope
typealias Color = UIColor
^~~~~~~
/Users/admin/builder/spi-builder-workspace/.dependencies/checkouts/Nuke/Sources/UI/ImageViewExtensions.swift:94:16: error: cannot find type 'ImageDisplayingView' in scope
into view: ImageDisplayingView,
^~~~~~~~~~~~~~~~~~~
/Users/admin/builder/spi-builder-workspace/.dependencies/checkouts/Nuke/Sources/UI/ImageViewExtensions.swift:126:16: error: cannot find type 'ImageDisplayingView' in scope
into view: ImageDisplayingView,
^~~~~~~~~~~~~~~~~~~
/Users/admin/builder/spi-builder-workspace/.dependencies/checkouts/Nuke/Sources/UI/ImageViewExtensions.swift:136:37: error: cannot find type 'ImageDisplayingView' in scope
public func cancelRequest(for view: ImageDisplayingView) {
^~~~~~~~~~~~~~~~~~~
/Users/admin/builder/spi-builder-workspace/.dependencies/checkouts/Nuke/Sources/UI/ImageViewExtensions.swift:365:33: error: cannot find type 'ImageDisplayingView' in scope
private weak var imageView: ImageDisplayingView?
^~~~~~~~~~~~~~~~~~~
/Users/admin/builder/spi-builder-workspace/.dependencies/checkouts/Nuke/Sources/UI/ImageViewExtensions.swift:380:27: error: cannot find type 'ImageDisplayingView' in scope
init(view: /* weak */ ImageDisplayingView) {
^~~~~~~~~~~~~~~~~~~
/Users/admin/builder/spi-builder-workspace/.dependencies/checkouts/Nuke/Sources/UI/ImageViewExtensions.swift:390:38: error: cannot find type 'ImageDisplayingView' in scope
static func controller(for view: ImageDisplayingView) -> ImageViewController {
^~~~~~~~~~~~~~~~~~~
SwiftCompile normal arm64 Compiling\ ImagePublisher.swift,\ DataCache.swift,\ DataCaching.swift,\ ImageCache.swift,\ ImageCaching.swift,\ ImagePipelineCache.swift /Users/admin/builder/spi-builder-workspace/.dependencies/checkouts/Nuke/Sources/Combine/ImagePublisher.swift /Users/admin/builder/spi-builder-workspace/.dependencies/checkouts/Nuke/Sources/Core/Caching/DataCache.swift /Users/admin/builder/spi-builder-workspace/.dependencies/checkouts/Nuke/Sources/Core/Caching/DataCaching.swift /Users/admin/builder/spi-builder-workspace/.dependencies/checkouts/Nuke/Sources/Core/Caching/ImageCache.swift /Users/admin/builder/spi-builder-workspace/.dependencies/checkouts/Nuke/Sources/Core/Caching/ImageCaching.swift /Users/admin/builder/spi-builder-workspace/.dependencies/checkouts/Nuke/Sources/Core/Caching/ImagePipelineCache.swift (in target 'Nuke' from project 'Nuke')
SwiftCompile normal arm64 /Users/admin/builder/spi-builder-workspace/.dependencies/checkouts/Nuke/Sources/Combine/ImagePublisher.swift (in target 'Nuke' from project 'Nuke')
cd /Users/admin/builder/spi-builder-workspace/.swiftpm/xcode
SwiftCompile normal arm64 /Users/admin/builder/spi-builder-workspace/.dependencies/checkouts/Nuke/Sources/Core/Caching/DataCache.swift (in target 'Nuke' from project 'Nuke')
cd /Users/admin/builder/spi-builder-workspace/.swiftpm/xcode
SwiftCompile normal arm64 /Users/admin/builder/spi-builder-workspace/.dependencies/checkouts/Nuke/Sources/Core/Caching/DataCaching.swift (in target 'Nuke' from project 'Nuke')
cd /Users/admin/builder/spi-builder-workspace/.swiftpm/xcode
SwiftCompile normal arm64 /Users/admin/builder/spi-builder-workspace/.dependencies/checkouts/Nuke/Sources/Core/Caching/ImageCache.swift (in target 'Nuke' from project 'Nuke')
cd /Users/admin/builder/spi-builder-workspace/.swiftpm/xcode
SwiftCompile normal arm64 /Users/admin/builder/spi-builder-workspace/.dependencies/checkouts/Nuke/Sources/Core/Caching/ImageCaching.swift (in target 'Nuke' from project 'Nuke')
cd /Users/admin/builder/spi-builder-workspace/.swiftpm/xcode
SwiftCompile normal arm64 /Users/admin/builder/spi-builder-workspace/.dependencies/checkouts/Nuke/Sources/Core/Caching/ImagePipelineCache.swift (in target 'Nuke' from project 'Nuke')
cd /Users/admin/builder/spi-builder-workspace/.swiftpm/xcode
SwiftCompile normal arm64 Compiling\ ImagePrefetcher.swift,\ ImageDecompression.swift,\ ImageProcessing.swift,\ ImageProcessingOptions.swift,\ ImageProcessors+Anonymous.swift,\ ImageProcessors+Circle.swift /Users/admin/builder/spi-builder-workspace/.dependencies/checkouts/Nuke/Sources/Core/Prefetching/ImagePrefetcher.swift /Users/admin/builder/spi-builder-workspace/.dependencies/checkouts/Nuke/Sources/Core/Processing/ImageDecompression.swift /Users/admin/builder/spi-builder-workspace/.dependencies/checkouts/Nuke/Sources/Core/Processing/ImageProcessing.swift /Users/admin/builder/spi-builder-workspace/.dependencies/checkouts/Nuke/Sources/Core/Processing/ImageProcessingOptions.swift /Users/admin/builder/spi-builder-workspace/.dependencies/checkouts/Nuke/Sources/Core/Processing/ImageProcessors+Anonymous.swift /Users/admin/builder/spi-builder-workspace/.dependencies/checkouts/Nuke/Sources/Core/Processing/ImageProcessors+Circle.swift (in target 'Nuke' from project 'Nuke')
SwiftCompile normal arm64 /Users/admin/builder/spi-builder-workspace/.dependencies/checkouts/Nuke/Sources/Core/Prefetching/ImagePrefetcher.swift (in target 'Nuke' from project 'Nuke')
cd /Users/admin/builder/spi-builder-workspace/.swiftpm/xcode
SwiftCompile normal arm64 /Users/admin/builder/spi-builder-workspace/.dependencies/checkouts/Nuke/Sources/Core/Processing/ImageDecompression.swift (in target 'Nuke' from project 'Nuke')
cd /Users/admin/builder/spi-builder-workspace/.swiftpm/xcode
SwiftCompile normal arm64 /Users/admin/builder/spi-builder-workspace/.dependencies/checkouts/Nuke/Sources/Core/Processing/ImageProcessing.swift (in target 'Nuke' from project 'Nuke')
cd /Users/admin/builder/spi-builder-workspace/.swiftpm/xcode
SwiftCompile normal arm64 /Users/admin/builder/spi-builder-workspace/.dependencies/checkouts/Nuke/Sources/Core/Processing/ImageProcessingOptions.swift (in target 'Nuke' from project 'Nuke')
cd /Users/admin/builder/spi-builder-workspace/.swiftpm/xcode
SwiftCompile normal arm64 /Users/admin/builder/spi-builder-workspace/.dependencies/checkouts/Nuke/Sources/Core/Processing/ImageProcessors+Anonymous.swift (in target 'Nuke' from project 'Nuke')
cd /Users/admin/builder/spi-builder-workspace/.swiftpm/xcode
SwiftCompile normal arm64 /Users/admin/builder/spi-builder-workspace/.dependencies/checkouts/Nuke/Sources/Core/Processing/ImageProcessors+Circle.swift (in target 'Nuke' from project 'Nuke')
cd /Users/admin/builder/spi-builder-workspace/.swiftpm/xcode
SwiftCompile normal arm64 Compiling\ AsyncTask.swift,\ ImagePipelineTask.swift,\ OperationTask.swift,\ TaskFetchDecodedImage.swift,\ TaskFetchOriginalImageData.swift,\ TaskFetchWithPublisher.swift /Users/admin/builder/spi-builder-workspace/.dependencies/checkouts/Nuke/Sources/Core/Tasks/AsyncTask.swift /Users/admin/builder/spi-builder-workspace/.dependencies/checkouts/Nuke/Sources/Core/Tasks/ImagePipelineTask.swift /Users/admin/builder/spi-builder-workspace/.dependencies/checkouts/Nuke/Sources/Core/Tasks/OperationTask.swift /Users/admin/builder/spi-builder-workspace/.dependencies/checkouts/Nuke/Sources/Core/Tasks/TaskFetchDecodedImage.swift /Users/admin/builder/spi-builder-workspace/.dependencies/checkouts/Nuke/Sources/Core/Tasks/TaskFetchOriginalImageData.swift /Users/admin/builder/spi-builder-workspace/.dependencies/checkouts/Nuke/Sources/Core/Tasks/TaskFetchWithPublisher.swift (in target 'Nuke' from project 'Nuke')
SwiftCompile normal arm64 /Users/admin/builder/spi-builder-workspace/.dependencies/checkouts/Nuke/Sources/Core/Tasks/AsyncTask.swift (in target 'Nuke' from project 'Nuke')
cd /Users/admin/builder/spi-builder-workspace/.swiftpm/xcode
SwiftCompile normal arm64 /Users/admin/builder/spi-builder-workspace/.dependencies/checkouts/Nuke/Sources/Core/Tasks/ImagePipelineTask.swift (in target 'Nuke' from project 'Nuke')
cd /Users/admin/builder/spi-builder-workspace/.swiftpm/xcode
SwiftCompile normal arm64 /Users/admin/builder/spi-builder-workspace/.dependencies/checkouts/Nuke/Sources/Core/Tasks/OperationTask.swift (in target 'Nuke' from project 'Nuke')
cd /Users/admin/builder/spi-builder-workspace/.swiftpm/xcode
SwiftCompile normal arm64 /Users/admin/builder/spi-builder-workspace/.dependencies/checkouts/Nuke/Sources/Core/Tasks/TaskFetchDecodedImage.swift (in target 'Nuke' from project 'Nuke')
cd /Users/admin/builder/spi-builder-workspace/.swiftpm/xcode
SwiftCompile normal arm64 /Users/admin/builder/spi-builder-workspace/.dependencies/checkouts/Nuke/Sources/Core/Tasks/TaskFetchOriginalImageData.swift (in target 'Nuke' from project 'Nuke')
cd /Users/admin/builder/spi-builder-workspace/.swiftpm/xcode
SwiftCompile normal arm64 /Users/admin/builder/spi-builder-workspace/.dependencies/checkouts/Nuke/Sources/Core/Tasks/TaskFetchWithPublisher.swift (in target 'Nuke' from project 'Nuke')
cd /Users/admin/builder/spi-builder-workspace/.swiftpm/xcode
SwiftCompile normal arm64 Compiling\ TaskLoadData.swift,\ TaskLoadImage.swift,\ AVDataAsset.swift,\ Allocations.swift,\ Combine.swift,\ Deprecated.swift /Users/admin/builder/spi-builder-workspace/.dependencies/checkouts/Nuke/Sources/Core/Tasks/TaskLoadData.swift /Users/admin/builder/spi-builder-workspace/.dependencies/checkouts/Nuke/Sources/Core/Tasks/TaskLoadImage.swift /Users/admin/builder/spi-builder-workspace/.dependencies/checkouts/Nuke/Sources/Internal/AVDataAsset.swift /Users/admin/builder/spi-builder-workspace/.dependencies/checkouts/Nuke/Sources/Internal/Allocations.swift /Users/admin/builder/spi-builder-workspace/.dependencies/checkouts/Nuke/Sources/Internal/Combine.swift /Users/admin/builder/spi-builder-workspace/.dependencies/checkouts/Nuke/Sources/Internal/Deprecated.swift (in target 'Nuke' from project 'Nuke')
SwiftCompile normal arm64 /Users/admin/builder/spi-builder-workspace/.dependencies/checkouts/Nuke/Sources/Core/Tasks/TaskLoadData.swift (in target 'Nuke' from project 'Nuke')
cd /Users/admin/builder/spi-builder-workspace/.swiftpm/xcode
SwiftCompile normal arm64 /Users/admin/builder/spi-builder-workspace/.dependencies/checkouts/Nuke/Sources/Core/Tasks/TaskLoadImage.swift (in target 'Nuke' from project 'Nuke')
cd /Users/admin/builder/spi-builder-workspace/.swiftpm/xcode
SwiftCompile normal arm64 /Users/admin/builder/spi-builder-workspace/.dependencies/checkouts/Nuke/Sources/Internal/AVDataAsset.swift (in target 'Nuke' from project 'Nuke')
cd /Users/admin/builder/spi-builder-workspace/.swiftpm/xcode
SwiftCompile normal arm64 /Users/admin/builder/spi-builder-workspace/.dependencies/checkouts/Nuke/Sources/Internal/Allocations.swift (in target 'Nuke' from project 'Nuke')
cd /Users/admin/builder/spi-builder-workspace/.swiftpm/xcode
SwiftCompile normal arm64 /Users/admin/builder/spi-builder-workspace/.dependencies/checkouts/Nuke/Sources/Internal/Combine.swift (in target 'Nuke' from project 'Nuke')
cd /Users/admin/builder/spi-builder-workspace/.swiftpm/xcode
SwiftCompile normal arm64 /Users/admin/builder/spi-builder-workspace/.dependencies/checkouts/Nuke/Sources/Internal/Deprecated.swift (in target 'Nuke' from project 'Nuke')
cd /Users/admin/builder/spi-builder-workspace/.swiftpm/xcode
SwiftCompile normal arm64 Compiling\ Extensions.swift,\ Graphics.swift,\ ImageRequestKeys.swift,\ LinkedList.swift,\ Log.swift /Users/admin/builder/spi-builder-workspace/.dependencies/checkouts/Nuke/Sources/Internal/Extensions.swift /Users/admin/builder/spi-builder-workspace/.dependencies/checkouts/Nuke/Sources/Internal/Graphics.swift /Users/admin/builder/spi-builder-workspace/.dependencies/checkouts/Nuke/Sources/Internal/ImageRequestKeys.swift /Users/admin/builder/spi-builder-workspace/.dependencies/checkouts/Nuke/Sources/Internal/LinkedList.swift /Users/admin/builder/spi-builder-workspace/.dependencies/checkouts/Nuke/Sources/Internal/Log.swift (in target 'Nuke' from project 'Nuke')
SwiftCompile normal arm64 /Users/admin/builder/spi-builder-workspace/.dependencies/checkouts/Nuke/Sources/Internal/Extensions.swift (in target 'Nuke' from project 'Nuke')
cd /Users/admin/builder/spi-builder-workspace/.swiftpm/xcode
SwiftCompile normal arm64 /Users/admin/builder/spi-builder-workspace/.dependencies/checkouts/Nuke/Sources/Internal/Graphics.swift (in target 'Nuke' from project 'Nuke')
cd /Users/admin/builder/spi-builder-workspace/.swiftpm/xcode
SwiftCompile normal arm64 /Users/admin/builder/spi-builder-workspace/.dependencies/checkouts/Nuke/Sources/Internal/ImageRequestKeys.swift (in target 'Nuke' from project 'Nuke')
cd /Users/admin/builder/spi-builder-workspace/.swiftpm/xcode
SwiftCompile normal arm64 /Users/admin/builder/spi-builder-workspace/.dependencies/checkouts/Nuke/Sources/Internal/LinkedList.swift (in target 'Nuke' from project 'Nuke')
cd /Users/admin/builder/spi-builder-workspace/.swiftpm/xcode
SwiftCompile normal arm64 /Users/admin/builder/spi-builder-workspace/.dependencies/checkouts/Nuke/Sources/Internal/Log.swift (in target 'Nuke' from project 'Nuke')
cd /Users/admin/builder/spi-builder-workspace/.swiftpm/xcode
SwiftCompile normal arm64 Compiling\ AssetType.swift,\ ImageDecoderRegistry.swift,\ ImageDecoders+Default.swift,\ ImageDecoders+Empty.swift,\ ImageDecoders+Video.swift,\ ImageDecoding.swift /Users/admin/builder/spi-builder-workspace/.dependencies/checkouts/Nuke/Sources/Core/Decoding/AssetType.swift /Users/admin/builder/spi-builder-workspace/.dependencies/checkouts/Nuke/Sources/Core/Decoding/ImageDecoderRegistry.swift /Users/admin/builder/spi-builder-workspace/.dependencies/checkouts/Nuke/Sources/Core/Decoding/ImageDecoders+Default.swift /Users/admin/builder/spi-builder-workspace/.dependencies/checkouts/Nuke/Sources/Core/Decoding/ImageDecoders+Empty.swift /Users/admin/builder/spi-builder-workspace/.dependencies/checkouts/Nuke/Sources/Core/Decoding/ImageDecoders+Video.swift /Users/admin/builder/spi-builder-workspace/.dependencies/checkouts/Nuke/Sources/Core/Decoding/ImageDecoding.swift (in target 'Nuke' from project 'Nuke')
SwiftCompile normal arm64 /Users/admin/builder/spi-builder-workspace/.dependencies/checkouts/Nuke/Sources/Core/Decoding/AssetType.swift (in target 'Nuke' from project 'Nuke')
cd /Users/admin/builder/spi-builder-workspace/.swiftpm/xcode
SwiftCompile normal arm64 /Users/admin/builder/spi-builder-workspace/.dependencies/checkouts/Nuke/Sources/Core/Decoding/ImageDecoderRegistry.swift (in target 'Nuke' from project 'Nuke')
cd /Users/admin/builder/spi-builder-workspace/.swiftpm/xcode
SwiftCompile normal arm64 /Users/admin/builder/spi-builder-workspace/.dependencies/checkouts/Nuke/Sources/Core/Decoding/ImageDecoders+Default.swift (in target 'Nuke' from project 'Nuke')
cd /Users/admin/builder/spi-builder-workspace/.swiftpm/xcode
SwiftCompile normal arm64 /Users/admin/builder/spi-builder-workspace/.dependencies/checkouts/Nuke/Sources/Core/Decoding/ImageDecoders+Empty.swift (in target 'Nuke' from project 'Nuke')
cd /Users/admin/builder/spi-builder-workspace/.swiftpm/xcode
SwiftCompile normal arm64 /Users/admin/builder/spi-builder-workspace/.dependencies/checkouts/Nuke/Sources/Core/Decoding/ImageDecoders+Video.swift (in target 'Nuke' from project 'Nuke')
cd /Users/admin/builder/spi-builder-workspace/.swiftpm/xcode
SwiftCompile normal arm64 /Users/admin/builder/spi-builder-workspace/.dependencies/checkouts/Nuke/Sources/Core/Decoding/ImageDecoding.swift (in target 'Nuke' from project 'Nuke')
cd /Users/admin/builder/spi-builder-workspace/.swiftpm/xcode
SwiftCompile normal arm64 Compiling\ ImageProcessors+Composition.swift,\ ImageProcessors+CoreImage.swift,\ ImageProcessors+GaussianBlur.swift,\ ImageProcessors+Resize.swift,\ ImageProcessors+RoundedCorners.swift,\ ImageProcessors.swift /Users/admin/builder/spi-builder-workspace/.dependencies/checkouts/Nuke/Sources/Core/Processing/ImageProcessors+Composition.swift /Users/admin/builder/spi-builder-workspace/.dependencies/checkouts/Nuke/Sources/Core/Processing/ImageProcessors+CoreImage.swift /Users/admin/builder/spi-builder-workspace/.dependencies/checkouts/Nuke/Sources/Core/Processing/ImageProcessors+GaussianBlur.swift /Users/admin/builder/spi-builder-workspace/.dependencies/checkouts/Nuke/Sources/Core/Processing/ImageProcessors+Resize.swift /Users/admin/builder/spi-builder-workspace/.dependencies/checkouts/Nuke/Sources/Core/Processing/ImageProcessors+RoundedCorners.swift /Users/admin/builder/spi-builder-workspace/.dependencies/checkouts/Nuke/Sources/Core/Processing/ImageProcessors.swift (in target 'Nuke' from project 'Nuke')
SwiftCompile normal arm64 /Users/admin/builder/spi-builder-workspace/.dependencies/checkouts/Nuke/Sources/Core/Processing/ImageProcessors+Composition.swift (in target 'Nuke' from project 'Nuke')
cd /Users/admin/builder/spi-builder-workspace/.swiftpm/xcode
SwiftCompile normal arm64 /Users/admin/builder/spi-builder-workspace/.dependencies/checkouts/Nuke/Sources/Core/Processing/ImageProcessors+CoreImage.swift (in target 'Nuke' from project 'Nuke')
cd /Users/admin/builder/spi-builder-workspace/.swiftpm/xcode
SwiftCompile normal arm64 /Users/admin/builder/spi-builder-workspace/.dependencies/checkouts/Nuke/Sources/Core/Processing/ImageProcessors+GaussianBlur.swift (in target 'Nuke' from project 'Nuke')
cd /Users/admin/builder/spi-builder-workspace/.swiftpm/xcode
SwiftCompile normal arm64 /Users/admin/builder/spi-builder-workspace/.dependencies/checkouts/Nuke/Sources/Core/Processing/ImageProcessors+Resize.swift (in target 'Nuke' from project 'Nuke')
cd /Users/admin/builder/spi-builder-workspace/.swiftpm/xcode
SwiftCompile normal arm64 /Users/admin/builder/spi-builder-workspace/.dependencies/checkouts/Nuke/Sources/Core/Processing/ImageProcessors+RoundedCorners.swift (in target 'Nuke' from project 'Nuke')
cd /Users/admin/builder/spi-builder-workspace/.swiftpm/xcode
SwiftCompile normal arm64 /Users/admin/builder/spi-builder-workspace/.dependencies/checkouts/Nuke/Sources/Core/Processing/ImageProcessors.swift (in target 'Nuke' from project 'Nuke')
cd /Users/admin/builder/spi-builder-workspace/.swiftpm/xcode
SwiftCompile normal arm64 Compiling\ ImagePipelineDelegate.swift,\ ImageRequest.swift,\ ImageResponse.swift,\ ImageTask.swift,\ DataLoader.swift,\ DataLoading.swift /Users/admin/builder/spi-builder-workspace/.dependencies/checkouts/Nuke/Sources/Core/ImagePipelineDelegate.swift /Users/admin/builder/spi-builder-workspace/.dependencies/checkouts/Nuke/Sources/Core/ImageRequest.swift /Users/admin/builder/spi-builder-workspace/.dependencies/checkouts/Nuke/Sources/Core/ImageResponse.swift /Users/admin/builder/spi-builder-workspace/.dependencies/checkouts/Nuke/Sources/Core/ImageTask.swift /Users/admin/builder/spi-builder-workspace/.dependencies/checkouts/Nuke/Sources/Core/Loading/DataLoader.swift /Users/admin/builder/spi-builder-workspace/.dependencies/checkouts/Nuke/Sources/Core/Loading/DataLoading.swift (in target 'Nuke' from project 'Nuke')
SwiftCompile normal arm64 /Users/admin/builder/spi-builder-workspace/.dependencies/checkouts/Nuke/Sources/Core/ImagePipelineDelegate.swift (in target 'Nuke' from project 'Nuke')
cd /Users/admin/builder/spi-builder-workspace/.swiftpm/xcode
SwiftCompile normal arm64 /Users/admin/builder/spi-builder-workspace/.dependencies/checkouts/Nuke/Sources/Core/ImageRequest.swift (in target 'Nuke' from project 'Nuke')
cd /Users/admin/builder/spi-builder-workspace/.swiftpm/xcode
SwiftCompile normal arm64 /Users/admin/builder/spi-builder-workspace/.dependencies/checkouts/Nuke/Sources/Core/ImageResponse.swift (in target 'Nuke' from project 'Nuke')
cd /Users/admin/builder/spi-builder-workspace/.swiftpm/xcode
SwiftCompile normal arm64 /Users/admin/builder/spi-builder-workspace/.dependencies/checkouts/Nuke/Sources/Core/ImageTask.swift (in target 'Nuke' from project 'Nuke')
cd /Users/admin/builder/spi-builder-workspace/.swiftpm/xcode
SwiftCompile normal arm64 /Users/admin/builder/spi-builder-workspace/.dependencies/checkouts/Nuke/Sources/Core/Loading/DataLoader.swift (in target 'Nuke' from project 'Nuke')
cd /Users/admin/builder/spi-builder-workspace/.swiftpm/xcode
SwiftCompile normal arm64 /Users/admin/builder/spi-builder-workspace/.dependencies/checkouts/Nuke/Sources/Core/Loading/DataLoading.swift (in target 'Nuke' from project 'Nuke')
cd /Users/admin/builder/spi-builder-workspace/.swiftpm/xcode
SwiftCompile normal arm64 Compiling\ Operation.swift,\ RateLimiter.swift,\ ResumableData.swift,\ FetchImage.swift,\ ImageViewExtensions.swift /Users/admin/builder/spi-builder-workspace/.dependencies/checkouts/Nuke/Sources/Internal/Operation.swift /Users/admin/builder/spi-builder-workspace/.dependencies/checkouts/Nuke/Sources/Internal/RateLimiter.swift /Users/admin/builder/spi-builder-workspace/.dependencies/checkouts/Nuke/Sources/Internal/ResumableData.swift /Users/admin/builder/spi-builder-workspace/.dependencies/checkouts/Nuke/Sources/UI/FetchImage.swift /Users/admin/builder/spi-builder-workspace/.dependencies/checkouts/Nuke/Sources/UI/ImageViewExtensions.swift (in target 'Nuke' from project 'Nuke')
Command SwiftCompile failed with a nonzero exit code
** BUILD FAILED **
The following build commands failed:
SwiftEmitModule normal arm64 Emitting\ module\ for\ Nuke (in target 'Nuke' from project 'Nuke')
EmitSwiftModule normal arm64 (in target 'Nuke' from project 'Nuke')
SwiftCompile normal arm64 Compiling\ Operation.swift,\ RateLimiter.swift,\ ResumableData.swift,\ FetchImage.swift,\ ImageViewExtensions.swift /Users/admin/builder/spi-builder-workspace/.dependencies/checkouts/Nuke/Sources/Internal/Operation.swift /Users/admin/builder/spi-builder-workspace/.dependencies/checkouts/Nuke/Sources/Internal/RateLimiter.swift /Users/admin/builder/spi-builder-workspace/.dependencies/checkouts/Nuke/Sources/Internal/ResumableData.swift /Users/admin/builder/spi-builder-workspace/.dependencies/checkouts/Nuke/Sources/UI/FetchImage.swift /Users/admin/builder/spi-builder-workspace/.dependencies/checkouts/Nuke/Sources/UI/ImageViewExtensions.swift (in target 'Nuke' from project 'Nuke')
Building workspace spi-builder-workspace with scheme NukeUI
(4 failures)
Command line invocation:
/Applications/Xcode-16.3.0.app/Contents/Developer/usr/bin/xcodebuild -IDEClonedSourcePackagesDirPathOverride=/Users/admin/builder/spi-builder-workspace/.dependencies -resolvePackageDependencies
Resolve Package Graph
Resolved source packages:
Nuke: https://github.com/kean/Nuke.git @ 10.11.2
Gifu: https://github.com/kaishin/Gifu @ 3.5.1
NukeUI: /Users/admin/builder/spi-builder-workspace
resolved source packages: Nuke, Gifu, NukeUI
{
"dependencies" : [
{
"identity" : "nuke",
"requirement" : {
"range" : [
{
"lower_bound" : "10.5.0",
"upper_bound" : "11.0.0"
}
]
},
"type" : "sourceControl",
"url" : "https://github.com/kean/Nuke.git"
},
{
"identity" : "gifu",
"requirement" : {
"range" : [
{
"lower_bound" : "3.0.0",
"upper_bound" : "4.0.0"
}
]
},
"type" : "sourceControl",
"url" : "https://github.com/kaishin/Gifu"
}
],
"manifest_display_name" : "NukeUI",
"name" : "NukeUI",
"path" : "/Users/admin/builder/spi-builder-workspace",
"platforms" : [
{
"name" : "macos",
"version" : "10.14"
},
{
"name" : "ios",
"version" : "12.0"
},
{
"name" : "tvos",
"version" : "12.0"
},
{
"name" : "watchos",
"version" : "5.0"
}
],
"products" : [
{
"name" : "NukeUI",
"targets" : [
"NukeUI"
],
"type" : {
"library" : [
"automatic"
]
}
}
],
"targets" : [
{
"c99name" : "NukeUI",
"module_type" : "SwiftTarget",
"name" : "NukeUI",
"path" : "Sources",
"product_dependencies" : [
"Nuke",
"Gifu"
],
"product_memberships" : [
"NukeUI"
],
"sources" : [
"Image.swift",
"ImageView.swift",
"Internal.swift",
"LazyImage.swift",
"LazyImageView.swift",
"VideoPlayerView.swift"
],
"type" : "library"
}
],
"tools_version" : "5.3"
}
{
"workspace" : {
"name" : "spi-builder-workspace",
"schemes" : [
"NukeUI"
]
}
}
Running build ...
env DEVELOPER_DIR=/Applications/Xcode-16.3.0.app xcrun xcodebuild -IDEClonedSourcePackagesDirPathOverride=$PWD/.dependencies -skipMacroValidation -skipPackagePluginValidation -derivedDataPath $PWD/.derivedData build -scheme NukeUI -destination generic/platform=xrOS
Command line invocation:
/Applications/Xcode-16.3.0.app/Contents/Developer/usr/bin/xcodebuild -IDEClonedSourcePackagesDirPathOverride=/Users/admin/builder/spi-builder-workspace/.dependencies -skipMacroValidation -skipPackagePluginValidation -derivedDataPath /Users/admin/builder/spi-builder-workspace/.derivedData build -scheme NukeUI -destination generic/platform=xrOS
Resolve Package Graph
Resolved source packages:
Nuke: https://github.com/kean/Nuke.git @ 10.11.2
Gifu: https://github.com/kaishin/Gifu @ 3.5.1
NukeUI: /Users/admin/builder/spi-builder-workspace
ComputePackagePrebuildTargetDependencyGraph
Prepare packages
CreateBuildRequest
SendProjectDescription
CreateBuildOperation
ComputeTargetDependencyGraph
note: Building targets in dependency order
note: Target dependency graph (4 targets)
Target 'NukeUI' in project 'NukeUI'
➜ Explicit dependency on target 'NukeUI' in project 'NukeUI'
➜ Explicit dependency on target 'Nuke' in project 'Nuke'
Target 'NukeUI' in project 'NukeUI'
➜ Explicit dependency on target 'Nuke' in project 'Nuke'
Target 'Nuke' in project 'Nuke'
➜ Explicit dependency on target 'Nuke' in project 'Nuke'
Target 'Nuke' in project 'Nuke' (no dependencies)
GatherProvisioningInputs
CreateBuildDescription
ExecuteExternalTool /Applications/Xcode-16.3.0.app/Contents/Developer/Toolchains/XcodeDefault.xctoolchain/usr/bin/clang -v -E -dM -isysroot /Applications/Xcode-16.3.0.app/Contents/Developer/Platforms/XROS.platform/Developer/SDKs/XROS2.4.sdk -x c -c /dev/null
ExecuteExternalTool /Applications/Xcode-16.3.0.app/Contents/Developer/Toolchains/XcodeDefault.xctoolchain/usr/bin/swiftc --version
ExecuteExternalTool /Applications/Xcode-16.3.0.app/Contents/Developer/Toolchains/XcodeDefault.xctoolchain/usr/bin/ld -version_details
Build description signature: 0dd389b101a3fffeddd9d1d5dafc5a02
Build description path: /Users/admin/builder/spi-builder-workspace/.derivedData/Build/Intermediates.noindex/XCBuildData/0dd389b101a3fffeddd9d1d5dafc5a02.xcbuilddata
ClangStatCache /Applications/Xcode-16.3.0.app/Contents/Developer/Toolchains/XcodeDefault.xctoolchain/usr/bin/clang-stat-cache /Applications/Xcode-16.3.0.app/Contents/Developer/Platforms/XROS.platform/Developer/SDKs/XROS2.4.sdk /Users/admin/builder/spi-builder-workspace/.derivedData/SDKStatCaches.noindex/xros2.4-22O233-407b76dbb837030756cbe1ab3f0b01b6.sdkstatcache
cd /Users/admin/builder/spi-builder-workspace/.swiftpm/xcode
/Applications/Xcode-16.3.0.app/Contents/Developer/Toolchains/XcodeDefault.xctoolchain/usr/bin/clang-stat-cache /Applications/Xcode-16.3.0.app/Contents/Developer/Platforms/XROS.platform/Developer/SDKs/XROS2.4.sdk -o /Users/admin/builder/spi-builder-workspace/.derivedData/SDKStatCaches.noindex/xros2.4-22O233-407b76dbb837030756cbe1ab3f0b01b6.sdkstatcache
SwiftDriver Nuke normal arm64 com.apple.xcode.tools.swift.compiler (in target 'Nuke' from project 'Nuke')
cd /Users/admin/builder/spi-builder-workspace/.swiftpm/xcode
builtin-SwiftDriver -- /Applications/Xcode-16.3.0.app/Contents/Developer/Toolchains/XcodeDefault.xctoolchain/usr/bin/swiftc -module-name Nuke -Onone -enforce-exclusivity\=checked @/Users/admin/builder/spi-builder-workspace/.derivedData/Build/Intermediates.noindex/Nuke.build/Debug-xros/Nuke.build/Objects-normal/arm64/Nuke.SwiftFileList -DSWIFT_PACKAGE -DDEBUG -DXcode -plugin-path /Applications/Xcode-16.3.0.app/Contents/Developer/Toolchains/XcodeDefault.xctoolchain/usr/lib/swift/host/plugins/testing -enable-experimental-feature DebugDescriptionMacro -sdk /Applications/Xcode-16.3.0.app/Contents/Developer/Platforms/XROS.platform/Developer/SDKs/XROS2.4.sdk -target arm64-apple-xros1.0 -g -module-cache-path /Users/admin/builder/spi-builder-workspace/.derivedData/ModuleCache.noindex -Xfrontend -serialize-debugging-options -enable-testing -suppress-warnings -index-store-path /Users/admin/builder/spi-builder-workspace/.derivedData/Index.noindex/DataStore -swift-version 5 -I /Users/admin/builder/spi-builder-workspace/.derivedData/Build/Products/Debug-xros -I /Applications/Xcode-16.3.0.app/Contents/Developer/Platforms/XROS.platform/Developer/usr/lib -F /Users/admin/builder/spi-builder-workspace/.derivedData/Build/Products/Debug-xros -F /Applications/Xcode-16.3.0.app/Contents/Developer/Platforms/XROS.platform/Developer/Library/Frameworks -F /Applications/Xcode-16.3.0.app/Contents/Developer/Platforms/XROS.platform/Developer/SDKs/XROS2.4.sdk/Developer/Library/Frameworks -c -j10 -enable-batch-mode -incremental -Xcc -ivfsstatcache -Xcc /Users/admin/builder/spi-builder-workspace/.derivedData/SDKStatCaches.noindex/xros2.4-22O233-407b76dbb837030756cbe1ab3f0b01b6.sdkstatcache -output-file-map /Users/admin/builder/spi-builder-workspace/.derivedData/Build/Intermediates.noindex/Nuke.build/Debug-xros/Nuke.build/Objects-normal/arm64/Nuke-OutputFileMap.json -use-frontend-parseable-output -save-temps -no-color-diagnostics -serialize-diagnostics -emit-dependencies -emit-module -emit-module-path /Users/admin/builder/spi-builder-workspace/.derivedData/Build/Intermediates.noindex/Nuke.build/Debug-xros/Nuke.build/Objects-normal/arm64/Nuke.swiftmodule -validate-clang-modules-once -clang-build-session-file /Users/admin/builder/spi-builder-workspace/.derivedData/ModuleCache.noindex/Session.modulevalidation -Xcc -I/Users/admin/builder/spi-builder-workspace/.derivedData/Build/Intermediates.noindex/Nuke.build/Debug-xros/Nuke.build/swift-overrides.hmap -emit-const-values -Xfrontend -const-gather-protocols-file -Xfrontend /Users/admin/builder/spi-builder-workspace/.derivedData/Build/Intermediates.noindex/Nuke.build/Debug-xros/Nuke.build/Objects-normal/arm64/Nuke_const_extract_protocols.json -Xcc -I/Users/admin/builder/spi-builder-workspace/.derivedData/Build/Products/Debug-xros/include -Xcc -I/Users/admin/builder/spi-builder-workspace/.derivedData/Build/Intermediates.noindex/Nuke.build/Debug-xros/Nuke.build/DerivedSources-normal/arm64 -Xcc -I/Users/admin/builder/spi-builder-workspace/.derivedData/Build/Intermediates.noindex/Nuke.build/Debug-xros/Nuke.build/DerivedSources/arm64 -Xcc -I/Users/admin/builder/spi-builder-workspace/.derivedData/Build/Intermediates.noindex/Nuke.build/Debug-xros/Nuke.build/DerivedSources -Xcc -DSWIFT_PACKAGE -Xcc -DDEBUG\=1 -emit-objc-header -emit-objc-header-path /Users/admin/builder/spi-builder-workspace/.derivedData/Build/Intermediates.noindex/Nuke.build/Debug-xros/Nuke.build/Objects-normal/arm64/Nuke-Swift.h -working-directory /Users/admin/builder/spi-builder-workspace/.swiftpm/xcode -experimental-emit-module-separately -disable-cmo
SwiftCompile normal arm64 Compiling\ ImagePublisher.swift,\ DataCache.swift,\ DataCaching.swift,\ ImageCache.swift,\ ImageCaching.swift,\ ImagePipelineCache.swift /Users/admin/builder/spi-builder-workspace/.dependencies/checkouts/Nuke/Sources/Combine/ImagePublisher.swift /Users/admin/builder/spi-builder-workspace/.dependencies/checkouts/Nuke/Sources/Core/Caching/DataCache.swift /Users/admin/builder/spi-builder-workspace/.dependencies/checkouts/Nuke/Sources/Core/Caching/DataCaching.swift /Users/admin/builder/spi-builder-workspace/.dependencies/checkouts/Nuke/Sources/Core/Caching/ImageCache.swift /Users/admin/builder/spi-builder-workspace/.dependencies/checkouts/Nuke/Sources/Core/Caching/ImageCaching.swift /Users/admin/builder/spi-builder-workspace/.dependencies/checkouts/Nuke/Sources/Core/Caching/ImagePipelineCache.swift (in target 'Nuke' from project 'Nuke')
SwiftCompile normal arm64 /Users/admin/builder/spi-builder-workspace/.dependencies/checkouts/Nuke/Sources/Combine/ImagePublisher.swift (in target 'Nuke' from project 'Nuke')
cd /Users/admin/builder/spi-builder-workspace/.swiftpm/xcode
SwiftCompile normal arm64 /Users/admin/builder/spi-builder-workspace/.dependencies/checkouts/Nuke/Sources/Core/Caching/DataCache.swift (in target 'Nuke' from project 'Nuke')
cd /Users/admin/builder/spi-builder-workspace/.swiftpm/xcode
SwiftCompile normal arm64 /Users/admin/builder/spi-builder-workspace/.dependencies/checkouts/Nuke/Sources/Core/Caching/DataCaching.swift (in target 'Nuke' from project 'Nuke')
cd /Users/admin/builder/spi-builder-workspace/.swiftpm/xcode
SwiftCompile normal arm64 /Users/admin/builder/spi-builder-workspace/.dependencies/checkouts/Nuke/Sources/Core/Caching/ImageCache.swift (in target 'Nuke' from project 'Nuke')
cd /Users/admin/builder/spi-builder-workspace/.swiftpm/xcode
SwiftCompile normal arm64 /Users/admin/builder/spi-builder-workspace/.dependencies/checkouts/Nuke/Sources/Core/Caching/ImageCaching.swift (in target 'Nuke' from project 'Nuke')
cd /Users/admin/builder/spi-builder-workspace/.swiftpm/xcode
SwiftCompile normal arm64 /Users/admin/builder/spi-builder-workspace/.dependencies/checkouts/Nuke/Sources/Core/Caching/ImagePipelineCache.swift (in target 'Nuke' from project 'Nuke')
cd /Users/admin/builder/spi-builder-workspace/.swiftpm/xcode
SwiftCompile normal arm64 Compiling\ ImageProcessors+Composition.swift,\ ImageProcessors+CoreImage.swift,\ ImageProcessors+GaussianBlur.swift,\ ImageProcessors+Resize.swift,\ ImageProcessors+RoundedCorners.swift,\ ImageProcessors.swift /Users/admin/builder/spi-builder-workspace/.dependencies/checkouts/Nuke/Sources/Core/Processing/ImageProcessors+Composition.swift /Users/admin/builder/spi-builder-workspace/.dependencies/checkouts/Nuke/Sources/Core/Processing/ImageProcessors+CoreImage.swift /Users/admin/builder/spi-builder-workspace/.dependencies/checkouts/Nuke/Sources/Core/Processing/ImageProcessors+GaussianBlur.swift /Users/admin/builder/spi-builder-workspace/.dependencies/checkouts/Nuke/Sources/Core/Processing/ImageProcessors+Resize.swift /Users/admin/builder/spi-builder-workspace/.dependencies/checkouts/Nuke/Sources/Core/Processing/ImageProcessors+RoundedCorners.swift /Users/admin/builder/spi-builder-workspace/.dependencies/checkouts/Nuke/Sources/Core/Processing/ImageProcessors.swift (in target 'Nuke' from project 'Nuke')
SwiftCompile normal arm64 /Users/admin/builder/spi-builder-workspace/.dependencies/checkouts/Nuke/Sources/Core/Processing/ImageProcessors+Composition.swift (in target 'Nuke' from project 'Nuke')
cd /Users/admin/builder/spi-builder-workspace/.swiftpm/xcode
SwiftCompile normal arm64 /Users/admin/builder/spi-builder-workspace/.dependencies/checkouts/Nuke/Sources/Core/Processing/ImageProcessors+CoreImage.swift (in target 'Nuke' from project 'Nuke')
cd /Users/admin/builder/spi-builder-workspace/.swiftpm/xcode
SwiftCompile normal arm64 /Users/admin/builder/spi-builder-workspace/.dependencies/checkouts/Nuke/Sources/Core/Processing/ImageProcessors+GaussianBlur.swift (in target 'Nuke' from project 'Nuke')
cd /Users/admin/builder/spi-builder-workspace/.swiftpm/xcode
SwiftCompile normal arm64 /Users/admin/builder/spi-builder-workspace/.dependencies/checkouts/Nuke/Sources/Core/Processing/ImageProcessors+Resize.swift (in target 'Nuke' from project 'Nuke')
cd /Users/admin/builder/spi-builder-workspace/.swiftpm/xcode
SwiftCompile normal arm64 /Users/admin/builder/spi-builder-workspace/.dependencies/checkouts/Nuke/Sources/Core/Processing/ImageProcessors+RoundedCorners.swift (in target 'Nuke' from project 'Nuke')
cd /Users/admin/builder/spi-builder-workspace/.swiftpm/xcode
SwiftCompile normal arm64 /Users/admin/builder/spi-builder-workspace/.dependencies/checkouts/Nuke/Sources/Core/Processing/ImageProcessors.swift (in target 'Nuke' from project 'Nuke')
cd /Users/admin/builder/spi-builder-workspace/.swiftpm/xcode
SwiftCompile normal arm64 Compiling\ AssetType.swift,\ ImageDecoderRegistry.swift,\ ImageDecoders+Default.swift,\ ImageDecoders+Empty.swift,\ ImageDecoders+Video.swift,\ ImageDecoding.swift /Users/admin/builder/spi-builder-workspace/.dependencies/checkouts/Nuke/Sources/Core/Decoding/AssetType.swift /Users/admin/builder/spi-builder-workspace/.dependencies/checkouts/Nuke/Sources/Core/Decoding/ImageDecoderRegistry.swift /Users/admin/builder/spi-builder-workspace/.dependencies/checkouts/Nuke/Sources/Core/Decoding/ImageDecoders+Default.swift /Users/admin/builder/spi-builder-workspace/.dependencies/checkouts/Nuke/Sources/Core/Decoding/ImageDecoders+Empty.swift /Users/admin/builder/spi-builder-workspace/.dependencies/checkouts/Nuke/Sources/Core/Decoding/ImageDecoders+Video.swift /Users/admin/builder/spi-builder-workspace/.dependencies/checkouts/Nuke/Sources/Core/Decoding/ImageDecoding.swift (in target 'Nuke' from project 'Nuke')
SwiftCompile normal arm64 /Users/admin/builder/spi-builder-workspace/.dependencies/checkouts/Nuke/Sources/Core/Decoding/AssetType.swift (in target 'Nuke' from project 'Nuke')
cd /Users/admin/builder/spi-builder-workspace/.swiftpm/xcode
SwiftCompile normal arm64 /Users/admin/builder/spi-builder-workspace/.dependencies/checkouts/Nuke/Sources/Core/Decoding/ImageDecoderRegistry.swift (in target 'Nuke' from project 'Nuke')
cd /Users/admin/builder/spi-builder-workspace/.swiftpm/xcode
SwiftCompile normal arm64 /Users/admin/builder/spi-builder-workspace/.dependencies/checkouts/Nuke/Sources/Core/Decoding/ImageDecoders+Default.swift (in target 'Nuke' from project 'Nuke')
cd /Users/admin/builder/spi-builder-workspace/.swiftpm/xcode
SwiftCompile normal arm64 /Users/admin/builder/spi-builder-workspace/.dependencies/checkouts/Nuke/Sources/Core/Decoding/ImageDecoders+Empty.swift (in target 'Nuke' from project 'Nuke')
cd /Users/admin/builder/spi-builder-workspace/.swiftpm/xcode
SwiftCompile normal arm64 /Users/admin/builder/spi-builder-workspace/.dependencies/checkouts/Nuke/Sources/Core/Decoding/ImageDecoders+Video.swift (in target 'Nuke' from project 'Nuke')
cd /Users/admin/builder/spi-builder-workspace/.swiftpm/xcode
SwiftCompile normal arm64 /Users/admin/builder/spi-builder-workspace/.dependencies/checkouts/Nuke/Sources/Core/Decoding/ImageDecoding.swift (in target 'Nuke' from project 'Nuke')
cd /Users/admin/builder/spi-builder-workspace/.swiftpm/xcode
SwiftCompile normal arm64 Compiling\ Extensions.swift,\ Graphics.swift,\ ImageRequestKeys.swift,\ LinkedList.swift,\ Log.swift /Users/admin/builder/spi-builder-workspace/.dependencies/checkouts/Nuke/Sources/Internal/Extensions.swift /Users/admin/builder/spi-builder-workspace/.dependencies/checkouts/Nuke/Sources/Internal/Graphics.swift /Users/admin/builder/spi-builder-workspace/.dependencies/checkouts/Nuke/Sources/Internal/ImageRequestKeys.swift /Users/admin/builder/spi-builder-workspace/.dependencies/checkouts/Nuke/Sources/Internal/LinkedList.swift /Users/admin/builder/spi-builder-workspace/.dependencies/checkouts/Nuke/Sources/Internal/Log.swift (in target 'Nuke' from project 'Nuke')
SwiftCompile normal arm64 /Users/admin/builder/spi-builder-workspace/.dependencies/checkouts/Nuke/Sources/Internal/Extensions.swift (in target 'Nuke' from project 'Nuke')
cd /Users/admin/builder/spi-builder-workspace/.swiftpm/xcode
SwiftCompile normal arm64 /Users/admin/builder/spi-builder-workspace/.dependencies/checkouts/Nuke/Sources/Internal/Graphics.swift (in target 'Nuke' from project 'Nuke')
cd /Users/admin/builder/spi-builder-workspace/.swiftpm/xcode
SwiftCompile normal arm64 /Users/admin/builder/spi-builder-workspace/.dependencies/checkouts/Nuke/Sources/Internal/ImageRequestKeys.swift (in target 'Nuke' from project 'Nuke')
cd /Users/admin/builder/spi-builder-workspace/.swiftpm/xcode
SwiftCompile normal arm64 /Users/admin/builder/spi-builder-workspace/.dependencies/checkouts/Nuke/Sources/Internal/LinkedList.swift (in target 'Nuke' from project 'Nuke')
cd /Users/admin/builder/spi-builder-workspace/.swiftpm/xcode
SwiftCompile normal arm64 /Users/admin/builder/spi-builder-workspace/.dependencies/checkouts/Nuke/Sources/Internal/Log.swift (in target 'Nuke' from project 'Nuke')
cd /Users/admin/builder/spi-builder-workspace/.swiftpm/xcode
SwiftCompile normal arm64 Compiling\ ImageEncoders+Default.swift,\ ImageEncoders+ImageIO.swift,\ ImageEncoders.swift,\ ImageEncoding.swift,\ ImagePipeline.swift,\ ImagePipelineConfiguration.swift /Users/admin/builder/spi-builder-workspace/.dependencies/checkouts/Nuke/Sources/Core/Encoding/ImageEncoders+Default.swift /Users/admin/builder/spi-builder-workspace/.dependencies/checkouts/Nuke/Sources/Core/Encoding/ImageEncoders+ImageIO.swift /Users/admin/builder/spi-builder-workspace/.dependencies/checkouts/Nuke/Sources/Core/Encoding/ImageEncoders.swift /Users/admin/builder/spi-builder-workspace/.dependencies/checkouts/Nuke/Sources/Core/Encoding/ImageEncoding.swift /Users/admin/builder/spi-builder-workspace/.dependencies/checkouts/Nuke/Sources/Core/ImagePipeline.swift /Users/admin/builder/spi-builder-workspace/.dependencies/checkouts/Nuke/Sources/Core/ImagePipelineConfiguration.swift (in target 'Nuke' from project 'Nuke')
SwiftCompile normal arm64 /Users/admin/builder/spi-builder-workspace/.dependencies/checkouts/Nuke/Sources/Core/Encoding/ImageEncoders+Default.swift (in target 'Nuke' from project 'Nuke')
cd /Users/admin/builder/spi-builder-workspace/.swiftpm/xcode
SwiftCompile normal arm64 /Users/admin/builder/spi-builder-workspace/.dependencies/checkouts/Nuke/Sources/Core/Encoding/ImageEncoders+ImageIO.swift (in target 'Nuke' from project 'Nuke')
cd /Users/admin/builder/spi-builder-workspace/.swiftpm/xcode
SwiftCompile normal arm64 /Users/admin/builder/spi-builder-workspace/.dependencies/checkouts/Nuke/Sources/Core/Encoding/ImageEncoders.swift (in target 'Nuke' from project 'Nuke')
cd /Users/admin/builder/spi-builder-workspace/.swiftpm/xcode
SwiftCompile normal arm64 /Users/admin/builder/spi-builder-workspace/.dependencies/checkouts/Nuke/Sources/Core/Encoding/ImageEncoding.swift (in target 'Nuke' from project 'Nuke')
cd /Users/admin/builder/spi-builder-workspace/.swiftpm/xcode
SwiftCompile normal arm64 /Users/admin/builder/spi-builder-workspace/.dependencies/checkouts/Nuke/Sources/Core/ImagePipeline.swift (in target 'Nuke' from project 'Nuke')
cd /Users/admin/builder/spi-builder-workspace/.swiftpm/xcode
SwiftCompile normal arm64 /Users/admin/builder/spi-builder-workspace/.dependencies/checkouts/Nuke/Sources/Core/ImagePipelineConfiguration.swift (in target 'Nuke' from project 'Nuke')
cd /Users/admin/builder/spi-builder-workspace/.swiftpm/xcode
SwiftCompile normal arm64 Compiling\ Operation.swift,\ RateLimiter.swift,\ ResumableData.swift,\ FetchImage.swift,\ ImageViewExtensions.swift /Users/admin/builder/spi-builder-workspace/.dependencies/checkouts/Nuke/Sources/Internal/Operation.swift /Users/admin/builder/spi-builder-workspace/.dependencies/checkouts/Nuke/Sources/Internal/RateLimiter.swift /Users/admin/builder/spi-builder-workspace/.dependencies/checkouts/Nuke/Sources/Internal/ResumableData.swift /Users/admin/builder/spi-builder-workspace/.dependencies/checkouts/Nuke/Sources/UI/FetchImage.swift /Users/admin/builder/spi-builder-workspace/.dependencies/checkouts/Nuke/Sources/UI/ImageViewExtensions.swift (in target 'Nuke' from project 'Nuke')
SwiftCompile normal arm64 /Users/admin/builder/spi-builder-workspace/.dependencies/checkouts/Nuke/Sources/Internal/Operation.swift (in target 'Nuke' from project 'Nuke')
cd /Users/admin/builder/spi-builder-workspace/.swiftpm/xcode
SwiftCompile normal arm64 /Users/admin/builder/spi-builder-workspace/.dependencies/checkouts/Nuke/Sources/Internal/RateLimiter.swift (in target 'Nuke' from project 'Nuke')
cd /Users/admin/builder/spi-builder-workspace/.swiftpm/xcode
SwiftCompile normal arm64 /Users/admin/builder/spi-builder-workspace/.dependencies/checkouts/Nuke/Sources/Internal/ResumableData.swift (in target 'Nuke' from project 'Nuke')
cd /Users/admin/builder/spi-builder-workspace/.swiftpm/xcode
SwiftCompile normal arm64 /Users/admin/builder/spi-builder-workspace/.dependencies/checkouts/Nuke/Sources/UI/FetchImage.swift (in target 'Nuke' from project 'Nuke')
cd /Users/admin/builder/spi-builder-workspace/.swiftpm/xcode
SwiftCompile normal arm64 /Users/admin/builder/spi-builder-workspace/.dependencies/checkouts/Nuke/Sources/UI/ImageViewExtensions.swift (in target 'Nuke' from project 'Nuke')
cd /Users/admin/builder/spi-builder-workspace/.swiftpm/xcode
SwiftEmitModule normal arm64 Emitting\ module\ for\ Nuke (in target 'Nuke' from project 'Nuke')
Failed frontend command:
/Applications/Xcode-16.3.0.app/Contents/Developer/Toolchains/XcodeDefault.xctoolchain/usr/bin/swift-frontend -frontend -emit-module -experimental-skip-non-inlinable-function-bodies-without-types /Users/admin/builder/spi-builder-workspace/.dependencies/checkouts/Nuke/Sources/Combine/ImagePublisher.swift /Users/admin/builder/spi-builder-workspace/.dependencies/checkouts/Nuke/Sources/Core/Caching/DataCache.swift /Users/admin/builder/spi-builder-workspace/.dependencies/checkouts/Nuke/Sources/Core/Caching/DataCaching.swift /Users/admin/builder/spi-builder-workspace/.dependencies/checkouts/Nuke/Sources/Core/Caching/ImageCache.swift /Users/admin/builder/spi-builder-workspace/.dependencies/checkouts/Nuke/Sources/Core/Caching/ImageCaching.swift /Users/admin/builder/spi-builder-workspace/.dependencies/checkouts/Nuke/Sources/Core/Caching/ImagePipelineCache.swift /Users/admin/builder/spi-builder-workspace/.dependencies/checkouts/Nuke/Sources/Core/Decoding/AssetType.swift /Users/admin/builder/spi-builder-workspace/.dependencies/checkouts/Nuke/Sources/Core/Decoding/ImageDecoderRegistry.swift /Users/admin/builder/spi-builder-workspace/.dependencies/checkouts/Nuke/Sources/Core/Decoding/ImageDecoders+Default.swift /Users/admin/builder/spi-builder-workspace/.dependencies/checkouts/Nuke/Sources/Core/Decoding/ImageDecoders+Empty.swift /Users/admin/builder/spi-builder-workspace/.dependencies/checkouts/Nuke/Sources/Core/Decoding/ImageDecoders+Video.swift /Users/admin/builder/spi-builder-workspace/.dependencies/checkouts/Nuke/Sources/Core/Decoding/ImageDecoding.swift /Users/admin/builder/spi-builder-workspace/.dependencies/checkouts/Nuke/Sources/Core/Encoding/ImageEncoders+Default.swift /Users/admin/builder/spi-builder-workspace/.dependencies/checkouts/Nuke/Sources/Core/Encoding/ImageEncoders+ImageIO.swift /Users/admin/builder/spi-builder-workspace/.dependencies/checkouts/Nuke/Sources/Core/Encoding/ImageEncoders.swift /Users/admin/builder/spi-builder-workspace/.dependencies/checkouts/Nuke/Sources/Core/Encoding/ImageEncoding.swift /Users/admin/builder/spi-builder-workspace/.dependencies/checkouts/Nuke/Sources/Core/ImagePipeline.swift /Users/admin/builder/spi-builder-workspace/.dependencies/checkouts/Nuke/Sources/Core/ImagePipelineConfiguration.swift /Users/admin/builder/spi-builder-workspace/.dependencies/checkouts/Nuke/Sources/Core/ImagePipelineDelegate.swift /Users/admin/builder/spi-builder-workspace/.dependencies/checkouts/Nuke/Sources/Core/ImageRequest.swift /Users/admin/builder/spi-builder-workspace/.dependencies/checkouts/Nuke/Sources/Core/ImageResponse.swift /Users/admin/builder/spi-builder-workspace/.dependencies/checkouts/Nuke/Sources/Core/ImageTask.swift /Users/admin/builder/spi-builder-workspace/.dependencies/checkouts/Nuke/Sources/Core/Loading/DataLoader.swift /Users/admin/builder/spi-builder-workspace/.dependencies/checkouts/Nuke/Sources/Core/Loading/DataLoading.swift /Users/admin/builder/spi-builder-workspace/.dependencies/checkouts/Nuke/Sources/Core/Prefetching/ImagePrefetcher.swift /Users/admin/builder/spi-builder-workspace/.dependencies/checkouts/Nuke/Sources/Core/Processing/ImageDecompression.swift /Users/admin/builder/spi-builder-workspace/.dependencies/checkouts/Nuke/Sources/Core/Processing/ImageProcessing.swift /Users/admin/builder/spi-builder-workspace/.dependencies/checkouts/Nuke/Sources/Core/Processing/ImageProcessingOptions.swift /Users/admin/builder/spi-builder-workspace/.dependencies/checkouts/Nuke/Sources/Core/Processing/ImageProcessors+Anonymous.swift /Users/admin/builder/spi-builder-workspace/.dependencies/checkouts/Nuke/Sources/Core/Processing/ImageProcessors+Circle.swift /Users/admin/builder/spi-builder-workspace/.dependencies/checkouts/Nuke/Sources/Core/Processing/ImageProcessors+Composition.swift /Users/admin/builder/spi-builder-workspace/.dependencies/checkouts/Nuke/Sources/Core/Processing/ImageProcessors+CoreImage.swift /Users/admin/builder/spi-builder-workspace/.dependencies/checkouts/Nuke/Sources/Core/Processing/ImageProcessors+GaussianBlur.swift /Users/admin/builder/spi-builder-workspace/.dependencies/checkouts/Nuke/Sources/Core/Processing/ImageProcessors+Resize.swift /Users/admin/builder/spi-builder-workspace/.dependencies/checkouts/Nuke/Sources/Core/Processing/ImageProcessors+RoundedCorners.swift /Users/admin/builder/spi-builder-workspace/.dependencies/checkouts/Nuke/Sources/Core/Processing/ImageProcessors.swift /Users/admin/builder/spi-builder-workspace/.dependencies/checkouts/Nuke/Sources/Core/Tasks/AsyncTask.swift /Users/admin/builder/spi-builder-workspace/.dependencies/checkouts/Nuke/Sources/Core/Tasks/ImagePipelineTask.swift /Users/admin/builder/spi-builder-workspace/.dependencies/checkouts/Nuke/Sources/Core/Tasks/OperationTask.swift /Users/admin/builder/spi-builder-workspace/.dependencies/checkouts/Nuke/Sources/Core/Tasks/TaskFetchDecodedImage.swift /Users/admin/builder/spi-builder-workspace/.dependencies/checkouts/Nuke/Sources/Core/Tasks/TaskFetchOriginalImageData.swift /Users/admin/builder/spi-builder-workspace/.dependencies/checkouts/Nuke/Sources/Core/Tasks/TaskFetchWithPublisher.swift /Users/admin/builder/spi-builder-workspace/.dependencies/checkouts/Nuke/Sources/Core/Tasks/TaskLoadData.swift /Users/admin/builder/spi-builder-workspace/.dependencies/checkouts/Nuke/Sources/Core/Tasks/TaskLoadImage.swift /Users/admin/builder/spi-builder-workspace/.dependencies/checkouts/Nuke/Sources/Internal/AVDataAsset.swift /Users/admin/builder/spi-builder-workspace/.dependencies/checkouts/Nuke/Sources/Internal/Allocations.swift /Users/admin/builder/spi-builder-workspace/.dependencies/checkouts/Nuke/Sources/Internal/Combine.swift /Users/admin/builder/spi-builder-workspace/.dependencies/checkouts/Nuke/Sources/Internal/Deprecated.swift /Users/admin/builder/spi-builder-workspace/.dependencies/checkouts/Nuke/Sources/Internal/Extensions.swift /Users/admin/builder/spi-builder-workspace/.dependencies/checkouts/Nuke/Sources/Internal/Graphics.swift /Users/admin/builder/spi-builder-workspace/.dependencies/checkouts/Nuke/Sources/Internal/ImageRequestKeys.swift /Users/admin/builder/spi-builder-workspace/.dependencies/checkouts/Nuke/Sources/Internal/LinkedList.swift /Users/admin/builder/spi-builder-workspace/.dependencies/checkouts/Nuke/Sources/Internal/Log.swift /Users/admin/builder/spi-builder-workspace/.dependencies/checkouts/Nuke/Sources/Internal/Operation.swift /Users/admin/builder/spi-builder-workspace/.dependencies/checkouts/Nuke/Sources/Internal/RateLimiter.swift /Users/admin/builder/spi-builder-workspace/.dependencies/checkouts/Nuke/Sources/Internal/ResumableData.swift /Users/admin/builder/spi-builder-workspace/.dependencies/checkouts/Nuke/Sources/UI/FetchImage.swift /Users/admin/builder/spi-builder-workspace/.dependencies/checkouts/Nuke/Sources/UI/ImageViewExtensions.swift -target arm64-apple-xros1.0 -Xllvm -aarch64-use-tbi -enable-objc-interop -stack-check -sdk /Applications/Xcode-16.3.0.app/Contents/Developer/Platforms/XROS.platform/Developer/SDKs/XROS2.4.sdk -I /Users/admin/builder/spi-builder-workspace/.derivedData/Build/Products/Debug-xros -I /Applications/Xcode-16.3.0.app/Contents/Developer/Platforms/XROS.platform/Developer/usr/lib -F /Users/admin/builder/spi-builder-workspace/.derivedData/Build/Products/Debug-xros -F /Applications/Xcode-16.3.0.app/Contents/Developer/Platforms/XROS.platform/Developer/Library/Frameworks -F /Applications/Xcode-16.3.0.app/Contents/Developer/Platforms/XROS.platform/Developer/SDKs/XROS2.4.sdk/Developer/Library/Frameworks -no-color-diagnostics -enable-testing -g -debug-info-format\=dwarf -dwarf-version\=4 -module-cache-path /Users/admin/builder/spi-builder-workspace/.derivedData/ModuleCache.noindex -suppress-warnings -swift-version 5 -enforce-exclusivity\=checked -Onone -D SWIFT_PACKAGE -D DEBUG -D Xcode -serialize-debugging-options -const-gather-protocols-file /Users/admin/builder/spi-builder-workspace/.derivedData/Build/Intermediates.noindex/Nuke.build/Debug-xros/Nuke.build/Objects-normal/arm64/Nuke_const_extract_protocols.json -enable-experimental-feature DebugDescriptionMacro -empty-abi-descriptor -plugin-path /Applications/Xcode-16.3.0.app/Contents/Developer/Toolchains/XcodeDefault.xctoolchain/usr/lib/swift/host/plugins/testing -validate-clang-modules-once -clang-build-session-file /Users/admin/builder/spi-builder-workspace/.derivedData/ModuleCache.noindex/Session.modulevalidation -Xcc -working-directory -Xcc /Users/admin/builder/spi-builder-workspace/.swiftpm/xcode -resource-dir /Applications/Xcode-16.3.0.app/Contents/Developer/Toolchains/XcodeDefault.xctoolchain/usr/lib/swift -enable-anonymous-context-mangled-names -file-compilation-dir /Users/admin/builder/spi-builder-workspace/.swiftpm/xcode -Xcc -ivfsstatcache -Xcc /Users/admin/builder/spi-builder-workspace/.derivedData/SDKStatCaches.noindex/xros2.4-22O233-407b76dbb837030756cbe1ab3f0b01b6.sdkstatcache -Xcc -I/Users/admin/builder/spi-builder-workspace/.derivedData/Build/Intermediates.noindex/Nuke.build/Debug-xros/Nuke.build/swift-overrides.hmap -Xcc -I/Users/admin/builder/spi-builder-workspace/.derivedData/Build/Products/Debug-xros/include -Xcc -I/Users/admin/builder/spi-builder-workspace/.derivedData/Build/Intermediates.noindex/Nuke.build/Debug-xros/Nuke.build/DerivedSources-normal/arm64 -Xcc -I/Users/admin/builder/spi-builder-workspace/.derivedData/Build/Intermediates.noindex/Nuke.build/Debug-xros/Nuke.build/DerivedSources/arm64 -Xcc -I/Users/admin/builder/spi-builder-workspace/.derivedData/Build/Intermediates.noindex/Nuke.build/Debug-xros/Nuke.build/DerivedSources -Xcc -DSWIFT_PACKAGE -Xcc -DDEBUG\=1 -module-name Nuke -frontend-parseable-output -disable-clang-spi -target-sdk-version 2.4 -target-sdk-name xros2.4 -external-plugin-path /Applications/Xcode-16.3.0.app/Contents/Developer/Platforms/XROS.platform/Developer/usr/lib/swift/host/plugins\#/Applications/Xcode-16.3.0.app/Contents/Developer/Platforms/XROS.platform/Developer/usr/bin/swift-plugin-server -external-plugin-path /Applications/Xcode-16.3.0.app/Contents/Developer/Platforms/XROS.platform/Developer/usr/local/lib/swift/host/plugins\#/Applications/Xcode-16.3.0.app/Contents/Developer/Platforms/XROS.platform/Developer/usr/bin/swift-plugin-server -in-process-plugin-server-path /Applications/Xcode-16.3.0.app/Contents/Developer/Toolchains/XcodeDefault.xctoolchain/usr/lib/swift/host/libSwiftInProcPluginServer.dylib -plugin-path /Applications/Xcode-16.3.0.app/Contents/Developer/Toolchains/XcodeDefault.xctoolchain/usr/lib/swift/host/plugins -plugin-path /Applications/Xcode-16.3.0.app/Contents/Developer/Toolchains/XcodeDefault.xctoolchain/usr/local/lib/swift/host/plugins -emit-module-doc-path /Users/admin/builder/spi-builder-workspace/.derivedData/Build/Intermediates.noindex/Nuke.build/Debug-xros/Nuke.build/Objects-normal/arm64/Nuke.swiftdoc -emit-module-source-info-path /Users/admin/builder/spi-builder-workspace/.derivedData/Build/Intermediates.noindex/Nuke.build/Debug-xros/Nuke.build/Objects-normal/arm64/Nuke.swiftsourceinfo -emit-objc-header-path /Users/admin/builder/spi-builder-workspace/.derivedData/Build/Intermediates.noindex/Nuke.build/Debug-xros/Nuke.build/Objects-normal/arm64/Nuke-Swift.h -serialize-diagnostics-path /Users/admin/builder/spi-builder-workspace/.derivedData/Build/Intermediates.noindex/Nuke.build/Debug-xros/Nuke.build/Objects-normal/arm64/Nuke-master-emit-module.dia -emit-dependencies-path /Users/admin/builder/spi-builder-workspace/.derivedData/Build/Intermediates.noindex/Nuke.build/Debug-xros/Nuke.build/Objects-normal/arm64/Nuke-master-emit-module.d -o /Users/admin/builder/spi-builder-workspace/.derivedData/Build/Intermediates.noindex/Nuke.build/Debug-xros/Nuke.build/Objects-normal/arm64/Nuke.swiftmodule -emit-abi-descriptor-path /Users/admin/builder/spi-builder-workspace/.derivedData/Build/Intermediates.noindex/Nuke.build/Debug-xros/Nuke.build/Objects-normal/arm64/Nuke.abi.json
EmitSwiftModule normal arm64 (in target 'Nuke' from project 'Nuke')
cd /Users/admin/builder/spi-builder-workspace/.swiftpm/xcode
/Users/admin/builder/spi-builder-workspace/.dependencies/checkouts/Nuke/Sources/Core/Processing/ImageProcessingOptions.swift:55:27: error: cannot find type 'NSColor' in scope
public let color: NSColor
^~~~~~~
/Users/admin/builder/spi-builder-workspace/.dependencies/checkouts/Nuke/Sources/Core/Processing/ImageProcessingOptions.swift:60:28: error: cannot find type 'NSColor' in scope
public init(color: NSColor, width: CGFloat = 1, unit: Unit = .points) {
^~~~~~~
/Users/admin/builder/spi-builder-workspace/.dependencies/checkouts/Nuke/Sources/Core/Processing/ImageProcessingOptions.swift:41:19: error: type 'ImageProcessingOptions.Border' does not conform to protocol 'Hashable'
public struct Border: Hashable, CustomStringConvertible {
^
/Users/admin/builder/spi-builder-workspace/.dependencies/checkouts/Nuke/Sources/Core/Processing/ImageProcessingOptions.swift:55:20: note: stored property type '<<error type>>' does not conform to protocol 'Hashable', preventing synthesized conformance of 'ImageProcessingOptions.Border' to 'Hashable'
public let color: NSColor
^
/Users/admin/builder/spi-builder-workspace/.dependencies/checkouts/Nuke/Sources/Core/Processing/ImageProcessingOptions.swift:41:19: error: type 'ImageProcessingOptions.Border' does not conform to protocol 'Equatable'
public struct Border: Hashable, CustomStringConvertible {
^
/Users/admin/builder/spi-builder-workspace/.dependencies/checkouts/Nuke/Sources/Core/Processing/ImageProcessingOptions.swift:55:20: note: stored property type '<<error type>>' does not conform to protocol 'Equatable', preventing synthesized conformance of 'ImageProcessingOptions.Border' to 'Equatable'
public let color: NSColor
^
Swift.==:1:24: note: candidate would match if 'ImageProcessingOptions.Border' conformed to 'RawRepresentable'
@inlinable public func == <T>(lhs: T, rhs: T) -> Bool where T : RawRepresentable, T.RawValue : Equatable
^
Swift.FloatingPoint.==:2:20: note: candidate would match if 'ImageProcessingOptions.Border' conformed to 'FloatingPoint'
public static func == (lhs: Self, rhs: Self) -> Bool}
^
Swift.BinaryInteger.==:2:20: note: candidate would match if 'ImageProcessingOptions.Border' conformed to 'BinaryInteger'
public static func == <Other>(lhs: Self, rhs: Other) -> Bool where Other : BinaryInteger}
^
Swift._Pointer.==:2:20: note: candidate would match if 'ImageProcessingOptions.Border' conformed to '_Pointer'
public static func == (lhs: Self, rhs: Self) -> Bool}
^
Swift._Pointer.==:2:31: note: candidate would match if 'ImageProcessingOptions.Border' conformed to '_Pointer'
@inlinable public static func == <Other>(lhs: Self, rhs: Other) -> Bool where Other : _Pointer}
^
Swift.Strideable.==:2:31: note: candidate would match if 'ImageProcessingOptions.Border' conformed to 'Strideable'
@inlinable public static func == (x: Self, y: Self) -> Bool}
^
Swift.StringProtocol.==:2:31: note: candidate would match if 'ImageProcessingOptions.Border' conformed to 'StringProtocol'
@inlinable public static func == <RHS>(lhs: Self, rhs: RHS) -> Bool where RHS : StringProtocol}
^
Swift.SIMD.==:2:20: note: candidate would match if 'ImageProcessingOptions.Border' conformed to 'SIMD'
public static func == (a: Self, b: Self) -> Bool}
^
Foundation.AttributedStringProtocol.==:2:20: note: candidate would match if 'ImageProcessingOptions.Border' conformed to 'AttributedStringProtocol'
public static func == <RHS>(lhs: Self, rhs: RHS) -> Bool where RHS : AttributedStringProtocol}
^
Foundation._BridgedStoredNSError.==:2:20: note: candidate would match if 'ImageProcessingOptions.Border' conformed to '_BridgedStoredNSError'
public static func == (lhs: Self, rhs: Self) -> Bool}
^
CoreFoundation._CFObject.==:2:20: note: candidate would match if 'ImageProcessingOptions.Border' conformed to '_CFObject'
public static func == (left: Self, right: Self) -> Bool}
^
/Users/admin/builder/spi-builder-workspace/.dependencies/checkouts/Nuke/Sources/Core/Processing/ImageProcessingOptions.swift:41:19: note: add stubs for conformance
public struct Border: Hashable, CustomStringConvertible {
^
Swift.Equatable.==:2:13: note: protocol requires function '==' with type '(ImageProcessingOptions.Border, ImageProcessingOptions.Border) -> Bool'
static func == (lhs: Self, rhs: Self) -> Bool}
^
/Users/admin/builder/spi-builder-workspace/.dependencies/checkouts/Nuke/Sources/Internal/Graphics.swift:156:19: error: cannot find type 'CGContext' in scope
private extension CGContext {
^~~~~~~~~
/Users/admin/builder/spi-builder-workspace/.dependencies/checkouts/Nuke/Sources/Internal/Graphics.swift:256:11: error: cannot find type 'UIImage' in scope
extension UIImage {
^~~~~~~
/Users/admin/builder/spi-builder-workspace/.dependencies/checkouts/Nuke/Sources/Internal/Graphics.swift:263:11: error: cannot find type 'CGImage' in scope
extension CGImage {
^~~~~~~
/Users/admin/builder/spi-builder-workspace/.dependencies/checkouts/Nuke/Sources/Internal/Graphics.swift:301:19: error: cannot find type 'UIColor' in scope
typealias Color = UIColor
^~~~~~~
/Users/admin/builder/spi-builder-workspace/.dependencies/checkouts/Nuke/Sources/UI/ImageViewExtensions.swift:94:16: error: cannot find type 'ImageDisplayingView' in scope
into view: ImageDisplayingView,
^~~~~~~~~~~~~~~~~~~
/Users/admin/builder/spi-builder-workspace/.dependencies/checkouts/Nuke/Sources/UI/ImageViewExtensions.swift:126:16: error: cannot find type 'ImageDisplayingView' in scope
into view: ImageDisplayingView,
^~~~~~~~~~~~~~~~~~~
/Users/admin/builder/spi-builder-workspace/.dependencies/checkouts/Nuke/Sources/UI/ImageViewExtensions.swift:136:37: error: cannot find type 'ImageDisplayingView' in scope
public func cancelRequest(for view: ImageDisplayingView) {
^~~~~~~~~~~~~~~~~~~
/Users/admin/builder/spi-builder-workspace/.dependencies/checkouts/Nuke/Sources/UI/ImageViewExtensions.swift:365:33: error: cannot find type 'ImageDisplayingView' in scope
private weak var imageView: ImageDisplayingView?
^~~~~~~~~~~~~~~~~~~
/Users/admin/builder/spi-builder-workspace/.dependencies/checkouts/Nuke/Sources/UI/ImageViewExtensions.swift:380:27: error: cannot find type 'ImageDisplayingView' in scope
init(view: /* weak */ ImageDisplayingView) {
^~~~~~~~~~~~~~~~~~~
/Users/admin/builder/spi-builder-workspace/.dependencies/checkouts/Nuke/Sources/UI/ImageViewExtensions.swift:390:38: error: cannot find type 'ImageDisplayingView' in scope
static func controller(for view: ImageDisplayingView) -> ImageViewController {
^~~~~~~~~~~~~~~~~~~
SwiftCompile normal arm64 Compiling\ TaskLoadData.swift,\ TaskLoadImage.swift,\ AVDataAsset.swift,\ Allocations.swift,\ Combine.swift,\ Deprecated.swift /Users/admin/builder/spi-builder-workspace/.dependencies/checkouts/Nuke/Sources/Core/Tasks/TaskLoadData.swift /Users/admin/builder/spi-builder-workspace/.dependencies/checkouts/Nuke/Sources/Core/Tasks/TaskLoadImage.swift /Users/admin/builder/spi-builder-workspace/.dependencies/checkouts/Nuke/Sources/Internal/AVDataAsset.swift /Users/admin/builder/spi-builder-workspace/.dependencies/checkouts/Nuke/Sources/Internal/Allocations.swift /Users/admin/builder/spi-builder-workspace/.dependencies/checkouts/Nuke/Sources/Internal/Combine.swift /Users/admin/builder/spi-builder-workspace/.dependencies/checkouts/Nuke/Sources/Internal/Deprecated.swift (in target 'Nuke' from project 'Nuke')
SwiftCompile normal arm64 /Users/admin/builder/spi-builder-workspace/.dependencies/checkouts/Nuke/Sources/Core/Tasks/TaskLoadData.swift (in target 'Nuke' from project 'Nuke')
cd /Users/admin/builder/spi-builder-workspace/.swiftpm/xcode
SwiftCompile normal arm64 /Users/admin/builder/spi-builder-workspace/.dependencies/checkouts/Nuke/Sources/Core/Tasks/TaskLoadImage.swift (in target 'Nuke' from project 'Nuke')
cd /Users/admin/builder/spi-builder-workspace/.swiftpm/xcode
SwiftCompile normal arm64 /Users/admin/builder/spi-builder-workspace/.dependencies/checkouts/Nuke/Sources/Internal/AVDataAsset.swift (in target 'Nuke' from project 'Nuke')
cd /Users/admin/builder/spi-builder-workspace/.swiftpm/xcode
SwiftCompile normal arm64 /Users/admin/builder/spi-builder-workspace/.dependencies/checkouts/Nuke/Sources/Internal/Allocations.swift (in target 'Nuke' from project 'Nuke')
cd /Users/admin/builder/spi-builder-workspace/.swiftpm/xcode
SwiftCompile normal arm64 /Users/admin/builder/spi-builder-workspace/.dependencies/checkouts/Nuke/Sources/Internal/Combine.swift (in target 'Nuke' from project 'Nuke')
cd /Users/admin/builder/spi-builder-workspace/.swiftpm/xcode
SwiftCompile normal arm64 /Users/admin/builder/spi-builder-workspace/.dependencies/checkouts/Nuke/Sources/Internal/Deprecated.swift (in target 'Nuke' from project 'Nuke')
cd /Users/admin/builder/spi-builder-workspace/.swiftpm/xcode
SwiftCompile normal arm64 Compiling\ ImagePrefetcher.swift,\ ImageDecompression.swift,\ ImageProcessing.swift,\ ImageProcessingOptions.swift,\ ImageProcessors+Anonymous.swift,\ ImageProcessors+Circle.swift /Users/admin/builder/spi-builder-workspace/.dependencies/checkouts/Nuke/Sources/Core/Prefetching/ImagePrefetcher.swift /Users/admin/builder/spi-builder-workspace/.dependencies/checkouts/Nuke/Sources/Core/Processing/ImageDecompression.swift /Users/admin/builder/spi-builder-workspace/.dependencies/checkouts/Nuke/Sources/Core/Processing/ImageProcessing.swift /Users/admin/builder/spi-builder-workspace/.dependencies/checkouts/Nuke/Sources/Core/Processing/ImageProcessingOptions.swift /Users/admin/builder/spi-builder-workspace/.dependencies/checkouts/Nuke/Sources/Core/Processing/ImageProcessors+Anonymous.swift /Users/admin/builder/spi-builder-workspace/.dependencies/checkouts/Nuke/Sources/Core/Processing/ImageProcessors+Circle.swift (in target 'Nuke' from project 'Nuke')
SwiftCompile normal arm64 /Users/admin/builder/spi-builder-workspace/.dependencies/checkouts/Nuke/Sources/Core/Prefetching/ImagePrefetcher.swift (in target 'Nuke' from project 'Nuke')
cd /Users/admin/builder/spi-builder-workspace/.swiftpm/xcode
SwiftCompile normal arm64 /Users/admin/builder/spi-builder-workspace/.dependencies/checkouts/Nuke/Sources/Core/Processing/ImageDecompression.swift (in target 'Nuke' from project 'Nuke')
cd /Users/admin/builder/spi-builder-workspace/.swiftpm/xcode
SwiftCompile normal arm64 /Users/admin/builder/spi-builder-workspace/.dependencies/checkouts/Nuke/Sources/Core/Processing/ImageProcessing.swift (in target 'Nuke' from project 'Nuke')
cd /Users/admin/builder/spi-builder-workspace/.swiftpm/xcode
SwiftCompile normal arm64 /Users/admin/builder/spi-builder-workspace/.dependencies/checkouts/Nuke/Sources/Core/Processing/ImageProcessingOptions.swift (in target 'Nuke' from project 'Nuke')
cd /Users/admin/builder/spi-builder-workspace/.swiftpm/xcode
SwiftCompile normal arm64 /Users/admin/builder/spi-builder-workspace/.dependencies/checkouts/Nuke/Sources/Core/Processing/ImageProcessors+Anonymous.swift (in target 'Nuke' from project 'Nuke')
cd /Users/admin/builder/spi-builder-workspace/.swiftpm/xcode
SwiftCompile normal arm64 /Users/admin/builder/spi-builder-workspace/.dependencies/checkouts/Nuke/Sources/Core/Processing/ImageProcessors+Circle.swift (in target 'Nuke' from project 'Nuke')
cd /Users/admin/builder/spi-builder-workspace/.swiftpm/xcode
SwiftCompile normal arm64 Compiling\ AsyncTask.swift,\ ImagePipelineTask.swift,\ OperationTask.swift,\ TaskFetchDecodedImage.swift,\ TaskFetchOriginalImageData.swift,\ TaskFetchWithPublisher.swift /Users/admin/builder/spi-builder-workspace/.dependencies/checkouts/Nuke/Sources/Core/Tasks/AsyncTask.swift /Users/admin/builder/spi-builder-workspace/.dependencies/checkouts/Nuke/Sources/Core/Tasks/ImagePipelineTask.swift /Users/admin/builder/spi-builder-workspace/.dependencies/checkouts/Nuke/Sources/Core/Tasks/OperationTask.swift /Users/admin/builder/spi-builder-workspace/.dependencies/checkouts/Nuke/Sources/Core/Tasks/TaskFetchDecodedImage.swift /Users/admin/builder/spi-builder-workspace/.dependencies/checkouts/Nuke/Sources/Core/Tasks/TaskFetchOriginalImageData.swift /Users/admin/builder/spi-builder-workspace/.dependencies/checkouts/Nuke/Sources/Core/Tasks/TaskFetchWithPublisher.swift (in target 'Nuke' from project 'Nuke')
SwiftCompile normal arm64 /Users/admin/builder/spi-builder-workspace/.dependencies/checkouts/Nuke/Sources/Core/Tasks/AsyncTask.swift (in target 'Nuke' from project 'Nuke')
cd /Users/admin/builder/spi-builder-workspace/.swiftpm/xcode
SwiftCompile normal arm64 /Users/admin/builder/spi-builder-workspace/.dependencies/checkouts/Nuke/Sources/Core/Tasks/ImagePipelineTask.swift (in target 'Nuke' from project 'Nuke')
cd /Users/admin/builder/spi-builder-workspace/.swiftpm/xcode
SwiftCompile normal arm64 /Users/admin/builder/spi-builder-workspace/.dependencies/checkouts/Nuke/Sources/Core/Tasks/OperationTask.swift (in target 'Nuke' from project 'Nuke')
cd /Users/admin/builder/spi-builder-workspace/.swiftpm/xcode
SwiftCompile normal arm64 /Users/admin/builder/spi-builder-workspace/.dependencies/checkouts/Nuke/Sources/Core/Tasks/TaskFetchDecodedImage.swift (in target 'Nuke' from project 'Nuke')
cd /Users/admin/builder/spi-builder-workspace/.swiftpm/xcode
SwiftCompile normal arm64 /Users/admin/builder/spi-builder-workspace/.dependencies/checkouts/Nuke/Sources/Core/Tasks/TaskFetchOriginalImageData.swift (in target 'Nuke' from project 'Nuke')
cd /Users/admin/builder/spi-builder-workspace/.swiftpm/xcode
SwiftCompile normal arm64 /Users/admin/builder/spi-builder-workspace/.dependencies/checkouts/Nuke/Sources/Core/Tasks/TaskFetchWithPublisher.swift (in target 'Nuke' from project 'Nuke')
cd /Users/admin/builder/spi-builder-workspace/.swiftpm/xcode
SwiftCompile normal arm64 Compiling\ ImagePipelineDelegate.swift,\ ImageRequest.swift,\ ImageResponse.swift,\ ImageTask.swift,\ DataLoader.swift,\ DataLoading.swift /Users/admin/builder/spi-builder-workspace/.dependencies/checkouts/Nuke/Sources/Core/ImagePipelineDelegate.swift /Users/admin/builder/spi-builder-workspace/.dependencies/checkouts/Nuke/Sources/Core/ImageRequest.swift /Users/admin/builder/spi-builder-workspace/.dependencies/checkouts/Nuke/Sources/Core/ImageResponse.swift /Users/admin/builder/spi-builder-workspace/.dependencies/checkouts/Nuke/Sources/Core/ImageTask.swift /Users/admin/builder/spi-builder-workspace/.dependencies/checkouts/Nuke/Sources/Core/Loading/DataLoader.swift /Users/admin/builder/spi-builder-workspace/.dependencies/checkouts/Nuke/Sources/Core/Loading/DataLoading.swift (in target 'Nuke' from project 'Nuke')
Command SwiftCompile failed with a nonzero exit code
** BUILD FAILED **
The following build commands failed:
SwiftEmitModule normal arm64 Emitting\ module\ for\ Nuke (in target 'Nuke' from project 'Nuke')
EmitSwiftModule normal arm64 (in target 'Nuke' from project 'Nuke')
SwiftCompile normal arm64 Compiling\ ImagePipelineDelegate.swift,\ ImageRequest.swift,\ ImageResponse.swift,\ ImageTask.swift,\ DataLoader.swift,\ DataLoading.swift /Users/admin/builder/spi-builder-workspace/.dependencies/checkouts/Nuke/Sources/Core/ImagePipelineDelegate.swift /Users/admin/builder/spi-builder-workspace/.dependencies/checkouts/Nuke/Sources/Core/ImageRequest.swift /Users/admin/builder/spi-builder-workspace/.dependencies/checkouts/Nuke/Sources/Core/ImageResponse.swift /Users/admin/builder/spi-builder-workspace/.dependencies/checkouts/Nuke/Sources/Core/ImageTask.swift /Users/admin/builder/spi-builder-workspace/.dependencies/checkouts/Nuke/Sources/Core/Loading/DataLoader.swift /Users/admin/builder/spi-builder-workspace/.dependencies/checkouts/Nuke/Sources/Core/Loading/DataLoading.swift (in target 'Nuke' from project 'Nuke')
Building workspace spi-builder-workspace with scheme NukeUI
(4 failures)
BUILD FAILURE 6.1 visionOS