The Swift Package Index logo.Swift Package Index

Track the adoption of Swift 6 strict concurrency checks for data race safety. How many packages are Ready for Swift 6?

Build Information

Failed to build ADPhotoKit, reference master (0fbf58), with Swift 6.0 for Linux on 3 Dec 2024 08:08:31 UTC.

Build Command

bash -c docker run --pull=always --rm -v "checkouts-4606859-0":/host -w "$PWD" registry.gitlab.com/finestructure/spi-images:basic-6.0-latest swift build --triple x86_64-unknown-linux-gnu -Xswiftc -Xfrontend -Xswiftc -stats-output-dir -Xswiftc -Xfrontend -Xswiftc .stats -Xswiftc -strict-concurrency=complete -Xswiftc -enable-upcoming-feature -Xswiftc StrictConcurrency -Xswiftc -enable-upcoming-feature -Xswiftc DisableOutwardActorInference -Xswiftc -enable-upcoming-feature -Xswiftc GlobalActorIsolatedTypesUsability -Xswiftc -enable-upcoming-feature -Xswiftc InferSendableFromCaptures 2>&1

Build Log

========================================
RunAll
========================================
Builder version: 4.58.3
Interrupt handler set up.
========================================
Checkout
========================================
Clone URL: https://github.com/duzexu/ADPhotoKit.git
Reference: master
Initialized empty Git repository in /host/spi-builder-workspace/.git/
hint: Using 'master' as the name for the initial branch. This default branch name
hint: is subject to change. To configure the initial branch name to use in all
hint: of your new repositories, which will suppress this warning, call:
hint:
hint: 	git config --global init.defaultBranch <name>
hint:
hint: Names commonly chosen instead of 'master' are 'main', 'trunk' and
hint: 'development'. The just-created branch can be renamed via this command:
hint:
hint: 	git branch -m <name>
From https://github.com/duzexu/ADPhotoKit
 * branch            master     -> FETCH_HEAD
 * [new branch]      master     -> origin/master
HEAD is now at 0fbf584 spec error fix
Cloned https://github.com/duzexu/ADPhotoKit.git
Revision (git rev-parse @):
0fbf5846e5e480cdeb08aa45e3675237332856df
SPI manifest file found: $PWD/.spi.yml
SUCCESS checkout https://github.com/duzexu/ADPhotoKit.git at master
========================================
Build
========================================
Selected platform:         linux
Swift version:             6.0
Building package at path:  $PWD
https://github.com/duzexu/ADPhotoKit.git
Running build ...
bash -c docker run --pull=always --rm -v "checkouts-4606859-0":/host -w "$PWD" registry.gitlab.com/finestructure/spi-images:basic-6.0-latest swift build --triple x86_64-unknown-linux-gnu -Xswiftc -Xfrontend -Xswiftc -stats-output-dir -Xswiftc -Xfrontend -Xswiftc .stats -Xswiftc -strict-concurrency=complete -Xswiftc -enable-upcoming-feature -Xswiftc StrictConcurrency -Xswiftc -enable-upcoming-feature -Xswiftc DisableOutwardActorInference -Xswiftc -enable-upcoming-feature -Xswiftc GlobalActorIsolatedTypesUsability -Xswiftc -enable-upcoming-feature -Xswiftc InferSendableFromCaptures 2>&1
basic-6.0-latest: Pulling from finestructure/spi-images
Digest: sha256:47d26c99ca4f1ac0a332c85fd5b13ff4390e72115219984a57a68fe9d1063a05
Status: Image is up to date for registry.gitlab.com/finestructure/spi-images:basic-6.0-latest
Fetching https://github.com/SnapKit/SnapKit
Fetching https://github.com/onevcat/Kingfisher
[1/4238] Fetching snapkit
[4239/35311] Fetching snapkit, kingfisher
Fetched https://github.com/SnapKit/SnapKit from cache (0.37s)
[622/31073] Fetching kingfisher
Fetched https://github.com/onevcat/Kingfisher from cache (3.01s)
Computing version for https://github.com/SnapKit/SnapKit
Computed https://github.com/SnapKit/SnapKit at 5.7.1 (0.42s)
Computing version for https://github.com/onevcat/Kingfisher
Computed https://github.com/onevcat/Kingfisher at 6.3.1 (0.50s)
Creating working copy for https://github.com/onevcat/Kingfisher
Working copy of https://github.com/onevcat/Kingfisher resolved at 6.3.1
Creating working copy for https://github.com/SnapKit/SnapKit
Working copy of https://github.com/SnapKit/SnapKit resolved at 5.7.1
warning: 'spi-builder-workspace': found 1 file(s) which are unhandled; explicitly declare them as resources or exclude from the target
    /host/spi-builder-workspace/ADPhotoKit/Classes/Base/PrivacyInfo.xcprivacy
Building for debugging...
[0/150] Copying Localizable.strings
[0/150] Write sources
[0/150] Copying Localizable.strings
[4/150] Copying warning@3x.png
[4/150] Copying PrivacyInfo.xcprivacy
[4/150] Copying video_filled_text@2x.png
[4/150] Copying Localizable.strings
[4/150] Copying video_filled_text@3x.png
[4/150] Copying videoLoadFailed@3x.png
[4/150] Copying video_filled_sticker@3x.png
[4/150] Copying video_filled_sticker@2x.png
[4/150] Copying videoLoadFailed@2x.png
[4/150] Copying video@2x.png
[4/150] Copying video@3x.png
[4/150] Copying toggle_camera@3x.png
[4/150] Copying Localizable.strings
[4/150] Copying toggle_camera@2x.png
[4/150] Copying Localizable.strings
[4/150] Copying warning@2x.png
[4/150] Copying takePhoto@3x.png
[4/150] Copying takePhoto@2x.png
[4/150] Copying shadow@3x.png
[4/150] Copying shadow@2x.png
[4/150] Copying right_arrow@2x.png
[4/150] Copying Localizable.strings
[4/150] Copying right_arrow@3x.png
[4/150] Copying Localizable.strings
[4/150] Copying retake@2x.png
[4/150] Copying retake@3x.png
[4/150] Copying playVideo@2x.png
[4/150] Copying playVideo@3x.png
[4/150] Copying Localizable.strings
[4/150] Copying nav_close@3x.png
[4/150] Copying nav_close@2x.png
[4/150] Copying navBack@2x.png
[4/150] Copying navBack@3x.png
[4/150] Copying Localizable.strings
[4/150] Copying live_lyric.gif
[4/150] Copying livePhoto@3x.png
[4/150] Copying livePhoto@2x.png
[4/150] Copying Localizable.strings
[4/150] Copying music_playing.gif
[4/150] Copying Localizable.strings
[4/150] Copying icons_video_clip@3x.png
[4/150] Copying icons_video_clip@2x.png
[4/150] Copying icons_unselected@3x.png
[4/150] Copying icons_undo_disable@3x.png
[4/150] Copying icons_unselected@2x.png
[4/150] Copying icons_undo_disable@2x.png
[4/150] Copying icons_undo@3x.png
[4/150] Copying icons_undo@2x.png
[4/150] Copying icons_selected@3x.png
[4/150] Copying icons_selected@2x.png
[4/150] Copying icons_search_clear@3x.png
[4/150] Copying icons_search_clear@2x.png
[4/150] Copying icons_redo_disable@3x.png
[4/150] Copying icons_redo_disable@2x.png
[4/150] Copying icons_redo@3x.png
[4/150] Copying icons_redo@2x.png
[4/150] Copying icons_outlined_session_arrow_down@3x.png
[4/150] Copying icons_outlined_session_arrow_down@2x.png
[4/150] Copying icons_outlined_rotate@3x.png
[4/150] Copying icons_outlined_rotate@2x.png
[4/150] Copying icons_input_outline@3x.png
[4/150] Copying icons_input_outline@2x.png
[4/150] Copying icons_input_font_bg@3x.png
[4/150] Copying icons_input_font_bg@2x.png
[4/150] Copying icons_input_font@3x.png
[4/150] Copying icons_input_font@2x.png
[4/150] Copying icons_filled_text@3x.png
[4/150] Copying icons_filled_text@2x.png
[4/150] Copying icons_filled_sticker@2x.png
[4/150] Copying icons_filled_sticker@3x.png
[4/150] Copying icons_filled_pencil3_on@3x.png
[4/150] Copying icons_filled_pencil3_on@2x.png
[4/150] Copying icons_filled_pencil3@3x.png
[4/150] Copying icons_filled_pencil3@2x.png
[4/150] Copying icons_filled_mosaic_on@3x.png
[4/150] Copying icons_filled_mosaic@3x.png
[4/150] Copying icons_filled_mosaic_on@2x.png
[4/150] Copying icons_filled_mosaic@2x.png
[4/150] Copying icons_filled_done@3x.png
[4/150] Copying icons_filled_done@2x.png
[4/150] Copying icons_filled_delete_on@2x.png
[4/150] Copying icons_filled_delete_on@3x.png
[4/150] Copying icons_filled_delete@2x.png
[4/150] Copying icons_filled_close@3x.png
[4/150] Copying icons_filled_close@2x.png
[4/150] Copying icons_filled_clip@3x.png
[4/150] Copying icons_filled_bgm_on@2x.png
[4/150] Copying icons_filled_clip@2x.png
[4/150] Copying icons_filled_bgm_on@3x.png
[4/150] Copying icons_filled_bgm@3x.png
[4/150] Copying icons_filled_bgm@2x.png
[4/150] Copying icons_eraser_circle@3x.png
[4/150] Copying icons_eraser_circle@2x.png
[4/150] Copying icons_eraser@3x.png
[4/150] Copying icons_eraser@2x.png
[4/150] Copying icons_drag_arrow@3x.png
[4/150] Copying icons_drag_arrow@2x.png
[4/150] Copying icons_clip_right@2x.png
[4/150] Copying icons_clip_right@3x.png
[4/150] Copying icons_clip_left@3x.png
[4/150] Copying icons_clip_left@2x.png
[4/150] Copying icons_bgm_search@3x.png
[4/150] Copying icons_bgm_search@2x.png
[4/150] Copying icons_bgm_check@3x.png
[4/150] Copying icons_bgm_check@2x.png
[4/150] Copying Localizable.strings
[4/150] Copying focus@3x.png
[4/150] Copying flash_on@2x.png
[4/150] Copying flash_on@3x.png
[4/150] Copying focus@2x.png
[4/150] Copying flash_off@2x.png
[4/150] Copying flash_off@3x.png
[4/150] Copying Localizable.strings
[4/150] Copying downArrow@2x.png
[4/150] Copying downArrow@3x.png
[4/150] Copying defaultphoto.png
[4/150] Copying icons_filled_delete@3x.png
[4/150] Copying btn_unselected_with_check@3x.png
[4/150] Copying btn_unselected_with_check@2x.png
[4/150] Copying btn_unselected@3x.png
[4/150] Copying btn_unselected@2x.png
[4/150] Copying btn_selected@3x.png
[4/150] Copying btn_original_selected@3x.png
[4/150] Copying btn_original_selected@2x.png
[4/150] Copying btn_original_circle@3x.png
[4/150] Copying btn_original_circle@2x.png
[4/150] Write sources
[4/150] Copying btn_circle@3x.png
[4/150] Copying albumSelect@2x.png
[4/150] Copying albumSelect@3x.png
[4/150] Copying addPhoto@3x.png
[4/150] Copying btn_circle@2x.png
[4/150] Copying addPhoto@2x.png
[4/150] Copying ablumList_arrow@3x.png
[4/150] Copying Info.plist
[4/150] Copying ablumList_arrow@2x.png
[4/150] Copying VideoEditedIcon@2x.png
[4/150] Copying VideoEditedIcon@3x.png
[4/150] Copying ImageEditedIcon@3x.png
[8/150] Copying ImageEditedIcon@2x.png
[18/150] Copying btn_selected@2x.png
[149/150] Write swift-version-24593BA9C3E375BF.txt
error: emit-module command failed with exit code 1 (use -v to see invocation)
[151/235] Emitting module SnapKit
/host/spi-builder-workspace/.build/checkouts/SnapKit/Sources/Constraint.swift:27:12: error: no such module 'AppKit'
 25 |     import UIKit
 26 | #else
 27 |     import AppKit
    |            `- error: no such module 'AppKit'
 28 | #endif
 29 |
error: emit-module command failed with exit code 1 (use -v to see invocation)
[152/239] Emitting module Kingfisher
/host/spi-builder-workspace/.build/checkouts/Kingfisher/Sources/Cache/CacheSerializer.swift:28:8: error: no such module 'CoreGraphics'
 26 |
 27 | import Foundation
 28 | import CoreGraphics
    |        `- error: no such module 'CoreGraphics'
 29 |
 30 | /// An `CacheSerializer` is used to convert some data to an image object after
[153/246] Compiling Kingfisher DiskStorage.swift
/host/spi-builder-workspace/.build/checkouts/SnapKit/Sources/Constraint.swift:27:12: error: no such module 'AppKit'
 25 |     import UIKit
 26 | #else
 27 |     import AppKit
    |            `- error: no such module 'AppKit'
 28 | #endif
 29 |
[154/246] Compiling Kingfisher FormatIndicatedCacheSerializer.swift
/host/spi-builder-workspace/.build/checkouts/SnapKit/Sources/Constraint.swift:27:12: error: no such module 'AppKit'
 25 |     import UIKit
 26 | #else
 27 |     import AppKit
    |            `- error: no such module 'AppKit'
 28 | #endif
 29 |
[155/246] Compiling Kingfisher ImageCache.swift
/host/spi-builder-workspace/.build/checkouts/SnapKit/Sources/Constraint.swift:27:12: error: no such module 'AppKit'
 25 |     import UIKit
 26 | #else
 27 |     import AppKit
    |            `- error: no such module 'AppKit'
 28 | #endif
 29 |
[156/246] Compiling Kingfisher MemoryStorage.swift
/host/spi-builder-workspace/.build/checkouts/SnapKit/Sources/Constraint.swift:27:12: error: no such module 'AppKit'
 25 |     import UIKit
 26 | #else
 27 |     import AppKit
    |            `- error: no such module 'AppKit'
 28 | #endif
 29 |
[157/246] Compiling Kingfisher KingfisherError.swift
/host/spi-builder-workspace/.build/checkouts/SnapKit/Sources/Constraint.swift:27:12: error: no such module 'AppKit'
 25 |     import UIKit
 26 | #else
 27 |     import AppKit
    |            `- error: no such module 'AppKit'
 28 | #endif
 29 |
[158/246] Compiling Kingfisher KingfisherManager.swift
/host/spi-builder-workspace/.build/checkouts/SnapKit/Sources/Constraint.swift:27:12: error: no such module 'AppKit'
 25 |     import UIKit
 26 | #else
 27 |     import AppKit
    |            `- error: no such module 'AppKit'
 28 | #endif
 29 |
[159/246] Compiling Kingfisher NSButton+Kingfisher.swift
/host/spi-builder-workspace/.build/checkouts/SnapKit/Sources/Constraint.swift:27:12: error: no such module 'AppKit'
 25 |     import UIKit
 26 | #else
 27 |     import AppKit
    |            `- error: no such module 'AppKit'
 28 | #endif
 29 |
[160/246] Compiling Kingfisher NSTextAttachment+Kingfisher.swift
/host/spi-builder-workspace/.build/checkouts/SnapKit/Sources/Constraint.swift:27:12: error: no such module 'AppKit'
 25 |     import UIKit
 26 | #else
 27 |     import AppKit
    |            `- error: no such module 'AppKit'
 28 | #endif
 29 |
[161/246] Compiling Kingfisher TVMonogramView+Kingfisher.swift
/host/spi-builder-workspace/.build/checkouts/SnapKit/Sources/Constraint.swift:27:12: error: no such module 'AppKit'
 25 |     import UIKit
 26 | #else
 27 |     import AppKit
    |            `- error: no such module 'AppKit'
 28 | #endif
 29 |
[162/246] Compiling Kingfisher GraphicsContext.swift
/host/spi-builder-workspace/.build/checkouts/SnapKit/Sources/Constraint.swift:27:12: error: no such module 'AppKit'
 25 |     import UIKit
 26 | #else
 27 |     import AppKit
    |            `- error: no such module 'AppKit'
 28 | #endif
 29 |
[163/246] Compiling Kingfisher Image.swift
/host/spi-builder-workspace/.build/checkouts/SnapKit/Sources/Constraint.swift:27:12: error: no such module 'AppKit'
 25 |     import UIKit
 26 | #else
 27 |     import AppKit
    |            `- error: no such module 'AppKit'
 28 | #endif
 29 |
[164/246] Compiling Kingfisher ImageDrawing.swift
/host/spi-builder-workspace/.build/checkouts/SnapKit/Sources/Constraint.swift:27:12: error: no such module 'AppKit'
 25 |     import UIKit
 26 | #else
 27 |     import AppKit
    |            `- error: no such module 'AppKit'
 28 | #endif
 29 |
[165/246] Compiling Kingfisher ImageFormat.swift
/host/spi-builder-workspace/.build/checkouts/SnapKit/Sources/Constraint.swift:27:12: error: no such module 'AppKit'
 25 |     import UIKit
 26 | #else
 27 |     import AppKit
    |            `- error: no such module 'AppKit'
 28 | #endif
 29 |
[166/246] Compiling Kingfisher ImageProcessor.swift
/host/spi-builder-workspace/.build/checkouts/SnapKit/Sources/Constraint.swift:27:12: error: no such module 'AppKit'
 25 |     import UIKit
 26 | #else
 27 |     import AppKit
    |            `- error: no such module 'AppKit'
 28 | #endif
 29 |
[167/246] Compiling Kingfisher Resource.swift
/host/spi-builder-workspace/.build/checkouts/SnapKit/Sources/Constraint.swift:27:12: error: no such module 'AppKit'
 25 |     import UIKit
 26 | #else
 27 |     import AppKit
    |            `- error: no such module 'AppKit'
 28 | #endif
 29 |
[168/246] Compiling Kingfisher Source.swift
/host/spi-builder-workspace/.build/checkouts/SnapKit/Sources/Constraint.swift:27:12: error: no such module 'AppKit'
 25 |     import UIKit
 26 | #else
 27 |     import AppKit
    |            `- error: no such module 'AppKit'
 28 | #endif
 29 |
[169/246] Compiling Kingfisher KF.swift
/host/spi-builder-workspace/.build/checkouts/SnapKit/Sources/Constraint.swift:27:12: error: no such module 'AppKit'
 25 |     import UIKit
 26 | #else
 27 |     import AppKit
    |            `- error: no such module 'AppKit'
 28 | #endif
 29 |
[170/246] Compiling Kingfisher KFOptionsSetter.swift
/host/spi-builder-workspace/.build/checkouts/SnapKit/Sources/Constraint.swift:27:12: error: no such module 'AppKit'
 25 |     import UIKit
 26 | #else
 27 |     import AppKit
    |            `- error: no such module 'AppKit'
 28 | #endif
 29 |
[171/246] Compiling Kingfisher Kingfisher.swift
/host/spi-builder-workspace/.build/checkouts/SnapKit/Sources/Constraint.swift:27:12: error: no such module 'AppKit'
 25 |     import UIKit
 26 | #else
 27 |     import AppKit
    |            `- error: no such module 'AppKit'
 28 | #endif
 29 |
[172/246] Compiling Kingfisher ImageProgressive.swift
/host/spi-builder-workspace/.build/checkouts/SnapKit/Sources/Constraint.swift:27:12: error: no such module 'AppKit'
 25 |     import UIKit
 26 | #else
 27 |     import AppKit
    |            `- error: no such module 'AppKit'
 28 | #endif
 29 |
[173/246] Compiling Kingfisher ImageTransition.swift
/host/spi-builder-workspace/.build/checkouts/SnapKit/Sources/Constraint.swift:27:12: error: no such module 'AppKit'
 25 |     import UIKit
 26 | #else
 27 |     import AppKit
    |            `- error: no such module 'AppKit'
 28 | #endif
 29 |
[174/246] Compiling Kingfisher Placeholder.swift
/host/spi-builder-workspace/.build/checkouts/SnapKit/Sources/Constraint.swift:27:12: error: no such module 'AppKit'
 25 |     import UIKit
 26 | #else
 27 |     import AppKit
    |            `- error: no such module 'AppKit'
 28 | #endif
 29 |
[175/246] Compiling Kingfisher AuthenticationChallengeResponsable.swift
/host/spi-builder-workspace/.build/checkouts/SnapKit/Sources/Constraint.swift:27:12: error: no such module 'AppKit'
 25 |     import UIKit
 26 | #else
 27 |     import AppKit
    |            `- error: no such module 'AppKit'
 28 | #endif
 29 |
[176/246] Compiling Kingfisher ImageDataProcessor.swift
/host/spi-builder-workspace/.build/checkouts/SnapKit/Sources/Constraint.swift:27:12: error: no such module 'AppKit'
 25 |     import UIKit
 26 | #else
 27 |     import AppKit
    |            `- error: no such module 'AppKit'
 28 | #endif
 29 |
[177/246] Compiling Kingfisher UIButton+Kingfisher.swift
/host/spi-builder-workspace/.build/checkouts/SnapKit/Sources/Constraint.swift:27:12: error: no such module 'AppKit'
 25 |     import UIKit
 26 | #else
 27 |     import AppKit
    |            `- error: no such module 'AppKit'
 28 | #endif
 29 |
[178/246] Compiling Kingfisher WKInterfaceImage+Kingfisher.swift
/host/spi-builder-workspace/.build/checkouts/SnapKit/Sources/Constraint.swift:27:12: error: no such module 'AppKit'
 25 |     import UIKit
 26 | #else
 27 |     import AppKit
    |            `- error: no such module 'AppKit'
 28 | #endif
 29 |
[179/246] Compiling Kingfisher AVAssetImageDataProvider.swift
/host/spi-builder-workspace/.build/checkouts/SnapKit/Sources/Constraint.swift:27:12: error: no such module 'AppKit'
 25 |     import UIKit
 26 | #else
 27 |     import AppKit
    |            `- error: no such module 'AppKit'
 28 | #endif
 29 |
[180/246] Compiling Kingfisher ImageDataProvider.swift
/host/spi-builder-workspace/.build/checkouts/SnapKit/Sources/Constraint.swift:27:12: error: no such module 'AppKit'
 25 |     import UIKit
 26 | #else
 27 |     import AppKit
    |            `- error: no such module 'AppKit'
 28 | #endif
 29 |
[181/246] Compiling Kingfisher CacheSerializer.swift
/host/spi-builder-workspace/.build/checkouts/SnapKit/Sources/Constraint.swift:27:12: error: no such module 'AppKit'
 25 |     import UIKit
 26 | #else
 27 |     import AppKit
    |            `- error: no such module 'AppKit'
 28 | #endif
 29 |
[182/246] Compiling Kingfisher Storage.swift
/host/spi-builder-workspace/.build/checkouts/SnapKit/Sources/Constraint.swift:27:12: error: no such module 'AppKit'
 25 |     import UIKit
 26 | #else
 27 |     import AppKit
    |            `- error: no such module 'AppKit'
 28 | #endif
 29 |
[183/246] Compiling Kingfisher ImageView+Kingfisher.swift
/host/spi-builder-workspace/.build/checkouts/SnapKit/Sources/Constraint.swift:27:12: error: no such module 'AppKit'
 25 |     import UIKit
 26 | #else
 27 |     import AppKit
    |            `- error: no such module 'AppKit'
 28 | #endif
 29 |
[184/246] Compiling Kingfisher KingfisherOptionsInfo.swift
/host/spi-builder-workspace/.build/checkouts/SnapKit/Sources/Constraint.swift:27:12: error: no such module 'AppKit'
 25 |     import UIKit
 26 | #else
 27 |     import AppKit
    |            `- error: no such module 'AppKit'
 28 | #endif
 29 |
[185/246] Compiling Kingfisher Filter.swift
/host/spi-builder-workspace/.build/checkouts/SnapKit/Sources/Constraint.swift:27:12: error: no such module 'AppKit'
 25 |     import UIKit
 26 | #else
 27 |     import AppKit
    |            `- error: no such module 'AppKit'
 28 | #endif
 29 |
[186/246] Compiling Kingfisher GIFAnimatedImage.swift
/host/spi-builder-workspace/.build/checkouts/SnapKit/Sources/Constraint.swift:27:12: error: no such module 'AppKit'
 25 |     import UIKit
 26 | #else
 27 |     import AppKit
    |            `- error: no such module 'AppKit'
 28 | #endif
 29 |
[187/246] Compiling Kingfisher ExtensionHelpers.swift
/host/spi-builder-workspace/.build/checkouts/Kingfisher/Sources/Cache/CacheSerializer.swift:28:8: error: no such module 'CoreGraphics'
 26 |
 27 | import Foundation
 28 | import CoreGraphics
    |        `- error: no such module 'CoreGraphics'
 29 |
 30 | /// An `CacheSerializer` is used to convert some data to an image object after
[188/246] Compiling Kingfisher Result.swift
/host/spi-builder-workspace/.build/checkouts/Kingfisher/Sources/Cache/CacheSerializer.swift:28:8: error: no such module 'CoreGraphics'
 26 |
 27 | import Foundation
 28 | import CoreGraphics
    |        `- error: no such module 'CoreGraphics'
 29 |
 30 | /// An `CacheSerializer` is used to convert some data to an image object after
[189/246] Compiling Kingfisher Runtime.swift
/host/spi-builder-workspace/.build/checkouts/Kingfisher/Sources/Cache/CacheSerializer.swift:28:8: error: no such module 'CoreGraphics'
 26 |
 27 | import Foundation
 28 | import CoreGraphics
    |        `- error: no such module 'CoreGraphics'
 29 |
 30 | /// An `CacheSerializer` is used to convert some data to an image object after
[190/246] Compiling Kingfisher SizeExtensions.swift
/host/spi-builder-workspace/.build/checkouts/Kingfisher/Sources/Cache/CacheSerializer.swift:28:8: error: no such module 'CoreGraphics'
 26 |
 27 | import Foundation
 28 | import CoreGraphics
    |        `- error: no such module 'CoreGraphics'
 29 |
 30 | /// An `CacheSerializer` is used to convert some data to an image object after
[191/246] Compiling Kingfisher String+MD5.swift
/host/spi-builder-workspace/.build/checkouts/Kingfisher/Sources/Cache/CacheSerializer.swift:28:8: error: no such module 'CoreGraphics'
 26 |
 27 | import Foundation
 28 | import CoreGraphics
    |        `- error: no such module 'CoreGraphics'
 29 |
 30 | /// An `CacheSerializer` is used to convert some data to an image object after
[192/246] Compiling Kingfisher AnimatedImageView.swift
/host/spi-builder-workspace/.build/checkouts/Kingfisher/Sources/Cache/CacheSerializer.swift:28:8: error: no such module 'CoreGraphics'
 26 |
 27 | import Foundation
 28 | import CoreGraphics
    |        `- error: no such module 'CoreGraphics'
 29 |
 30 | /// An `CacheSerializer` is used to convert some data to an image object after
[193/246] Compiling Kingfisher Indicator.swift
/host/spi-builder-workspace/.build/checkouts/Kingfisher/Sources/Cache/CacheSerializer.swift:28:8: error: no such module 'CoreGraphics'
 26 |
 27 | import Foundation
 28 | import CoreGraphics
    |        `- error: no such module 'CoreGraphics'
 29 |
 30 | /// An `CacheSerializer` is used to convert some data to an image object after
/host/spi-builder-workspace/.build/checkouts/Kingfisher/Sources/Cache/CacheSerializer.swift:28:8: error: no such module 'CoreGraphics'
 26 |
 27 | import Foundation
 28 | import CoreGraphics
    |        `- error: no such module 'CoreGraphics'
 29 |
 30 | /// An `CacheSerializer` is used to convert some data to an image object after
/host/spi-builder-workspace/.build/checkouts/Kingfisher/Sources/Cache/CacheSerializer.swift:28:8: error: no such module 'CoreGraphics'
 26 |
 27 | import Foundation
 28 | import CoreGraphics
    |        `- error: no such module 'CoreGraphics'
 29 |
 30 | /// An `CacheSerializer` is used to convert some data to an image object after
/host/spi-builder-workspace/.build/checkouts/Kingfisher/Sources/Cache/CacheSerializer.swift:28:8: error: no such module 'CoreGraphics'
 26 |
 27 | import Foundation
 28 | import CoreGraphics
    |        `- error: no such module 'CoreGraphics'
 29 |
 30 | /// An `CacheSerializer` is used to convert some data to an image object after
/host/spi-builder-workspace/.build/checkouts/Kingfisher/Sources/Cache/CacheSerializer.swift:28:8: error: no such module 'CoreGraphics'
 26 |
 27 | import Foundation
 28 | import CoreGraphics
    |        `- error: no such module 'CoreGraphics'
 29 |
 30 | /// An `CacheSerializer` is used to convert some data to an image object after
/host/spi-builder-workspace/.build/checkouts/Kingfisher/Sources/Cache/CacheSerializer.swift:28:8: error: no such module 'CoreGraphics'
 26 |
 27 | import Foundation
 28 | import CoreGraphics
    |        `- error: no such module 'CoreGraphics'
 29 |
 30 | /// An `CacheSerializer` is used to convert some data to an image object after
/host/spi-builder-workspace/.build/checkouts/Kingfisher/Sources/Cache/CacheSerializer.swift:28:8: error: no such module 'CoreGraphics'
 26 |
 27 | import Foundation
 28 | import CoreGraphics
    |        `- error: no such module 'CoreGraphics'
 29 |
 30 | /// An `CacheSerializer` is used to convert some data to an image object after
/host/spi-builder-workspace/.build/checkouts/Kingfisher/Sources/Cache/CacheSerializer.swift:28:8: error: no such module 'CoreGraphics'
 26 |
 27 | import Foundation
 28 | import CoreGraphics
    |        `- error: no such module 'CoreGraphics'
 29 |
 30 | /// An `CacheSerializer` is used to convert some data to an image object after
[201/246] Compiling Kingfisher SessionDelegate.swift
/host/spi-builder-workspace/.build/checkouts/Kingfisher/Sources/Cache/CacheSerializer.swift:28:8: error: no such module 'CoreGraphics'
 26 |
 27 | import Foundation
 28 | import CoreGraphics
    |        `- error: no such module 'CoreGraphics'
 29 |
 30 | /// An `CacheSerializer` is used to convert some data to an image object after
[202/246] Compiling Kingfisher ImageBinder.swift
/host/spi-builder-workspace/.build/checkouts/Kingfisher/Sources/Cache/CacheSerializer.swift:28:8: error: no such module 'CoreGraphics'
 26 |
 27 | import Foundation
 28 | import CoreGraphics
    |        `- error: no such module 'CoreGraphics'
 29 |
 30 | /// An `CacheSerializer` is used to convert some data to an image object after
[203/246] Compiling Kingfisher KFImage.swift
/host/spi-builder-workspace/.build/checkouts/Kingfisher/Sources/Cache/CacheSerializer.swift:28:8: error: no such module 'CoreGraphics'
 26 |
 27 | import Foundation
 28 | import CoreGraphics
    |        `- error: no such module 'CoreGraphics'
 29 |
 30 | /// An `CacheSerializer` is used to convert some data to an image object after
[204/246] Compiling Kingfisher KFImageOptions.swift
/host/spi-builder-workspace/.build/checkouts/Kingfisher/Sources/Cache/CacheSerializer.swift:28:8: error: no such module 'CoreGraphics'
 26 |
 27 | import Foundation
 28 | import CoreGraphics
    |        `- error: no such module 'CoreGraphics'
 29 |
 30 | /// An `CacheSerializer` is used to convert some data to an image object after
[205/246] Compiling Kingfisher Box.swift
/host/spi-builder-workspace/.build/checkouts/Kingfisher/Sources/Cache/CacheSerializer.swift:28:8: error: no such module 'CoreGraphics'
 26 |
 27 | import Foundation
 28 | import CoreGraphics
    |        `- error: no such module 'CoreGraphics'
 29 |
 30 | /// An `CacheSerializer` is used to convert some data to an image object after
[206/246] Compiling Kingfisher CallbackQueue.swift
/host/spi-builder-workspace/.build/checkouts/Kingfisher/Sources/Cache/CacheSerializer.swift:28:8: error: no such module 'CoreGraphics'
 26 |
 27 | import Foundation
 28 | import CoreGraphics
    |        `- error: no such module 'CoreGraphics'
 29 |
 30 | /// An `CacheSerializer` is used to convert some data to an image object after
[207/246] Compiling Kingfisher Delegate.swift
/host/spi-builder-workspace/.build/checkouts/Kingfisher/Sources/Cache/CacheSerializer.swift:28:8: error: no such module 'CoreGraphics'
 26 |
 27 | import Foundation
 28 | import CoreGraphics
    |        `- error: no such module 'CoreGraphics'
 29 |
 30 | /// An `CacheSerializer` is used to convert some data to an image object after
[208/246] Compiling SnapKit LayoutConstraintItem.swift
/host/spi-builder-workspace/.build/checkouts/SnapKit/Sources/Constraint.swift:27:12: error: no such module 'AppKit'
 25 |     import UIKit
 26 | #else
 27 |     import AppKit
    |            `- error: no such module 'AppKit'
 28 | #endif
 29 |
[209/246] Compiling SnapKit Typealiases.swift
/host/spi-builder-workspace/.build/checkouts/SnapKit/Sources/Constraint.swift:27:12: error: no such module 'AppKit'
 25 |     import UIKit
 26 | #else
 27 |     import AppKit
    |            `- error: no such module 'AppKit'
 28 | #endif
 29 |
[210/246] Compiling SnapKit UILayoutSupport+Extensions.swift
/host/spi-builder-workspace/.build/checkouts/SnapKit/Sources/Constraint.swift:27:12: error: no such module 'AppKit'
 25 |     import UIKit
 26 | #else
 27 |     import AppKit
    |            `- error: no such module 'AppKit'
 28 | #endif
 29 |
[211/246] Compiling SnapKit resource_bundle_accessor.swift
/host/spi-builder-workspace/.build/checkouts/SnapKit/Sources/Constraint.swift:27:12: error: no such module 'AppKit'
 25 |     import UIKit
 26 | #else
 27 |     import AppKit
    |            `- error: no such module 'AppKit'
 28 | #endif
 29 |
/host/spi-builder-workspace/.build/checkouts/Kingfisher/Sources/Cache/CacheSerializer.swift:28:8: error: no such module 'CoreGraphics'
 26 |
 27 | import Foundation
 28 | import CoreGraphics
    |        `- error: no such module 'CoreGraphics'
 29 |
 30 | /// An `CacheSerializer` is used to convert some data to an image object after
/host/spi-builder-workspace/.build/checkouts/Kingfisher/Sources/Cache/CacheSerializer.swift:28:8: error: no such module 'CoreGraphics'
 26 |
 27 | import Foundation
 28 | import CoreGraphics
    |        `- error: no such module 'CoreGraphics'
 29 |
 30 | /// An `CacheSerializer` is used to convert some data to an image object after
/host/spi-builder-workspace/.build/checkouts/Kingfisher/Sources/Cache/CacheSerializer.swift:28:8: error: no such module 'CoreGraphics'
 26 |
 27 | import Foundation
 28 | import CoreGraphics
    |        `- error: no such module 'CoreGraphics'
 29 |
 30 | /// An `CacheSerializer` is used to convert some data to an image object after
/host/spi-builder-workspace/.build/checkouts/Kingfisher/Sources/Cache/CacheSerializer.swift:28:8: error: no such module 'CoreGraphics'
 26 |
 27 | import Foundation
 28 | import CoreGraphics
    |        `- error: no such module 'CoreGraphics'
 29 |
 30 | /// An `CacheSerializer` is used to convert some data to an image object after
/host/spi-builder-workspace/.build/checkouts/Kingfisher/Sources/Cache/CacheSerializer.swift:28:8: error: no such module 'CoreGraphics'
 26 |
 27 | import Foundation
 28 | import CoreGraphics
    |        `- error: no such module 'CoreGraphics'
 29 |
 30 | /// An `CacheSerializer` is used to convert some data to an image object after
/host/spi-builder-workspace/.build/checkouts/Kingfisher/Sources/Cache/CacheSerializer.swift:28:8: error: no such module 'CoreGraphics'
 26 |
 27 | import Foundation
 28 | import CoreGraphics
    |        `- error: no such module 'CoreGraphics'
 29 |
 30 | /// An `CacheSerializer` is used to convert some data to an image object after
/host/spi-builder-workspace/.build/checkouts/Kingfisher/Sources/Cache/CacheSerializer.swift:28:8: error: no such module 'CoreGraphics'
 26 |
 27 | import Foundation
 28 | import CoreGraphics
    |        `- error: no such module 'CoreGraphics'
 29 |
 30 | /// An `CacheSerializer` is used to convert some data to an image object after
/host/spi-builder-workspace/.build/checkouts/Kingfisher/Sources/Cache/CacheSerializer.swift:28:8: error: no such module 'CoreGraphics'
 26 |
 27 | import Foundation
 28 | import CoreGraphics
    |        `- error: no such module 'CoreGraphics'
 29 |
 30 | /// An `CacheSerializer` is used to convert some data to an image object after
/host/spi-builder-workspace/.build/checkouts/Kingfisher/Sources/Cache/CacheSerializer.swift:28:8: error: no such module 'CoreGraphics'
 26 |
 27 | import Foundation
 28 | import CoreGraphics
    |        `- error: no such module 'CoreGraphics'
 29 |
 30 | /// An `CacheSerializer` is used to convert some data to an image object after
/host/spi-builder-workspace/.build/checkouts/Kingfisher/Sources/Cache/CacheSerializer.swift:28:8: error: no such module 'CoreGraphics'
 26 |
 27 | import Foundation
 28 | import CoreGraphics
    |        `- error: no such module 'CoreGraphics'
 29 |
 30 | /// An `CacheSerializer` is used to convert some data to an image object after
/host/spi-builder-workspace/.build/checkouts/Kingfisher/Sources/Cache/CacheSerializer.swift:28:8: error: no such module 'CoreGraphics'
 26 |
 27 | import Foundation
 28 | import CoreGraphics
    |        `- error: no such module 'CoreGraphics'
 29 |
 30 | /// An `CacheSerializer` is used to convert some data to an image object after
/host/spi-builder-workspace/.build/checkouts/Kingfisher/Sources/Cache/CacheSerializer.swift:28:8: error: no such module 'CoreGraphics'
 26 |
 27 | import Foundation
 28 | import CoreGraphics
    |        `- error: no such module 'CoreGraphics'
 29 |
 30 | /// An `CacheSerializer` is used to convert some data to an image object after
/host/spi-builder-workspace/.build/checkouts/Kingfisher/Sources/Cache/CacheSerializer.swift:28:8: error: no such module 'CoreGraphics'
 26 |
 27 | import Foundation
 28 | import CoreGraphics
    |        `- error: no such module 'CoreGraphics'
 29 |
 30 | /// An `CacheSerializer` is used to convert some data to an image object after
/host/spi-builder-workspace/.build/checkouts/Kingfisher/Sources/Cache/CacheSerializer.swift:28:8: error: no such module 'CoreGraphics'
 26 |
 27 | import Foundation
 28 | import CoreGraphics
    |        `- error: no such module 'CoreGraphics'
 29 |
 30 | /// An `CacheSerializer` is used to convert some data to an image object after
/host/spi-builder-workspace/.build/checkouts/Kingfisher/Sources/Cache/CacheSerializer.swift:28:8: error: no such module 'CoreGraphics'
 26 |
 27 | import Foundation
 28 | import CoreGraphics
    |        `- error: no such module 'CoreGraphics'
 29 |
 30 | /// An `CacheSerializer` is used to convert some data to an image object after
BUILD FAILURE 6.0 linux