Build Information
Failed to build PhotoSelectAndCrop, reference 2.0.4 (26eec4
), with Swift 6.1 for watchOS using Xcode 16.3 on 27 Apr 2025 19:22:28 UTC.
Build Command
env DEVELOPER_DIR=/Applications/Xcode-16.3.0.app xcrun xcodebuild -IDEClonedSourcePackagesDirPathOverride=$PWD/.dependencies -skipMacroValidation -skipPackagePluginValidation -derivedDataPath $PWD/.derivedData build -scheme PhotoSelectAndCrop -destination generic/platform=watchOS
Build Log
========================================
RunAll
========================================
Builder version: 4.61.0
Interrupt handler set up.
========================================
Checkout
========================================
Clone URL: https://github.com/Rillieux/PhotoSelectAndCrop.git
Reference: 2.0.4
Initialized empty Git repository in /Users/admin/builder/spi-builder-workspace/.git/
From https://github.com/Rillieux/PhotoSelectAndCrop
* tag 2.0.4 -> FETCH_HEAD
HEAD is now at 26eec46 Added "public" in init for ImageAttributes
Cloned https://github.com/Rillieux/PhotoSelectAndCrop.git
Revision (git rev-parse @):
26eec466026a99ebde07e653ea325d7492f949d9
SUCCESS checkout https://github.com/Rillieux/PhotoSelectAndCrop.git at 2.0.4
========================================
Build
========================================
Selected platform: watchOS
Swift version: 6.1
Building package at path: $PWD
https://github.com/Rillieux/PhotoSelectAndCrop.git
https://github.com/Rillieux/PhotoSelectAndCrop.git
{
"default_localization" : "en",
"dependencies" : [
],
"manifest_display_name" : "PhotoSelectAndCrop",
"name" : "PhotoSelectAndCrop",
"path" : "/Users/admin/builder/spi-builder-workspace",
"platforms" : [
{
"name" : "ios",
"version" : "15.0"
}
],
"products" : [
{
"name" : "PhotoSelectAndCrop",
"targets" : [
"PhotoSelectAndCrop"
],
"type" : {
"library" : [
"automatic"
]
}
}
],
"targets" : [
{
"c99name" : "PhotoSelectAndCrop",
"module_type" : "SwiftTarget",
"name" : "PhotoSelectAndCrop",
"path" : "Sources",
"product_memberships" : [
"PhotoSelectAndCrop"
],
"resources" : [
{
"path" : "/Users/admin/builder/spi-builder-workspace/Sources/PhotoSelectAndCrop/Resources/en.lproj/Localizable.strings",
"rule" : {
"process" : {
"localization" : "en"
}
}
},
{
"path" : "/Users/admin/builder/spi-builder-workspace/Sources/PhotoSelectAndCrop/Resources/fr.lproj/Localizable.strings",
"rule" : {
"process" : {
"localization" : "fr"
}
}
}
],
"sources" : [
"Color+Extensions.swift",
"DeviceOrientation.swift",
"Image+Extensions.swift",
"ImageAttributes.swift",
"ImageManipulation.swift",
"ImageMoveAndScaleSheet+Extensions.swift",
"ImageMoveAndScaleSheet+ViewModel.swift",
"ImageMoveAndScaleSheet.swift",
"ImagePane.swift",
"SystemImagePicker.swift",
"SystemPHPicker.swift",
"ViewModifiers.swift"
],
"type" : "library"
}
],
"tools_version" : "5.3"
}
Command line invocation:
/Applications/Xcode-16.3.0.app/Contents/Developer/usr/bin/xcodebuild -IDEClonedSourcePackagesDirPathOverride=/Users/admin/builder/spi-builder-workspace/.dependencies -resolvePackageDependencies
Resolve Package Graph
Resolved source packages:
PhotoSelectAndCrop: /Users/admin/builder/spi-builder-workspace
resolved source packages: PhotoSelectAndCrop
{
"default_localization" : "en",
"dependencies" : [
],
"manifest_display_name" : "PhotoSelectAndCrop",
"name" : "PhotoSelectAndCrop",
"path" : "/Users/admin/builder/spi-builder-workspace",
"platforms" : [
{
"name" : "ios",
"version" : "15.0"
}
],
"products" : [
{
"name" : "PhotoSelectAndCrop",
"targets" : [
"PhotoSelectAndCrop"
],
"type" : {
"library" : [
"automatic"
]
}
}
],
"targets" : [
{
"c99name" : "PhotoSelectAndCrop",
"module_type" : "SwiftTarget",
"name" : "PhotoSelectAndCrop",
"path" : "Sources",
"product_memberships" : [
"PhotoSelectAndCrop"
],
"resources" : [
{
"path" : "/Users/admin/builder/spi-builder-workspace/Sources/PhotoSelectAndCrop/Resources/en.lproj/Localizable.strings",
"rule" : {
"process" : {
"localization" : "en"
}
}
},
{
"path" : "/Users/admin/builder/spi-builder-workspace/Sources/PhotoSelectAndCrop/Resources/fr.lproj/Localizable.strings",
"rule" : {
"process" : {
"localization" : "fr"
}
}
}
],
"sources" : [
"Color+Extensions.swift",
"DeviceOrientation.swift",
"Image+Extensions.swift",
"ImageAttributes.swift",
"ImageManipulation.swift",
"ImageMoveAndScaleSheet+Extensions.swift",
"ImageMoveAndScaleSheet+ViewModel.swift",
"ImageMoveAndScaleSheet.swift",
"ImagePane.swift",
"SystemImagePicker.swift",
"SystemPHPicker.swift",
"ViewModifiers.swift"
],
"type" : "library"
}
],
"tools_version" : "5.3"
}
{
"workspace" : {
"name" : "spi-builder-workspace",
"schemes" : [
"PhotoSelectAndCrop"
]
}
}
Running build ...
env DEVELOPER_DIR=/Applications/Xcode-16.3.0.app xcrun xcodebuild -IDEClonedSourcePackagesDirPathOverride=$PWD/.dependencies -skipMacroValidation -skipPackagePluginValidation -derivedDataPath $PWD/.derivedData build -scheme PhotoSelectAndCrop -destination generic/platform=watchOS OTHER_SWIFT_FLAGS=-stats-output-dir .stats -strict-concurrency=complete -enable-upcoming-feature StrictConcurrency -enable-upcoming-feature DisableOutwardActorInference -enable-upcoming-feature GlobalActorIsolatedTypesUsability -enable-upcoming-feature InferSendableFromCaptures
Command line invocation:
/Applications/Xcode-16.3.0.app/Contents/Developer/usr/bin/xcodebuild -IDEClonedSourcePackagesDirPathOverride=/Users/admin/builder/spi-builder-workspace/.dependencies -skipMacroValidation -skipPackagePluginValidation -derivedDataPath /Users/admin/builder/spi-builder-workspace/.derivedData build -scheme PhotoSelectAndCrop -destination generic/platform=watchOS "OTHER_SWIFT_FLAGS=-stats-output-dir .stats -strict-concurrency=complete -enable-upcoming-feature StrictConcurrency -enable-upcoming-feature DisableOutwardActorInference -enable-upcoming-feature GlobalActorIsolatedTypesUsability -enable-upcoming-feature InferSendableFromCaptures"
Build settings from command line:
OTHER_SWIFT_FLAGS = -stats-output-dir .stats -strict-concurrency=complete -enable-upcoming-feature StrictConcurrency -enable-upcoming-feature DisableOutwardActorInference -enable-upcoming-feature GlobalActorIsolatedTypesUsability -enable-upcoming-feature InferSendableFromCaptures
Resolve Package Graph
Resolved source packages:
PhotoSelectAndCrop: /Users/admin/builder/spi-builder-workspace
ComputePackagePrebuildTargetDependencyGraph
Prepare packages
CreateBuildRequest
SendProjectDescription
CreateBuildOperation
ComputeTargetDependencyGraph
note: Building targets in dependency order
note: Target dependency graph (3 targets)
Target 'PhotoSelectAndCrop' in project 'PhotoSelectAndCrop'
➜ Explicit dependency on target 'PhotoSelectAndCrop' in project 'PhotoSelectAndCrop'
➜ Explicit dependency on target 'PhotoSelectAndCrop_PhotoSelectAndCrop' in project 'PhotoSelectAndCrop'
Target 'PhotoSelectAndCrop' in project 'PhotoSelectAndCrop'
➜ Explicit dependency on target 'PhotoSelectAndCrop_PhotoSelectAndCrop' in project 'PhotoSelectAndCrop'
Target 'PhotoSelectAndCrop_PhotoSelectAndCrop' in project 'PhotoSelectAndCrop' (no dependencies)
GatherProvisioningInputs
CreateBuildDescription
ExecuteExternalTool /Applications/Xcode-16.3.0.app/Contents/Developer/Toolchains/XcodeDefault.xctoolchain/usr/bin/clang -v -E -dM -isysroot /Applications/Xcode-16.3.0.app/Contents/Developer/Platforms/WatchOS.platform/Developer/SDKs/WatchOS11.4.sdk -x c -c /dev/null
ExecuteExternalTool /Applications/Xcode-16.3.0.app/Contents/Developer/Toolchains/XcodeDefault.xctoolchain/usr/bin/swiftc --version
ExecuteExternalTool /Applications/Xcode-16.3.0.app/Contents/Developer/Toolchains/XcodeDefault.xctoolchain/usr/bin/ld -version_details
Build description signature: f92346f7fd7c8fa50eb89d6cb37fc3b1
Build description path: /Users/admin/builder/spi-builder-workspace/.derivedData/Build/Intermediates.noindex/XCBuildData/f92346f7fd7c8fa50eb89d6cb37fc3b1.xcbuilddata
CreateBuildDirectory /Users/admin/builder/spi-builder-workspace/.derivedData/Build/Products
cd /Users/admin/builder/spi-builder-workspace/.swiftpm/xcode
builtin-create-build-directory /Users/admin/builder/spi-builder-workspace/.derivedData/Build/Products
CreateBuildDirectory /Users/admin/builder/spi-builder-workspace/.derivedData/Build/Intermediates.noindex
cd /Users/admin/builder/spi-builder-workspace/.swiftpm/xcode
builtin-create-build-directory /Users/admin/builder/spi-builder-workspace/.derivedData/Build/Intermediates.noindex
ClangStatCache /Applications/Xcode-16.3.0.app/Contents/Developer/Toolchains/XcodeDefault.xctoolchain/usr/bin/clang-stat-cache /Applications/Xcode-16.3.0.app/Contents/Developer/Platforms/WatchOS.platform/Developer/SDKs/WatchOS11.4.sdk /Users/admin/builder/spi-builder-workspace/.derivedData/SDKStatCaches.noindex/watchos11.4-22T246-43efb940ff07ba2497b70ec94253f576.sdkstatcache
cd /Users/admin/builder/spi-builder-workspace/.swiftpm/xcode
/Applications/Xcode-16.3.0.app/Contents/Developer/Toolchains/XcodeDefault.xctoolchain/usr/bin/clang-stat-cache /Applications/Xcode-16.3.0.app/Contents/Developer/Platforms/WatchOS.platform/Developer/SDKs/WatchOS11.4.sdk -o /Users/admin/builder/spi-builder-workspace/.derivedData/SDKStatCaches.noindex/watchos11.4-22T246-43efb940ff07ba2497b70ec94253f576.sdkstatcache
CreateBuildDirectory /Users/admin/builder/spi-builder-workspace/.derivedData/Build/Products/Debug-watchos
cd /Users/admin/builder/spi-builder-workspace/.swiftpm/xcode
builtin-create-build-directory /Users/admin/builder/spi-builder-workspace/.derivedData/Build/Products/Debug-watchos
CreateBuildDirectory /Users/admin/builder/spi-builder-workspace/.derivedData/Build/Intermediates.noindex/EagerLinkingTBDs/Debug-watchos
cd /Users/admin/builder/spi-builder-workspace/.swiftpm/xcode
builtin-create-build-directory /Users/admin/builder/spi-builder-workspace/.derivedData/Build/Intermediates.noindex/EagerLinkingTBDs/Debug-watchos
CreateBuildDirectory /Users/admin/builder/spi-builder-workspace/.derivedData/Build/Products/Debug-watchos/PackageFrameworks
cd /Users/admin/builder/spi-builder-workspace/.swiftpm/xcode
builtin-create-build-directory /Users/admin/builder/spi-builder-workspace/.derivedData/Build/Products/Debug-watchos/PackageFrameworks
MkDir /Users/admin/builder/spi-builder-workspace/.derivedData/Build/Products/Debug-watchos/PhotoSelectAndCrop_PhotoSelectAndCrop.bundle (in target 'PhotoSelectAndCrop_PhotoSelectAndCrop' from project 'PhotoSelectAndCrop')
cd /Users/admin/builder/spi-builder-workspace
/bin/mkdir -p /Users/admin/builder/spi-builder-workspace/.derivedData/Build/Products/Debug-watchos/PhotoSelectAndCrop_PhotoSelectAndCrop.bundle
WriteAuxiliaryFile /Users/admin/builder/spi-builder-workspace/.derivedData/Build/Intermediates.noindex/PhotoSelectAndCrop.build/Debug-watchos/PhotoSelectAndCrop.build/PhotoSelectAndCrop.DependencyStaticMetadataFileList (in target 'PhotoSelectAndCrop' from project 'PhotoSelectAndCrop')
cd /Users/admin/builder/spi-builder-workspace
write-file /Users/admin/builder/spi-builder-workspace/.derivedData/Build/Intermediates.noindex/PhotoSelectAndCrop.build/Debug-watchos/PhotoSelectAndCrop.build/PhotoSelectAndCrop.DependencyStaticMetadataFileList
WriteAuxiliaryFile /Users/admin/builder/spi-builder-workspace/.derivedData/Build/Intermediates.noindex/PhotoSelectAndCrop.build/Debug-watchos/PhotoSelectAndCrop_PhotoSelectAndCrop.build/PhotoSelectAndCrop_PhotoSelectAndCrop.DependencyMetadataFileList (in target 'PhotoSelectAndCrop_PhotoSelectAndCrop' from project 'PhotoSelectAndCrop')
cd /Users/admin/builder/spi-builder-workspace
write-file /Users/admin/builder/spi-builder-workspace/.derivedData/Build/Intermediates.noindex/PhotoSelectAndCrop.build/Debug-watchos/PhotoSelectAndCrop_PhotoSelectAndCrop.build/PhotoSelectAndCrop_PhotoSelectAndCrop.DependencyMetadataFileList
WriteAuxiliaryFile /Users/admin/builder/spi-builder-workspace/.derivedData/Build/Intermediates.noindex/PhotoSelectAndCrop.build/Debug-watchos/PhotoSelectAndCrop.build/PhotoSelectAndCrop.DependencyMetadataFileList (in target 'PhotoSelectAndCrop' from project 'PhotoSelectAndCrop')
cd /Users/admin/builder/spi-builder-workspace
write-file /Users/admin/builder/spi-builder-workspace/.derivedData/Build/Intermediates.noindex/PhotoSelectAndCrop.build/Debug-watchos/PhotoSelectAndCrop.build/PhotoSelectAndCrop.DependencyMetadataFileList
WriteAuxiliaryFile /Users/admin/builder/spi-builder-workspace/.derivedData/Build/Intermediates.noindex/PhotoSelectAndCrop.build/Debug-watchos/PhotoSelectAndCrop_PhotoSelectAndCrop.build/empty-PhotoSelectAndCrop_PhotoSelectAndCrop.plist (in target 'PhotoSelectAndCrop_PhotoSelectAndCrop' from project 'PhotoSelectAndCrop')
cd /Users/admin/builder/spi-builder-workspace
write-file /Users/admin/builder/spi-builder-workspace/.derivedData/Build/Intermediates.noindex/PhotoSelectAndCrop.build/Debug-watchos/PhotoSelectAndCrop_PhotoSelectAndCrop.build/empty-PhotoSelectAndCrop_PhotoSelectAndCrop.plist
WriteAuxiliaryFile /Users/admin/builder/spi-builder-workspace/.derivedData/Build/Intermediates.noindex/PhotoSelectAndCrop.build/Debug-watchos/PhotoSelectAndCrop_PhotoSelectAndCrop.build/PhotoSelectAndCrop_PhotoSelectAndCrop.DependencyStaticMetadataFileList (in target 'PhotoSelectAndCrop_PhotoSelectAndCrop' from project 'PhotoSelectAndCrop')
cd /Users/admin/builder/spi-builder-workspace
write-file /Users/admin/builder/spi-builder-workspace/.derivedData/Build/Intermediates.noindex/PhotoSelectAndCrop.build/Debug-watchos/PhotoSelectAndCrop_PhotoSelectAndCrop.build/PhotoSelectAndCrop_PhotoSelectAndCrop.DependencyStaticMetadataFileList
WriteAuxiliaryFile /Users/admin/builder/spi-builder-workspace/.derivedData/Build/Intermediates.noindex/PhotoSelectAndCrop.build/Debug-watchos/PhotoSelectAndCrop.build/PhotoSelectAndCrop.modulemap (in target 'PhotoSelectAndCrop' from project 'PhotoSelectAndCrop')
cd /Users/admin/builder/spi-builder-workspace
write-file /Users/admin/builder/spi-builder-workspace/.derivedData/Build/Intermediates.noindex/PhotoSelectAndCrop.build/Debug-watchos/PhotoSelectAndCrop.build/PhotoSelectAndCrop.modulemap
WriteAuxiliaryFile /Users/admin/builder/spi-builder-workspace/.derivedData/Build/Intermediates.noindex/PhotoSelectAndCrop.build/Debug-watchos/PhotoSelectAndCrop.build/Objects-normal/armv7k/PhotoSelectAndCrop_const_extract_protocols.json (in target 'PhotoSelectAndCrop' from project 'PhotoSelectAndCrop')
cd /Users/admin/builder/spi-builder-workspace
write-file /Users/admin/builder/spi-builder-workspace/.derivedData/Build/Intermediates.noindex/PhotoSelectAndCrop.build/Debug-watchos/PhotoSelectAndCrop.build/Objects-normal/armv7k/PhotoSelectAndCrop_const_extract_protocols.json
WriteAuxiliaryFile /Users/admin/builder/spi-builder-workspace/.derivedData/Build/Intermediates.noindex/PhotoSelectAndCrop.build/Debug-watchos/PhotoSelectAndCrop.build/Objects-normal/armv7k/PhotoSelectAndCrop.SwiftConstValuesFileList (in target 'PhotoSelectAndCrop' from project 'PhotoSelectAndCrop')
cd /Users/admin/builder/spi-builder-workspace
write-file /Users/admin/builder/spi-builder-workspace/.derivedData/Build/Intermediates.noindex/PhotoSelectAndCrop.build/Debug-watchos/PhotoSelectAndCrop.build/Objects-normal/armv7k/PhotoSelectAndCrop.SwiftConstValuesFileList
WriteAuxiliaryFile /Users/admin/builder/spi-builder-workspace/.derivedData/Build/Intermediates.noindex/PhotoSelectAndCrop.build/Debug-watchos/PhotoSelectAndCrop.build/Objects-normal/armv7k/PhotoSelectAndCrop.SwiftFileList (in target 'PhotoSelectAndCrop' from project 'PhotoSelectAndCrop')
cd /Users/admin/builder/spi-builder-workspace
write-file /Users/admin/builder/spi-builder-workspace/.derivedData/Build/Intermediates.noindex/PhotoSelectAndCrop.build/Debug-watchos/PhotoSelectAndCrop.build/Objects-normal/armv7k/PhotoSelectAndCrop.SwiftFileList
WriteAuxiliaryFile /Users/admin/builder/spi-builder-workspace/.derivedData/Build/Intermediates.noindex/PhotoSelectAndCrop.build/Debug-watchos/PhotoSelectAndCrop.build/Objects-normal/armv7k/PhotoSelectAndCrop.LinkFileList (in target 'PhotoSelectAndCrop' from project 'PhotoSelectAndCrop')
cd /Users/admin/builder/spi-builder-workspace
write-file /Users/admin/builder/spi-builder-workspace/.derivedData/Build/Intermediates.noindex/PhotoSelectAndCrop.build/Debug-watchos/PhotoSelectAndCrop.build/Objects-normal/armv7k/PhotoSelectAndCrop.LinkFileList
WriteAuxiliaryFile /Users/admin/builder/spi-builder-workspace/.derivedData/Build/Intermediates.noindex/PhotoSelectAndCrop.build/Debug-watchos/PhotoSelectAndCrop.build/Objects-normal/armv7k/PhotoSelectAndCrop-OutputFileMap.json (in target 'PhotoSelectAndCrop' from project 'PhotoSelectAndCrop')
cd /Users/admin/builder/spi-builder-workspace
write-file /Users/admin/builder/spi-builder-workspace/.derivedData/Build/Intermediates.noindex/PhotoSelectAndCrop.build/Debug-watchos/PhotoSelectAndCrop.build/Objects-normal/armv7k/PhotoSelectAndCrop-OutputFileMap.json
WriteAuxiliaryFile /Users/admin/builder/spi-builder-workspace/.derivedData/Build/Intermediates.noindex/PhotoSelectAndCrop.build/Debug-watchos/PhotoSelectAndCrop.build/Objects-normal/arm64_32/PhotoSelectAndCrop.SwiftFileList (in target 'PhotoSelectAndCrop' from project 'PhotoSelectAndCrop')
cd /Users/admin/builder/spi-builder-workspace
write-file /Users/admin/builder/spi-builder-workspace/.derivedData/Build/Intermediates.noindex/PhotoSelectAndCrop.build/Debug-watchos/PhotoSelectAndCrop.build/Objects-normal/arm64_32/PhotoSelectAndCrop.SwiftFileList
WriteAuxiliaryFile /Users/admin/builder/spi-builder-workspace/.derivedData/Build/Intermediates.noindex/PhotoSelectAndCrop.build/Debug-watchos/PhotoSelectAndCrop.build/Objects-normal/arm64_32/PhotoSelectAndCrop.LinkFileList (in target 'PhotoSelectAndCrop' from project 'PhotoSelectAndCrop')
cd /Users/admin/builder/spi-builder-workspace
write-file /Users/admin/builder/spi-builder-workspace/.derivedData/Build/Intermediates.noindex/PhotoSelectAndCrop.build/Debug-watchos/PhotoSelectAndCrop.build/Objects-normal/arm64_32/PhotoSelectAndCrop.LinkFileList
WriteAuxiliaryFile /Users/admin/builder/spi-builder-workspace/.derivedData/Build/Intermediates.noindex/PhotoSelectAndCrop.build/Debug-watchos/PhotoSelectAndCrop.build/Objects-normal/arm64_32/PhotoSelectAndCrop_const_extract_protocols.json (in target 'PhotoSelectAndCrop' from project 'PhotoSelectAndCrop')
cd /Users/admin/builder/spi-builder-workspace
write-file /Users/admin/builder/spi-builder-workspace/.derivedData/Build/Intermediates.noindex/PhotoSelectAndCrop.build/Debug-watchos/PhotoSelectAndCrop.build/Objects-normal/arm64_32/PhotoSelectAndCrop_const_extract_protocols.json
WriteAuxiliaryFile /Users/admin/builder/spi-builder-workspace/.derivedData/Build/Intermediates.noindex/PhotoSelectAndCrop.build/Debug-watchos/PhotoSelectAndCrop.build/Objects-normal/arm64_32/PhotoSelectAndCrop.SwiftConstValuesFileList (in target 'PhotoSelectAndCrop' from project 'PhotoSelectAndCrop')
cd /Users/admin/builder/spi-builder-workspace
write-file /Users/admin/builder/spi-builder-workspace/.derivedData/Build/Intermediates.noindex/PhotoSelectAndCrop.build/Debug-watchos/PhotoSelectAndCrop.build/Objects-normal/arm64_32/PhotoSelectAndCrop.SwiftConstValuesFileList
WriteAuxiliaryFile /Users/admin/builder/spi-builder-workspace/.derivedData/Build/Intermediates.noindex/PhotoSelectAndCrop.build/Debug-watchos/PhotoSelectAndCrop.build/Objects-normal/arm64_32/PhotoSelectAndCrop-OutputFileMap.json (in target 'PhotoSelectAndCrop' from project 'PhotoSelectAndCrop')
cd /Users/admin/builder/spi-builder-workspace
write-file /Users/admin/builder/spi-builder-workspace/.derivedData/Build/Intermediates.noindex/PhotoSelectAndCrop.build/Debug-watchos/PhotoSelectAndCrop.build/Objects-normal/arm64_32/PhotoSelectAndCrop-OutputFileMap.json
WriteAuxiliaryFile /Users/admin/builder/spi-builder-workspace/.derivedData/Build/Intermediates.noindex/PhotoSelectAndCrop.build/Debug-watchos/PhotoSelectAndCrop.build/Objects-normal/arm64/PhotoSelectAndCrop.SwiftFileList (in target 'PhotoSelectAndCrop' from project 'PhotoSelectAndCrop')
cd /Users/admin/builder/spi-builder-workspace
write-file /Users/admin/builder/spi-builder-workspace/.derivedData/Build/Intermediates.noindex/PhotoSelectAndCrop.build/Debug-watchos/PhotoSelectAndCrop.build/Objects-normal/arm64/PhotoSelectAndCrop.SwiftFileList
WriteAuxiliaryFile /Users/admin/builder/spi-builder-workspace/.derivedData/Build/Intermediates.noindex/PhotoSelectAndCrop.build/Debug-watchos/PhotoSelectAndCrop.build/Objects-normal/arm64/PhotoSelectAndCrop_const_extract_protocols.json (in target 'PhotoSelectAndCrop' from project 'PhotoSelectAndCrop')
cd /Users/admin/builder/spi-builder-workspace
write-file /Users/admin/builder/spi-builder-workspace/.derivedData/Build/Intermediates.noindex/PhotoSelectAndCrop.build/Debug-watchos/PhotoSelectAndCrop.build/Objects-normal/arm64/PhotoSelectAndCrop_const_extract_protocols.json
WriteAuxiliaryFile /Users/admin/builder/spi-builder-workspace/.derivedData/Build/Intermediates.noindex/PhotoSelectAndCrop.build/Debug-watchos/PhotoSelectAndCrop.build/Objects-normal/arm64/PhotoSelectAndCrop.SwiftConstValuesFileList (in target 'PhotoSelectAndCrop' from project 'PhotoSelectAndCrop')
cd /Users/admin/builder/spi-builder-workspace
write-file /Users/admin/builder/spi-builder-workspace/.derivedData/Build/Intermediates.noindex/PhotoSelectAndCrop.build/Debug-watchos/PhotoSelectAndCrop.build/Objects-normal/arm64/PhotoSelectAndCrop.SwiftConstValuesFileList
WriteAuxiliaryFile /Users/admin/builder/spi-builder-workspace/.derivedData/Build/Intermediates.noindex/PhotoSelectAndCrop.build/Debug-watchos/PhotoSelectAndCrop.build/Objects-normal/arm64/PhotoSelectAndCrop.LinkFileList (in target 'PhotoSelectAndCrop' from project 'PhotoSelectAndCrop')
cd /Users/admin/builder/spi-builder-workspace
write-file /Users/admin/builder/spi-builder-workspace/.derivedData/Build/Intermediates.noindex/PhotoSelectAndCrop.build/Debug-watchos/PhotoSelectAndCrop.build/Objects-normal/arm64/PhotoSelectAndCrop.LinkFileList
WriteAuxiliaryFile /Users/admin/builder/spi-builder-workspace/.derivedData/Build/Intermediates.noindex/PhotoSelectAndCrop.build/Debug-watchos/PhotoSelectAndCrop.build/Objects-normal/arm64/PhotoSelectAndCrop-OutputFileMap.json (in target 'PhotoSelectAndCrop' from project 'PhotoSelectAndCrop')
cd /Users/admin/builder/spi-builder-workspace
write-file /Users/admin/builder/spi-builder-workspace/.derivedData/Build/Intermediates.noindex/PhotoSelectAndCrop.build/Debug-watchos/PhotoSelectAndCrop.build/Objects-normal/arm64/PhotoSelectAndCrop-OutputFileMap.json
WriteAuxiliaryFile /Users/admin/builder/spi-builder-workspace/.derivedData/Build/Intermediates.noindex/PhotoSelectAndCrop.build/Debug-watchos/PhotoSelectAndCrop.build/DerivedSources/resource_bundle_accessor.swift (in target 'PhotoSelectAndCrop' from project 'PhotoSelectAndCrop')
cd /Users/admin/builder/spi-builder-workspace
write-file /Users/admin/builder/spi-builder-workspace/.derivedData/Build/Intermediates.noindex/PhotoSelectAndCrop.build/Debug-watchos/PhotoSelectAndCrop.build/DerivedSources/resource_bundle_accessor.swift
Copy /Users/admin/builder/spi-builder-workspace/.derivedData/Build/Intermediates.noindex/GeneratedModuleMaps-watchos/PhotoSelectAndCrop.modulemap /Users/admin/builder/spi-builder-workspace/.derivedData/Build/Intermediates.noindex/PhotoSelectAndCrop.build/Debug-watchos/PhotoSelectAndCrop.build/PhotoSelectAndCrop.modulemap (in target 'PhotoSelectAndCrop' from project 'PhotoSelectAndCrop')
cd /Users/admin/builder/spi-builder-workspace
builtin-copy -exclude .DS_Store -exclude CVS -exclude .svn -exclude .git -exclude .hg -resolve-src-symlinks /Users/admin/builder/spi-builder-workspace/.derivedData/Build/Intermediates.noindex/PhotoSelectAndCrop.build/Debug-watchos/PhotoSelectAndCrop.build/PhotoSelectAndCrop.modulemap /Users/admin/builder/spi-builder-workspace/.derivedData/Build/Intermediates.noindex/GeneratedModuleMaps-watchos
ProcessInfoPlistFile /Users/admin/builder/spi-builder-workspace/.derivedData/Build/Products/Debug-watchos/PhotoSelectAndCrop_PhotoSelectAndCrop.bundle/Info.plist /Users/admin/builder/spi-builder-workspace/.derivedData/Build/Intermediates.noindex/PhotoSelectAndCrop.build/Debug-watchos/PhotoSelectAndCrop_PhotoSelectAndCrop.build/empty-PhotoSelectAndCrop_PhotoSelectAndCrop.plist (in target 'PhotoSelectAndCrop_PhotoSelectAndCrop' from project 'PhotoSelectAndCrop')
cd /Users/admin/builder/spi-builder-workspace
builtin-infoPlistUtility /Users/admin/builder/spi-builder-workspace/.derivedData/Build/Intermediates.noindex/PhotoSelectAndCrop.build/Debug-watchos/PhotoSelectAndCrop_PhotoSelectAndCrop.build/empty-PhotoSelectAndCrop_PhotoSelectAndCrop.plist -producttype com.apple.product-type.bundle -expandbuildsettings -format binary -platform watchos -o /Users/admin/builder/spi-builder-workspace/.derivedData/Build/Products/Debug-watchos/PhotoSelectAndCrop_PhotoSelectAndCrop.bundle/Info.plist
CpResource /Users/admin/builder/spi-builder-workspace/.derivedData/Build/Products/Debug-watchos/PhotoSelectAndCrop_PhotoSelectAndCrop.bundle/en.lproj/Localizable.strings /Users/admin/builder/spi-builder-workspace/Sources/PhotoSelectAndCrop/Resources/en.lproj/Localizable.strings (in target 'PhotoSelectAndCrop_PhotoSelectAndCrop' from project 'PhotoSelectAndCrop')
cd /Users/admin/builder/spi-builder-workspace
builtin-copy -exclude .DS_Store -exclude CVS -exclude .svn -exclude .git -exclude .hg -resolve-src-symlinks /Users/admin/builder/spi-builder-workspace/Sources/PhotoSelectAndCrop/Resources/en.lproj/Localizable.strings /Users/admin/builder/spi-builder-workspace/.derivedData/Build/Products/Debug-watchos/PhotoSelectAndCrop_PhotoSelectAndCrop.bundle/en.lproj
CpResource /Users/admin/builder/spi-builder-workspace/.derivedData/Build/Products/Debug-watchos/PhotoSelectAndCrop_PhotoSelectAndCrop.bundle/fr.lproj/Localizable.strings /Users/admin/builder/spi-builder-workspace/Sources/PhotoSelectAndCrop/Resources/fr.lproj/Localizable.strings (in target 'PhotoSelectAndCrop_PhotoSelectAndCrop' from project 'PhotoSelectAndCrop')
cd /Users/admin/builder/spi-builder-workspace
builtin-copy -exclude .DS_Store -exclude CVS -exclude .svn -exclude .git -exclude .hg -resolve-src-symlinks /Users/admin/builder/spi-builder-workspace/Sources/PhotoSelectAndCrop/Resources/fr.lproj/Localizable.strings /Users/admin/builder/spi-builder-workspace/.derivedData/Build/Products/Debug-watchos/PhotoSelectAndCrop_PhotoSelectAndCrop.bundle/fr.lproj
RegisterExecutionPolicyException /Users/admin/builder/spi-builder-workspace/.derivedData/Build/Products/Debug-watchos/PhotoSelectAndCrop_PhotoSelectAndCrop.bundle (in target 'PhotoSelectAndCrop_PhotoSelectAndCrop' from project 'PhotoSelectAndCrop')
cd /Users/admin/builder/spi-builder-workspace
builtin-RegisterExecutionPolicyException /Users/admin/builder/spi-builder-workspace/.derivedData/Build/Products/Debug-watchos/PhotoSelectAndCrop_PhotoSelectAndCrop.bundle
Touch /Users/admin/builder/spi-builder-workspace/.derivedData/Build/Products/Debug-watchos/PhotoSelectAndCrop_PhotoSelectAndCrop.bundle (in target 'PhotoSelectAndCrop_PhotoSelectAndCrop' from project 'PhotoSelectAndCrop')
cd /Users/admin/builder/spi-builder-workspace
/usr/bin/touch -c /Users/admin/builder/spi-builder-workspace/.derivedData/Build/Products/Debug-watchos/PhotoSelectAndCrop_PhotoSelectAndCrop.bundle
SwiftDriver PhotoSelectAndCrop normal arm64 com.apple.xcode.tools.swift.compiler (in target 'PhotoSelectAndCrop' from project 'PhotoSelectAndCrop')
cd /Users/admin/builder/spi-builder-workspace/.swiftpm/xcode
builtin-SwiftDriver -- /Applications/Xcode-16.3.0.app/Contents/Developer/Toolchains/XcodeDefault.xctoolchain/usr/bin/swiftc -module-name PhotoSelectAndCrop -Onone -enforce-exclusivity\=checked @/Users/admin/builder/spi-builder-workspace/.derivedData/Build/Intermediates.noindex/PhotoSelectAndCrop.build/Debug-watchos/PhotoSelectAndCrop.build/Objects-normal/arm64/PhotoSelectAndCrop.SwiftFileList -DSWIFT_PACKAGE -DDEBUG -stats-output-dir .stats -strict-concurrency\=complete -enable-upcoming-feature StrictConcurrency -enable-upcoming-feature DisableOutwardActorInference -enable-upcoming-feature GlobalActorIsolatedTypesUsability -enable-upcoming-feature InferSendableFromCaptures -plugin-path /Applications/Xcode-16.3.0.app/Contents/Developer/Toolchains/XcodeDefault.xctoolchain/usr/lib/swift/host/plugins/testing -enable-experimental-feature DebugDescriptionMacro -sdk /Applications/Xcode-16.3.0.app/Contents/Developer/Platforms/WatchOS.platform/Developer/SDKs/WatchOS11.4.sdk -target arm64-apple-watchos8.0 -g -module-cache-path /Users/admin/builder/spi-builder-workspace/.derivedData/ModuleCache.noindex -Xfrontend -serialize-debugging-options -enable-testing -index-store-path /Users/admin/builder/spi-builder-workspace/.derivedData/Index.noindex/DataStore -swift-version 5 -I /Users/admin/builder/spi-builder-workspace/.derivedData/Build/Products/Debug-watchos -I /Applications/Xcode-16.3.0.app/Contents/Developer/Platforms/WatchOS.platform/Developer/usr/lib -F /Users/admin/builder/spi-builder-workspace/.derivedData/Build/Products/Debug-watchos -F /Applications/Xcode-16.3.0.app/Contents/Developer/Platforms/WatchOS.platform/Developer/Library/Frameworks -F /Applications/Xcode-16.3.0.app/Contents/Developer/Platforms/WatchOS.platform/Developer/SDKs/WatchOS11.4.sdk/Developer/Library/Frameworks -emit-localized-strings -emit-localized-strings-path /Users/admin/builder/spi-builder-workspace/.derivedData/Build/Intermediates.noindex/PhotoSelectAndCrop.build/Debug-watchos/PhotoSelectAndCrop.build/Objects-normal/arm64 -c -j10 -enable-batch-mode -incremental -Xcc -ivfsstatcache -Xcc /Users/admin/builder/spi-builder-workspace/.derivedData/SDKStatCaches.noindex/watchos11.4-22T246-43efb940ff07ba2497b70ec94253f576.sdkstatcache -output-file-map /Users/admin/builder/spi-builder-workspace/.derivedData/Build/Intermediates.noindex/PhotoSelectAndCrop.build/Debug-watchos/PhotoSelectAndCrop.build/Objects-normal/arm64/PhotoSelectAndCrop-OutputFileMap.json -use-frontend-parseable-output -save-temps -no-color-diagnostics -serialize-diagnostics -emit-dependencies -emit-module -emit-module-path /Users/admin/builder/spi-builder-workspace/.derivedData/Build/Intermediates.noindex/PhotoSelectAndCrop.build/Debug-watchos/PhotoSelectAndCrop.build/Objects-normal/arm64/PhotoSelectAndCrop.swiftmodule -validate-clang-modules-once -clang-build-session-file /Users/admin/builder/spi-builder-workspace/.derivedData/ModuleCache.noindex/Session.modulevalidation -Xcc -I/Users/admin/builder/spi-builder-workspace/.derivedData/Build/Intermediates.noindex/PhotoSelectAndCrop.build/Debug-watchos/PhotoSelectAndCrop.build/swift-overrides.hmap -emit-const-values -Xfrontend -const-gather-protocols-file -Xfrontend /Users/admin/builder/spi-builder-workspace/.derivedData/Build/Intermediates.noindex/PhotoSelectAndCrop.build/Debug-watchos/PhotoSelectAndCrop.build/Objects-normal/arm64/PhotoSelectAndCrop_const_extract_protocols.json -Xcc -I/Users/admin/builder/spi-builder-workspace/.derivedData/Build/Products/Debug-watchos/include -Xcc -I/Users/admin/builder/spi-builder-workspace/.derivedData/Build/Intermediates.noindex/PhotoSelectAndCrop.build/Debug-watchos/PhotoSelectAndCrop.build/DerivedSources-normal/arm64 -Xcc -I/Users/admin/builder/spi-builder-workspace/.derivedData/Build/Intermediates.noindex/PhotoSelectAndCrop.build/Debug-watchos/PhotoSelectAndCrop.build/DerivedSources/arm64 -Xcc -I/Users/admin/builder/spi-builder-workspace/.derivedData/Build/Intermediates.noindex/PhotoSelectAndCrop.build/Debug-watchos/PhotoSelectAndCrop.build/DerivedSources -Xcc -DSWIFT_PACKAGE -Xcc -DDEBUG\=1 -emit-objc-header -emit-objc-header-path /Users/admin/builder/spi-builder-workspace/.derivedData/Build/Intermediates.noindex/PhotoSelectAndCrop.build/Debug-watchos/PhotoSelectAndCrop.build/Objects-normal/arm64/PhotoSelectAndCrop-Swift.h -working-directory /Users/admin/builder/spi-builder-workspace/.swiftpm/xcode -experimental-emit-module-separately -disable-cmo
SwiftDriver PhotoSelectAndCrop normal arm64_32 com.apple.xcode.tools.swift.compiler (in target 'PhotoSelectAndCrop' from project 'PhotoSelectAndCrop')
cd /Users/admin/builder/spi-builder-workspace/.swiftpm/xcode
builtin-SwiftDriver -- /Applications/Xcode-16.3.0.app/Contents/Developer/Toolchains/XcodeDefault.xctoolchain/usr/bin/swiftc -module-name PhotoSelectAndCrop -Onone -enforce-exclusivity\=checked @/Users/admin/builder/spi-builder-workspace/.derivedData/Build/Intermediates.noindex/PhotoSelectAndCrop.build/Debug-watchos/PhotoSelectAndCrop.build/Objects-normal/arm64_32/PhotoSelectAndCrop.SwiftFileList -DSWIFT_PACKAGE -DDEBUG -stats-output-dir .stats -strict-concurrency\=complete -enable-upcoming-feature StrictConcurrency -enable-upcoming-feature DisableOutwardActorInference -enable-upcoming-feature GlobalActorIsolatedTypesUsability -enable-upcoming-feature InferSendableFromCaptures -plugin-path /Applications/Xcode-16.3.0.app/Contents/Developer/Toolchains/XcodeDefault.xctoolchain/usr/lib/swift/host/plugins/testing -enable-experimental-feature DebugDescriptionMacro -sdk /Applications/Xcode-16.3.0.app/Contents/Developer/Platforms/WatchOS.platform/Developer/SDKs/WatchOS11.4.sdk -target arm64_32-apple-watchos8.0 -g -module-cache-path /Users/admin/builder/spi-builder-workspace/.derivedData/ModuleCache.noindex -Xfrontend -serialize-debugging-options -enable-testing -index-store-path /Users/admin/builder/spi-builder-workspace/.derivedData/Index.noindex/DataStore -swift-version 5 -I /Users/admin/builder/spi-builder-workspace/.derivedData/Build/Products/Debug-watchos -I /Applications/Xcode-16.3.0.app/Contents/Developer/Platforms/WatchOS.platform/Developer/usr/lib -F /Users/admin/builder/spi-builder-workspace/.derivedData/Build/Products/Debug-watchos -F /Applications/Xcode-16.3.0.app/Contents/Developer/Platforms/WatchOS.platform/Developer/Library/Frameworks -F /Applications/Xcode-16.3.0.app/Contents/Developer/Platforms/WatchOS.platform/Developer/SDKs/WatchOS11.4.sdk/Developer/Library/Frameworks -emit-localized-strings -emit-localized-strings-path /Users/admin/builder/spi-builder-workspace/.derivedData/Build/Intermediates.noindex/PhotoSelectAndCrop.build/Debug-watchos/PhotoSelectAndCrop.build/Objects-normal/arm64_32 -c -j10 -enable-batch-mode -incremental -Xcc -ivfsstatcache -Xcc /Users/admin/builder/spi-builder-workspace/.derivedData/SDKStatCaches.noindex/watchos11.4-22T246-43efb940ff07ba2497b70ec94253f576.sdkstatcache -output-file-map /Users/admin/builder/spi-builder-workspace/.derivedData/Build/Intermediates.noindex/PhotoSelectAndCrop.build/Debug-watchos/PhotoSelectAndCrop.build/Objects-normal/arm64_32/PhotoSelectAndCrop-OutputFileMap.json -use-frontend-parseable-output -save-temps -no-color-diagnostics -serialize-diagnostics -emit-dependencies -emit-module -emit-module-path /Users/admin/builder/spi-builder-workspace/.derivedData/Build/Intermediates.noindex/PhotoSelectAndCrop.build/Debug-watchos/PhotoSelectAndCrop.build/Objects-normal/arm64_32/PhotoSelectAndCrop.swiftmodule -validate-clang-modules-once -clang-build-session-file /Users/admin/builder/spi-builder-workspace/.derivedData/ModuleCache.noindex/Session.modulevalidation -Xcc -I/Users/admin/builder/spi-builder-workspace/.derivedData/Build/Intermediates.noindex/PhotoSelectAndCrop.build/Debug-watchos/PhotoSelectAndCrop.build/swift-overrides.hmap -emit-const-values -Xfrontend -const-gather-protocols-file -Xfrontend /Users/admin/builder/spi-builder-workspace/.derivedData/Build/Intermediates.noindex/PhotoSelectAndCrop.build/Debug-watchos/PhotoSelectAndCrop.build/Objects-normal/arm64_32/PhotoSelectAndCrop_const_extract_protocols.json -Xcc -I/Users/admin/builder/spi-builder-workspace/.derivedData/Build/Products/Debug-watchos/include -Xcc -I/Users/admin/builder/spi-builder-workspace/.derivedData/Build/Intermediates.noindex/PhotoSelectAndCrop.build/Debug-watchos/PhotoSelectAndCrop.build/DerivedSources-normal/arm64_32 -Xcc -I/Users/admin/builder/spi-builder-workspace/.derivedData/Build/Intermediates.noindex/PhotoSelectAndCrop.build/Debug-watchos/PhotoSelectAndCrop.build/DerivedSources/arm64_32 -Xcc -I/Users/admin/builder/spi-builder-workspace/.derivedData/Build/Intermediates.noindex/PhotoSelectAndCrop.build/Debug-watchos/PhotoSelectAndCrop.build/DerivedSources -Xcc -DSWIFT_PACKAGE -Xcc -DDEBUG\=1 -emit-objc-header -emit-objc-header-path /Users/admin/builder/spi-builder-workspace/.derivedData/Build/Intermediates.noindex/PhotoSelectAndCrop.build/Debug-watchos/PhotoSelectAndCrop.build/Objects-normal/arm64_32/PhotoSelectAndCrop-Swift.h -working-directory /Users/admin/builder/spi-builder-workspace/.swiftpm/xcode -experimental-emit-module-separately -disable-cmo
SwiftDriver PhotoSelectAndCrop normal armv7k com.apple.xcode.tools.swift.compiler (in target 'PhotoSelectAndCrop' from project 'PhotoSelectAndCrop')
cd /Users/admin/builder/spi-builder-workspace/.swiftpm/xcode
builtin-SwiftDriver -- /Applications/Xcode-16.3.0.app/Contents/Developer/Toolchains/XcodeDefault.xctoolchain/usr/bin/swiftc -module-name PhotoSelectAndCrop -Onone -enforce-exclusivity\=checked @/Users/admin/builder/spi-builder-workspace/.derivedData/Build/Intermediates.noindex/PhotoSelectAndCrop.build/Debug-watchos/PhotoSelectAndCrop.build/Objects-normal/armv7k/PhotoSelectAndCrop.SwiftFileList -DSWIFT_PACKAGE -DDEBUG -stats-output-dir .stats -strict-concurrency\=complete -enable-upcoming-feature StrictConcurrency -enable-upcoming-feature DisableOutwardActorInference -enable-upcoming-feature GlobalActorIsolatedTypesUsability -enable-upcoming-feature InferSendableFromCaptures -plugin-path /Applications/Xcode-16.3.0.app/Contents/Developer/Toolchains/XcodeDefault.xctoolchain/usr/lib/swift/host/plugins/testing -enable-experimental-feature DebugDescriptionMacro -sdk /Applications/Xcode-16.3.0.app/Contents/Developer/Platforms/WatchOS.platform/Developer/SDKs/WatchOS11.4.sdk -target armv7k-apple-watchos8.0 -g -module-cache-path /Users/admin/builder/spi-builder-workspace/.derivedData/ModuleCache.noindex -Xfrontend -serialize-debugging-options -enable-testing -index-store-path /Users/admin/builder/spi-builder-workspace/.derivedData/Index.noindex/DataStore -swift-version 5 -I /Users/admin/builder/spi-builder-workspace/.derivedData/Build/Products/Debug-watchos -I /Applications/Xcode-16.3.0.app/Contents/Developer/Platforms/WatchOS.platform/Developer/usr/lib -F /Users/admin/builder/spi-builder-workspace/.derivedData/Build/Products/Debug-watchos -F /Applications/Xcode-16.3.0.app/Contents/Developer/Platforms/WatchOS.platform/Developer/Library/Frameworks -F /Applications/Xcode-16.3.0.app/Contents/Developer/Platforms/WatchOS.platform/Developer/SDKs/WatchOS11.4.sdk/Developer/Library/Frameworks -emit-localized-strings -emit-localized-strings-path /Users/admin/builder/spi-builder-workspace/.derivedData/Build/Intermediates.noindex/PhotoSelectAndCrop.build/Debug-watchos/PhotoSelectAndCrop.build/Objects-normal/armv7k -c -j10 -enable-batch-mode -incremental -Xcc -ivfsstatcache -Xcc /Users/admin/builder/spi-builder-workspace/.derivedData/SDKStatCaches.noindex/watchos11.4-22T246-43efb940ff07ba2497b70ec94253f576.sdkstatcache -output-file-map /Users/admin/builder/spi-builder-workspace/.derivedData/Build/Intermediates.noindex/PhotoSelectAndCrop.build/Debug-watchos/PhotoSelectAndCrop.build/Objects-normal/armv7k/PhotoSelectAndCrop-OutputFileMap.json -use-frontend-parseable-output -save-temps -no-color-diagnostics -serialize-diagnostics -emit-dependencies -emit-module -emit-module-path /Users/admin/builder/spi-builder-workspace/.derivedData/Build/Intermediates.noindex/PhotoSelectAndCrop.build/Debug-watchos/PhotoSelectAndCrop.build/Objects-normal/armv7k/PhotoSelectAndCrop.swiftmodule -validate-clang-modules-once -clang-build-session-file /Users/admin/builder/spi-builder-workspace/.derivedData/ModuleCache.noindex/Session.modulevalidation -Xcc -I/Users/admin/builder/spi-builder-workspace/.derivedData/Build/Intermediates.noindex/PhotoSelectAndCrop.build/Debug-watchos/PhotoSelectAndCrop.build/swift-overrides.hmap -emit-const-values -Xfrontend -const-gather-protocols-file -Xfrontend /Users/admin/builder/spi-builder-workspace/.derivedData/Build/Intermediates.noindex/PhotoSelectAndCrop.build/Debug-watchos/PhotoSelectAndCrop.build/Objects-normal/armv7k/PhotoSelectAndCrop_const_extract_protocols.json -Xcc -I/Users/admin/builder/spi-builder-workspace/.derivedData/Build/Products/Debug-watchos/include -Xcc -I/Users/admin/builder/spi-builder-workspace/.derivedData/Build/Intermediates.noindex/PhotoSelectAndCrop.build/Debug-watchos/PhotoSelectAndCrop.build/DerivedSources-normal/armv7k -Xcc -I/Users/admin/builder/spi-builder-workspace/.derivedData/Build/Intermediates.noindex/PhotoSelectAndCrop.build/Debug-watchos/PhotoSelectAndCrop.build/DerivedSources/armv7k -Xcc -I/Users/admin/builder/spi-builder-workspace/.derivedData/Build/Intermediates.noindex/PhotoSelectAndCrop.build/Debug-watchos/PhotoSelectAndCrop.build/DerivedSources -Xcc -DSWIFT_PACKAGE -Xcc -DDEBUG\=1 -emit-objc-header -emit-objc-header-path /Users/admin/builder/spi-builder-workspace/.derivedData/Build/Intermediates.noindex/PhotoSelectAndCrop.build/Debug-watchos/PhotoSelectAndCrop.build/Objects-normal/armv7k/PhotoSelectAndCrop-Swift.h -working-directory /Users/admin/builder/spi-builder-workspace/.swiftpm/xcode -experimental-emit-module-separately -disable-cmo
SwiftCompile normal arm64 Compiling\ DeviceOrientation.swift,\ Image+Extensions.swift /Users/admin/builder/spi-builder-workspace/Sources/DeviceOrientation.swift /Users/admin/builder/spi-builder-workspace/Sources/Image+Extensions.swift (in target 'PhotoSelectAndCrop' from project 'PhotoSelectAndCrop')
SwiftCompile normal arm64 /Users/admin/builder/spi-builder-workspace/Sources/DeviceOrientation.swift (in target 'PhotoSelectAndCrop' from project 'PhotoSelectAndCrop')
cd /Users/admin/builder/spi-builder-workspace/.swiftpm/xcode
/Users/admin/builder/spi-builder-workspace/Sources/DeviceOrientation.swift:21:60: error: cannot find 'UIDevice' in scope
@Published private(set) var orientation: Orientation = UIDevice.current.orientation.isLandscape ? .landscape : .portrait
^~~~~~~~
/Users/admin/builder/spi-builder-workspace/Sources/DeviceOrientation.swift:24:51: error: cannot find 'UIDevice' in scope
NotificationCenter.default.publisher(for: UIDevice.orientationDidChangeNotification)
^~~~~~~~
/Users/admin/builder/spi-builder-workspace/Sources/DeviceOrientation.swift:26:60: error: cannot find type 'UIDevice' in scope
guard let device = notification.object as? UIDevice else { return nil }
^~~~~~~~
SwiftCompile normal arm64 /Users/admin/builder/spi-builder-workspace/Sources/Image+Extensions.swift (in target 'PhotoSelectAndCrop' from project 'PhotoSelectAndCrop')
cd /Users/admin/builder/spi-builder-workspace/.swiftpm/xcode
Failed frontend command:
/Applications/Xcode-16.3.0.app/Contents/Developer/Toolchains/XcodeDefault.xctoolchain/usr/bin/swift-frontend -frontend -c /Users/admin/builder/spi-builder-workspace/.derivedData/Build/Intermediates.noindex/PhotoSelectAndCrop.build/Debug-watchos/PhotoSelectAndCrop.build/DerivedSources/resource_bundle_accessor.swift /Users/admin/builder/spi-builder-workspace/Sources/Color+Extensions.swift -primary-file /Users/admin/builder/spi-builder-workspace/Sources/DeviceOrientation.swift -primary-file /Users/admin/builder/spi-builder-workspace/Sources/Image+Extensions.swift /Users/admin/builder/spi-builder-workspace/Sources/ImageAttributes.swift /Users/admin/builder/spi-builder-workspace/Sources/ImageManipulation.swift /Users/admin/builder/spi-builder-workspace/Sources/ImageMoveAndScaleSheet+Extensions.swift /Users/admin/builder/spi-builder-workspace/Sources/ImageMoveAndScaleSheet+ViewModel.swift /Users/admin/builder/spi-builder-workspace/Sources/ImageMoveAndScaleSheet.swift /Users/admin/builder/spi-builder-workspace/Sources/ImagePane.swift /Users/admin/builder/spi-builder-workspace/Sources/SystemImagePicker.swift /Users/admin/builder/spi-builder-workspace/Sources/SystemPHPicker.swift /Users/admin/builder/spi-builder-workspace/Sources/ViewModifiers.swift -emit-dependencies-path /Users/admin/builder/spi-builder-workspace/.derivedData/Build/Intermediates.noindex/PhotoSelectAndCrop.build/Debug-watchos/PhotoSelectAndCrop.build/Objects-normal/arm64/DeviceOrientation.d -emit-const-values-path /Users/admin/builder/spi-builder-workspace/.derivedData/Build/Intermediates.noindex/PhotoSelectAndCrop.build/Debug-watchos/PhotoSelectAndCrop.build/Objects-normal/arm64/DeviceOrientation.swiftconstvalues -emit-reference-dependencies-path /Users/admin/builder/spi-builder-workspace/.derivedData/Build/Intermediates.noindex/PhotoSelectAndCrop.build/Debug-watchos/PhotoSelectAndCrop.build/Objects-normal/arm64/DeviceOrientation.swiftdeps -serialize-diagnostics-path /Users/admin/builder/spi-builder-workspace/.derivedData/Build/Intermediates.noindex/PhotoSelectAndCrop.build/Debug-watchos/PhotoSelectAndCrop.build/Objects-normal/arm64/DeviceOrientation.dia -emit-dependencies-path /Users/admin/builder/spi-builder-workspace/.derivedData/Build/Intermediates.noindex/PhotoSelectAndCrop.build/Debug-watchos/PhotoSelectAndCrop.build/Objects-normal/arm64/Image+Extensions.d -emit-const-values-path /Users/admin/builder/spi-builder-workspace/.derivedData/Build/Intermediates.noindex/PhotoSelectAndCrop.build/Debug-watchos/PhotoSelectAndCrop.build/Objects-normal/arm64/Image+Extensions.swiftconstvalues -emit-reference-dependencies-path /Users/admin/builder/spi-builder-workspace/.derivedData/Build/Intermediates.noindex/PhotoSelectAndCrop.build/Debug-watchos/PhotoSelectAndCrop.build/Objects-normal/arm64/Image+Extensions.swiftdeps -serialize-diagnostics-path /Users/admin/builder/spi-builder-workspace/.derivedData/Build/Intermediates.noindex/PhotoSelectAndCrop.build/Debug-watchos/PhotoSelectAndCrop.build/Objects-normal/arm64/Image+Extensions.dia -emit-localized-strings -emit-localized-strings-path /Users/admin/builder/spi-builder-workspace/.derivedData/Build/Intermediates.noindex/PhotoSelectAndCrop.build/Debug-watchos/PhotoSelectAndCrop.build/Objects-normal/arm64 -target arm64-apple-watchos8.0 -Xllvm -aarch64-use-tbi -enable-objc-interop -stack-check -sdk /Applications/Xcode-16.3.0.app/Contents/Developer/Platforms/WatchOS.platform/Developer/SDKs/WatchOS11.4.sdk -I /Users/admin/builder/spi-builder-workspace/.derivedData/Build/Products/Debug-watchos -I /Applications/Xcode-16.3.0.app/Contents/Developer/Platforms/WatchOS.platform/Developer/usr/lib -F /Users/admin/builder/spi-builder-workspace/.derivedData/Build/Products/Debug-watchos -F /Applications/Xcode-16.3.0.app/Contents/Developer/Platforms/WatchOS.platform/Developer/Library/Frameworks -F /Applications/Xcode-16.3.0.app/Contents/Developer/Platforms/WatchOS.platform/Developer/SDKs/WatchOS11.4.sdk/Developer/Library/Frameworks -no-color-diagnostics -enable-testing -g -debug-info-format\=dwarf -dwarf-version\=4 -module-cache-path /Users/admin/builder/spi-builder-workspace/.derivedData/ModuleCache.noindex -swift-version 5 -enforce-exclusivity\=checked -stats-output-dir /Users/admin/builder/spi-builder-workspace/.swiftpm/xcode/.stats -Onone -D SWIFT_PACKAGE -D DEBUG -serialize-debugging-options -const-gather-protocols-file /Users/admin/builder/spi-builder-workspace/.derivedData/Build/Intermediates.noindex/PhotoSelectAndCrop.build/Debug-watchos/PhotoSelectAndCrop.build/Objects-normal/arm64/PhotoSelectAndCrop_const_extract_protocols.json -enable-upcoming-feature StrictConcurrency -enable-upcoming-feature DisableOutwardActorInference -enable-upcoming-feature GlobalActorIsolatedTypesUsability -enable-upcoming-feature InferSendableFromCaptures -enable-experimental-feature DebugDescriptionMacro -strict-concurrency\=complete -empty-abi-descriptor -plugin-path /Applications/Xcode-16.3.0.app/Contents/Developer/Toolchains/XcodeDefault.xctoolchain/usr/lib/swift/host/plugins/testing -validate-clang-modules-once -clang-build-session-file /Users/admin/builder/spi-builder-workspace/.derivedData/ModuleCache.noindex/Session.modulevalidation -Xcc -working-directory -Xcc /Users/admin/builder/spi-builder-workspace/.swiftpm/xcode -resource-dir /Applications/Xcode-16.3.0.app/Contents/Developer/Toolchains/XcodeDefault.xctoolchain/usr/lib/swift -enable-anonymous-context-mangled-names -file-compilation-dir /Users/admin/builder/spi-builder-workspace/.swiftpm/xcode -Xcc -ivfsstatcache -Xcc /Users/admin/builder/spi-builder-workspace/.derivedData/SDKStatCaches.noindex/watchos11.4-22T246-43efb940ff07ba2497b70ec94253f576.sdkstatcache -Xcc -I/Users/admin/builder/spi-builder-workspace/.derivedData/Build/Intermediates.noindex/PhotoSelectAndCrop.build/Debug-watchos/PhotoSelectAndCrop.build/swift-overrides.hmap -Xcc -I/Users/admin/builder/spi-builder-workspace/.derivedData/Build/Products/Debug-watchos/include -Xcc -I/Users/admin/builder/spi-builder-workspace/.derivedData/Build/Intermediates.noindex/PhotoSelectAndCrop.build/Debug-watchos/PhotoSelectAndCrop.build/DerivedSources-normal/arm64 -Xcc -I/Users/admin/builder/spi-builder-workspace/.derivedData/Build/Intermediates.noindex/PhotoSelectAndCrop.build/Debug-watchos/PhotoSelectAndCrop.build/DerivedSources/arm64 -Xcc -I/Users/admin/builder/spi-builder-workspace/.derivedData/Build/Intermediates.noindex/PhotoSelectAndCrop.build/Debug-watchos/PhotoSelectAndCrop.build/DerivedSources -Xcc -DSWIFT_PACKAGE -Xcc -DDEBUG\=1 -module-name PhotoSelectAndCrop -frontend-parseable-output -disable-clang-spi -target-sdk-version 11.4 -target-sdk-name watchos11.4 -external-plugin-path /Applications/Xcode-16.3.0.app/Contents/Developer/Platforms/WatchOS.platform/Developer/usr/lib/swift/host/plugins\#/Applications/Xcode-16.3.0.app/Contents/Developer/Platforms/WatchOS.platform/Developer/usr/bin/swift-plugin-server -external-plugin-path /Applications/Xcode-16.3.0.app/Contents/Developer/Platforms/WatchOS.platform/Developer/usr/local/lib/swift/host/plugins\#/Applications/Xcode-16.3.0.app/Contents/Developer/Platforms/WatchOS.platform/Developer/usr/bin/swift-plugin-server -in-process-plugin-server-path /Applications/Xcode-16.3.0.app/Contents/Developer/Toolchains/XcodeDefault.xctoolchain/usr/lib/swift/host/libSwiftInProcPluginServer.dylib -plugin-path /Applications/Xcode-16.3.0.app/Contents/Developer/Toolchains/XcodeDefault.xctoolchain/usr/lib/swift/host/plugins -plugin-path /Applications/Xcode-16.3.0.app/Contents/Developer/Toolchains/XcodeDefault.xctoolchain/usr/local/lib/swift/host/plugins -o /Users/admin/builder/spi-builder-workspace/.derivedData/Build/Intermediates.noindex/PhotoSelectAndCrop.build/Debug-watchos/PhotoSelectAndCrop.build/Objects-normal/arm64/DeviceOrientation.o -o /Users/admin/builder/spi-builder-workspace/.derivedData/Build/Intermediates.noindex/PhotoSelectAndCrop.build/Debug-watchos/PhotoSelectAndCrop.build/Objects-normal/arm64/Image+Extensions.o -index-unit-output-path /PhotoSelectAndCrop.build/Debug-watchos/PhotoSelectAndCrop.build/Objects-normal/arm64/DeviceOrientation.o -index-unit-output-path /PhotoSelectAndCrop.build/Debug-watchos/PhotoSelectAndCrop.build/Objects-normal/arm64/Image+Extensions.o -index-store-path /Users/admin/builder/spi-builder-workspace/.derivedData/Index.noindex/DataStore -index-system-modules
SwiftCompile normal arm64 Compiling\ ImageMoveAndScaleSheet+Extensions.swift /Users/admin/builder/spi-builder-workspace/Sources/ImageMoveAndScaleSheet+Extensions.swift (in target 'PhotoSelectAndCrop' from project 'PhotoSelectAndCrop')
SwiftCompile normal arm64 /Users/admin/builder/spi-builder-workspace/Sources/ImageMoveAndScaleSheet+Extensions.swift (in target 'PhotoSelectAndCrop' from project 'PhotoSelectAndCrop')
cd /Users/admin/builder/spi-builder-workspace/.swiftpm/xcode
SwiftCompile normal arm64 Compiling\ ImageMoveAndScaleSheet+ViewModel.swift /Users/admin/builder/spi-builder-workspace/Sources/ImageMoveAndScaleSheet+ViewModel.swift (in target 'PhotoSelectAndCrop' from project 'PhotoSelectAndCrop')
SwiftCompile normal arm64 /Users/admin/builder/spi-builder-workspace/Sources/ImageMoveAndScaleSheet+ViewModel.swift (in target 'PhotoSelectAndCrop' from project 'PhotoSelectAndCrop')
cd /Users/admin/builder/spi-builder-workspace/.swiftpm/xcode
SwiftCompile normal arm64 Compiling\ ImageMoveAndScaleSheet.swift /Users/admin/builder/spi-builder-workspace/Sources/ImageMoveAndScaleSheet.swift (in target 'PhotoSelectAndCrop' from project 'PhotoSelectAndCrop')
SwiftCompile normal arm64 /Users/admin/builder/spi-builder-workspace/Sources/ImageMoveAndScaleSheet.swift (in target 'PhotoSelectAndCrop' from project 'PhotoSelectAndCrop')
cd /Users/admin/builder/spi-builder-workspace/.swiftpm/xcode
SwiftCompile normal arm64 Compiling\ ViewModifiers.swift /Users/admin/builder/spi-builder-workspace/Sources/ViewModifiers.swift (in target 'PhotoSelectAndCrop' from project 'PhotoSelectAndCrop')
SwiftCompile normal arm64 /Users/admin/builder/spi-builder-workspace/Sources/ViewModifiers.swift (in target 'PhotoSelectAndCrop' from project 'PhotoSelectAndCrop')
cd /Users/admin/builder/spi-builder-workspace/.swiftpm/xcode
SwiftCompile normal arm64 Compiling\ SystemPHPicker.swift /Users/admin/builder/spi-builder-workspace/Sources/SystemPHPicker.swift (in target 'PhotoSelectAndCrop' from project 'PhotoSelectAndCrop')
SwiftCompile normal arm64 /Users/admin/builder/spi-builder-workspace/Sources/SystemPHPicker.swift (in target 'PhotoSelectAndCrop' from project 'PhotoSelectAndCrop')
cd /Users/admin/builder/spi-builder-workspace/.swiftpm/xcode
/Users/admin/builder/spi-builder-workspace/Sources/SystemPHPicker.swift:28:47: error: cannot find type 'Context' in scope
public func makeUIViewController(context: Context) -> PHPickerViewController {
^~~~~~~
/Users/admin/builder/spi-builder-workspace/Sources/SystemPHPicker.swift:28:59: error: 'PHPickerViewController' is unavailable in watchOS
public func makeUIViewController(context: Context) -> PHPickerViewController {
^~~~~~~~~~~~~~~~~~~~~~
/Applications/Xcode-16.3.0.app/Contents/Developer/Platforms/WatchOS.platform/Developer/SDKs/WatchOS11.4.sdk/System/Library/Frameworks/PhotosUI.framework/Headers/PHPicker.h:236:12: note: 'PHPickerViewController' has been explicitly marked unavailable here
@interface PHPickerViewController : NSObject
^
/Users/admin/builder/spi-builder-workspace/Sources/SystemPHPicker.swift:38:93: error: cannot find type 'Context' in scope
public func updateUIViewController(_ uiViewController: PHPickerViewController, context: Context) {
^~~~~~~
/Users/admin/builder/spi-builder-workspace/Sources/SystemPHPicker.swift:38:60: error: 'PHPickerViewController' is unavailable in watchOS
public func updateUIViewController(_ uiViewController: PHPickerViewController, context: Context) {
^~~~~~~~~~~~~~~~~~~~~~
/Applications/Xcode-16.3.0.app/Contents/Developer/Platforms/WatchOS.platform/Developer/SDKs/WatchOS11.4.sdk/System/Library/Frameworks/PhotosUI.framework/Headers/PHPicker.h:236:12: note: 'PHPickerViewController' has been explicitly marked unavailable here
@interface PHPickerViewController : NSObject
^
/Users/admin/builder/spi-builder-workspace/Sources/SystemPHPicker.swift:53:38: error: 'PHPickerViewController' is unavailable in watchOS
public func picker(_ picker: PHPickerViewController, didFinishPicking results: [PHPickerResult]) {
^~~~~~~~~~~~~~~~~~~~~~
/Applications/Xcode-16.3.0.app/Contents/Developer/Platforms/WatchOS.platform/Developer/SDKs/WatchOS11.4.sdk/System/Library/Frameworks/PhotosUI.framework/Headers/PHPicker.h:236:12: note: 'PHPickerViewController' has been explicitly marked unavailable here
@interface PHPickerViewController : NSObject
^
/Users/admin/builder/spi-builder-workspace/Sources/SystemPHPicker.swift:53:89: error: 'PHPickerResult' is unavailable in watchOS
public func picker(_ picker: PHPickerViewController, didFinishPicking results: [PHPickerResult]) {
^~~~~~~~~~~~~~
PhotosUI.PHPickerResult:4:15: note: 'PHPickerResult' has been explicitly marked unavailable here
public struct PHPickerResult : Equatable, Hashable {
^
/Users/admin/builder/spi-builder-workspace/Sources/SystemPHPicker.swift:46:41: error: 'PHPickerViewControllerDelegate' is unavailable in watchOS
public class Coordinator: NSObject, PHPickerViewControllerDelegate {
^~~~~~~~~~~~~~~~~~~~~~~~~~~~~~
PhotosUI.PHPickerViewControllerDelegate:4:44: note: 'PHPickerViewControllerDelegate' has been explicitly marked unavailable here
@MainActor @preconcurrency public protocol PHPickerViewControllerDelegate : AnyObject {
^
/Users/admin/builder/spi-builder-workspace/Sources/SystemPHPicker.swift:22:31: error: cannot find type 'UIViewControllerRepresentable' in scope
public struct SystemPHPicker: UIViewControllerRepresentable {
^~~~~~~~~~~~~~~~~~~~~~~~~~~~~
/Users/admin/builder/spi-builder-workspace/Sources/SystemPHPicker.swift:29:29: error: 'PHPickerConfiguration' is unavailable in watchOS
var configuration = PHPickerConfiguration()
^~~~~~~~~~~~~~~~~~~~~
PhotosUI.PHPickerConfiguration:4:15: note: 'PHPickerConfiguration' has been explicitly marked unavailable here
public struct PHPickerConfiguration : Equatable, Hashable, @unchecked Sendable {
^
/Users/admin/builder/spi-builder-workspace/Sources/SystemPHPicker.swift:33:22: error: 'PHPickerViewController' is unavailable in watchOS
let picker = PHPickerViewController(configuration: configuration)
^~~~~~~~~~~~~~~~~~~~~~
/Applications/Xcode-16.3.0.app/Contents/Developer/Platforms/WatchOS.platform/Developer/SDKs/WatchOS11.4.sdk/System/Library/Frameworks/PhotosUI.framework/Headers/PHPicker.h:236:12: note: 'PHPickerViewController' has been explicitly marked unavailable here
@interface PHPickerViewController : NSObject
^
/Users/admin/builder/spi-builder-workspace/Sources/SystemPHPicker.swift:33:22: error: 'init(configuration:)' is unavailable in watchOS
let picker = PHPickerViewController(configuration: configuration)
^~~~~~~~~~~~~~~~~~~~~~
PhotosUI.PHPickerViewController.init:2:47: note: 'init(configuration:)' has been explicitly marked unavailable here
@MainActor @preconcurrency public convenience init(configuration: PHPickerConfiguration)}
^
/Users/admin/builder/spi-builder-workspace/Sources/SystemPHPicker.swift:33:22: warning: call to main actor-isolated initializer 'init(configuration:)' in a synchronous nonisolated context; this is an error in the Swift 6 language mode
let picker = PHPickerViewController(configuration: configuration)
^
PhotosUI.PHPickerViewController.init:2:47: note: calls to initializer 'init(configuration:)' from outside of its actor context are implicitly asynchronous
@MainActor @preconcurrency public convenience init(configuration: PHPickerConfiguration)}
^
/Users/admin/builder/spi-builder-workspace/Sources/SystemPHPicker.swift:28:17: note: add '@MainActor' to make instance method 'makeUIViewController(context:)' part of global actor 'MainActor'
public func makeUIViewController(context: Context) -> PHPickerViewController {
^
@MainActor
/Users/admin/builder/spi-builder-workspace/Sources/SystemPHPicker.swift:43:16: warning: call to main actor-isolated initializer 'init(parent:)' in a synchronous nonisolated context; this is an error in the Swift 6 language mode
return Coordinator(parent: self)
^
/Users/admin/builder/spi-builder-workspace/Sources/SystemPHPicker.swift:49:9: note: calls to initializer 'init(parent:)' from outside of its actor context are implicitly asynchronous
init(parent: SystemPHPicker) {
^
/Users/admin/builder/spi-builder-workspace/Sources/SystemPHPicker.swift:49:9: note: main actor isolation inferred from conformance to protocol 'PHPickerViewControllerDelegate'
init(parent: SystemPHPicker) {
^
/Users/admin/builder/spi-builder-workspace/Sources/SystemPHPicker.swift:42:17: note: add '@MainActor' to make instance method 'makeCoordinator()' part of global actor 'MainActor'
public func makeCoordinator() -> Coordinator {
^
@MainActor
/Users/admin/builder/spi-builder-workspace/Sources/SystemPHPicker.swift:63:26: warning: main actor-isolated property 'parent' can not be mutated from a Sendable closure; this is an error in the Swift 6 language mode
self.parent.image = image
^
/Users/admin/builder/spi-builder-workspace/Sources/SystemPHPicker.swift:47:13: note: mutation of this property is only permitted within the actor
let parent: SystemPHPicker
^
/Users/admin/builder/spi-builder-workspace/Sources/SystemPHPicker.swift:64:26: warning: main actor-isolated property 'parent' can not be mutated from a Sendable closure; this is an error in the Swift 6 language mode
self.parent.presentationMode.wrappedValue.dismiss()
^
/Users/admin/builder/spi-builder-workspace/Sources/SystemPHPicker.swift:47:13: note: mutation of this property is only permitted within the actor
let parent: SystemPHPicker
^
SwiftCompile normal arm64 Compiling\ ImagePane.swift /Users/admin/builder/spi-builder-workspace/Sources/ImagePane.swift (in target 'PhotoSelectAndCrop' from project 'PhotoSelectAndCrop')
SwiftCompile normal arm64 /Users/admin/builder/spi-builder-workspace/Sources/ImagePane.swift (in target 'PhotoSelectAndCrop' from project 'PhotoSelectAndCrop')
cd /Users/admin/builder/spi-builder-workspace/.swiftpm/xcode
SwiftEmitModule normal arm64 Emitting\ module\ for\ PhotoSelectAndCrop (in target 'PhotoSelectAndCrop' from project 'PhotoSelectAndCrop')
EmitSwiftModule normal arm64 (in target 'PhotoSelectAndCrop' from project 'PhotoSelectAndCrop')
cd /Users/admin/builder/spi-builder-workspace/.swiftpm/xcode
SwiftCompile normal arm64 Compiling\ resource_bundle_accessor.swift,\ Color+Extensions.swift /Users/admin/builder/spi-builder-workspace/.derivedData/Build/Intermediates.noindex/PhotoSelectAndCrop.build/Debug-watchos/PhotoSelectAndCrop.build/DerivedSources/resource_bundle_accessor.swift /Users/admin/builder/spi-builder-workspace/Sources/Color+Extensions.swift (in target 'PhotoSelectAndCrop' from project 'PhotoSelectAndCrop')
SwiftCompile normal arm64 /Users/admin/builder/spi-builder-workspace/.derivedData/Build/Intermediates.noindex/PhotoSelectAndCrop.build/Debug-watchos/PhotoSelectAndCrop.build/DerivedSources/resource_bundle_accessor.swift (in target 'PhotoSelectAndCrop' from project 'PhotoSelectAndCrop')
cd /Users/admin/builder/spi-builder-workspace/.swiftpm/xcode
SwiftCompile normal arm64 /Users/admin/builder/spi-builder-workspace/Sources/Color+Extensions.swift (in target 'PhotoSelectAndCrop' from project 'PhotoSelectAndCrop')
cd /Users/admin/builder/spi-builder-workspace/.swiftpm/xcode
/Users/admin/builder/spi-builder-workspace/Sources/Color+Extensions.swift:13:30: error: type 'UIColor' has no member 'label'
return Color(UIColor.label)
~~~~~~~ ^~~~~
/Users/admin/builder/spi-builder-workspace/Sources/Color+Extensions.swift:17:30: error: type 'UIColor' has no member 'secondaryLabel'
return Color(UIColor.secondaryLabel)
~~~~~~~ ^~~~~~~~~~~~~~
/Users/admin/builder/spi-builder-workspace/Sources/Color+Extensions.swift:21:30: error: type 'UIColor' has no member 'tertiaryLabel'
return Color(UIColor.tertiaryLabel)
~~~~~~~ ^~~~~~~~~~~~~
/Users/admin/builder/spi-builder-workspace/Sources/Color+Extensions.swift:25:30: error: type 'UIColor' has no member 'quaternaryLabel'
return Color(UIColor.quaternaryLabel)
~~~~~~~ ^~~~~~~~~~~~~~~
/Users/admin/builder/spi-builder-workspace/Sources/Color+Extensions.swift:29:30: error: type 'UIColor' has no member 'systemFill'
return Color(UIColor.systemFill)
~~~~~~~ ^~~~~~~~~~
/Users/admin/builder/spi-builder-workspace/Sources/Color+Extensions.swift:33:30: error: type 'UIColor' has no member 'secondarySystemFill'
return Color(UIColor.secondarySystemFill)
~~~~~~~ ^~~~~~~~~~~~~~~~~~~
/Users/admin/builder/spi-builder-workspace/Sources/Color+Extensions.swift:37:30: error: type 'UIColor' has no member 'tertiarySystemFill'
return Color(UIColor.tertiarySystemFill)
~~~~~~~ ^~~~~~~~~~~~~~~~~~
/Users/admin/builder/spi-builder-workspace/Sources/Color+Extensions.swift:41:30: error: type 'UIColor' has no member 'quaternarySystemFill'
return Color(UIColor.quaternarySystemFill)
~~~~~~~ ^~~~~~~~~~~~~~~~~~~~
/Users/admin/builder/spi-builder-workspace/Sources/Color+Extensions.swift:45:33: error: type 'UIColor' has no member 'systemBackground'
return Color(UIColor.systemBackground)
~~~~~~~ ^~~~~~~~~~~~~~~~
/Users/admin/builder/spi-builder-workspace/Sources/Color+Extensions.swift:49:30: error: type 'UIColor' has no member 'secondarySystemBackground'
return Color(UIColor.secondarySystemBackground)
~~~~~~~ ^~~~~~~~~~~~~~~~~~~~~~~~~
/Users/admin/builder/spi-builder-workspace/Sources/Color+Extensions.swift:53:30: error: type 'UIColor' has no member 'tertiarySystemBackground'
return Color(UIColor.tertiarySystemBackground)
~~~~~~~ ^~~~~~~~~~~~~~~~~~~~~~~~
/Users/admin/builder/spi-builder-workspace/Sources/Color+Extensions.swift:57:30: error: type 'UIColor' has no member 'systemGroupedBackground'
return Color(UIColor.systemGroupedBackground)
~~~~~~~ ^~~~~~~~~~~~~~~~~~~~~~~
/Users/admin/builder/spi-builder-workspace/Sources/Color+Extensions.swift:61:30: error: type 'UIColor' has no member 'secondarySystemGroupedBackground'
return Color(UIColor.secondarySystemGroupedBackground)
~~~~~~~ ^~~~~~~~~~~~~~~~~~~~~~~~~~~~~~~~
/Users/admin/builder/spi-builder-workspace/Sources/Color+Extensions.swift:65:30: error: type 'UIColor' has no member 'tertiarySystemGroupedBackground'
return Color(UIColor.tertiarySystemGroupedBackground)
~~~~~~~ ^~~~~~~~~~~~~~~~~~~~~~~~~~~~~~~
/Users/admin/builder/spi-builder-workspace/Sources/Color+Extensions.swift:69:30: error: type 'UIColor' has no member 'systemRed'
return Color(UIColor.systemRed)
~~~~~~~ ^~~~~~~~~
/Users/admin/builder/spi-builder-workspace/Sources/Color+Extensions.swift:73:30: error: type 'UIColor' has no member 'systemBlue'
return Color(UIColor.systemBlue)
~~~~~~~ ^~~~~~~~~~
/Users/admin/builder/spi-builder-workspace/Sources/Color+Extensions.swift:77:30: error: type 'UIColor' has no member 'systemPink'
return Color(UIColor.systemPink)
~~~~~~~ ^~~~~~~~~~
/Users/admin/builder/spi-builder-workspace/Sources/Color+Extensions.swift:81:30: error: type 'UIColor' has no member 'systemTeal'
return Color(UIColor.systemTeal)
~~~~~~~ ^~~~~~~~~~
/Users/admin/builder/spi-builder-workspace/Sources/Color+Extensions.swift:85:30: error: type 'UIColor' has no member 'systemGreen'
return Color(UIColor.systemGreen)
~~~~~~~ ^~~~~~~~~~~
/Users/admin/builder/spi-builder-workspace/Sources/Color+Extensions.swift:89:30: error: type 'UIColor' has no member 'systemIndigo'
return Color(UIColor.systemIndigo)
~~~~~~~ ^~~~~~~~~~~~
/Users/admin/builder/spi-builder-workspace/Sources/Color+Extensions.swift:93:30: error: type 'UIColor' has no member 'systemOrange'
return Color(UIColor.systemOrange)
~~~~~~~ ^~~~~~~~~~~~
/Users/admin/builder/spi-builder-workspace/Sources/Color+Extensions.swift:97:30: error: type 'UIColor' has no member 'systemPurple'
return Color(UIColor.systemPurple)
~~~~~~~ ^~~~~~~~~~~~
/Users/admin/builder/spi-builder-workspace/Sources/Color+Extensions.swift:101:30: error: type 'UIColor' has no member 'systemYellow'
return Color(UIColor.systemYellow)
~~~~~~~ ^~~~~~~~~~~~
/Users/admin/builder/spi-builder-workspace/Sources/Color+Extensions.swift:105:30: error: type 'UIColor' has no member 'systemGray'
return Color(UIColor.systemGray)
~~~~~~~ ^~~~~~~~~~
/Users/admin/builder/spi-builder-workspace/Sources/Color+Extensions.swift:109:30: error: type 'UIColor' has no member 'systemGray2'
return Color(UIColor.systemGray2)
~~~~~~~ ^~~~~~~~~~~
/Users/admin/builder/spi-builder-workspace/Sources/Color+Extensions.swift:113:30: error: type 'UIColor' has no member 'systemGray3'
return Color(UIColor.systemGray3)
~~~~~~~ ^~~~~~~~~~~
/Users/admin/builder/spi-builder-workspace/Sources/Color+Extensions.swift:117:30: error: type 'UIColor' has no member 'systemGray4'
return Color(UIColor.systemGray4)
~~~~~~~ ^~~~~~~~~~~
/Users/admin/builder/spi-builder-workspace/Sources/Color+Extensions.swift:121:30: error: type 'UIColor' has no member 'systemGray5'
return Color(UIColor.systemGray5)
~~~~~~~ ^~~~~~~~~~~
/Users/admin/builder/spi-builder-workspace/Sources/Color+Extensions.swift:125:30: error: type 'UIColor' has no member 'systemGray6'
return Color(UIColor.systemGray6)
~~~~~~~ ^~~~~~~~~~~
SwiftEmitModule normal arm64_32 Emitting\ module\ for\ PhotoSelectAndCrop (in target 'PhotoSelectAndCrop' from project 'PhotoSelectAndCrop')
EmitSwiftModule normal arm64_32 (in target 'PhotoSelectAndCrop' from project 'PhotoSelectAndCrop')
cd /Users/admin/builder/spi-builder-workspace/.swiftpm/xcode
SwiftEmitModule normal armv7k Emitting\ module\ for\ PhotoSelectAndCrop (in target 'PhotoSelectAndCrop' from project 'PhotoSelectAndCrop')
Command SwiftEmitModule failed with a nonzero exit code
** BUILD FAILED **
The following build commands failed:
SwiftCompile normal arm64 /Users/admin/builder/spi-builder-workspace/Sources/DeviceOrientation.swift (in target 'PhotoSelectAndCrop' from project 'PhotoSelectAndCrop')
SwiftCompile normal arm64 Compiling\ DeviceOrientation.swift,\ Image+Extensions.swift /Users/admin/builder/spi-builder-workspace/Sources/DeviceOrientation.swift /Users/admin/builder/spi-builder-workspace/Sources/Image+Extensions.swift (in target 'PhotoSelectAndCrop' from project 'PhotoSelectAndCrop')
SwiftCompile normal arm64 /Users/admin/builder/spi-builder-workspace/Sources/SystemPHPicker.swift (in target 'PhotoSelectAndCrop' from project 'PhotoSelectAndCrop')
SwiftCompile normal arm64 /Users/admin/builder/spi-builder-workspace/Sources/Color+Extensions.swift (in target 'PhotoSelectAndCrop' from project 'PhotoSelectAndCrop')
SwiftEmitModule normal armv7k Emitting\ module\ for\ PhotoSelectAndCrop (in target 'PhotoSelectAndCrop' from project 'PhotoSelectAndCrop')
Building workspace spi-builder-workspace with scheme PhotoSelectAndCrop
(6 failures)
Command line invocation:
/Applications/Xcode-16.3.0.app/Contents/Developer/usr/bin/xcodebuild -IDEClonedSourcePackagesDirPathOverride=/Users/admin/builder/spi-builder-workspace/.dependencies -resolvePackageDependencies
Resolve Package Graph
Resolved source packages:
PhotoSelectAndCrop: /Users/admin/builder/spi-builder-workspace
resolved source packages: PhotoSelectAndCrop
{
"default_localization" : "en",
"dependencies" : [
],
"manifest_display_name" : "PhotoSelectAndCrop",
"name" : "PhotoSelectAndCrop",
"path" : "/Users/admin/builder/spi-builder-workspace",
"platforms" : [
{
"name" : "ios",
"version" : "15.0"
}
],
"products" : [
{
"name" : "PhotoSelectAndCrop",
"targets" : [
"PhotoSelectAndCrop"
],
"type" : {
"library" : [
"automatic"
]
}
}
],
"targets" : [
{
"c99name" : "PhotoSelectAndCrop",
"module_type" : "SwiftTarget",
"name" : "PhotoSelectAndCrop",
"path" : "Sources",
"product_memberships" : [
"PhotoSelectAndCrop"
],
"resources" : [
{
"path" : "/Users/admin/builder/spi-builder-workspace/Sources/PhotoSelectAndCrop/Resources/en.lproj/Localizable.strings",
"rule" : {
"process" : {
"localization" : "en"
}
}
},
{
"path" : "/Users/admin/builder/spi-builder-workspace/Sources/PhotoSelectAndCrop/Resources/fr.lproj/Localizable.strings",
"rule" : {
"process" : {
"localization" : "fr"
}
}
}
],
"sources" : [
"Color+Extensions.swift",
"DeviceOrientation.swift",
"Image+Extensions.swift",
"ImageAttributes.swift",
"ImageManipulation.swift",
"ImageMoveAndScaleSheet+Extensions.swift",
"ImageMoveAndScaleSheet+ViewModel.swift",
"ImageMoveAndScaleSheet.swift",
"ImagePane.swift",
"SystemImagePicker.swift",
"SystemPHPicker.swift",
"ViewModifiers.swift"
],
"type" : "library"
}
],
"tools_version" : "5.3"
}
{
"workspace" : {
"name" : "spi-builder-workspace",
"schemes" : [
"PhotoSelectAndCrop"
]
}
}
Running build ...
env DEVELOPER_DIR=/Applications/Xcode-16.3.0.app xcrun xcodebuild -IDEClonedSourcePackagesDirPathOverride=$PWD/.dependencies -skipMacroValidation -skipPackagePluginValidation -derivedDataPath $PWD/.derivedData build -scheme PhotoSelectAndCrop -destination generic/platform=watchOS
Command line invocation:
/Applications/Xcode-16.3.0.app/Contents/Developer/usr/bin/xcodebuild -IDEClonedSourcePackagesDirPathOverride=/Users/admin/builder/spi-builder-workspace/.dependencies -skipMacroValidation -skipPackagePluginValidation -derivedDataPath /Users/admin/builder/spi-builder-workspace/.derivedData build -scheme PhotoSelectAndCrop -destination generic/platform=watchOS
Resolve Package Graph
Resolved source packages:
PhotoSelectAndCrop: /Users/admin/builder/spi-builder-workspace
ComputePackagePrebuildTargetDependencyGraph
Prepare packages
CreateBuildRequest
SendProjectDescription
CreateBuildOperation
ComputeTargetDependencyGraph
note: Building targets in dependency order
note: Target dependency graph (3 targets)
Target 'PhotoSelectAndCrop' in project 'PhotoSelectAndCrop'
➜ Explicit dependency on target 'PhotoSelectAndCrop' in project 'PhotoSelectAndCrop'
➜ Explicit dependency on target 'PhotoSelectAndCrop_PhotoSelectAndCrop' in project 'PhotoSelectAndCrop'
Target 'PhotoSelectAndCrop' in project 'PhotoSelectAndCrop'
➜ Explicit dependency on target 'PhotoSelectAndCrop_PhotoSelectAndCrop' in project 'PhotoSelectAndCrop'
Target 'PhotoSelectAndCrop_PhotoSelectAndCrop' in project 'PhotoSelectAndCrop' (no dependencies)
GatherProvisioningInputs
CreateBuildDescription
ExecuteExternalTool /Applications/Xcode-16.3.0.app/Contents/Developer/Toolchains/XcodeDefault.xctoolchain/usr/bin/clang -v -E -dM -isysroot /Applications/Xcode-16.3.0.app/Contents/Developer/Platforms/WatchOS.platform/Developer/SDKs/WatchOS11.4.sdk -x c -c /dev/null
ExecuteExternalTool /Applications/Xcode-16.3.0.app/Contents/Developer/Toolchains/XcodeDefault.xctoolchain/usr/bin/swiftc --version
ExecuteExternalTool /Applications/Xcode-16.3.0.app/Contents/Developer/Toolchains/XcodeDefault.xctoolchain/usr/bin/ld -version_details
Build description signature: b73e0c6ea2f7a59bb3f7a5352ff69063
Build description path: /Users/admin/builder/spi-builder-workspace/.derivedData/Build/Intermediates.noindex/XCBuildData/b73e0c6ea2f7a59bb3f7a5352ff69063.xcbuilddata
ClangStatCache /Applications/Xcode-16.3.0.app/Contents/Developer/Toolchains/XcodeDefault.xctoolchain/usr/bin/clang-stat-cache /Applications/Xcode-16.3.0.app/Contents/Developer/Platforms/WatchOS.platform/Developer/SDKs/WatchOS11.4.sdk /Users/admin/builder/spi-builder-workspace/.derivedData/SDKStatCaches.noindex/watchos11.4-22T246-43efb940ff07ba2497b70ec94253f576.sdkstatcache
cd /Users/admin/builder/spi-builder-workspace/.swiftpm/xcode
/Applications/Xcode-16.3.0.app/Contents/Developer/Toolchains/XcodeDefault.xctoolchain/usr/bin/clang-stat-cache /Applications/Xcode-16.3.0.app/Contents/Developer/Platforms/WatchOS.platform/Developer/SDKs/WatchOS11.4.sdk -o /Users/admin/builder/spi-builder-workspace/.derivedData/SDKStatCaches.noindex/watchos11.4-22T246-43efb940ff07ba2497b70ec94253f576.sdkstatcache
ProcessInfoPlistFile /Users/admin/builder/spi-builder-workspace/.derivedData/Build/Products/Debug-watchos/PhotoSelectAndCrop_PhotoSelectAndCrop.bundle/Info.plist /Users/admin/builder/spi-builder-workspace/.derivedData/Build/Intermediates.noindex/PhotoSelectAndCrop.build/Debug-watchos/PhotoSelectAndCrop_PhotoSelectAndCrop.build/empty-PhotoSelectAndCrop_PhotoSelectAndCrop.plist (in target 'PhotoSelectAndCrop_PhotoSelectAndCrop' from project 'PhotoSelectAndCrop')
cd /Users/admin/builder/spi-builder-workspace
builtin-infoPlistUtility /Users/admin/builder/spi-builder-workspace/.derivedData/Build/Intermediates.noindex/PhotoSelectAndCrop.build/Debug-watchos/PhotoSelectAndCrop_PhotoSelectAndCrop.build/empty-PhotoSelectAndCrop_PhotoSelectAndCrop.plist -producttype com.apple.product-type.bundle -expandbuildsettings -format binary -platform watchos -o /Users/admin/builder/spi-builder-workspace/.derivedData/Build/Products/Debug-watchos/PhotoSelectAndCrop_PhotoSelectAndCrop.bundle/Info.plist
SwiftDriver PhotoSelectAndCrop normal arm64_32 com.apple.xcode.tools.swift.compiler (in target 'PhotoSelectAndCrop' from project 'PhotoSelectAndCrop')
cd /Users/admin/builder/spi-builder-workspace/.swiftpm/xcode
builtin-SwiftDriver -- /Applications/Xcode-16.3.0.app/Contents/Developer/Toolchains/XcodeDefault.xctoolchain/usr/bin/swiftc -module-name PhotoSelectAndCrop -Onone -enforce-exclusivity\=checked @/Users/admin/builder/spi-builder-workspace/.derivedData/Build/Intermediates.noindex/PhotoSelectAndCrop.build/Debug-watchos/PhotoSelectAndCrop.build/Objects-normal/arm64_32/PhotoSelectAndCrop.SwiftFileList -DSWIFT_PACKAGE -DDEBUG -DXcode -plugin-path /Applications/Xcode-16.3.0.app/Contents/Developer/Toolchains/XcodeDefault.xctoolchain/usr/lib/swift/host/plugins/testing -enable-experimental-feature DebugDescriptionMacro -sdk /Applications/Xcode-16.3.0.app/Contents/Developer/Platforms/WatchOS.platform/Developer/SDKs/WatchOS11.4.sdk -target arm64_32-apple-watchos8.0 -g -module-cache-path /Users/admin/builder/spi-builder-workspace/.derivedData/ModuleCache.noindex -Xfrontend -serialize-debugging-options -enable-testing -index-store-path /Users/admin/builder/spi-builder-workspace/.derivedData/Index.noindex/DataStore -swift-version 5 -I /Users/admin/builder/spi-builder-workspace/.derivedData/Build/Products/Debug-watchos -I /Applications/Xcode-16.3.0.app/Contents/Developer/Platforms/WatchOS.platform/Developer/usr/lib -F /Users/admin/builder/spi-builder-workspace/.derivedData/Build/Products/Debug-watchos -F /Applications/Xcode-16.3.0.app/Contents/Developer/Platforms/WatchOS.platform/Developer/Library/Frameworks -F /Applications/Xcode-16.3.0.app/Contents/Developer/Platforms/WatchOS.platform/Developer/SDKs/WatchOS11.4.sdk/Developer/Library/Frameworks -emit-localized-strings -emit-localized-strings-path /Users/admin/builder/spi-builder-workspace/.derivedData/Build/Intermediates.noindex/PhotoSelectAndCrop.build/Debug-watchos/PhotoSelectAndCrop.build/Objects-normal/arm64_32 -c -j10 -enable-batch-mode -incremental -Xcc -ivfsstatcache -Xcc /Users/admin/builder/spi-builder-workspace/.derivedData/SDKStatCaches.noindex/watchos11.4-22T246-43efb940ff07ba2497b70ec94253f576.sdkstatcache -output-file-map /Users/admin/builder/spi-builder-workspace/.derivedData/Build/Intermediates.noindex/PhotoSelectAndCrop.build/Debug-watchos/PhotoSelectAndCrop.build/Objects-normal/arm64_32/PhotoSelectAndCrop-OutputFileMap.json -use-frontend-parseable-output -save-temps -no-color-diagnostics -serialize-diagnostics -emit-dependencies -emit-module -emit-module-path /Users/admin/builder/spi-builder-workspace/.derivedData/Build/Intermediates.noindex/PhotoSelectAndCrop.build/Debug-watchos/PhotoSelectAndCrop.build/Objects-normal/arm64_32/PhotoSelectAndCrop.swiftmodule -validate-clang-modules-once -clang-build-session-file /Users/admin/builder/spi-builder-workspace/.derivedData/ModuleCache.noindex/Session.modulevalidation -Xcc -I/Users/admin/builder/spi-builder-workspace/.derivedData/Build/Intermediates.noindex/PhotoSelectAndCrop.build/Debug-watchos/PhotoSelectAndCrop.build/swift-overrides.hmap -emit-const-values -Xfrontend -const-gather-protocols-file -Xfrontend /Users/admin/builder/spi-builder-workspace/.derivedData/Build/Intermediates.noindex/PhotoSelectAndCrop.build/Debug-watchos/PhotoSelectAndCrop.build/Objects-normal/arm64_32/PhotoSelectAndCrop_const_extract_protocols.json -Xcc -I/Users/admin/builder/spi-builder-workspace/.derivedData/Build/Products/Debug-watchos/include -Xcc -I/Users/admin/builder/spi-builder-workspace/.derivedData/Build/Intermediates.noindex/PhotoSelectAndCrop.build/Debug-watchos/PhotoSelectAndCrop.build/DerivedSources-normal/arm64_32 -Xcc -I/Users/admin/builder/spi-builder-workspace/.derivedData/Build/Intermediates.noindex/PhotoSelectAndCrop.build/Debug-watchos/PhotoSelectAndCrop.build/DerivedSources/arm64_32 -Xcc -I/Users/admin/builder/spi-builder-workspace/.derivedData/Build/Intermediates.noindex/PhotoSelectAndCrop.build/Debug-watchos/PhotoSelectAndCrop.build/DerivedSources -Xcc -DSWIFT_PACKAGE -Xcc -DDEBUG\=1 -emit-objc-header -emit-objc-header-path /Users/admin/builder/spi-builder-workspace/.derivedData/Build/Intermediates.noindex/PhotoSelectAndCrop.build/Debug-watchos/PhotoSelectAndCrop.build/Objects-normal/arm64_32/PhotoSelectAndCrop-Swift.h -working-directory /Users/admin/builder/spi-builder-workspace/.swiftpm/xcode -experimental-emit-module-separately -disable-cmo
SwiftDriver PhotoSelectAndCrop normal armv7k com.apple.xcode.tools.swift.compiler (in target 'PhotoSelectAndCrop' from project 'PhotoSelectAndCrop')
cd /Users/admin/builder/spi-builder-workspace/.swiftpm/xcode
builtin-SwiftDriver -- /Applications/Xcode-16.3.0.app/Contents/Developer/Toolchains/XcodeDefault.xctoolchain/usr/bin/swiftc -module-name PhotoSelectAndCrop -Onone -enforce-exclusivity\=checked @/Users/admin/builder/spi-builder-workspace/.derivedData/Build/Intermediates.noindex/PhotoSelectAndCrop.build/Debug-watchos/PhotoSelectAndCrop.build/Objects-normal/armv7k/PhotoSelectAndCrop.SwiftFileList -DSWIFT_PACKAGE -DDEBUG -DXcode -plugin-path /Applications/Xcode-16.3.0.app/Contents/Developer/Toolchains/XcodeDefault.xctoolchain/usr/lib/swift/host/plugins/testing -enable-experimental-feature DebugDescriptionMacro -sdk /Applications/Xcode-16.3.0.app/Contents/Developer/Platforms/WatchOS.platform/Developer/SDKs/WatchOS11.4.sdk -target armv7k-apple-watchos8.0 -g -module-cache-path /Users/admin/builder/spi-builder-workspace/.derivedData/ModuleCache.noindex -Xfrontend -serialize-debugging-options -enable-testing -index-store-path /Users/admin/builder/spi-builder-workspace/.derivedData/Index.noindex/DataStore -swift-version 5 -I /Users/admin/builder/spi-builder-workspace/.derivedData/Build/Products/Debug-watchos -I /Applications/Xcode-16.3.0.app/Contents/Developer/Platforms/WatchOS.platform/Developer/usr/lib -F /Users/admin/builder/spi-builder-workspace/.derivedData/Build/Products/Debug-watchos -F /Applications/Xcode-16.3.0.app/Contents/Developer/Platforms/WatchOS.platform/Developer/Library/Frameworks -F /Applications/Xcode-16.3.0.app/Contents/Developer/Platforms/WatchOS.platform/Developer/SDKs/WatchOS11.4.sdk/Developer/Library/Frameworks -emit-localized-strings -emit-localized-strings-path /Users/admin/builder/spi-builder-workspace/.derivedData/Build/Intermediates.noindex/PhotoSelectAndCrop.build/Debug-watchos/PhotoSelectAndCrop.build/Objects-normal/armv7k -c -j10 -enable-batch-mode -incremental -Xcc -ivfsstatcache -Xcc /Users/admin/builder/spi-builder-workspace/.derivedData/SDKStatCaches.noindex/watchos11.4-22T246-43efb940ff07ba2497b70ec94253f576.sdkstatcache -output-file-map /Users/admin/builder/spi-builder-workspace/.derivedData/Build/Intermediates.noindex/PhotoSelectAndCrop.build/Debug-watchos/PhotoSelectAndCrop.build/Objects-normal/armv7k/PhotoSelectAndCrop-OutputFileMap.json -use-frontend-parseable-output -save-temps -no-color-diagnostics -serialize-diagnostics -emit-dependencies -emit-module -emit-module-path /Users/admin/builder/spi-builder-workspace/.derivedData/Build/Intermediates.noindex/PhotoSelectAndCrop.build/Debug-watchos/PhotoSelectAndCrop.build/Objects-normal/armv7k/PhotoSelectAndCrop.swiftmodule -validate-clang-modules-once -clang-build-session-file /Users/admin/builder/spi-builder-workspace/.derivedData/ModuleCache.noindex/Session.modulevalidation -Xcc -I/Users/admin/builder/spi-builder-workspace/.derivedData/Build/Intermediates.noindex/PhotoSelectAndCrop.build/Debug-watchos/PhotoSelectAndCrop.build/swift-overrides.hmap -emit-const-values -Xfrontend -const-gather-protocols-file -Xfrontend /Users/admin/builder/spi-builder-workspace/.derivedData/Build/Intermediates.noindex/PhotoSelectAndCrop.build/Debug-watchos/PhotoSelectAndCrop.build/Objects-normal/armv7k/PhotoSelectAndCrop_const_extract_protocols.json -Xcc -I/Users/admin/builder/spi-builder-workspace/.derivedData/Build/Products/Debug-watchos/include -Xcc -I/Users/admin/builder/spi-builder-workspace/.derivedData/Build/Intermediates.noindex/PhotoSelectAndCrop.build/Debug-watchos/PhotoSelectAndCrop.build/DerivedSources-normal/armv7k -Xcc -I/Users/admin/builder/spi-builder-workspace/.derivedData/Build/Intermediates.noindex/PhotoSelectAndCrop.build/Debug-watchos/PhotoSelectAndCrop.build/DerivedSources/armv7k -Xcc -I/Users/admin/builder/spi-builder-workspace/.derivedData/Build/Intermediates.noindex/PhotoSelectAndCrop.build/Debug-watchos/PhotoSelectAndCrop.build/DerivedSources -Xcc -DSWIFT_PACKAGE -Xcc -DDEBUG\=1 -emit-objc-header -emit-objc-header-path /Users/admin/builder/spi-builder-workspace/.derivedData/Build/Intermediates.noindex/PhotoSelectAndCrop.build/Debug-watchos/PhotoSelectAndCrop.build/Objects-normal/armv7k/PhotoSelectAndCrop-Swift.h -working-directory /Users/admin/builder/spi-builder-workspace/.swiftpm/xcode -experimental-emit-module-separately -disable-cmo
SwiftDriver PhotoSelectAndCrop normal arm64 com.apple.xcode.tools.swift.compiler (in target 'PhotoSelectAndCrop' from project 'PhotoSelectAndCrop')
cd /Users/admin/builder/spi-builder-workspace/.swiftpm/xcode
builtin-SwiftDriver -- /Applications/Xcode-16.3.0.app/Contents/Developer/Toolchains/XcodeDefault.xctoolchain/usr/bin/swiftc -module-name PhotoSelectAndCrop -Onone -enforce-exclusivity\=checked @/Users/admin/builder/spi-builder-workspace/.derivedData/Build/Intermediates.noindex/PhotoSelectAndCrop.build/Debug-watchos/PhotoSelectAndCrop.build/Objects-normal/arm64/PhotoSelectAndCrop.SwiftFileList -DSWIFT_PACKAGE -DDEBUG -DXcode -plugin-path /Applications/Xcode-16.3.0.app/Contents/Developer/Toolchains/XcodeDefault.xctoolchain/usr/lib/swift/host/plugins/testing -enable-experimental-feature DebugDescriptionMacro -sdk /Applications/Xcode-16.3.0.app/Contents/Developer/Platforms/WatchOS.platform/Developer/SDKs/WatchOS11.4.sdk -target arm64-apple-watchos8.0 -g -module-cache-path /Users/admin/builder/spi-builder-workspace/.derivedData/ModuleCache.noindex -Xfrontend -serialize-debugging-options -enable-testing -index-store-path /Users/admin/builder/spi-builder-workspace/.derivedData/Index.noindex/DataStore -swift-version 5 -I /Users/admin/builder/spi-builder-workspace/.derivedData/Build/Products/Debug-watchos -I /Applications/Xcode-16.3.0.app/Contents/Developer/Platforms/WatchOS.platform/Developer/usr/lib -F /Users/admin/builder/spi-builder-workspace/.derivedData/Build/Products/Debug-watchos -F /Applications/Xcode-16.3.0.app/Contents/Developer/Platforms/WatchOS.platform/Developer/Library/Frameworks -F /Applications/Xcode-16.3.0.app/Contents/Developer/Platforms/WatchOS.platform/Developer/SDKs/WatchOS11.4.sdk/Developer/Library/Frameworks -emit-localized-strings -emit-localized-strings-path /Users/admin/builder/spi-builder-workspace/.derivedData/Build/Intermediates.noindex/PhotoSelectAndCrop.build/Debug-watchos/PhotoSelectAndCrop.build/Objects-normal/arm64 -c -j10 -enable-batch-mode -incremental -Xcc -ivfsstatcache -Xcc /Users/admin/builder/spi-builder-workspace/.derivedData/SDKStatCaches.noindex/watchos11.4-22T246-43efb940ff07ba2497b70ec94253f576.sdkstatcache -output-file-map /Users/admin/builder/spi-builder-workspace/.derivedData/Build/Intermediates.noindex/PhotoSelectAndCrop.build/Debug-watchos/PhotoSelectAndCrop.build/Objects-normal/arm64/PhotoSelectAndCrop-OutputFileMap.json -use-frontend-parseable-output -save-temps -no-color-diagnostics -serialize-diagnostics -emit-dependencies -emit-module -emit-module-path /Users/admin/builder/spi-builder-workspace/.derivedData/Build/Intermediates.noindex/PhotoSelectAndCrop.build/Debug-watchos/PhotoSelectAndCrop.build/Objects-normal/arm64/PhotoSelectAndCrop.swiftmodule -validate-clang-modules-once -clang-build-session-file /Users/admin/builder/spi-builder-workspace/.derivedData/ModuleCache.noindex/Session.modulevalidation -Xcc -I/Users/admin/builder/spi-builder-workspace/.derivedData/Build/Intermediates.noindex/PhotoSelectAndCrop.build/Debug-watchos/PhotoSelectAndCrop.build/swift-overrides.hmap -emit-const-values -Xfrontend -const-gather-protocols-file -Xfrontend /Users/admin/builder/spi-builder-workspace/.derivedData/Build/Intermediates.noindex/PhotoSelectAndCrop.build/Debug-watchos/PhotoSelectAndCrop.build/Objects-normal/arm64/PhotoSelectAndCrop_const_extract_protocols.json -Xcc -I/Users/admin/builder/spi-builder-workspace/.derivedData/Build/Products/Debug-watchos/include -Xcc -I/Users/admin/builder/spi-builder-workspace/.derivedData/Build/Intermediates.noindex/PhotoSelectAndCrop.build/Debug-watchos/PhotoSelectAndCrop.build/DerivedSources-normal/arm64 -Xcc -I/Users/admin/builder/spi-builder-workspace/.derivedData/Build/Intermediates.noindex/PhotoSelectAndCrop.build/Debug-watchos/PhotoSelectAndCrop.build/DerivedSources/arm64 -Xcc -I/Users/admin/builder/spi-builder-workspace/.derivedData/Build/Intermediates.noindex/PhotoSelectAndCrop.build/Debug-watchos/PhotoSelectAndCrop.build/DerivedSources -Xcc -DSWIFT_PACKAGE -Xcc -DDEBUG\=1 -emit-objc-header -emit-objc-header-path /Users/admin/builder/spi-builder-workspace/.derivedData/Build/Intermediates.noindex/PhotoSelectAndCrop.build/Debug-watchos/PhotoSelectAndCrop.build/Objects-normal/arm64/PhotoSelectAndCrop-Swift.h -working-directory /Users/admin/builder/spi-builder-workspace/.swiftpm/xcode -experimental-emit-module-separately -disable-cmo
SwiftCompile normal arm64 Compiling\ resource_bundle_accessor.swift,\ Color+Extensions.swift /Users/admin/builder/spi-builder-workspace/.derivedData/Build/Intermediates.noindex/PhotoSelectAndCrop.build/Debug-watchos/PhotoSelectAndCrop.build/DerivedSources/resource_bundle_accessor.swift /Users/admin/builder/spi-builder-workspace/Sources/Color+Extensions.swift (in target 'PhotoSelectAndCrop' from project 'PhotoSelectAndCrop')
SwiftCompile normal arm64 /Users/admin/builder/spi-builder-workspace/.derivedData/Build/Intermediates.noindex/PhotoSelectAndCrop.build/Debug-watchos/PhotoSelectAndCrop.build/DerivedSources/resource_bundle_accessor.swift (in target 'PhotoSelectAndCrop' from project 'PhotoSelectAndCrop')
cd /Users/admin/builder/spi-builder-workspace/.swiftpm/xcode
SwiftCompile normal arm64 /Users/admin/builder/spi-builder-workspace/Sources/Color+Extensions.swift (in target 'PhotoSelectAndCrop' from project 'PhotoSelectAndCrop')
cd /Users/admin/builder/spi-builder-workspace/.swiftpm/xcode
/Users/admin/builder/spi-builder-workspace/Sources/Color+Extensions.swift:13:30: error: type 'UIColor' has no member 'label'
return Color(UIColor.label)
~~~~~~~ ^~~~~
/Users/admin/builder/spi-builder-workspace/Sources/Color+Extensions.swift:17:30: error: type 'UIColor' has no member 'secondaryLabel'
return Color(UIColor.secondaryLabel)
~~~~~~~ ^~~~~~~~~~~~~~
/Users/admin/builder/spi-builder-workspace/Sources/Color+Extensions.swift:21:30: error: type 'UIColor' has no member 'tertiaryLabel'
return Color(UIColor.tertiaryLabel)
~~~~~~~ ^~~~~~~~~~~~~
/Users/admin/builder/spi-builder-workspace/Sources/Color+Extensions.swift:25:30: error: type 'UIColor' has no member 'quaternaryLabel'
return Color(UIColor.quaternaryLabel)
~~~~~~~ ^~~~~~~~~~~~~~~
/Users/admin/builder/spi-builder-workspace/Sources/Color+Extensions.swift:29:30: error: type 'UIColor' has no member 'systemFill'
return Color(UIColor.systemFill)
~~~~~~~ ^~~~~~~~~~
/Users/admin/builder/spi-builder-workspace/Sources/Color+Extensions.swift:33:30: error: type 'UIColor' has no member 'secondarySystemFill'
return Color(UIColor.secondarySystemFill)
~~~~~~~ ^~~~~~~~~~~~~~~~~~~
/Users/admin/builder/spi-builder-workspace/Sources/Color+Extensions.swift:37:30: error: type 'UIColor' has no member 'tertiarySystemFill'
return Color(UIColor.tertiarySystemFill)
~~~~~~~ ^~~~~~~~~~~~~~~~~~
/Users/admin/builder/spi-builder-workspace/Sources/Color+Extensions.swift:41:30: error: type 'UIColor' has no member 'quaternarySystemFill'
return Color(UIColor.quaternarySystemFill)
~~~~~~~ ^~~~~~~~~~~~~~~~~~~~
/Users/admin/builder/spi-builder-workspace/Sources/Color+Extensions.swift:45:33: error: type 'UIColor' has no member 'systemBackground'
return Color(UIColor.systemBackground)
~~~~~~~ ^~~~~~~~~~~~~~~~
/Users/admin/builder/spi-builder-workspace/Sources/Color+Extensions.swift:49:30: error: type 'UIColor' has no member 'secondarySystemBackground'
return Color(UIColor.secondarySystemBackground)
~~~~~~~ ^~~~~~~~~~~~~~~~~~~~~~~~~
/Users/admin/builder/spi-builder-workspace/Sources/Color+Extensions.swift:53:30: error: type 'UIColor' has no member 'tertiarySystemBackground'
return Color(UIColor.tertiarySystemBackground)
~~~~~~~ ^~~~~~~~~~~~~~~~~~~~~~~~
/Users/admin/builder/spi-builder-workspace/Sources/Color+Extensions.swift:57:30: error: type 'UIColor' has no member 'systemGroupedBackground'
return Color(UIColor.systemGroupedBackground)
~~~~~~~ ^~~~~~~~~~~~~~~~~~~~~~~
/Users/admin/builder/spi-builder-workspace/Sources/Color+Extensions.swift:61:30: error: type 'UIColor' has no member 'secondarySystemGroupedBackground'
return Color(UIColor.secondarySystemGroupedBackground)
~~~~~~~ ^~~~~~~~~~~~~~~~~~~~~~~~~~~~~~~~
/Users/admin/builder/spi-builder-workspace/Sources/Color+Extensions.swift:65:30: error: type 'UIColor' has no member 'tertiarySystemGroupedBackground'
return Color(UIColor.tertiarySystemGroupedBackground)
~~~~~~~ ^~~~~~~~~~~~~~~~~~~~~~~~~~~~~~~
/Users/admin/builder/spi-builder-workspace/Sources/Color+Extensions.swift:69:30: error: type 'UIColor' has no member 'systemRed'
return Color(UIColor.systemRed)
~~~~~~~ ^~~~~~~~~
/Users/admin/builder/spi-builder-workspace/Sources/Color+Extensions.swift:73:30: error: type 'UIColor' has no member 'systemBlue'
return Color(UIColor.systemBlue)
~~~~~~~ ^~~~~~~~~~
/Users/admin/builder/spi-builder-workspace/Sources/Color+Extensions.swift:77:30: error: type 'UIColor' has no member 'systemPink'
return Color(UIColor.systemPink)
~~~~~~~ ^~~~~~~~~~
/Users/admin/builder/spi-builder-workspace/Sources/Color+Extensions.swift:81:30: error: type 'UIColor' has no member 'systemTeal'
return Color(UIColor.systemTeal)
~~~~~~~ ^~~~~~~~~~
/Users/admin/builder/spi-builder-workspace/Sources/Color+Extensions.swift:85:30: error: type 'UIColor' has no member 'systemGreen'
return Color(UIColor.systemGreen)
~~~~~~~ ^~~~~~~~~~~
/Users/admin/builder/spi-builder-workspace/Sources/Color+Extensions.swift:89:30: error: type 'UIColor' has no member 'systemIndigo'
return Color(UIColor.systemIndigo)
~~~~~~~ ^~~~~~~~~~~~
/Users/admin/builder/spi-builder-workspace/Sources/Color+Extensions.swift:93:30: error: type 'UIColor' has no member 'systemOrange'
return Color(UIColor.systemOrange)
~~~~~~~ ^~~~~~~~~~~~
/Users/admin/builder/spi-builder-workspace/Sources/Color+Extensions.swift:97:30: error: type 'UIColor' has no member 'systemPurple'
return Color(UIColor.systemPurple)
~~~~~~~ ^~~~~~~~~~~~
/Users/admin/builder/spi-builder-workspace/Sources/Color+Extensions.swift:101:30: error: type 'UIColor' has no member 'systemYellow'
return Color(UIColor.systemYellow)
~~~~~~~ ^~~~~~~~~~~~
/Users/admin/builder/spi-builder-workspace/Sources/Color+Extensions.swift:105:30: error: type 'UIColor' has no member 'systemGray'
return Color(UIColor.systemGray)
~~~~~~~ ^~~~~~~~~~
/Users/admin/builder/spi-builder-workspace/Sources/Color+Extensions.swift:109:30: error: type 'UIColor' has no member 'systemGray2'
return Color(UIColor.systemGray2)
~~~~~~~ ^~~~~~~~~~~
/Users/admin/builder/spi-builder-workspace/Sources/Color+Extensions.swift:113:30: error: type 'UIColor' has no member 'systemGray3'
return Color(UIColor.systemGray3)
~~~~~~~ ^~~~~~~~~~~
/Users/admin/builder/spi-builder-workspace/Sources/Color+Extensions.swift:117:30: error: type 'UIColor' has no member 'systemGray4'
return Color(UIColor.systemGray4)
~~~~~~~ ^~~~~~~~~~~
/Users/admin/builder/spi-builder-workspace/Sources/Color+Extensions.swift:121:30: error: type 'UIColor' has no member 'systemGray5'
return Color(UIColor.systemGray5)
~~~~~~~ ^~~~~~~~~~~
/Users/admin/builder/spi-builder-workspace/Sources/Color+Extensions.swift:125:30: error: type 'UIColor' has no member 'systemGray6'
return Color(UIColor.systemGray6)
~~~~~~~ ^~~~~~~~~~~
SwiftCompile normal arm64 Compiling\ ImageMoveAndScaleSheet+Extensions.swift /Users/admin/builder/spi-builder-workspace/Sources/ImageMoveAndScaleSheet+Extensions.swift (in target 'PhotoSelectAndCrop' from project 'PhotoSelectAndCrop')
SwiftCompile normal arm64 /Users/admin/builder/spi-builder-workspace/Sources/ImageMoveAndScaleSheet+Extensions.swift (in target 'PhotoSelectAndCrop' from project 'PhotoSelectAndCrop')
cd /Users/admin/builder/spi-builder-workspace/.swiftpm/xcode
SwiftCompile normal arm64 Compiling\ ImageAttributes.swift,\ ImageManipulation.swift /Users/admin/builder/spi-builder-workspace/Sources/ImageAttributes.swift /Users/admin/builder/spi-builder-workspace/Sources/ImageManipulation.swift (in target 'PhotoSelectAndCrop' from project 'PhotoSelectAndCrop')
SwiftCompile normal arm64 /Users/admin/builder/spi-builder-workspace/Sources/ImageAttributes.swift (in target 'PhotoSelectAndCrop' from project 'PhotoSelectAndCrop')
cd /Users/admin/builder/spi-builder-workspace/.swiftpm/xcode
SwiftCompile normal arm64 /Users/admin/builder/spi-builder-workspace/Sources/ImageManipulation.swift (in target 'PhotoSelectAndCrop' from project 'PhotoSelectAndCrop')
cd /Users/admin/builder/spi-builder-workspace/.swiftpm/xcode
SwiftCompile normal arm64 Compiling\ DeviceOrientation.swift,\ Image+Extensions.swift /Users/admin/builder/spi-builder-workspace/Sources/DeviceOrientation.swift /Users/admin/builder/spi-builder-workspace/Sources/Image+Extensions.swift (in target 'PhotoSelectAndCrop' from project 'PhotoSelectAndCrop')
SwiftCompile normal arm64 /Users/admin/builder/spi-builder-workspace/Sources/DeviceOrientation.swift (in target 'PhotoSelectAndCrop' from project 'PhotoSelectAndCrop')
cd /Users/admin/builder/spi-builder-workspace/.swiftpm/xcode
SwiftCompile normal arm64 /Users/admin/builder/spi-builder-workspace/Sources/Image+Extensions.swift (in target 'PhotoSelectAndCrop' from project 'PhotoSelectAndCrop')
cd /Users/admin/builder/spi-builder-workspace/.swiftpm/xcode
SwiftCompile normal arm64 Compiling\ ImageMoveAndScaleSheet+ViewModel.swift /Users/admin/builder/spi-builder-workspace/Sources/ImageMoveAndScaleSheet+ViewModel.swift (in target 'PhotoSelectAndCrop' from project 'PhotoSelectAndCrop')
SwiftCompile normal arm64 /Users/admin/builder/spi-builder-workspace/Sources/ImageMoveAndScaleSheet+ViewModel.swift (in target 'PhotoSelectAndCrop' from project 'PhotoSelectAndCrop')
cd /Users/admin/builder/spi-builder-workspace/.swiftpm/xcode
SwiftCompile normal arm64 Compiling\ ImagePane.swift /Users/admin/builder/spi-builder-workspace/Sources/ImagePane.swift (in target 'PhotoSelectAndCrop' from project 'PhotoSelectAndCrop')
SwiftCompile normal arm64 /Users/admin/builder/spi-builder-workspace/Sources/ImagePane.swift (in target 'PhotoSelectAndCrop' from project 'PhotoSelectAndCrop')
cd /Users/admin/builder/spi-builder-workspace/.swiftpm/xcode
SwiftCompile normal arm64 Compiling\ SystemImagePicker.swift /Users/admin/builder/spi-builder-workspace/Sources/SystemImagePicker.swift (in target 'PhotoSelectAndCrop' from project 'PhotoSelectAndCrop')
Failed frontend command:
/Applications/Xcode-16.3.0.app/Contents/Developer/Toolchains/XcodeDefault.xctoolchain/usr/bin/swift-frontend -frontend -c /Users/admin/builder/spi-builder-workspace/.derivedData/Build/Intermediates.noindex/PhotoSelectAndCrop.build/Debug-watchos/PhotoSelectAndCrop.build/DerivedSources/resource_bundle_accessor.swift /Users/admin/builder/spi-builder-workspace/Sources/Color+Extensions.swift /Users/admin/builder/spi-builder-workspace/Sources/DeviceOrientation.swift /Users/admin/builder/spi-builder-workspace/Sources/Image+Extensions.swift /Users/admin/builder/spi-builder-workspace/Sources/ImageAttributes.swift /Users/admin/builder/spi-builder-workspace/Sources/ImageManipulation.swift /Users/admin/builder/spi-builder-workspace/Sources/ImageMoveAndScaleSheet+Extensions.swift /Users/admin/builder/spi-builder-workspace/Sources/ImageMoveAndScaleSheet+ViewModel.swift /Users/admin/builder/spi-builder-workspace/Sources/ImageMoveAndScaleSheet.swift /Users/admin/builder/spi-builder-workspace/Sources/ImagePane.swift -primary-file /Users/admin/builder/spi-builder-workspace/Sources/SystemImagePicker.swift /Users/admin/builder/spi-builder-workspace/Sources/SystemPHPicker.swift /Users/admin/builder/spi-builder-workspace/Sources/ViewModifiers.swift -emit-dependencies-path /Users/admin/builder/spi-builder-workspace/.derivedData/Build/Intermediates.noindex/PhotoSelectAndCrop.build/Debug-watchos/PhotoSelectAndCrop.build/Objects-normal/arm64/SystemImagePicker.d -emit-const-values-path /Users/admin/builder/spi-builder-workspace/.derivedData/Build/Intermediates.noindex/PhotoSelectAndCrop.build/Debug-watchos/PhotoSelectAndCrop.build/Objects-normal/arm64/SystemImagePicker.swiftconstvalues -emit-reference-dependencies-path /Users/admin/builder/spi-builder-workspace/.derivedData/Build/Intermediates.noindex/PhotoSelectAndCrop.build/Debug-watchos/PhotoSelectAndCrop.build/Objects-normal/arm64/SystemImagePicker.swiftdeps -serialize-diagnostics-path /Users/admin/builder/spi-builder-workspace/.derivedData/Build/Intermediates.noindex/PhotoSelectAndCrop.build/Debug-watchos/PhotoSelectAndCrop.build/Objects-normal/arm64/SystemImagePicker.dia -emit-localized-strings -emit-localized-strings-path /Users/admin/builder/spi-builder-workspace/.derivedData/Build/Intermediates.noindex/PhotoSelectAndCrop.build/Debug-watchos/PhotoSelectAndCrop.build/Objects-normal/arm64 -target arm64-apple-watchos8.0 -Xllvm -aarch64-use-tbi -enable-objc-interop -stack-check -sdk /Applications/Xcode-16.3.0.app/Contents/Developer/Platforms/WatchOS.platform/Developer/SDKs/WatchOS11.4.sdk -I /Users/admin/builder/spi-builder-workspace/.derivedData/Build/Products/Debug-watchos -I /Applications/Xcode-16.3.0.app/Contents/Developer/Platforms/WatchOS.platform/Developer/usr/lib -F /Users/admin/builder/spi-builder-workspace/.derivedData/Build/Products/Debug-watchos -F /Applications/Xcode-16.3.0.app/Contents/Developer/Platforms/WatchOS.platform/Developer/Library/Frameworks -F /Applications/Xcode-16.3.0.app/Contents/Developer/Platforms/WatchOS.platform/Developer/SDKs/WatchOS11.4.sdk/Developer/Library/Frameworks -no-color-diagnostics -enable-testing -g -debug-info-format\=dwarf -dwarf-version\=4 -module-cache-path /Users/admin/builder/spi-builder-workspace/.derivedData/ModuleCache.noindex -swift-version 5 -enforce-exclusivity\=checked -Onone -D SWIFT_PACKAGE -D DEBUG -D Xcode -serialize-debugging-options -const-gather-protocols-file /Users/admin/builder/spi-builder-workspace/.derivedData/Build/Intermediates.noindex/PhotoSelectAndCrop.build/Debug-watchos/PhotoSelectAndCrop.build/Objects-normal/arm64/PhotoSelectAndCrop_const_extract_protocols.json -enable-experimental-feature DebugDescriptionMacro -empty-abi-descriptor -plugin-path /Applications/Xcode-16.3.0.app/Contents/Developer/Toolchains/XcodeDefault.xctoolchain/usr/lib/swift/host/plugins/testing -validate-clang-modules-once -clang-build-session-file /Users/admin/builder/spi-builder-workspace/.derivedData/ModuleCache.noindex/Session.modulevalidation -Xcc -working-directory -Xcc /Users/admin/builder/spi-builder-workspace/.swiftpm/xcode -resource-dir /Applications/Xcode-16.3.0.app/Contents/Developer/Toolchains/XcodeDefault.xctoolchain/usr/lib/swift -enable-anonymous-context-mangled-names -file-compilation-dir /Users/admin/builder/spi-builder-workspace/.swiftpm/xcode -Xcc -ivfsstatcache -Xcc /Users/admin/builder/spi-builder-workspace/.derivedData/SDKStatCaches.noindex/watchos11.4-22T246-43efb940ff07ba2497b70ec94253f576.sdkstatcache -Xcc -I/Users/admin/builder/spi-builder-workspace/.derivedData/Build/Intermediates.noindex/PhotoSelectAndCrop.build/Debug-watchos/PhotoSelectAndCrop.build/swift-overrides.hmap -Xcc -I/Users/admin/builder/spi-builder-workspace/.derivedData/Build/Products/Debug-watchos/include -Xcc -I/Users/admin/builder/spi-builder-workspace/.derivedData/Build/Intermediates.noindex/PhotoSelectAndCrop.build/Debug-watchos/PhotoSelectAndCrop.build/DerivedSources-normal/arm64 -Xcc -I/Users/admin/builder/spi-builder-workspace/.derivedData/Build/Intermediates.noindex/PhotoSelectAndCrop.build/Debug-watchos/PhotoSelectAndCrop.build/DerivedSources/arm64 -Xcc -I/Users/admin/builder/spi-builder-workspace/.derivedData/Build/Intermediates.noindex/PhotoSelectAndCrop.build/Debug-watchos/PhotoSelectAndCrop.build/DerivedSources -Xcc -DSWIFT_PACKAGE -Xcc -DDEBUG\=1 -module-name PhotoSelectAndCrop -frontend-parseable-output -disable-clang-spi -target-sdk-version 11.4 -target-sdk-name watchos11.4 -external-plugin-path /Applications/Xcode-16.3.0.app/Contents/Developer/Platforms/WatchOS.platform/Developer/usr/lib/swift/host/plugins\#/Applications/Xcode-16.3.0.app/Contents/Developer/Platforms/WatchOS.platform/Developer/usr/bin/swift-plugin-server -external-plugin-path /Applications/Xcode-16.3.0.app/Contents/Developer/Platforms/WatchOS.platform/Developer/usr/local/lib/swift/host/plugins\#/Applications/Xcode-16.3.0.app/Contents/Developer/Platforms/WatchOS.platform/Developer/usr/bin/swift-plugin-server -in-process-plugin-server-path /Applications/Xcode-16.3.0.app/Contents/Developer/Toolchains/XcodeDefault.xctoolchain/usr/lib/swift/host/libSwiftInProcPluginServer.dylib -plugin-path /Applications/Xcode-16.3.0.app/Contents/Developer/Toolchains/XcodeDefault.xctoolchain/usr/lib/swift/host/plugins -plugin-path /Applications/Xcode-16.3.0.app/Contents/Developer/Toolchains/XcodeDefault.xctoolchain/usr/local/lib/swift/host/plugins -o /Users/admin/builder/spi-builder-workspace/.derivedData/Build/Intermediates.noindex/PhotoSelectAndCrop.build/Debug-watchos/PhotoSelectAndCrop.build/Objects-normal/arm64/SystemImagePicker.o -index-unit-output-path /PhotoSelectAndCrop.build/Debug-watchos/PhotoSelectAndCrop.build/Objects-normal/arm64/SystemImagePicker.o -index-store-path /Users/admin/builder/spi-builder-workspace/.derivedData/Index.noindex/DataStore -index-system-modules
SwiftCompile normal arm64 /Users/admin/builder/spi-builder-workspace/Sources/SystemImagePicker.swift (in target 'PhotoSelectAndCrop' from project 'PhotoSelectAndCrop')
cd /Users/admin/builder/spi-builder-workspace/.swiftpm/xcode
/Users/admin/builder/spi-builder-workspace/Sources/SystemImagePicker.swift:27:53: error: cannot find type 'UIImagePickerController' in scope
public func imagePickerController(_ picker: UIImagePickerController, didFinishPickingMediaWithInfo info: [UIImagePickerController.InfoKey : Any]) {
^~~~~~~~~~~~~~~~~~~~~~~
/Users/admin/builder/spi-builder-workspace/Sources/SystemImagePicker.swift:27:115: error: cannot find type 'UIImagePickerController' in scope
public func imagePickerController(_ picker: UIImagePickerController, didFinishPickingMediaWithInfo info: [UIImagePickerController.InfoKey : Any]) {
^~~~~~~~~~~~~~~~~~~~~~~
/Users/admin/builder/spi-builder-workspace/Sources/SystemImagePicker.swift:20:41: error: cannot find type 'UINavigationControllerDelegate' in scope
public class Coordinator: NSObject, UINavigationControllerDelegate, UIImagePickerControllerDelegate {
^~~~~~~~~~~~~~~~~~~~~~~~~~~~~~
/Users/admin/builder/spi-builder-workspace/Sources/SystemImagePicker.swift:20:73: error: cannot find type 'UIImagePickerControllerDelegate' in scope
public class Coordinator: NSObject, UINavigationControllerDelegate, UIImagePickerControllerDelegate {
^~~~~~~~~~~~~~~~~~~~~~~~~~~~~~~
/Users/admin/builder/spi-builder-workspace/Sources/SystemImagePicker.swift:39:109: error: cannot find type 'UIImagePickerController' in scope
public func makeUIViewController(context: UIViewControllerRepresentableContext<SystemUIImagePicker>) -> UIImagePickerController {
^~~~~~~~~~~~~~~~~~~~~~~
/Users/admin/builder/spi-builder-workspace/Sources/SystemImagePicker.swift:39:47: error: cannot find type 'UIViewControllerRepresentableContext' in scope
public func makeUIViewController(context: UIViewControllerRepresentableContext<SystemUIImagePicker>) -> UIImagePickerController {
^~~~~~~~~~~~~~~~~~~~~~~~~~~~~~~~~~~~
/Users/admin/builder/spi-builder-workspace/Sources/SystemImagePicker.swift:45:60: error: cannot find type 'UIImagePickerController' in scope
public func updateUIViewController(_ uiViewController: UIImagePickerController, context: UIViewControllerRepresentableContext<SystemUIImagePicker>) {
^~~~~~~~~~~~~~~~~~~~~~~
/Users/admin/builder/spi-builder-workspace/Sources/SystemImagePicker.swift:45:94: error: cannot find type 'UIViewControllerRepresentableContext' in scope
public func updateUIViewController(_ uiViewController: UIImagePickerController, context: UIViewControllerRepresentableContext<SystemUIImagePicker>) {
^~~~~~~~~~~~~~~~~~~~~~~~~~~~~~~~~~~~
/Users/admin/builder/spi-builder-workspace/Sources/SystemImagePicker.swift:15:36: error: cannot find type 'UIViewControllerRepresentable' in scope
public struct SystemUIImagePicker: UIViewControllerRepresentable {
^~~~~~~~~~~~~~~~~~~~~~~~~~~~~
/Users/admin/builder/spi-builder-workspace/Sources/SystemImagePicker.swift:28:36: error: cannot infer contextual base in reference to member 'originalImage'
if let uiImage = info[.originalImage] as? UIImage {
~^~~~~~~~~~~~~
/Users/admin/builder/spi-builder-workspace/Sources/SystemImagePicker.swift:40:22: error: cannot find 'UIImagePickerController' in scope
let picker = UIImagePickerController()
^~~~~~~~~~~~~~~~~~~~~~~
SwiftCompile normal arm64 Compiling\ SystemPHPicker.swift /Users/admin/builder/spi-builder-workspace/Sources/SystemPHPicker.swift (in target 'PhotoSelectAndCrop' from project 'PhotoSelectAndCrop')
Failed frontend command:
/Applications/Xcode-16.3.0.app/Contents/Developer/Toolchains/XcodeDefault.xctoolchain/usr/bin/swift-frontend -frontend -c /Users/admin/builder/spi-builder-workspace/.derivedData/Build/Intermediates.noindex/PhotoSelectAndCrop.build/Debug-watchos/PhotoSelectAndCrop.build/DerivedSources/resource_bundle_accessor.swift /Users/admin/builder/spi-builder-workspace/Sources/Color+Extensions.swift /Users/admin/builder/spi-builder-workspace/Sources/DeviceOrientation.swift /Users/admin/builder/spi-builder-workspace/Sources/Image+Extensions.swift /Users/admin/builder/spi-builder-workspace/Sources/ImageAttributes.swift /Users/admin/builder/spi-builder-workspace/Sources/ImageManipulation.swift /Users/admin/builder/spi-builder-workspace/Sources/ImageMoveAndScaleSheet+Extensions.swift /Users/admin/builder/spi-builder-workspace/Sources/ImageMoveAndScaleSheet+ViewModel.swift /Users/admin/builder/spi-builder-workspace/Sources/ImageMoveAndScaleSheet.swift /Users/admin/builder/spi-builder-workspace/Sources/ImagePane.swift /Users/admin/builder/spi-builder-workspace/Sources/SystemImagePicker.swift -primary-file /Users/admin/builder/spi-builder-workspace/Sources/SystemPHPicker.swift /Users/admin/builder/spi-builder-workspace/Sources/ViewModifiers.swift -emit-dependencies-path /Users/admin/builder/spi-builder-workspace/.derivedData/Build/Intermediates.noindex/PhotoSelectAndCrop.build/Debug-watchos/PhotoSelectAndCrop.build/Objects-normal/arm64/SystemPHPicker.d -emit-const-values-path /Users/admin/builder/spi-builder-workspace/.derivedData/Build/Intermediates.noindex/PhotoSelectAndCrop.build/Debug-watchos/PhotoSelectAndCrop.build/Objects-normal/arm64/SystemPHPicker.swiftconstvalues -emit-reference-dependencies-path /Users/admin/builder/spi-builder-workspace/.derivedData/Build/Intermediates.noindex/PhotoSelectAndCrop.build/Debug-watchos/PhotoSelectAndCrop.build/Objects-normal/arm64/SystemPHPicker.swiftdeps -serialize-diagnostics-path /Users/admin/builder/spi-builder-workspace/.derivedData/Build/Intermediates.noindex/PhotoSelectAndCrop.build/Debug-watchos/PhotoSelectAndCrop.build/Objects-normal/arm64/SystemPHPicker.dia -emit-localized-strings -emit-localized-strings-path /Users/admin/builder/spi-builder-workspace/.derivedData/Build/Intermediates.noindex/PhotoSelectAndCrop.build/Debug-watchos/PhotoSelectAndCrop.build/Objects-normal/arm64 -target arm64-apple-watchos8.0 -Xllvm -aarch64-use-tbi -enable-objc-interop -stack-check -sdk /Applications/Xcode-16.3.0.app/Contents/Developer/Platforms/WatchOS.platform/Developer/SDKs/WatchOS11.4.sdk -I /Users/admin/builder/spi-builder-workspace/.derivedData/Build/Products/Debug-watchos -I /Applications/Xcode-16.3.0.app/Contents/Developer/Platforms/WatchOS.platform/Developer/usr/lib -F /Users/admin/builder/spi-builder-workspace/.derivedData/Build/Products/Debug-watchos -F /Applications/Xcode-16.3.0.app/Contents/Developer/Platforms/WatchOS.platform/Developer/Library/Frameworks -F /Applications/Xcode-16.3.0.app/Contents/Developer/Platforms/WatchOS.platform/Developer/SDKs/WatchOS11.4.sdk/Developer/Library/Frameworks -no-color-diagnostics -enable-testing -g -debug-info-format\=dwarf -dwarf-version\=4 -module-cache-path /Users/admin/builder/spi-builder-workspace/.derivedData/ModuleCache.noindex -swift-version 5 -enforce-exclusivity\=checked -Onone -D SWIFT_PACKAGE -D DEBUG -D Xcode -serialize-debugging-options -const-gather-protocols-file /Users/admin/builder/spi-builder-workspace/.derivedData/Build/Intermediates.noindex/PhotoSelectAndCrop.build/Debug-watchos/PhotoSelectAndCrop.build/Objects-normal/arm64/PhotoSelectAndCrop_const_extract_protocols.json -enable-experimental-feature DebugDescriptionMacro -empty-abi-descriptor -plugin-path /Applications/Xcode-16.3.0.app/Contents/Developer/Toolchains/XcodeDefault.xctoolchain/usr/lib/swift/host/plugins/testing -validate-clang-modules-once -clang-build-session-file /Users/admin/builder/spi-builder-workspace/.derivedData/ModuleCache.noindex/Session.modulevalidation -Xcc -working-directory -Xcc /Users/admin/builder/spi-builder-workspace/.swiftpm/xcode -resource-dir /Applications/Xcode-16.3.0.app/Contents/Developer/Toolchains/XcodeDefault.xctoolchain/usr/lib/swift -enable-anonymous-context-mangled-names -file-compilation-dir /Users/admin/builder/spi-builder-workspace/.swiftpm/xcode -Xcc -ivfsstatcache -Xcc /Users/admin/builder/spi-builder-workspace/.derivedData/SDKStatCaches.noindex/watchos11.4-22T246-43efb940ff07ba2497b70ec94253f576.sdkstatcache -Xcc -I/Users/admin/builder/spi-builder-workspace/.derivedData/Build/Intermediates.noindex/PhotoSelectAndCrop.build/Debug-watchos/PhotoSelectAndCrop.build/swift-overrides.hmap -Xcc -I/Users/admin/builder/spi-builder-workspace/.derivedData/Build/Products/Debug-watchos/include -Xcc -I/Users/admin/builder/spi-builder-workspace/.derivedData/Build/Intermediates.noindex/PhotoSelectAndCrop.build/Debug-watchos/PhotoSelectAndCrop.build/DerivedSources-normal/arm64 -Xcc -I/Users/admin/builder/spi-builder-workspace/.derivedData/Build/Intermediates.noindex/PhotoSelectAndCrop.build/Debug-watchos/PhotoSelectAndCrop.build/DerivedSources/arm64 -Xcc -I/Users/admin/builder/spi-builder-workspace/.derivedData/Build/Intermediates.noindex/PhotoSelectAndCrop.build/Debug-watchos/PhotoSelectAndCrop.build/DerivedSources -Xcc -DSWIFT_PACKAGE -Xcc -DDEBUG\=1 -module-name PhotoSelectAndCrop -frontend-parseable-output -disable-clang-spi -target-sdk-version 11.4 -target-sdk-name watchos11.4 -external-plugin-path /Applications/Xcode-16.3.0.app/Contents/Developer/Platforms/WatchOS.platform/Developer/usr/lib/swift/host/plugins\#/Applications/Xcode-16.3.0.app/Contents/Developer/Platforms/WatchOS.platform/Developer/usr/bin/swift-plugin-server -external-plugin-path /Applications/Xcode-16.3.0.app/Contents/Developer/Platforms/WatchOS.platform/Developer/usr/local/lib/swift/host/plugins\#/Applications/Xcode-16.3.0.app/Contents/Developer/Platforms/WatchOS.platform/Developer/usr/bin/swift-plugin-server -in-process-plugin-server-path /Applications/Xcode-16.3.0.app/Contents/Developer/Toolchains/XcodeDefault.xctoolchain/usr/lib/swift/host/libSwiftInProcPluginServer.dylib -plugin-path /Applications/Xcode-16.3.0.app/Contents/Developer/Toolchains/XcodeDefault.xctoolchain/usr/lib/swift/host/plugins -plugin-path /Applications/Xcode-16.3.0.app/Contents/Developer/Toolchains/XcodeDefault.xctoolchain/usr/local/lib/swift/host/plugins -o /Users/admin/builder/spi-builder-workspace/.derivedData/Build/Intermediates.noindex/PhotoSelectAndCrop.build/Debug-watchos/PhotoSelectAndCrop.build/Objects-normal/arm64/SystemPHPicker.o -index-unit-output-path /PhotoSelectAndCrop.build/Debug-watchos/PhotoSelectAndCrop.build/Objects-normal/arm64/SystemPHPicker.o -index-store-path /Users/admin/builder/spi-builder-workspace/.derivedData/Index.noindex/DataStore -index-system-modules
SwiftCompile normal arm64 /Users/admin/builder/spi-builder-workspace/Sources/SystemPHPicker.swift (in target 'PhotoSelectAndCrop' from project 'PhotoSelectAndCrop')
cd /Users/admin/builder/spi-builder-workspace/.swiftpm/xcode
/Users/admin/builder/spi-builder-workspace/Sources/SystemPHPicker.swift:28:47: error: cannot find type 'Context' in scope
public func makeUIViewController(context: Context) -> PHPickerViewController {
^~~~~~~
/Users/admin/builder/spi-builder-workspace/Sources/SystemPHPicker.swift:28:59: error: 'PHPickerViewController' is unavailable in watchOS
public func makeUIViewController(context: Context) -> PHPickerViewController {
^~~~~~~~~~~~~~~~~~~~~~
/Applications/Xcode-16.3.0.app/Contents/Developer/Platforms/WatchOS.platform/Developer/SDKs/WatchOS11.4.sdk/System/Library/Frameworks/PhotosUI.framework/Headers/PHPicker.h:236:12: note: 'PHPickerViewController' has been explicitly marked unavailable here
@interface PHPickerViewController : NSObject
^
/Users/admin/builder/spi-builder-workspace/Sources/SystemPHPicker.swift:38:93: error: cannot find type 'Context' in scope
public func updateUIViewController(_ uiViewController: PHPickerViewController, context: Context) {
^~~~~~~
/Users/admin/builder/spi-builder-workspace/Sources/SystemPHPicker.swift:38:60: error: 'PHPickerViewController' is unavailable in watchOS
public func updateUIViewController(_ uiViewController: PHPickerViewController, context: Context) {
^~~~~~~~~~~~~~~~~~~~~~
/Applications/Xcode-16.3.0.app/Contents/Developer/Platforms/WatchOS.platform/Developer/SDKs/WatchOS11.4.sdk/System/Library/Frameworks/PhotosUI.framework/Headers/PHPicker.h:236:12: note: 'PHPickerViewController' has been explicitly marked unavailable here
@interface PHPickerViewController : NSObject
^
/Users/admin/builder/spi-builder-workspace/Sources/SystemPHPicker.swift:53:38: error: 'PHPickerViewController' is unavailable in watchOS
public func picker(_ picker: PHPickerViewController, didFinishPicking results: [PHPickerResult]) {
^~~~~~~~~~~~~~~~~~~~~~
/Applications/Xcode-16.3.0.app/Contents/Developer/Platforms/WatchOS.platform/Developer/SDKs/WatchOS11.4.sdk/System/Library/Frameworks/PhotosUI.framework/Headers/PHPicker.h:236:12: note: 'PHPickerViewController' has been explicitly marked unavailable here
@interface PHPickerViewController : NSObject
^
/Users/admin/builder/spi-builder-workspace/Sources/SystemPHPicker.swift:53:89: error: 'PHPickerResult' is unavailable in watchOS
public func picker(_ picker: PHPickerViewController, didFinishPicking results: [PHPickerResult]) {
^~~~~~~~~~~~~~
PhotosUI.PHPickerResult:4:15: note: 'PHPickerResult' has been explicitly marked unavailable here
public struct PHPickerResult : Equatable, Hashable {
^
/Users/admin/builder/spi-builder-workspace/Sources/SystemPHPicker.swift:46:41: error: 'PHPickerViewControllerDelegate' is unavailable in watchOS
public class Coordinator: NSObject, PHPickerViewControllerDelegate {
^~~~~~~~~~~~~~~~~~~~~~~~~~~~~~
PhotosUI.PHPickerViewControllerDelegate:4:44: note: 'PHPickerViewControllerDelegate' has been explicitly marked unavailable here
@MainActor @preconcurrency public protocol PHPickerViewControllerDelegate : AnyObject {
^
/Users/admin/builder/spi-builder-workspace/Sources/SystemPHPicker.swift:22:31: error: cannot find type 'UIViewControllerRepresentable' in scope
public struct SystemPHPicker: UIViewControllerRepresentable {
^~~~~~~~~~~~~~~~~~~~~~~~~~~~~
/Users/admin/builder/spi-builder-workspace/Sources/SystemPHPicker.swift:29:29: error: 'PHPickerConfiguration' is unavailable in watchOS
var configuration = PHPickerConfiguration()
^~~~~~~~~~~~~~~~~~~~~
PhotosUI.PHPickerConfiguration:4:15: note: 'PHPickerConfiguration' has been explicitly marked unavailable here
public struct PHPickerConfiguration : Equatable, Hashable, @unchecked Sendable {
^
/Users/admin/builder/spi-builder-workspace/Sources/SystemPHPicker.swift:33:22: error: 'PHPickerViewController' is unavailable in watchOS
let picker = PHPickerViewController(configuration: configuration)
^~~~~~~~~~~~~~~~~~~~~~
/Applications/Xcode-16.3.0.app/Contents/Developer/Platforms/WatchOS.platform/Developer/SDKs/WatchOS11.4.sdk/System/Library/Frameworks/PhotosUI.framework/Headers/PHPicker.h:236:12: note: 'PHPickerViewController' has been explicitly marked unavailable here
@interface PHPickerViewController : NSObject
^
/Users/admin/builder/spi-builder-workspace/Sources/SystemPHPicker.swift:33:22: error: 'init(configuration:)' is unavailable in watchOS
let picker = PHPickerViewController(configuration: configuration)
^~~~~~~~~~~~~~~~~~~~~~
PhotosUI.PHPickerViewController.init:2:47: note: 'init(configuration:)' has been explicitly marked unavailable here
@MainActor @preconcurrency public convenience init(configuration: PHPickerConfiguration)}
^
SwiftEmitModule normal arm64 Emitting\ module\ for\ PhotoSelectAndCrop (in target 'PhotoSelectAndCrop' from project 'PhotoSelectAndCrop')
EmitSwiftModule normal arm64 (in target 'PhotoSelectAndCrop' from project 'PhotoSelectAndCrop')
cd /Users/admin/builder/spi-builder-workspace/.swiftpm/xcode
SwiftEmitModule normal armv7k Emitting\ module\ for\ PhotoSelectAndCrop (in target 'PhotoSelectAndCrop' from project 'PhotoSelectAndCrop')
EmitSwiftModule normal armv7k (in target 'PhotoSelectAndCrop' from project 'PhotoSelectAndCrop')
cd /Users/admin/builder/spi-builder-workspace/.swiftpm/xcode
SwiftEmitModule normal arm64_32 Emitting\ module\ for\ PhotoSelectAndCrop (in target 'PhotoSelectAndCrop' from project 'PhotoSelectAndCrop')
Command SwiftEmitModule failed with a nonzero exit code
** BUILD FAILED **
The following build commands failed:
SwiftCompile normal arm64 /Users/admin/builder/spi-builder-workspace/Sources/Color+Extensions.swift (in target 'PhotoSelectAndCrop' from project 'PhotoSelectAndCrop')
SwiftCompile normal arm64 Compiling\ SystemImagePicker.swift /Users/admin/builder/spi-builder-workspace/Sources/SystemImagePicker.swift (in target 'PhotoSelectAndCrop' from project 'PhotoSelectAndCrop')
SwiftCompile normal arm64 /Users/admin/builder/spi-builder-workspace/Sources/SystemImagePicker.swift (in target 'PhotoSelectAndCrop' from project 'PhotoSelectAndCrop')
SwiftCompile normal arm64 Compiling\ SystemPHPicker.swift /Users/admin/builder/spi-builder-workspace/Sources/SystemPHPicker.swift (in target 'PhotoSelectAndCrop' from project 'PhotoSelectAndCrop')
SwiftCompile normal arm64 /Users/admin/builder/spi-builder-workspace/Sources/SystemPHPicker.swift (in target 'PhotoSelectAndCrop' from project 'PhotoSelectAndCrop')
SwiftEmitModule normal arm64_32 Emitting\ module\ for\ PhotoSelectAndCrop (in target 'PhotoSelectAndCrop' from project 'PhotoSelectAndCrop')
Building workspace spi-builder-workspace with scheme PhotoSelectAndCrop
(7 failures)
BUILD FAILURE 6.1 watchOS