Build Information
Failed to build Coverage, reference master (b85f8c
), with Swift 6.0 for macOS (Xcode) using Xcode 16.2 on 26 Nov 2024 11:48:49 UTC.
Build Command
env DEVELOPER_DIR=/Applications/Xcode-16.1.0.app xcrun xcodebuild -IDEClonedSourcePackagesDirPathOverride=$PWD/.dependencies -skipMacroValidation -skipPackagePluginValidation -derivedDataPath $PWD/.derivedData build -scheme Coverage-Package -destination platform=macOS,arch=arm64 OTHER_SWIFT_FLAGS=-stats-output-dir .stats -strict-concurrency=complete -enable-upcoming-feature StrictConcurrency -enable-upcoming-feature DisableOutwardActorInference -enable-upcoming-feature GlobalActorIsolatedTypesUsability -enable-upcoming-feature InferSendableFromCaptures
Build Log
========================================
RunAll
========================================
Builder version: 4.58.0
Interrupt handler set up.
========================================
Checkout
========================================
Clone URL: https://github.com/elegantchaos/Coverage.git
Reference: master
Initialized empty Git repository in /Users/admin/builder/spi-builder-workspace/.git/
From https://github.com/elegantchaos/Coverage
* branch master -> FETCH_HEAD
* [new branch] master -> origin/master
HEAD is now at b85f8c9 added license
Cloned https://github.com/elegantchaos/Coverage.git
Revision (git rev-parse @):
b85f8c9e515c03072791efb97c902490ad4ce4ed
SUCCESS checkout https://github.com/elegantchaos/Coverage.git at master
========================================
Build
========================================
Selected platform: macosXcodebuild
Swift version: 6.0
Building package at path: $PWD
https://github.com/elegantchaos/Coverage.git
Command line invocation:
/Applications/Xcode-16.1.0.app/Contents/Developer/usr/bin/xcodebuild -IDEClonedSourcePackagesDirPathOverride=/Users/admin/builder/spi-builder-workspace/.dependencies -resolvePackageDependencies
User defaults from command line:
IDEClonedSourcePackagesDirPathOverride = /Users/admin/builder/spi-builder-workspace/.dependencies
IDEPackageSupportUseBuiltinSCM = YES
resolved source packages:
{
"dependencies" : [
{
"identity" : "runner",
"requirement" : {
"range" : [
{
"lower_bound" : "1.0.2",
"upper_bound" : "2.0.0"
}
]
},
"type" : "sourceControl",
"url" : "https://github.com/elegantchaos/Runner.git"
},
{
"identity" : "arguments",
"requirement" : {
"range" : [
{
"lower_bound" : "1.1.0",
"upper_bound" : "2.0.0"
}
]
},
"type" : "sourceControl",
"url" : "https://github.com/elegantchaos/Arguments.git"
},
{
"identity" : "logger",
"requirement" : {
"range" : [
{
"lower_bound" : "1.3.6",
"upper_bound" : "2.0.0"
}
]
},
"type" : "sourceControl",
"url" : "https://github.com/elegantchaos/Logger.git"
}
],
"manifest_display_name" : "Coverage",
"name" : "Coverage",
"path" : "/Users/admin/builder/spi-builder-workspace",
"platforms" : [
{
"name" : "macos",
"version" : "10.13"
}
],
"products" : [
{
"name" : "coverage",
"targets" : [
"Coverage"
],
"type" : {
"executable" : null
}
}
],
"targets" : [
{
"c99name" : "CoverageTests",
"module_type" : "SwiftTarget",
"name" : "CoverageTests",
"path" : "Tests/CoverageTests",
"sources" : [
"CoverageTests.swift",
"XCTestManifests.swift"
],
"target_dependencies" : [
"Coverage"
],
"type" : "test"
},
{
"c99name" : "Coverage",
"module_type" : "SwiftTarget",
"name" : "Coverage",
"path" : "Sources/Coverage",
"product_dependencies" : [
"Runner",
"Arguments",
"Logger"
],
"product_memberships" : [
"coverage"
],
"sources" : [
"CodeCoverageParser.swift",
"XCodeResultParser.swift",
"main.swift"
],
"type" : "executable"
}
],
"tools_version" : "5.0"
}
{
"project" : {
"configurations" : [
"Debug",
"Release"
],
"name" : "Coverage",
"schemes" : [
"Coverage",
"Coverage-Package"
],
"targets" : [
"Arguments",
"ArgumentsPackageDescription",
"Coverage",
"CoveragePackageDescription",
"CoveragePackageTests",
"CoverageTests",
"Docopt",
"DocoptPackageDescription",
"Logger",
"LoggerPackageDescription",
"Runner",
"RunnerPackageDescription",
"coverage"
]
}
}
Running build ...
env DEVELOPER_DIR=/Applications/Xcode-16.1.0.app xcrun xcodebuild -IDEClonedSourcePackagesDirPathOverride=$PWD/.dependencies -skipMacroValidation -skipPackagePluginValidation -derivedDataPath $PWD/.derivedData build -scheme Coverage-Package -destination platform=macOS,arch=arm64 OTHER_SWIFT_FLAGS=-stats-output-dir .stats -strict-concurrency=complete -enable-upcoming-feature StrictConcurrency -enable-upcoming-feature DisableOutwardActorInference -enable-upcoming-feature GlobalActorIsolatedTypesUsability -enable-upcoming-feature InferSendableFromCaptures
Command line invocation:
/Applications/Xcode-16.1.0.app/Contents/Developer/usr/bin/xcodebuild -IDEClonedSourcePackagesDirPathOverride=/Users/admin/builder/spi-builder-workspace/.dependencies -skipMacroValidation -skipPackagePluginValidation -derivedDataPath /Users/admin/builder/spi-builder-workspace/.derivedData build -scheme Coverage-Package -destination platform=macOS,arch=arm64 "OTHER_SWIFT_FLAGS=-stats-output-dir .stats -strict-concurrency=complete -enable-upcoming-feature StrictConcurrency -enable-upcoming-feature DisableOutwardActorInference -enable-upcoming-feature GlobalActorIsolatedTypesUsability -enable-upcoming-feature InferSendableFromCaptures"
User defaults from command line:
IDEClonedSourcePackagesDirPathOverride = /Users/admin/builder/spi-builder-workspace/.dependencies
IDEDerivedDataPathOverride = /Users/admin/builder/spi-builder-workspace/.derivedData
IDEPackageSupportUseBuiltinSCM = YES
Build settings from command line:
OTHER_SWIFT_FLAGS = -stats-output-dir .stats -strict-concurrency=complete -enable-upcoming-feature StrictConcurrency -enable-upcoming-feature DisableOutwardActorInference -enable-upcoming-feature GlobalActorIsolatedTypesUsability -enable-upcoming-feature InferSendableFromCaptures
Prepare packages
ComputeTargetDependencyGraph
note: Building targets in dependency order
note: Target dependency graph (5 targets)
Target 'Coverage' in project 'Coverage'
➜ Explicit dependency on target 'Arguments' in project 'Coverage'
➜ Explicit dependency on target 'Logger' in project 'Coverage'
➜ Explicit dependency on target 'Docopt' in project 'Coverage'
➜ Explicit dependency on target 'Runner' in project 'Coverage'
Target 'Runner' in project 'Coverage' (no dependencies)
Target 'Arguments' in project 'Coverage'
➜ Explicit dependency on target 'Logger' in project 'Coverage'
➜ Explicit dependency on target 'Docopt' in project 'Coverage'
Target 'Docopt' in project 'Coverage' (no dependencies)
Target 'Logger' in project 'Coverage' (no dependencies)
GatherProvisioningInputs
CreateBuildDescription
ExecuteExternalTool /Applications/Xcode-16.1.0.app/Contents/Developer/Toolchains/XcodeDefault.xctoolchain/usr/bin/swiftc --version
ExecuteExternalTool /Applications/Xcode-16.1.0.app/Contents/Developer/Toolchains/XcodeDefault.xctoolchain/usr/bin/clang -v -E -dM -isysroot /Applications/Xcode-16.1.0.app/Contents/Developer/Platforms/MacOSX.platform/Developer/SDKs/MacOSX15.1.sdk -x c -c /dev/null
ExecuteExternalTool /Applications/Xcode-16.1.0.app/Contents/Developer/Toolchains/XcodeDefault.xctoolchain/usr/bin/ld -version_details
Build description signature: f4e7bac8d8f5acccf24627d5ec89b3cc
Build description path: /Users/admin/builder/spi-builder-workspace/.derivedData/Build/Intermediates.noindex/XCBuildData/f4e7bac8d8f5acccf24627d5ec89b3cc.xcbuilddata
CreateBuildDirectory /Users/admin/builder/spi-builder-workspace/.derivedData/Build/Products
cd /Users/admin/builder/spi-builder-workspace/Coverage.xcodeproj
builtin-create-build-directory /Users/admin/builder/spi-builder-workspace/.derivedData/Build/Products
ClangStatCache /Applications/Xcode-16.1.0.app/Contents/Developer/Toolchains/XcodeDefault.xctoolchain/usr/bin/clang-stat-cache /Applications/Xcode-16.1.0.app/Contents/Developer/Platforms/MacOSX.platform/Developer/SDKs/MacOSX15.1.sdk /Users/admin/builder/spi-builder-workspace/.derivedData/SDKStatCaches.noindex/macosx15.1-24B75-44d23fded74b714c58e69ec4af40d824.sdkstatcache
cd /Users/admin/builder/spi-builder-workspace/Coverage.xcodeproj
/Applications/Xcode-16.1.0.app/Contents/Developer/Toolchains/XcodeDefault.xctoolchain/usr/bin/clang-stat-cache /Applications/Xcode-16.1.0.app/Contents/Developer/Platforms/MacOSX.platform/Developer/SDKs/MacOSX15.1.sdk -o /Users/admin/builder/spi-builder-workspace/.derivedData/SDKStatCaches.noindex/macosx15.1-24B75-44d23fded74b714c58e69ec4af40d824.sdkstatcache
CreateBuildDirectory /Users/admin/builder/spi-builder-workspace/.derivedData/Build/Intermediates.noindex
cd /Users/admin/builder/spi-builder-workspace/Coverage.xcodeproj
builtin-create-build-directory /Users/admin/builder/spi-builder-workspace/.derivedData/Build/Intermediates.noindex
CreateBuildDirectory /Users/admin/builder/spi-builder-workspace/.derivedData/Build/Products/Debug
cd /Users/admin/builder/spi-builder-workspace/Coverage.xcodeproj
builtin-create-build-directory /Users/admin/builder/spi-builder-workspace/.derivedData/Build/Products/Debug
CreateBuildDirectory /Users/admin/builder/spi-builder-workspace/.derivedData/Build/Intermediates.noindex/EagerLinkingTBDs/Debug
cd /Users/admin/builder/spi-builder-workspace/Coverage.xcodeproj
builtin-create-build-directory /Users/admin/builder/spi-builder-workspace/.derivedData/Build/Intermediates.noindex/EagerLinkingTBDs/Debug
SymLink /Users/admin/builder/spi-builder-workspace/.derivedData/Build/Products/Debug/Runner.framework/Resources Versions/Current/Resources (in target 'Runner' from project 'Coverage')
cd /Users/admin/builder/spi-builder-workspace
/bin/ln -sfh Versions/Current/Resources /Users/admin/builder/spi-builder-workspace/.derivedData/Build/Products/Debug/Runner.framework/Resources
SymLink /Users/admin/builder/spi-builder-workspace/.derivedData/Build/Products/Debug/Runner.framework/Runner Versions/Current/Runner (in target 'Runner' from project 'Coverage')
cd /Users/admin/builder/spi-builder-workspace
/bin/ln -sfh Versions/Current/Runner /Users/admin/builder/spi-builder-workspace/.derivedData/Build/Products/Debug/Runner.framework/Runner
SymLink /Users/admin/builder/spi-builder-workspace/.derivedData/Build/Products/Debug/Runner.framework/Versions/Current A (in target 'Runner' from project 'Coverage')
cd /Users/admin/builder/spi-builder-workspace
/bin/ln -sfh A /Users/admin/builder/spi-builder-workspace/.derivedData/Build/Products/Debug/Runner.framework/Versions/Current
WriteAuxiliaryFile /Users/admin/builder/spi-builder-workspace/.derivedData/Build/Intermediates.noindex/Coverage.build/Debug/Runner.build/Runner.DependencyMetadataFileList (in target 'Runner' from project 'Coverage')
cd /Users/admin/builder/spi-builder-workspace
write-file /Users/admin/builder/spi-builder-workspace/.derivedData/Build/Intermediates.noindex/Coverage.build/Debug/Runner.build/Runner.DependencyMetadataFileList
WriteAuxiliaryFile /Users/admin/builder/spi-builder-workspace/.derivedData/Build/Intermediates.noindex/Coverage.build/Debug/Runner.build/Objects-normal/arm64/Runner.SwiftConstValuesFileList (in target 'Runner' from project 'Coverage')
cd /Users/admin/builder/spi-builder-workspace
write-file /Users/admin/builder/spi-builder-workspace/.derivedData/Build/Intermediates.noindex/Coverage.build/Debug/Runner.build/Objects-normal/arm64/Runner.SwiftConstValuesFileList
WriteAuxiliaryFile /Users/admin/builder/spi-builder-workspace/.derivedData/Build/Intermediates.noindex/Coverage.build/Debug/Runner.build/Objects-normal/arm64/Runner_const_extract_protocols.json (in target 'Runner' from project 'Coverage')
cd /Users/admin/builder/spi-builder-workspace
write-file /Users/admin/builder/spi-builder-workspace/.derivedData/Build/Intermediates.noindex/Coverage.build/Debug/Runner.build/Objects-normal/arm64/Runner_const_extract_protocols.json
WriteAuxiliaryFile /Users/admin/builder/spi-builder-workspace/.derivedData/Build/Intermediates.noindex/Coverage.build/Debug/Runner.build/Objects-normal/arm64/Runner.SwiftFileList (in target 'Runner' from project 'Coverage')
cd /Users/admin/builder/spi-builder-workspace
write-file /Users/admin/builder/spi-builder-workspace/.derivedData/Build/Intermediates.noindex/Coverage.build/Debug/Runner.build/Objects-normal/arm64/Runner.SwiftFileList
WriteAuxiliaryFile /Users/admin/builder/spi-builder-workspace/.derivedData/Build/Intermediates.noindex/Coverage.build/Debug/Runner.build/Objects-normal/arm64/Runner.LinkFileList (in target 'Runner' from project 'Coverage')
cd /Users/admin/builder/spi-builder-workspace
write-file /Users/admin/builder/spi-builder-workspace/.derivedData/Build/Intermediates.noindex/Coverage.build/Debug/Runner.build/Objects-normal/arm64/Runner.LinkFileList
WriteAuxiliaryFile /Users/admin/builder/spi-builder-workspace/.derivedData/Build/Intermediates.noindex/Coverage.build/Debug/Runner.build/Objects-normal/arm64/Runner-OutputFileMap.json (in target 'Runner' from project 'Coverage')
cd /Users/admin/builder/spi-builder-workspace
write-file /Users/admin/builder/spi-builder-workspace/.derivedData/Build/Intermediates.noindex/Coverage.build/Debug/Runner.build/Objects-normal/arm64/Runner-OutputFileMap.json
WriteAuxiliaryFile /Users/admin/builder/spi-builder-workspace/.derivedData/Build/Intermediates.noindex/Coverage.build/Debug/Logger.build/Objects-normal/arm64/Logger_const_extract_protocols.json (in target 'Logger' from project 'Coverage')
cd /Users/admin/builder/spi-builder-workspace
write-file /Users/admin/builder/spi-builder-workspace/.derivedData/Build/Intermediates.noindex/Coverage.build/Debug/Logger.build/Objects-normal/arm64/Logger_const_extract_protocols.json
WriteAuxiliaryFile /Users/admin/builder/spi-builder-workspace/.derivedData/Build/Intermediates.noindex/Coverage.build/Debug/Logger.build/Objects-normal/arm64/Logger.SwiftFileList (in target 'Logger' from project 'Coverage')
cd /Users/admin/builder/spi-builder-workspace
write-file /Users/admin/builder/spi-builder-workspace/.derivedData/Build/Intermediates.noindex/Coverage.build/Debug/Logger.build/Objects-normal/arm64/Logger.SwiftFileList
WriteAuxiliaryFile /Users/admin/builder/spi-builder-workspace/.derivedData/Build/Intermediates.noindex/Coverage.build/Debug/Logger.build/Objects-normal/arm64/Logger.SwiftConstValuesFileList (in target 'Logger' from project 'Coverage')
cd /Users/admin/builder/spi-builder-workspace
write-file /Users/admin/builder/spi-builder-workspace/.derivedData/Build/Intermediates.noindex/Coverage.build/Debug/Logger.build/Objects-normal/arm64/Logger.SwiftConstValuesFileList
WriteAuxiliaryFile /Users/admin/builder/spi-builder-workspace/.derivedData/Build/Intermediates.noindex/Coverage.build/Debug/Logger.build/Objects-normal/arm64/Logger.LinkFileList (in target 'Logger' from project 'Coverage')
cd /Users/admin/builder/spi-builder-workspace
write-file /Users/admin/builder/spi-builder-workspace/.derivedData/Build/Intermediates.noindex/Coverage.build/Debug/Logger.build/Objects-normal/arm64/Logger.LinkFileList
WriteAuxiliaryFile /Users/admin/builder/spi-builder-workspace/.derivedData/Build/Intermediates.noindex/Coverage.build/Debug/Logger.build/Objects-normal/arm64/Logger-OutputFileMap.json (in target 'Logger' from project 'Coverage')
cd /Users/admin/builder/spi-builder-workspace
write-file /Users/admin/builder/spi-builder-workspace/.derivedData/Build/Intermediates.noindex/Coverage.build/Debug/Logger.build/Objects-normal/arm64/Logger-OutputFileMap.json
WriteAuxiliaryFile /Users/admin/builder/spi-builder-workspace/.derivedData/Build/Intermediates.noindex/Coverage.build/Debug/Logger.build/Logger.DependencyMetadataFileList (in target 'Logger' from project 'Coverage')
cd /Users/admin/builder/spi-builder-workspace
write-file /Users/admin/builder/spi-builder-workspace/.derivedData/Build/Intermediates.noindex/Coverage.build/Debug/Logger.build/Logger.DependencyMetadataFileList
WriteAuxiliaryFile /Users/admin/builder/spi-builder-workspace/.derivedData/Build/Intermediates.noindex/Coverage.build/Debug/Docopt.build/Objects-normal/arm64/Docopt_const_extract_protocols.json (in target 'Docopt' from project 'Coverage')
cd /Users/admin/builder/spi-builder-workspace
write-file /Users/admin/builder/spi-builder-workspace/.derivedData/Build/Intermediates.noindex/Coverage.build/Debug/Docopt.build/Objects-normal/arm64/Docopt_const_extract_protocols.json
WriteAuxiliaryFile /Users/admin/builder/spi-builder-workspace/.derivedData/Build/Intermediates.noindex/Coverage.build/Debug/Docopt.build/Objects-normal/arm64/Docopt.SwiftFileList (in target 'Docopt' from project 'Coverage')
cd /Users/admin/builder/spi-builder-workspace
write-file /Users/admin/builder/spi-builder-workspace/.derivedData/Build/Intermediates.noindex/Coverage.build/Debug/Docopt.build/Objects-normal/arm64/Docopt.SwiftFileList
WriteAuxiliaryFile /Users/admin/builder/spi-builder-workspace/.derivedData/Build/Intermediates.noindex/Coverage.build/Debug/Docopt.build/Objects-normal/arm64/Docopt.SwiftConstValuesFileList (in target 'Docopt' from project 'Coverage')
cd /Users/admin/builder/spi-builder-workspace
write-file /Users/admin/builder/spi-builder-workspace/.derivedData/Build/Intermediates.noindex/Coverage.build/Debug/Docopt.build/Objects-normal/arm64/Docopt.SwiftConstValuesFileList
WriteAuxiliaryFile /Users/admin/builder/spi-builder-workspace/.derivedData/Build/Intermediates.noindex/Coverage.build/Debug/Docopt.build/Objects-normal/arm64/Docopt.LinkFileList (in target 'Docopt' from project 'Coverage')
cd /Users/admin/builder/spi-builder-workspace
write-file /Users/admin/builder/spi-builder-workspace/.derivedData/Build/Intermediates.noindex/Coverage.build/Debug/Docopt.build/Objects-normal/arm64/Docopt.LinkFileList
WriteAuxiliaryFile /Users/admin/builder/spi-builder-workspace/.derivedData/Build/Intermediates.noindex/Coverage.build/Debug/Docopt.build/Objects-normal/arm64/Docopt-OutputFileMap.json (in target 'Docopt' from project 'Coverage')
cd /Users/admin/builder/spi-builder-workspace
write-file /Users/admin/builder/spi-builder-workspace/.derivedData/Build/Intermediates.noindex/Coverage.build/Debug/Docopt.build/Objects-normal/arm64/Docopt-OutputFileMap.json
WriteAuxiliaryFile /Users/admin/builder/spi-builder-workspace/.derivedData/Build/Intermediates.noindex/Coverage.build/Debug/Docopt.build/Docopt.DependencyMetadataFileList (in target 'Docopt' from project 'Coverage')
cd /Users/admin/builder/spi-builder-workspace
write-file /Users/admin/builder/spi-builder-workspace/.derivedData/Build/Intermediates.noindex/Coverage.build/Debug/Docopt.build/Docopt.DependencyMetadataFileList
WriteAuxiliaryFile /Users/admin/builder/spi-builder-workspace/.derivedData/Build/Intermediates.noindex/Coverage.build/Debug/Coverage.build/Objects-normal/arm64/Coverage_const_extract_protocols.json (in target 'Coverage' from project 'Coverage')
cd /Users/admin/builder/spi-builder-workspace
write-file /Users/admin/builder/spi-builder-workspace/.derivedData/Build/Intermediates.noindex/Coverage.build/Debug/Coverage.build/Objects-normal/arm64/Coverage_const_extract_protocols.json
WriteAuxiliaryFile /Users/admin/builder/spi-builder-workspace/.derivedData/Build/Intermediates.noindex/Coverage.build/Debug/Coverage.build/Objects-normal/arm64/Coverage.SwiftFileList (in target 'Coverage' from project 'Coverage')
cd /Users/admin/builder/spi-builder-workspace
write-file /Users/admin/builder/spi-builder-workspace/.derivedData/Build/Intermediates.noindex/Coverage.build/Debug/Coverage.build/Objects-normal/arm64/Coverage.SwiftFileList
WriteAuxiliaryFile /Users/admin/builder/spi-builder-workspace/.derivedData/Build/Intermediates.noindex/Coverage.build/Debug/Coverage.build/Objects-normal/arm64/Coverage.LinkFileList (in target 'Coverage' from project 'Coverage')
cd /Users/admin/builder/spi-builder-workspace
write-file /Users/admin/builder/spi-builder-workspace/.derivedData/Build/Intermediates.noindex/Coverage.build/Debug/Coverage.build/Objects-normal/arm64/Coverage.LinkFileList
WriteAuxiliaryFile /Users/admin/builder/spi-builder-workspace/.derivedData/Build/Intermediates.noindex/Coverage.build/Debug/Coverage.build/Objects-normal/arm64/Coverage-OutputFileMap.json (in target 'Coverage' from project 'Coverage')
cd /Users/admin/builder/spi-builder-workspace
write-file /Users/admin/builder/spi-builder-workspace/.derivedData/Build/Intermediates.noindex/Coverage.build/Debug/Coverage.build/Objects-normal/arm64/Coverage-OutputFileMap.json
WriteAuxiliaryFile /Users/admin/builder/spi-builder-workspace/.derivedData/Build/Intermediates.noindex/Coverage.build/Debug/Coverage.build/DerivedSources/Entitlements.plist (in target 'Coverage' from project 'Coverage')
cd /Users/admin/builder/spi-builder-workspace
write-file /Users/admin/builder/spi-builder-workspace/.derivedData/Build/Intermediates.noindex/Coverage.build/Debug/Coverage.build/DerivedSources/Entitlements.plist
WriteAuxiliaryFile /Users/admin/builder/spi-builder-workspace/.derivedData/Build/Intermediates.noindex/Coverage.build/Debug/Coverage.build/Coverage.DependencyMetadataFileList (in target 'Coverage' from project 'Coverage')
cd /Users/admin/builder/spi-builder-workspace
write-file /Users/admin/builder/spi-builder-workspace/.derivedData/Build/Intermediates.noindex/Coverage.build/Debug/Coverage.build/Coverage.DependencyMetadataFileList
WriteAuxiliaryFile /Users/admin/builder/spi-builder-workspace/.derivedData/Build/Intermediates.noindex/Coverage.build/Debug/Arguments.build/Objects-normal/arm64/Arguments_const_extract_protocols.json (in target 'Arguments' from project 'Coverage')
cd /Users/admin/builder/spi-builder-workspace
write-file /Users/admin/builder/spi-builder-workspace/.derivedData/Build/Intermediates.noindex/Coverage.build/Debug/Arguments.build/Objects-normal/arm64/Arguments_const_extract_protocols.json
WriteAuxiliaryFile /Users/admin/builder/spi-builder-workspace/.derivedData/Build/Intermediates.noindex/Coverage.build/Debug/Arguments.build/Objects-normal/arm64/Arguments.SwiftFileList (in target 'Arguments' from project 'Coverage')
cd /Users/admin/builder/spi-builder-workspace
write-file /Users/admin/builder/spi-builder-workspace/.derivedData/Build/Intermediates.noindex/Coverage.build/Debug/Arguments.build/Objects-normal/arm64/Arguments.SwiftFileList
WriteAuxiliaryFile /Users/admin/builder/spi-builder-workspace/.derivedData/Build/Intermediates.noindex/Coverage.build/Debug/Arguments.build/Objects-normal/arm64/Arguments.SwiftConstValuesFileList (in target 'Arguments' from project 'Coverage')
cd /Users/admin/builder/spi-builder-workspace
write-file /Users/admin/builder/spi-builder-workspace/.derivedData/Build/Intermediates.noindex/Coverage.build/Debug/Arguments.build/Objects-normal/arm64/Arguments.SwiftConstValuesFileList
WriteAuxiliaryFile /Users/admin/builder/spi-builder-workspace/.derivedData/Build/Intermediates.noindex/Coverage.build/Debug/Arguments.build/Objects-normal/arm64/Arguments.LinkFileList (in target 'Arguments' from project 'Coverage')
cd /Users/admin/builder/spi-builder-workspace
write-file /Users/admin/builder/spi-builder-workspace/.derivedData/Build/Intermediates.noindex/Coverage.build/Debug/Arguments.build/Objects-normal/arm64/Arguments.LinkFileList
WriteAuxiliaryFile /Users/admin/builder/spi-builder-workspace/.derivedData/Build/Intermediates.noindex/Coverage.build/Debug/Arguments.build/Objects-normal/arm64/Arguments-OutputFileMap.json (in target 'Arguments' from project 'Coverage')
cd /Users/admin/builder/spi-builder-workspace
write-file /Users/admin/builder/spi-builder-workspace/.derivedData/Build/Intermediates.noindex/Coverage.build/Debug/Arguments.build/Objects-normal/arm64/Arguments-OutputFileMap.json
WriteAuxiliaryFile /Users/admin/builder/spi-builder-workspace/.derivedData/Build/Intermediates.noindex/Coverage.build/Debug/Arguments.build/Arguments.DependencyMetadataFileList (in target 'Arguments' from project 'Coverage')
cd /Users/admin/builder/spi-builder-workspace
write-file /Users/admin/builder/spi-builder-workspace/.derivedData/Build/Intermediates.noindex/Coverage.build/Debug/Arguments.build/Arguments.DependencyMetadataFileList
SymLink /Users/admin/builder/spi-builder-workspace/.derivedData/Build/Products/Debug/Runner.framework/Modules Versions/Current/Modules (in target 'Runner' from project 'Coverage')
cd /Users/admin/builder/spi-builder-workspace
/bin/ln -sfh Versions/Current/Modules /Users/admin/builder/spi-builder-workspace/.derivedData/Build/Products/Debug/Runner.framework/Modules
SymLink /Users/admin/builder/spi-builder-workspace/.derivedData/Build/Products/Debug/Runner.framework/Headers Versions/Current/Headers (in target 'Runner' from project 'Coverage')
cd /Users/admin/builder/spi-builder-workspace
/bin/ln -sfh Versions/Current/Headers /Users/admin/builder/spi-builder-workspace/.derivedData/Build/Products/Debug/Runner.framework/Headers
MkDir /Users/admin/builder/spi-builder-workspace/.derivedData/Build/Products/Debug/Runner.framework/Versions/A/Resources (in target 'Runner' from project 'Coverage')
cd /Users/admin/builder/spi-builder-workspace
/bin/mkdir -p /Users/admin/builder/spi-builder-workspace/.derivedData/Build/Products/Debug/Runner.framework/Versions/A/Resources
MkDir /Users/admin/builder/spi-builder-workspace/.derivedData/Build/Products/Debug/Runner.framework/Versions/A/Headers (in target 'Runner' from project 'Coverage')
cd /Users/admin/builder/spi-builder-workspace
/bin/mkdir -p /Users/admin/builder/spi-builder-workspace/.derivedData/Build/Products/Debug/Runner.framework/Versions/A/Headers
MkDir /Users/admin/builder/spi-builder-workspace/.derivedData/Build/Products/Debug/Runner.framework/Versions/A (in target 'Runner' from project 'Coverage')
cd /Users/admin/builder/spi-builder-workspace
/bin/mkdir -p /Users/admin/builder/spi-builder-workspace/.derivedData/Build/Products/Debug/Runner.framework/Versions/A
MkDir /Users/admin/builder/spi-builder-workspace/.derivedData/Build/Products/Debug/Runner.framework/Versions (in target 'Runner' from project 'Coverage')
cd /Users/admin/builder/spi-builder-workspace
/bin/mkdir -p /Users/admin/builder/spi-builder-workspace/.derivedData/Build/Products/Debug/Runner.framework/Versions
MkDir /Users/admin/builder/spi-builder-workspace/.derivedData/Build/Products/Debug/Runner.framework (in target 'Runner' from project 'Coverage')
cd /Users/admin/builder/spi-builder-workspace
/bin/mkdir -p /Users/admin/builder/spi-builder-workspace/.derivedData/Build/Products/Debug/Runner.framework
SymLink /Users/admin/builder/spi-builder-workspace/.derivedData/Build/Products/Debug/Logger.framework/Versions/Current A (in target 'Logger' from project 'Coverage')
cd /Users/admin/builder/spi-builder-workspace
/bin/ln -sfh A /Users/admin/builder/spi-builder-workspace/.derivedData/Build/Products/Debug/Logger.framework/Versions/Current
SymLink /Users/admin/builder/spi-builder-workspace/.derivedData/Build/Products/Debug/Logger.framework/Resources Versions/Current/Resources (in target 'Logger' from project 'Coverage')
cd /Users/admin/builder/spi-builder-workspace
/bin/ln -sfh Versions/Current/Resources /Users/admin/builder/spi-builder-workspace/.derivedData/Build/Products/Debug/Logger.framework/Resources
SymLink /Users/admin/builder/spi-builder-workspace/.derivedData/Build/Products/Debug/Logger.framework/Modules Versions/Current/Modules (in target 'Logger' from project 'Coverage')
cd /Users/admin/builder/spi-builder-workspace
/bin/ln -sfh Versions/Current/Modules /Users/admin/builder/spi-builder-workspace/.derivedData/Build/Products/Debug/Logger.framework/Modules
SymLink /Users/admin/builder/spi-builder-workspace/.derivedData/Build/Products/Debug/Logger.framework/Logger Versions/Current/Logger (in target 'Logger' from project 'Coverage')
cd /Users/admin/builder/spi-builder-workspace
/bin/ln -sfh Versions/Current/Logger /Users/admin/builder/spi-builder-workspace/.derivedData/Build/Products/Debug/Logger.framework/Logger
SymLink /Users/admin/builder/spi-builder-workspace/.derivedData/Build/Products/Debug/Logger.framework/Headers Versions/Current/Headers (in target 'Logger' from project 'Coverage')
cd /Users/admin/builder/spi-builder-workspace
/bin/ln -sfh Versions/Current/Headers /Users/admin/builder/spi-builder-workspace/.derivedData/Build/Products/Debug/Logger.framework/Headers
MkDir /Users/admin/builder/spi-builder-workspace/.derivedData/Build/Products/Debug/Logger.framework/Versions/A/Resources (in target 'Logger' from project 'Coverage')
cd /Users/admin/builder/spi-builder-workspace
/bin/mkdir -p /Users/admin/builder/spi-builder-workspace/.derivedData/Build/Products/Debug/Logger.framework/Versions/A/Resources
MkDir /Users/admin/builder/spi-builder-workspace/.derivedData/Build/Products/Debug/Logger.framework/Versions/A/Headers (in target 'Logger' from project 'Coverage')
cd /Users/admin/builder/spi-builder-workspace
/bin/mkdir -p /Users/admin/builder/spi-builder-workspace/.derivedData/Build/Products/Debug/Logger.framework/Versions/A/Headers
MkDir /Users/admin/builder/spi-builder-workspace/.derivedData/Build/Products/Debug/Logger.framework/Versions/A (in target 'Logger' from project 'Coverage')
cd /Users/admin/builder/spi-builder-workspace
/bin/mkdir -p /Users/admin/builder/spi-builder-workspace/.derivedData/Build/Products/Debug/Logger.framework/Versions/A
MkDir /Users/admin/builder/spi-builder-workspace/.derivedData/Build/Products/Debug/Logger.framework/Versions (in target 'Logger' from project 'Coverage')
cd /Users/admin/builder/spi-builder-workspace
/bin/mkdir -p /Users/admin/builder/spi-builder-workspace/.derivedData/Build/Products/Debug/Logger.framework/Versions
MkDir /Users/admin/builder/spi-builder-workspace/.derivedData/Build/Products/Debug/Logger.framework (in target 'Logger' from project 'Coverage')
cd /Users/admin/builder/spi-builder-workspace
/bin/mkdir -p /Users/admin/builder/spi-builder-workspace/.derivedData/Build/Products/Debug/Logger.framework
SymLink /Users/admin/builder/spi-builder-workspace/.derivedData/Build/Products/Debug/Docopt.framework/Versions/Current A (in target 'Docopt' from project 'Coverage')
cd /Users/admin/builder/spi-builder-workspace
/bin/ln -sfh A /Users/admin/builder/spi-builder-workspace/.derivedData/Build/Products/Debug/Docopt.framework/Versions/Current
SymLink /Users/admin/builder/spi-builder-workspace/.derivedData/Build/Products/Debug/Docopt.framework/Resources Versions/Current/Resources (in target 'Docopt' from project 'Coverage')
cd /Users/admin/builder/spi-builder-workspace
/bin/ln -sfh Versions/Current/Resources /Users/admin/builder/spi-builder-workspace/.derivedData/Build/Products/Debug/Docopt.framework/Resources
SymLink /Users/admin/builder/spi-builder-workspace/.derivedData/Build/Products/Debug/Docopt.framework/Modules Versions/Current/Modules (in target 'Docopt' from project 'Coverage')
cd /Users/admin/builder/spi-builder-workspace
/bin/ln -sfh Versions/Current/Modules /Users/admin/builder/spi-builder-workspace/.derivedData/Build/Products/Debug/Docopt.framework/Modules
SymLink /Users/admin/builder/spi-builder-workspace/.derivedData/Build/Products/Debug/Docopt.framework/Headers Versions/Current/Headers (in target 'Docopt' from project 'Coverage')
cd /Users/admin/builder/spi-builder-workspace
/bin/ln -sfh Versions/Current/Headers /Users/admin/builder/spi-builder-workspace/.derivedData/Build/Products/Debug/Docopt.framework/Headers
SymLink /Users/admin/builder/spi-builder-workspace/.derivedData/Build/Products/Debug/Docopt.framework/Docopt Versions/Current/Docopt (in target 'Docopt' from project 'Coverage')
cd /Users/admin/builder/spi-builder-workspace
/bin/ln -sfh Versions/Current/Docopt /Users/admin/builder/spi-builder-workspace/.derivedData/Build/Products/Debug/Docopt.framework/Docopt
MkDir /Users/admin/builder/spi-builder-workspace/.derivedData/Build/Products/Debug/Docopt.framework/Versions/A/Resources (in target 'Docopt' from project 'Coverage')
cd /Users/admin/builder/spi-builder-workspace
/bin/mkdir -p /Users/admin/builder/spi-builder-workspace/.derivedData/Build/Products/Debug/Docopt.framework/Versions/A/Resources
MkDir /Users/admin/builder/spi-builder-workspace/.derivedData/Build/Products/Debug/Docopt.framework/Versions/A/Headers (in target 'Docopt' from project 'Coverage')
cd /Users/admin/builder/spi-builder-workspace
/bin/mkdir -p /Users/admin/builder/spi-builder-workspace/.derivedData/Build/Products/Debug/Docopt.framework/Versions/A/Headers
MkDir /Users/admin/builder/spi-builder-workspace/.derivedData/Build/Products/Debug/Docopt.framework/Versions/A (in target 'Docopt' from project 'Coverage')
cd /Users/admin/builder/spi-builder-workspace
/bin/mkdir -p /Users/admin/builder/spi-builder-workspace/.derivedData/Build/Products/Debug/Docopt.framework/Versions/A
MkDir /Users/admin/builder/spi-builder-workspace/.derivedData/Build/Products/Debug/Docopt.framework/Versions (in target 'Docopt' from project 'Coverage')
cd /Users/admin/builder/spi-builder-workspace
/bin/mkdir -p /Users/admin/builder/spi-builder-workspace/.derivedData/Build/Products/Debug/Docopt.framework/Versions
MkDir /Users/admin/builder/spi-builder-workspace/.derivedData/Build/Products/Debug/Docopt.framework (in target 'Docopt' from project 'Coverage')
cd /Users/admin/builder/spi-builder-workspace
/bin/mkdir -p /Users/admin/builder/spi-builder-workspace/.derivedData/Build/Products/Debug/Docopt.framework
SymLink /Users/admin/builder/spi-builder-workspace/.derivedData/Build/Products/Debug/Arguments.framework/Versions/Current A (in target 'Arguments' from project 'Coverage')
cd /Users/admin/builder/spi-builder-workspace
/bin/ln -sfh A /Users/admin/builder/spi-builder-workspace/.derivedData/Build/Products/Debug/Arguments.framework/Versions/Current
SymLink /Users/admin/builder/spi-builder-workspace/.derivedData/Build/Products/Debug/Arguments.framework/Resources Versions/Current/Resources (in target 'Arguments' from project 'Coverage')
cd /Users/admin/builder/spi-builder-workspace
/bin/ln -sfh Versions/Current/Resources /Users/admin/builder/spi-builder-workspace/.derivedData/Build/Products/Debug/Arguments.framework/Resources
SymLink /Users/admin/builder/spi-builder-workspace/.derivedData/Build/Products/Debug/Arguments.framework/Modules Versions/Current/Modules (in target 'Arguments' from project 'Coverage')
cd /Users/admin/builder/spi-builder-workspace
/bin/ln -sfh Versions/Current/Modules /Users/admin/builder/spi-builder-workspace/.derivedData/Build/Products/Debug/Arguments.framework/Modules
SymLink /Users/admin/builder/spi-builder-workspace/.derivedData/Build/Products/Debug/Arguments.framework/Headers Versions/Current/Headers (in target 'Arguments' from project 'Coverage')
cd /Users/admin/builder/spi-builder-workspace
/bin/ln -sfh Versions/Current/Headers /Users/admin/builder/spi-builder-workspace/.derivedData/Build/Products/Debug/Arguments.framework/Headers
SymLink /Users/admin/builder/spi-builder-workspace/.derivedData/Build/Products/Debug/Arguments.framework/Arguments Versions/Current/Arguments (in target 'Arguments' from project 'Coverage')
cd /Users/admin/builder/spi-builder-workspace
/bin/ln -sfh Versions/Current/Arguments /Users/admin/builder/spi-builder-workspace/.derivedData/Build/Products/Debug/Arguments.framework/Arguments
MkDir /Users/admin/builder/spi-builder-workspace/.derivedData/Build/Products/Debug/Arguments.framework/Versions/A/Resources (in target 'Arguments' from project 'Coverage')
cd /Users/admin/builder/spi-builder-workspace
/bin/mkdir -p /Users/admin/builder/spi-builder-workspace/.derivedData/Build/Products/Debug/Arguments.framework/Versions/A/Resources
MkDir /Users/admin/builder/spi-builder-workspace/.derivedData/Build/Products/Debug/Arguments.framework/Versions/A/Headers (in target 'Arguments' from project 'Coverage')
cd /Users/admin/builder/spi-builder-workspace
/bin/mkdir -p /Users/admin/builder/spi-builder-workspace/.derivedData/Build/Products/Debug/Arguments.framework/Versions/A/Headers
MkDir /Users/admin/builder/spi-builder-workspace/.derivedData/Build/Products/Debug/Arguments.framework/Versions/A (in target 'Arguments' from project 'Coverage')
cd /Users/admin/builder/spi-builder-workspace
/bin/mkdir -p /Users/admin/builder/spi-builder-workspace/.derivedData/Build/Products/Debug/Arguments.framework/Versions/A
MkDir /Users/admin/builder/spi-builder-workspace/.derivedData/Build/Products/Debug/Arguments.framework/Versions (in target 'Arguments' from project 'Coverage')
cd /Users/admin/builder/spi-builder-workspace
/bin/mkdir -p /Users/admin/builder/spi-builder-workspace/.derivedData/Build/Products/Debug/Arguments.framework/Versions
MkDir /Users/admin/builder/spi-builder-workspace/.derivedData/Build/Products/Debug/Arguments.framework (in target 'Arguments' from project 'Coverage')
cd /Users/admin/builder/spi-builder-workspace
/bin/mkdir -p /Users/admin/builder/spi-builder-workspace/.derivedData/Build/Products/Debug/Arguments.framework
ProcessInfoPlistFile /Users/admin/builder/spi-builder-workspace/.derivedData/Build/Products/Debug/Docopt.framework/Versions/A/Resources/Info.plist /Users/admin/builder/spi-builder-workspace/Coverage.xcodeproj/Docopt_Info.plist (in target 'Docopt' from project 'Coverage')
cd /Users/admin/builder/spi-builder-workspace
builtin-infoPlistUtility /Users/admin/builder/spi-builder-workspace/Coverage.xcodeproj/Docopt_Info.plist -producttype com.apple.product-type.framework -expandbuildsettings -platform macosx -o /Users/admin/builder/spi-builder-workspace/.derivedData/Build/Products/Debug/Docopt.framework/Versions/A/Resources/Info.plist
ProcessInfoPlistFile /Users/admin/builder/spi-builder-workspace/.derivedData/Build/Products/Debug/Runner.framework/Versions/A/Resources/Info.plist /Users/admin/builder/spi-builder-workspace/Coverage.xcodeproj/Runner_Info.plist (in target 'Runner' from project 'Coverage')
cd /Users/admin/builder/spi-builder-workspace
builtin-infoPlistUtility /Users/admin/builder/spi-builder-workspace/Coverage.xcodeproj/Runner_Info.plist -producttype com.apple.product-type.framework -expandbuildsettings -platform macosx -o /Users/admin/builder/spi-builder-workspace/.derivedData/Build/Products/Debug/Runner.framework/Versions/A/Resources/Info.plist
ProcessInfoPlistFile /Users/admin/builder/spi-builder-workspace/.derivedData/Build/Products/Debug/Logger.framework/Versions/A/Resources/Info.plist /Users/admin/builder/spi-builder-workspace/Coverage.xcodeproj/Logger_Info.plist (in target 'Logger' from project 'Coverage')
cd /Users/admin/builder/spi-builder-workspace
builtin-infoPlistUtility /Users/admin/builder/spi-builder-workspace/Coverage.xcodeproj/Logger_Info.plist -producttype com.apple.product-type.framework -expandbuildsettings -platform macosx -o /Users/admin/builder/spi-builder-workspace/.derivedData/Build/Products/Debug/Logger.framework/Versions/A/Resources/Info.plist
SwiftDriver\ Compilation\ Requirements Runner normal arm64 com.apple.xcode.tools.swift.compiler (in target 'Runner' from project 'Coverage')
cd /Users/admin/builder/spi-builder-workspace
builtin-Swift-Compilation-Requirements -- /Applications/Xcode-16.1.0.app/Contents/Developer/Toolchains/XcodeDefault.xctoolchain/usr/bin/swiftc -module-name Runner -Onone -enforce-exclusivity\=checked @/Users/admin/builder/spi-builder-workspace/.derivedData/Build/Intermediates.noindex/Coverage.build/Debug/Runner.build/Objects-normal/arm64/Runner.SwiftFileList -DSWIFT_PACKAGE -DDEBUG -stats-output-dir .stats -strict-concurrency\=complete -enable-upcoming-feature StrictConcurrency -enable-upcoming-feature DisableOutwardActorInference -enable-upcoming-feature GlobalActorIsolatedTypesUsability -enable-upcoming-feature InferSendableFromCaptures -enable-bare-slash-regex -enable-experimental-feature DebugDescriptionMacro -sdk /Applications/Xcode-16.1.0.app/Contents/Developer/Platforms/MacOSX.platform/Developer/SDKs/MacOSX15.1.sdk -target arm64-apple-macos10.10 -g -module-cache-path /Users/admin/builder/spi-builder-workspace/.derivedData/ModuleCache.noindex -Xfrontend -serialize-debugging-options -enable-testing -index-store-path /Users/admin/builder/spi-builder-workspace/.derivedData/Index.noindex/DataStore -enable-experimental-feature OpaqueTypeErasure -Xcc -D_LIBCPP_HARDENING_MODE\=_LIBCPP_HARDENING_MODE_DEBUG -swift-version 4.2 -I /Users/admin/builder/spi-builder-workspace/.derivedData/Build/Products/Debug -F /Users/admin/builder/spi-builder-workspace/.derivedData/Build/Products/Debug -F /Applications/Xcode-16.1.0.app/Contents/Developer/Platforms/MacOSX.platform/Developer/Library/Frameworks -parse-as-library -c -j10 -enable-batch-mode -incremental -Xcc -ivfsstatcache -Xcc /Users/admin/builder/spi-builder-workspace/.derivedData/SDKStatCaches.noindex/macosx15.1-24B75-44d23fded74b714c58e69ec4af40d824.sdkstatcache -output-file-map /Users/admin/builder/spi-builder-workspace/.derivedData/Build/Intermediates.noindex/Coverage.build/Debug/Runner.build/Objects-normal/arm64/Runner-OutputFileMap.json -use-frontend-parseable-output -save-temps -no-color-diagnostics -serialize-diagnostics -emit-dependencies -emit-module -emit-module-path /Users/admin/builder/spi-builder-workspace/.derivedData/Build/Intermediates.noindex/Coverage.build/Debug/Runner.build/Objects-normal/arm64/Runner.swiftmodule -validate-clang-modules-once -clang-build-session-file /Users/admin/builder/spi-builder-workspace/.derivedData/ModuleCache.noindex/Session.modulevalidation -Xcc -I/Users/admin/builder/spi-builder-workspace/.derivedData/Build/Intermediates.noindex/Coverage.build/Debug/Runner.build/swift-overrides.hmap -emit-const-values -Xfrontend -const-gather-protocols-file -Xfrontend /Users/admin/builder/spi-builder-workspace/.derivedData/Build/Intermediates.noindex/Coverage.build/Debug/Runner.build/Objects-normal/arm64/Runner_const_extract_protocols.json -Xcc -I/Users/admin/builder/spi-builder-workspace/.derivedData/Build/Products/Debug/include -Xcc -I/Users/admin/builder/spi-builder-workspace/.derivedData/Build/Intermediates.noindex/Coverage.build/Debug/Runner.build/DerivedSources-normal/arm64 -Xcc -I/Users/admin/builder/spi-builder-workspace/.derivedData/Build/Intermediates.noindex/Coverage.build/Debug/Runner.build/DerivedSources/arm64 -Xcc -I/Users/admin/builder/spi-builder-workspace/.derivedData/Build/Intermediates.noindex/Coverage.build/Debug/Runner.build/DerivedSources -Xcc -DSWIFT_PACKAGE\=1 -Xcc -DDEBUG\=1 -emit-objc-header -emit-objc-header-path /Users/admin/builder/spi-builder-workspace/.derivedData/Build/Intermediates.noindex/Coverage.build/Debug/Runner.build/Objects-normal/arm64/Runner-Swift.h -working-directory /Users/admin/builder/spi-builder-workspace -experimental-emit-module-separately -disable-cmo
error: Build input file cannot be found: '/Users/admin/builder/spi-builder-workspace/.build/checkouts/Runner/Sources/Runner/Runner.swift'. Did you forget to declare this file as an output of a script phase or custom build rule which produces it? (in target 'Runner' from project 'Coverage')
SwiftDriver\ Compilation Logger normal arm64 com.apple.xcode.tools.swift.compiler (in target 'Logger' from project 'Coverage')
cd /Users/admin/builder/spi-builder-workspace
builtin-Swift-Compilation -- /Applications/Xcode-16.1.0.app/Contents/Developer/Toolchains/XcodeDefault.xctoolchain/usr/bin/swiftc -module-name Logger -Onone -enforce-exclusivity\=checked @/Users/admin/builder/spi-builder-workspace/.derivedData/Build/Intermediates.noindex/Coverage.build/Debug/Logger.build/Objects-normal/arm64/Logger.SwiftFileList -DSWIFT_PACKAGE -DDEBUG -stats-output-dir .stats -strict-concurrency\=complete -enable-upcoming-feature StrictConcurrency -enable-upcoming-feature DisableOutwardActorInference -enable-upcoming-feature GlobalActorIsolatedTypesUsability -enable-upcoming-feature InferSendableFromCaptures -enable-bare-slash-regex -enable-experimental-feature DebugDescriptionMacro -sdk /Applications/Xcode-16.1.0.app/Contents/Developer/Platforms/MacOSX.platform/Developer/SDKs/MacOSX15.1.sdk -target arm64-apple-macos10.10 -g -module-cache-path /Users/admin/builder/spi-builder-workspace/.derivedData/ModuleCache.noindex -Xfrontend -serialize-debugging-options -enable-testing -index-store-path /Users/admin/builder/spi-builder-workspace/.derivedData/Index.noindex/DataStore -enable-experimental-feature OpaqueTypeErasure -Xcc -D_LIBCPP_HARDENING_MODE\=_LIBCPP_HARDENING_MODE_DEBUG -swift-version 4.2 -I /Users/admin/builder/spi-builder-workspace/.derivedData/Build/Products/Debug -F /Users/admin/builder/spi-builder-workspace/.derivedData/Build/Products/Debug -F /Applications/Xcode-16.1.0.app/Contents/Developer/Platforms/MacOSX.platform/Developer/Library/Frameworks -c -j10 -enable-batch-mode -incremental -Xcc -ivfsstatcache -Xcc /Users/admin/builder/spi-builder-workspace/.derivedData/SDKStatCaches.noindex/macosx15.1-24B75-44d23fded74b714c58e69ec4af40d824.sdkstatcache -output-file-map /Users/admin/builder/spi-builder-workspace/.derivedData/Build/Intermediates.noindex/Coverage.build/Debug/Logger.build/Objects-normal/arm64/Logger-OutputFileMap.json -use-frontend-parseable-output -save-temps -no-color-diagnostics -serialize-diagnostics -emit-dependencies -emit-module -emit-module-path /Users/admin/builder/spi-builder-workspace/.derivedData/Build/Intermediates.noindex/Coverage.build/Debug/Logger.build/Objects-normal/arm64/Logger.swiftmodule -validate-clang-modules-once -clang-build-session-file /Users/admin/builder/spi-builder-workspace/.derivedData/ModuleCache.noindex/Session.modulevalidation -Xcc -I/Users/admin/builder/spi-builder-workspace/.derivedData/Build/Intermediates.noindex/Coverage.build/Debug/Logger.build/swift-overrides.hmap -emit-const-values -Xfrontend -const-gather-protocols-file -Xfrontend /Users/admin/builder/spi-builder-workspace/.derivedData/Build/Intermediates.noindex/Coverage.build/Debug/Logger.build/Objects-normal/arm64/Logger_const_extract_protocols.json -Xcc -I/Users/admin/builder/spi-builder-workspace/.derivedData/Build/Products/Debug/include -Xcc -I/Users/admin/builder/spi-builder-workspace/.derivedData/Build/Intermediates.noindex/Coverage.build/Debug/Logger.build/DerivedSources-normal/arm64 -Xcc -I/Users/admin/builder/spi-builder-workspace/.derivedData/Build/Intermediates.noindex/Coverage.build/Debug/Logger.build/DerivedSources/arm64 -Xcc -I/Users/admin/builder/spi-builder-workspace/.derivedData/Build/Intermediates.noindex/Coverage.build/Debug/Logger.build/DerivedSources -Xcc -DSWIFT_PACKAGE\=1 -Xcc -DDEBUG\=1 -emit-objc-header -emit-objc-header-path /Users/admin/builder/spi-builder-workspace/.derivedData/Build/Intermediates.noindex/Coverage.build/Debug/Logger.build/Objects-normal/arm64/Logger-Swift.h -working-directory /Users/admin/builder/spi-builder-workspace -experimental-emit-module-separately -disable-cmo
error: Build input files cannot be found: '/Users/admin/builder/spi-builder-workspace/.build/checkouts/Logger/Sources/Logger/Channel.swift', '/Users/admin/builder/spi-builder-workspace/.build/checkouts/Logger/Sources/Logger/Context.swift', '/Users/admin/builder/spi-builder-workspace/.build/checkouts/Logger/Sources/Logger/Handler.swift', '/Users/admin/builder/spi-builder-workspace/.build/checkouts/Logger/Sources/Logger/Manager.swift', '/Users/admin/builder/spi-builder-workspace/.build/checkouts/Logger/Sources/Logger/NSLogHandler.swift', '/Users/admin/builder/spi-builder-workspace/.build/checkouts/Logger/Sources/Logger/OSLogHandler.swift', '/Users/admin/builder/spi-builder-workspace/.build/checkouts/Logger/Sources/Logger/PrintHandler.swift'. Did you forget to declare these files as outputs of any script phases or custom build rules which produce them? (in target 'Logger' from project 'Coverage')
SwiftDriver\ Compilation\ Requirements Logger normal arm64 com.apple.xcode.tools.swift.compiler (in target 'Logger' from project 'Coverage')
cd /Users/admin/builder/spi-builder-workspace
builtin-Swift-Compilation-Requirements -- /Applications/Xcode-16.1.0.app/Contents/Developer/Toolchains/XcodeDefault.xctoolchain/usr/bin/swiftc -module-name Logger -Onone -enforce-exclusivity\=checked @/Users/admin/builder/spi-builder-workspace/.derivedData/Build/Intermediates.noindex/Coverage.build/Debug/Logger.build/Objects-normal/arm64/Logger.SwiftFileList -DSWIFT_PACKAGE -DDEBUG -stats-output-dir .stats -strict-concurrency\=complete -enable-upcoming-feature StrictConcurrency -enable-upcoming-feature DisableOutwardActorInference -enable-upcoming-feature GlobalActorIsolatedTypesUsability -enable-upcoming-feature InferSendableFromCaptures -enable-bare-slash-regex -enable-experimental-feature DebugDescriptionMacro -sdk /Applications/Xcode-16.1.0.app/Contents/Developer/Platforms/MacOSX.platform/Developer/SDKs/MacOSX15.1.sdk -target arm64-apple-macos10.10 -g -module-cache-path /Users/admin/builder/spi-builder-workspace/.derivedData/ModuleCache.noindex -Xfrontend -serialize-debugging-options -enable-testing -index-store-path /Users/admin/builder/spi-builder-workspace/.derivedData/Index.noindex/DataStore -enable-experimental-feature OpaqueTypeErasure -Xcc -D_LIBCPP_HARDENING_MODE\=_LIBCPP_HARDENING_MODE_DEBUG -swift-version 4.2 -I /Users/admin/builder/spi-builder-workspace/.derivedData/Build/Products/Debug -F /Users/admin/builder/spi-builder-workspace/.derivedData/Build/Products/Debug -F /Applications/Xcode-16.1.0.app/Contents/Developer/Platforms/MacOSX.platform/Developer/Library/Frameworks -c -j10 -enable-batch-mode -incremental -Xcc -ivfsstatcache -Xcc /Users/admin/builder/spi-builder-workspace/.derivedData/SDKStatCaches.noindex/macosx15.1-24B75-44d23fded74b714c58e69ec4af40d824.sdkstatcache -output-file-map /Users/admin/builder/spi-builder-workspace/.derivedData/Build/Intermediates.noindex/Coverage.build/Debug/Logger.build/Objects-normal/arm64/Logger-OutputFileMap.json -use-frontend-parseable-output -save-temps -no-color-diagnostics -serialize-diagnostics -emit-dependencies -emit-module -emit-module-path /Users/admin/builder/spi-builder-workspace/.derivedData/Build/Intermediates.noindex/Coverage.build/Debug/Logger.build/Objects-normal/arm64/Logger.swiftmodule -validate-clang-modules-once -clang-build-session-file /Users/admin/builder/spi-builder-workspace/.derivedData/ModuleCache.noindex/Session.modulevalidation -Xcc -I/Users/admin/builder/spi-builder-workspace/.derivedData/Build/Intermediates.noindex/Coverage.build/Debug/Logger.build/swift-overrides.hmap -emit-const-values -Xfrontend -const-gather-protocols-file -Xfrontend /Users/admin/builder/spi-builder-workspace/.derivedData/Build/Intermediates.noindex/Coverage.build/Debug/Logger.build/Objects-normal/arm64/Logger_const_extract_protocols.json -Xcc -I/Users/admin/builder/spi-builder-workspace/.derivedData/Build/Products/Debug/include -Xcc -I/Users/admin/builder/spi-builder-workspace/.derivedData/Build/Intermediates.noindex/Coverage.build/Debug/Logger.build/DerivedSources-normal/arm64 -Xcc -I/Users/admin/builder/spi-builder-workspace/.derivedData/Build/Intermediates.noindex/Coverage.build/Debug/Logger.build/DerivedSources/arm64 -Xcc -I/Users/admin/builder/spi-builder-workspace/.derivedData/Build/Intermediates.noindex/Coverage.build/Debug/Logger.build/DerivedSources -Xcc -DSWIFT_PACKAGE\=1 -Xcc -DDEBUG\=1 -emit-objc-header -emit-objc-header-path /Users/admin/builder/spi-builder-workspace/.derivedData/Build/Intermediates.noindex/Coverage.build/Debug/Logger.build/Objects-normal/arm64/Logger-Swift.h -working-directory /Users/admin/builder/spi-builder-workspace -experimental-emit-module-separately -disable-cmo
error: Build input files cannot be found: '/Users/admin/builder/spi-builder-workspace/.build/checkouts/Logger/Sources/Logger/Channel.swift', '/Users/admin/builder/spi-builder-workspace/.build/checkouts/Logger/Sources/Logger/Context.swift', '/Users/admin/builder/spi-builder-workspace/.build/checkouts/Logger/Sources/Logger/Handler.swift', '/Users/admin/builder/spi-builder-workspace/.build/checkouts/Logger/Sources/Logger/Manager.swift', '/Users/admin/builder/spi-builder-workspace/.build/checkouts/Logger/Sources/Logger/NSLogHandler.swift', '/Users/admin/builder/spi-builder-workspace/.build/checkouts/Logger/Sources/Logger/OSLogHandler.swift', '/Users/admin/builder/spi-builder-workspace/.build/checkouts/Logger/Sources/Logger/PrintHandler.swift'. Did you forget to declare these files as outputs of any script phases or custom build rules which produce them? (in target 'Logger' from project 'Coverage')
SwiftDriver\ Compilation Runner normal arm64 com.apple.xcode.tools.swift.compiler (in target 'Runner' from project 'Coverage')
cd /Users/admin/builder/spi-builder-workspace
builtin-Swift-Compilation -- /Applications/Xcode-16.1.0.app/Contents/Developer/Toolchains/XcodeDefault.xctoolchain/usr/bin/swiftc -module-name Runner -Onone -enforce-exclusivity\=checked @/Users/admin/builder/spi-builder-workspace/.derivedData/Build/Intermediates.noindex/Coverage.build/Debug/Runner.build/Objects-normal/arm64/Runner.SwiftFileList -DSWIFT_PACKAGE -DDEBUG -stats-output-dir .stats -strict-concurrency\=complete -enable-upcoming-feature StrictConcurrency -enable-upcoming-feature DisableOutwardActorInference -enable-upcoming-feature GlobalActorIsolatedTypesUsability -enable-upcoming-feature InferSendableFromCaptures -enable-bare-slash-regex -enable-experimental-feature DebugDescriptionMacro -sdk /Applications/Xcode-16.1.0.app/Contents/Developer/Platforms/MacOSX.platform/Developer/SDKs/MacOSX15.1.sdk -target arm64-apple-macos10.10 -g -module-cache-path /Users/admin/builder/spi-builder-workspace/.derivedData/ModuleCache.noindex -Xfrontend -serialize-debugging-options -enable-testing -index-store-path /Users/admin/builder/spi-builder-workspace/.derivedData/Index.noindex/DataStore -enable-experimental-feature OpaqueTypeErasure -Xcc -D_LIBCPP_HARDENING_MODE\=_LIBCPP_HARDENING_MODE_DEBUG -swift-version 4.2 -I /Users/admin/builder/spi-builder-workspace/.derivedData/Build/Products/Debug -F /Users/admin/builder/spi-builder-workspace/.derivedData/Build/Products/Debug -F /Applications/Xcode-16.1.0.app/Contents/Developer/Platforms/MacOSX.platform/Developer/Library/Frameworks -parse-as-library -c -j10 -enable-batch-mode -incremental -Xcc -ivfsstatcache -Xcc /Users/admin/builder/spi-builder-workspace/.derivedData/SDKStatCaches.noindex/macosx15.1-24B75-44d23fded74b714c58e69ec4af40d824.sdkstatcache -output-file-map /Users/admin/builder/spi-builder-workspace/.derivedData/Build/Intermediates.noindex/Coverage.build/Debug/Runner.build/Objects-normal/arm64/Runner-OutputFileMap.json -use-frontend-parseable-output -save-temps -no-color-diagnostics -serialize-diagnostics -emit-dependencies -emit-module -emit-module-path /Users/admin/builder/spi-builder-workspace/.derivedData/Build/Intermediates.noindex/Coverage.build/Debug/Runner.build/Objects-normal/arm64/Runner.swiftmodule -validate-clang-modules-once -clang-build-session-file /Users/admin/builder/spi-builder-workspace/.derivedData/ModuleCache.noindex/Session.modulevalidation -Xcc -I/Users/admin/builder/spi-builder-workspace/.derivedData/Build/Intermediates.noindex/Coverage.build/Debug/Runner.build/swift-overrides.hmap -emit-const-values -Xfrontend -const-gather-protocols-file -Xfrontend /Users/admin/builder/spi-builder-workspace/.derivedData/Build/Intermediates.noindex/Coverage.build/Debug/Runner.build/Objects-normal/arm64/Runner_const_extract_protocols.json -Xcc -I/Users/admin/builder/spi-builder-workspace/.derivedData/Build/Products/Debug/include -Xcc -I/Users/admin/builder/spi-builder-workspace/.derivedData/Build/Intermediates.noindex/Coverage.build/Debug/Runner.build/DerivedSources-normal/arm64 -Xcc -I/Users/admin/builder/spi-builder-workspace/.derivedData/Build/Intermediates.noindex/Coverage.build/Debug/Runner.build/DerivedSources/arm64 -Xcc -I/Users/admin/builder/spi-builder-workspace/.derivedData/Build/Intermediates.noindex/Coverage.build/Debug/Runner.build/DerivedSources -Xcc -DSWIFT_PACKAGE\=1 -Xcc -DDEBUG\=1 -emit-objc-header -emit-objc-header-path /Users/admin/builder/spi-builder-workspace/.derivedData/Build/Intermediates.noindex/Coverage.build/Debug/Runner.build/Objects-normal/arm64/Runner-Swift.h -working-directory /Users/admin/builder/spi-builder-workspace -experimental-emit-module-separately -disable-cmo
error: Build input file cannot be found: '/Users/admin/builder/spi-builder-workspace/.build/checkouts/Runner/Sources/Runner/Runner.swift'. Did you forget to declare this file as an output of a script phase or custom build rule which produces it? (in target 'Runner' from project 'Coverage')
SwiftDriver\ Compilation\ Requirements Docopt normal arm64 com.apple.xcode.tools.swift.compiler (in target 'Docopt' from project 'Coverage')
cd /Users/admin/builder/spi-builder-workspace
builtin-Swift-Compilation-Requirements -- /Applications/Xcode-16.1.0.app/Contents/Developer/Toolchains/XcodeDefault.xctoolchain/usr/bin/swiftc -module-name Docopt -Onone -enforce-exclusivity\=checked @/Users/admin/builder/spi-builder-workspace/.derivedData/Build/Intermediates.noindex/Coverage.build/Debug/Docopt.build/Objects-normal/arm64/Docopt.SwiftFileList -DSWIFT_PACKAGE -DDEBUG -stats-output-dir .stats -strict-concurrency\=complete -enable-upcoming-feature StrictConcurrency -enable-upcoming-feature DisableOutwardActorInference -enable-upcoming-feature GlobalActorIsolatedTypesUsability -enable-upcoming-feature InferSendableFromCaptures -enable-bare-slash-regex -enable-experimental-feature DebugDescriptionMacro -sdk /Applications/Xcode-16.1.0.app/Contents/Developer/Platforms/MacOSX.platform/Developer/SDKs/MacOSX15.1.sdk -target arm64-apple-macos10.10 -g -module-cache-path /Users/admin/builder/spi-builder-workspace/.derivedData/ModuleCache.noindex -Xfrontend -serialize-debugging-options -enable-testing -index-store-path /Users/admin/builder/spi-builder-workspace/.derivedData/Index.noindex/DataStore -enable-experimental-feature OpaqueTypeErasure -Xcc -D_LIBCPP_HARDENING_MODE\=_LIBCPP_HARDENING_MODE_DEBUG -swift-version 4 -I /Users/admin/builder/spi-builder-workspace/.derivedData/Build/Products/Debug -F /Users/admin/builder/spi-builder-workspace/.derivedData/Build/Products/Debug -F /Applications/Xcode-16.1.0.app/Contents/Developer/Platforms/MacOSX.platform/Developer/Library/Frameworks -c -j10 -enable-batch-mode -incremental -Xcc -ivfsstatcache -Xcc /Users/admin/builder/spi-builder-workspace/.derivedData/SDKStatCaches.noindex/macosx15.1-24B75-44d23fded74b714c58e69ec4af40d824.sdkstatcache -output-file-map /Users/admin/builder/spi-builder-workspace/.derivedData/Build/Intermediates.noindex/Coverage.build/Debug/Docopt.build/Objects-normal/arm64/Docopt-OutputFileMap.json -use-frontend-parseable-output -save-temps -no-color-diagnostics -serialize-diagnostics -emit-dependencies -emit-module -emit-module-path /Users/admin/builder/spi-builder-workspace/.derivedData/Build/Intermediates.noindex/Coverage.build/Debug/Docopt.build/Objects-normal/arm64/Docopt.swiftmodule -validate-clang-modules-once -clang-build-session-file /Users/admin/builder/spi-builder-workspace/.derivedData/ModuleCache.noindex/Session.modulevalidation -Xcc -I/Users/admin/builder/spi-builder-workspace/.derivedData/Build/Intermediates.noindex/Coverage.build/Debug/Docopt.build/swift-overrides.hmap -emit-const-values -Xfrontend -const-gather-protocols-file -Xfrontend /Users/admin/builder/spi-builder-workspace/.derivedData/Build/Intermediates.noindex/Coverage.build/Debug/Docopt.build/Objects-normal/arm64/Docopt_const_extract_protocols.json -Xcc -I/Users/admin/builder/spi-builder-workspace/.derivedData/Build/Products/Debug/include -Xcc -I/Users/admin/builder/spi-builder-workspace/.derivedData/Build/Intermediates.noindex/Coverage.build/Debug/Docopt.build/DerivedSources-normal/arm64 -Xcc -I/Users/admin/builder/spi-builder-workspace/.derivedData/Build/Intermediates.noindex/Coverage.build/Debug/Docopt.build/DerivedSources/arm64 -Xcc -I/Users/admin/builder/spi-builder-workspace/.derivedData/Build/Intermediates.noindex/Coverage.build/Debug/Docopt.build/DerivedSources -Xcc -DSWIFT_PACKAGE\=1 -Xcc -DDEBUG\=1 -emit-objc-header -emit-objc-header-path /Users/admin/builder/spi-builder-workspace/.derivedData/Build/Intermediates.noindex/Coverage.build/Debug/Docopt.build/Objects-normal/arm64/Docopt-Swift.h -working-directory /Users/admin/builder/spi-builder-workspace -experimental-emit-module-separately -disable-cmo
error: Build input files cannot be found: '/Users/admin/builder/spi-builder-workspace/.build/checkouts/docopt.swift/Sources/Docopt/Argument.swift', '/Users/admin/builder/spi-builder-workspace/.build/checkouts/docopt.swift/Sources/Docopt/BranchPattern.swift', '/Users/admin/builder/spi-builder-workspace/.build/checkouts/docopt.swift/Sources/Docopt/Command.swift', '/Users/admin/builder/spi-builder-workspace/.build/checkouts/docopt.swift/Sources/Docopt/Docopt.swift', '/Users/admin/builder/spi-builder-workspace/.build/checkouts/docopt.swift/Sources/Docopt/DocoptError.swift', '/Users/admin/builder/spi-builder-workspace/.build/checkouts/docopt.swift/Sources/Docopt/Either.swift', '/Users/admin/builder/spi-builder-workspace/.build/checkouts/docopt.swift/Sources/Docopt/LeafPattern.swift', '/Users/admin/builder/spi-builder-workspace/.build/checkouts/docopt.swift/Sources/Docopt/OneOrMore.swift', '/Users/admin/builder/spi-builder-workspace/.build/checkouts/docopt.swift/Sources/Docopt/Option.swift', '/Users/admin/builder/spi-builder-workspace/.build/checkouts/docopt.swift/Sources/Docopt/Optional.swift', '/Users/admin/builder/spi-builder-workspace/.build/checkouts/docopt.swift/Sources/Docopt/OptionsShortcut.swift', '/Users/admin/builder/spi-builder-workspace/.build/checkouts/docopt.swift/Sources/Docopt/Pattern.swift', '/Users/admin/builder/spi-builder-workspace/.build/checkouts/docopt.swift/Sources/Docopt/Required.swift', '/Users/admin/builder/spi-builder-workspace/.build/checkouts/docopt.swift/Sources/Docopt/String.swift', '/Users/admin/builder/spi-builder-workspace/.build/checkouts/docopt.swift/Sources/Docopt/Tokens.swift'. Did you forget to declare these files as outputs of any script phases or custom build rules which produce them? (in target 'Docopt' from project 'Coverage')
SwiftDriver\ Compilation Docopt normal arm64 com.apple.xcode.tools.swift.compiler (in target 'Docopt' from project 'Coverage')
cd /Users/admin/builder/spi-builder-workspace
builtin-Swift-Compilation -- /Applications/Xcode-16.1.0.app/Contents/Developer/Toolchains/XcodeDefault.xctoolchain/usr/bin/swiftc -module-name Docopt -Onone -enforce-exclusivity\=checked @/Users/admin/builder/spi-builder-workspace/.derivedData/Build/Intermediates.noindex/Coverage.build/Debug/Docopt.build/Objects-normal/arm64/Docopt.SwiftFileList -DSWIFT_PACKAGE -DDEBUG -stats-output-dir .stats -strict-concurrency\=complete -enable-upcoming-feature StrictConcurrency -enable-upcoming-feature DisableOutwardActorInference -enable-upcoming-feature GlobalActorIsolatedTypesUsability -enable-upcoming-feature InferSendableFromCaptures -enable-bare-slash-regex -enable-experimental-feature DebugDescriptionMacro -sdk /Applications/Xcode-16.1.0.app/Contents/Developer/Platforms/MacOSX.platform/Developer/SDKs/MacOSX15.1.sdk -target arm64-apple-macos10.10 -g -module-cache-path /Users/admin/builder/spi-builder-workspace/.derivedData/ModuleCache.noindex -Xfrontend -serialize-debugging-options -enable-testing -index-store-path /Users/admin/builder/spi-builder-workspace/.derivedData/Index.noindex/DataStore -enable-experimental-feature OpaqueTypeErasure -Xcc -D_LIBCPP_HARDENING_MODE\=_LIBCPP_HARDENING_MODE_DEBUG -swift-version 4 -I /Users/admin/builder/spi-builder-workspace/.derivedData/Build/Products/Debug -F /Users/admin/builder/spi-builder-workspace/.derivedData/Build/Products/Debug -F /Applications/Xcode-16.1.0.app/Contents/Developer/Platforms/MacOSX.platform/Developer/Library/Frameworks -c -j10 -enable-batch-mode -incremental -Xcc -ivfsstatcache -Xcc /Users/admin/builder/spi-builder-workspace/.derivedData/SDKStatCaches.noindex/macosx15.1-24B75-44d23fded74b714c58e69ec4af40d824.sdkstatcache -output-file-map /Users/admin/builder/spi-builder-workspace/.derivedData/Build/Intermediates.noindex/Coverage.build/Debug/Docopt.build/Objects-normal/arm64/Docopt-OutputFileMap.json -use-frontend-parseable-output -save-temps -no-color-diagnostics -serialize-diagnostics -emit-dependencies -emit-module -emit-module-path /Users/admin/builder/spi-builder-workspace/.derivedData/Build/Intermediates.noindex/Coverage.build/Debug/Docopt.build/Objects-normal/arm64/Docopt.swiftmodule -validate-clang-modules-once -clang-build-session-file /Users/admin/builder/spi-builder-workspace/.derivedData/ModuleCache.noindex/Session.modulevalidation -Xcc -I/Users/admin/builder/spi-builder-workspace/.derivedData/Build/Intermediates.noindex/Coverage.build/Debug/Docopt.build/swift-overrides.hmap -emit-const-values -Xfrontend -const-gather-protocols-file -Xfrontend /Users/admin/builder/spi-builder-workspace/.derivedData/Build/Intermediates.noindex/Coverage.build/Debug/Docopt.build/Objects-normal/arm64/Docopt_const_extract_protocols.json -Xcc -I/Users/admin/builder/spi-builder-workspace/.derivedData/Build/Products/Debug/include -Xcc -I/Users/admin/builder/spi-builder-workspace/.derivedData/Build/Intermediates.noindex/Coverage.build/Debug/Docopt.build/DerivedSources-normal/arm64 -Xcc -I/Users/admin/builder/spi-builder-workspace/.derivedData/Build/Intermediates.noindex/Coverage.build/Debug/Docopt.build/DerivedSources/arm64 -Xcc -I/Users/admin/builder/spi-builder-workspace/.derivedData/Build/Intermediates.noindex/Coverage.build/Debug/Docopt.build/DerivedSources -Xcc -DSWIFT_PACKAGE\=1 -Xcc -DDEBUG\=1 -emit-objc-header -emit-objc-header-path /Users/admin/builder/spi-builder-workspace/.derivedData/Build/Intermediates.noindex/Coverage.build/Debug/Docopt.build/Objects-normal/arm64/Docopt-Swift.h -working-directory /Users/admin/builder/spi-builder-workspace -experimental-emit-module-separately -disable-cmo
error: Build input files cannot be found: '/Users/admin/builder/spi-builder-workspace/.build/checkouts/docopt.swift/Sources/Docopt/Argument.swift', '/Users/admin/builder/spi-builder-workspace/.build/checkouts/docopt.swift/Sources/Docopt/BranchPattern.swift', '/Users/admin/builder/spi-builder-workspace/.build/checkouts/docopt.swift/Sources/Docopt/Command.swift', '/Users/admin/builder/spi-builder-workspace/.build/checkouts/docopt.swift/Sources/Docopt/Docopt.swift', '/Users/admin/builder/spi-builder-workspace/.build/checkouts/docopt.swift/Sources/Docopt/DocoptError.swift', '/Users/admin/builder/spi-builder-workspace/.build/checkouts/docopt.swift/Sources/Docopt/Either.swift', '/Users/admin/builder/spi-builder-workspace/.build/checkouts/docopt.swift/Sources/Docopt/LeafPattern.swift', '/Users/admin/builder/spi-builder-workspace/.build/checkouts/docopt.swift/Sources/Docopt/OneOrMore.swift', '/Users/admin/builder/spi-builder-workspace/.build/checkouts/docopt.swift/Sources/Docopt/Option.swift', '/Users/admin/builder/spi-builder-workspace/.build/checkouts/docopt.swift/Sources/Docopt/Optional.swift', '/Users/admin/builder/spi-builder-workspace/.build/checkouts/docopt.swift/Sources/Docopt/OptionsShortcut.swift', '/Users/admin/builder/spi-builder-workspace/.build/checkouts/docopt.swift/Sources/Docopt/Pattern.swift', '/Users/admin/builder/spi-builder-workspace/.build/checkouts/docopt.swift/Sources/Docopt/Required.swift', '/Users/admin/builder/spi-builder-workspace/.build/checkouts/docopt.swift/Sources/Docopt/String.swift', '/Users/admin/builder/spi-builder-workspace/.build/checkouts/docopt.swift/Sources/Docopt/Tokens.swift'. Did you forget to declare these files as outputs of any script phases or custom build rules which produce them? (in target 'Docopt' from project 'Coverage')
/Users/admin/builder/spi-builder-workspace/Coverage.xcodeproj: warning: The macOS deployment target 'MACOSX_DEPLOYMENT_TARGET' is set to 10.10, but the range of supported deployment target versions is 10.13 to 15.1.99. (in target 'Runner' from project 'Coverage')
/Users/admin/builder/spi-builder-workspace/Coverage.xcodeproj: warning: The macOS deployment target 'MACOSX_DEPLOYMENT_TARGET' is set to 10.10, but the range of supported deployment target versions is 10.13 to 15.1.99. (in target 'Logger' from project 'Coverage')
/Users/admin/builder/spi-builder-workspace/Coverage.xcodeproj: warning: The macOS deployment target 'MACOSX_DEPLOYMENT_TARGET' is set to 10.10, but the range of supported deployment target versions is 10.13 to 15.1.99. (in target 'Docopt' from project 'Coverage')
/Users/admin/builder/spi-builder-workspace/Coverage.xcodeproj: warning: The macOS deployment target 'MACOSX_DEPLOYMENT_TARGET' is set to 10.10, but the range of supported deployment target versions is 10.13 to 15.1.99. (in target 'Coverage' from project 'Coverage')
/Users/admin/builder/spi-builder-workspace/Coverage.xcodeproj: warning: The macOS deployment target 'MACOSX_DEPLOYMENT_TARGET' is set to 10.10, but the range of supported deployment target versions is 10.13 to 15.1.99. (in target 'Arguments' from project 'Coverage')
** BUILD FAILED **
The following build commands failed:
SwiftDriver\ Compilation\ Requirements Runner normal arm64 com.apple.xcode.tools.swift.compiler (in target 'Runner' from project 'Coverage')
SwiftDriver\ Compilation Logger normal arm64 com.apple.xcode.tools.swift.compiler (in target 'Logger' from project 'Coverage')
SwiftDriver\ Compilation\ Requirements Logger normal arm64 com.apple.xcode.tools.swift.compiler (in target 'Logger' from project 'Coverage')
SwiftDriver\ Compilation Runner normal arm64 com.apple.xcode.tools.swift.compiler (in target 'Runner' from project 'Coverage')
SwiftDriver\ Compilation\ Requirements Docopt normal arm64 com.apple.xcode.tools.swift.compiler (in target 'Docopt' from project 'Coverage')
SwiftDriver\ Compilation Docopt normal arm64 com.apple.xcode.tools.swift.compiler (in target 'Docopt' from project 'Coverage')
Building project Coverage with scheme Coverage-Package
(7 failures)
Command line invocation:
/Applications/Xcode-16.1.0.app/Contents/Developer/usr/bin/xcodebuild -IDEClonedSourcePackagesDirPathOverride=/Users/admin/builder/spi-builder-workspace/.dependencies -skipMacroValidation -skipPackagePluginValidation -derivedDataPath /Users/admin/builder/spi-builder-workspace/.derivedData build -scheme Coverage-Package -destination platform=macOS,arch=arm64 "OTHER_SWIFT_FLAGS=-stats-output-dir .stats -strict-concurrency=complete -enable-upcoming-feature StrictConcurrency -enable-upcoming-feature DisableOutwardActorInference -enable-upcoming-feature GlobalActorIsolatedTypesUsability -enable-upcoming-feature InferSendableFromCaptures"
User defaults from command line:
IDEClonedSourcePackagesDirPathOverride = /Users/admin/builder/spi-builder-workspace/.dependencies
IDEDerivedDataPathOverride = /Users/admin/builder/spi-builder-workspace/.derivedData
IDEPackageSupportUseBuiltinSCM = YES
Build settings from command line:
OTHER_SWIFT_FLAGS = -stats-output-dir .stats -strict-concurrency=complete -enable-upcoming-feature StrictConcurrency -enable-upcoming-feature DisableOutwardActorInference -enable-upcoming-feature GlobalActorIsolatedTypesUsability -enable-upcoming-feature InferSendableFromCaptures
Prepare packages
ComputeTargetDependencyGraph
note: Building targets in dependency order
note: Target dependency graph (5 targets)
Target 'Coverage' in project 'Coverage'
➜ Explicit dependency on target 'Arguments' in project 'Coverage'
➜ Explicit dependency on target 'Logger' in project 'Coverage'
➜ Explicit dependency on target 'Docopt' in project 'Coverage'
➜ Explicit dependency on target 'Runner' in project 'Coverage'
Target 'Runner' in project 'Coverage' (no dependencies)
Target 'Arguments' in project 'Coverage'
➜ Explicit dependency on target 'Logger' in project 'Coverage'
➜ Explicit dependency on target 'Docopt' in project 'Coverage'
Target 'Docopt' in project 'Coverage' (no dependencies)
Target 'Logger' in project 'Coverage' (no dependencies)
GatherProvisioningInputs
CreateBuildDescription
ClangStatCache /Applications/Xcode-16.1.0.app/Contents/Developer/Toolchains/XcodeDefault.xctoolchain/usr/bin/clang-stat-cache /Applications/Xcode-16.1.0.app/Contents/Developer/Platforms/MacOSX.platform/Developer/SDKs/MacOSX15.1.sdk /Users/admin/builder/spi-builder-workspace/.derivedData/SDKStatCaches.noindex/macosx15.1-24B75-44d23fded74b714c58e69ec4af40d824.sdkstatcache
cd /Users/admin/builder/spi-builder-workspace/Coverage.xcodeproj
/Applications/Xcode-16.1.0.app/Contents/Developer/Toolchains/XcodeDefault.xctoolchain/usr/bin/clang-stat-cache /Applications/Xcode-16.1.0.app/Contents/Developer/Platforms/MacOSX.platform/Developer/SDKs/MacOSX15.1.sdk -o /Users/admin/builder/spi-builder-workspace/.derivedData/SDKStatCaches.noindex/macosx15.1-24B75-44d23fded74b714c58e69ec4af40d824.sdkstatcache
/Users/admin/builder/spi-builder-workspace/Coverage.xcodeproj: warning: The macOS deployment target 'MACOSX_DEPLOYMENT_TARGET' is set to 10.10, but the range of supported deployment target versions is 10.13 to 15.1.99. (in target 'Logger' from project 'Coverage')
SwiftDriver\ Compilation\ Requirements Logger normal arm64 com.apple.xcode.tools.swift.compiler (in target 'Logger' from project 'Coverage')
cd /Users/admin/builder/spi-builder-workspace
builtin-Swift-Compilation-Requirements -- /Applications/Xcode-16.1.0.app/Contents/Developer/Toolchains/XcodeDefault.xctoolchain/usr/bin/swiftc -module-name Logger -Onone -enforce-exclusivity\=checked @/Users/admin/builder/spi-builder-workspace/.derivedData/Build/Intermediates.noindex/Coverage.build/Debug/Logger.build/Objects-normal/arm64/Logger.SwiftFileList -DSWIFT_PACKAGE -DDEBUG -stats-output-dir .stats -strict-concurrency\=complete -enable-upcoming-feature StrictConcurrency -enable-upcoming-feature DisableOutwardActorInference -enable-upcoming-feature GlobalActorIsolatedTypesUsability -enable-upcoming-feature InferSendableFromCaptures -enable-bare-slash-regex -enable-experimental-feature DebugDescriptionMacro -sdk /Applications/Xcode-16.1.0.app/Contents/Developer/Platforms/MacOSX.platform/Developer/SDKs/MacOSX15.1.sdk -target arm64-apple-macos10.10 -g -module-cache-path /Users/admin/builder/spi-builder-workspace/.derivedData/ModuleCache.noindex -Xfrontend -serialize-debugging-options -enable-testing -index-store-path /Users/admin/builder/spi-builder-workspace/.derivedData/Index.noindex/DataStore -enable-experimental-feature OpaqueTypeErasure -Xcc -D_LIBCPP_HARDENING_MODE\=_LIBCPP_HARDENING_MODE_DEBUG -swift-version 4.2 -I /Users/admin/builder/spi-builder-workspace/.derivedData/Build/Products/Debug -F /Users/admin/builder/spi-builder-workspace/.derivedData/Build/Products/Debug -F /Applications/Xcode-16.1.0.app/Contents/Developer/Platforms/MacOSX.platform/Developer/Library/Frameworks -c -j10 -enable-batch-mode -incremental -Xcc -ivfsstatcache -Xcc /Users/admin/builder/spi-builder-workspace/.derivedData/SDKStatCaches.noindex/macosx15.1-24B75-44d23fded74b714c58e69ec4af40d824.sdkstatcache -output-file-map /Users/admin/builder/spi-builder-workspace/.derivedData/Build/Intermediates.noindex/Coverage.build/Debug/Logger.build/Objects-normal/arm64/Logger-OutputFileMap.json -use-frontend-parseable-output -save-temps -no-color-diagnostics -serialize-diagnostics -emit-dependencies -emit-module -emit-module-path /Users/admin/builder/spi-builder-workspace/.derivedData/Build/Intermediates.noindex/Coverage.build/Debug/Logger.build/Objects-normal/arm64/Logger.swiftmodule -validate-clang-modules-once -clang-build-session-file /Users/admin/builder/spi-builder-workspace/.derivedData/ModuleCache.noindex/Session.modulevalidation -Xcc -I/Users/admin/builder/spi-builder-workspace/.derivedData/Build/Intermediates.noindex/Coverage.build/Debug/Logger.build/swift-overrides.hmap -emit-const-values -Xfrontend -const-gather-protocols-file -Xfrontend /Users/admin/builder/spi-builder-workspace/.derivedData/Build/Intermediates.noindex/Coverage.build/Debug/Logger.build/Objects-normal/arm64/Logger_const_extract_protocols.json -Xcc -I/Users/admin/builder/spi-builder-workspace/.derivedData/Build/Products/Debug/include -Xcc -I/Users/admin/builder/spi-builder-workspace/.derivedData/Build/Intermediates.noindex/Coverage.build/Debug/Logger.build/DerivedSources-normal/arm64 -Xcc -I/Users/admin/builder/spi-builder-workspace/.derivedData/Build/Intermediates.noindex/Coverage.build/Debug/Logger.build/DerivedSources/arm64 -Xcc -I/Users/admin/builder/spi-builder-workspace/.derivedData/Build/Intermediates.noindex/Coverage.build/Debug/Logger.build/DerivedSources -Xcc -DSWIFT_PACKAGE\=1 -Xcc -DDEBUG\=1 -emit-objc-header -emit-objc-header-path /Users/admin/builder/spi-builder-workspace/.derivedData/Build/Intermediates.noindex/Coverage.build/Debug/Logger.build/Objects-normal/arm64/Logger-Swift.h -working-directory /Users/admin/builder/spi-builder-workspace -experimental-emit-module-separately -disable-cmo
error: Build input files cannot be found: '/Users/admin/builder/spi-builder-workspace/.build/checkouts/Logger/Sources/Logger/PrintHandler.swift', '/Users/admin/builder/spi-builder-workspace/.build/checkouts/Logger/Sources/Logger/OSLogHandler.swift', '/Users/admin/builder/spi-builder-workspace/.build/checkouts/Logger/Sources/Logger/NSLogHandler.swift', '/Users/admin/builder/spi-builder-workspace/.build/checkouts/Logger/Sources/Logger/Manager.swift', '/Users/admin/builder/spi-builder-workspace/.build/checkouts/Logger/Sources/Logger/Handler.swift', '/Users/admin/builder/spi-builder-workspace/.build/checkouts/Logger/Sources/Logger/Context.swift', '/Users/admin/builder/spi-builder-workspace/.build/checkouts/Logger/Sources/Logger/Channel.swift'. Did you forget to declare these files as outputs of any script phases or custom build rules which produce them? (in target 'Logger' from project 'Coverage')
SwiftDriver\ Compilation\ Requirements Runner normal arm64 com.apple.xcode.tools.swift.compiler (in target 'Runner' from project 'Coverage')
cd /Users/admin/builder/spi-builder-workspace
builtin-Swift-Compilation-Requirements -- /Applications/Xcode-16.1.0.app/Contents/Developer/Toolchains/XcodeDefault.xctoolchain/usr/bin/swiftc -module-name Runner -Onone -enforce-exclusivity\=checked @/Users/admin/builder/spi-builder-workspace/.derivedData/Build/Intermediates.noindex/Coverage.build/Debug/Runner.build/Objects-normal/arm64/Runner.SwiftFileList -DSWIFT_PACKAGE -DDEBUG -stats-output-dir .stats -strict-concurrency\=complete -enable-upcoming-feature StrictConcurrency -enable-upcoming-feature DisableOutwardActorInference -enable-upcoming-feature GlobalActorIsolatedTypesUsability -enable-upcoming-feature InferSendableFromCaptures -enable-bare-slash-regex -enable-experimental-feature DebugDescriptionMacro -sdk /Applications/Xcode-16.1.0.app/Contents/Developer/Platforms/MacOSX.platform/Developer/SDKs/MacOSX15.1.sdk -target arm64-apple-macos10.10 -g -module-cache-path /Users/admin/builder/spi-builder-workspace/.derivedData/ModuleCache.noindex -Xfrontend -serialize-debugging-options -enable-testing -index-store-path /Users/admin/builder/spi-builder-workspace/.derivedData/Index.noindex/DataStore -enable-experimental-feature OpaqueTypeErasure -Xcc -D_LIBCPP_HARDENING_MODE\=_LIBCPP_HARDENING_MODE_DEBUG -swift-version 4.2 -I /Users/admin/builder/spi-builder-workspace/.derivedData/Build/Products/Debug -F /Users/admin/builder/spi-builder-workspace/.derivedData/Build/Products/Debug -F /Applications/Xcode-16.1.0.app/Contents/Developer/Platforms/MacOSX.platform/Developer/Library/Frameworks -parse-as-library -c -j10 -enable-batch-mode -incremental -Xcc -ivfsstatcache -Xcc /Users/admin/builder/spi-builder-workspace/.derivedData/SDKStatCaches.noindex/macosx15.1-24B75-44d23fded74b714c58e69ec4af40d824.sdkstatcache -output-file-map /Users/admin/builder/spi-builder-workspace/.derivedData/Build/Intermediates.noindex/Coverage.build/Debug/Runner.build/Objects-normal/arm64/Runner-OutputFileMap.json -use-frontend-parseable-output -save-temps -no-color-diagnostics -serialize-diagnostics -emit-dependencies -emit-module -emit-module-path /Users/admin/builder/spi-builder-workspace/.derivedData/Build/Intermediates.noindex/Coverage.build/Debug/Runner.build/Objects-normal/arm64/Runner.swiftmodule -validate-clang-modules-once -clang-build-session-file /Users/admin/builder/spi-builder-workspace/.derivedData/ModuleCache.noindex/Session.modulevalidation -Xcc -I/Users/admin/builder/spi-builder-workspace/.derivedData/Build/Intermediates.noindex/Coverage.build/Debug/Runner.build/swift-overrides.hmap -emit-const-values -Xfrontend -const-gather-protocols-file -Xfrontend /Users/admin/builder/spi-builder-workspace/.derivedData/Build/Intermediates.noindex/Coverage.build/Debug/Runner.build/Objects-normal/arm64/Runner_const_extract_protocols.json -Xcc -I/Users/admin/builder/spi-builder-workspace/.derivedData/Build/Products/Debug/include -Xcc -I/Users/admin/builder/spi-builder-workspace/.derivedData/Build/Intermediates.noindex/Coverage.build/Debug/Runner.build/DerivedSources-normal/arm64 -Xcc -I/Users/admin/builder/spi-builder-workspace/.derivedData/Build/Intermediates.noindex/Coverage.build/Debug/Runner.build/DerivedSources/arm64 -Xcc -I/Users/admin/builder/spi-builder-workspace/.derivedData/Build/Intermediates.noindex/Coverage.build/Debug/Runner.build/DerivedSources -Xcc -DSWIFT_PACKAGE\=1 -Xcc -DDEBUG\=1 -emit-objc-header -emit-objc-header-path /Users/admin/builder/spi-builder-workspace/.derivedData/Build/Intermediates.noindex/Coverage.build/Debug/Runner.build/Objects-normal/arm64/Runner-Swift.h -working-directory /Users/admin/builder/spi-builder-workspace -experimental-emit-module-separately -disable-cmo
error: Build input file cannot be found: '/Users/admin/builder/spi-builder-workspace/.build/checkouts/Runner/Sources/Runner/Runner.swift'. Did you forget to declare this file as an output of a script phase or custom build rule which produces it? (in target 'Runner' from project 'Coverage')
SwiftDriver\ Compilation Runner normal arm64 com.apple.xcode.tools.swift.compiler (in target 'Runner' from project 'Coverage')
cd /Users/admin/builder/spi-builder-workspace
builtin-Swift-Compilation -- /Applications/Xcode-16.1.0.app/Contents/Developer/Toolchains/XcodeDefault.xctoolchain/usr/bin/swiftc -module-name Runner -Onone -enforce-exclusivity\=checked @/Users/admin/builder/spi-builder-workspace/.derivedData/Build/Intermediates.noindex/Coverage.build/Debug/Runner.build/Objects-normal/arm64/Runner.SwiftFileList -DSWIFT_PACKAGE -DDEBUG -stats-output-dir .stats -strict-concurrency\=complete -enable-upcoming-feature StrictConcurrency -enable-upcoming-feature DisableOutwardActorInference -enable-upcoming-feature GlobalActorIsolatedTypesUsability -enable-upcoming-feature InferSendableFromCaptures -enable-bare-slash-regex -enable-experimental-feature DebugDescriptionMacro -sdk /Applications/Xcode-16.1.0.app/Contents/Developer/Platforms/MacOSX.platform/Developer/SDKs/MacOSX15.1.sdk -target arm64-apple-macos10.10 -g -module-cache-path /Users/admin/builder/spi-builder-workspace/.derivedData/ModuleCache.noindex -Xfrontend -serialize-debugging-options -enable-testing -index-store-path /Users/admin/builder/spi-builder-workspace/.derivedData/Index.noindex/DataStore -enable-experimental-feature OpaqueTypeErasure -Xcc -D_LIBCPP_HARDENING_MODE\=_LIBCPP_HARDENING_MODE_DEBUG -swift-version 4.2 -I /Users/admin/builder/spi-builder-workspace/.derivedData/Build/Products/Debug -F /Users/admin/builder/spi-builder-workspace/.derivedData/Build/Products/Debug -F /Applications/Xcode-16.1.0.app/Contents/Developer/Platforms/MacOSX.platform/Developer/Library/Frameworks -parse-as-library -c -j10 -enable-batch-mode -incremental -Xcc -ivfsstatcache -Xcc /Users/admin/builder/spi-builder-workspace/.derivedData/SDKStatCaches.noindex/macosx15.1-24B75-44d23fded74b714c58e69ec4af40d824.sdkstatcache -output-file-map /Users/admin/builder/spi-builder-workspace/.derivedData/Build/Intermediates.noindex/Coverage.build/Debug/Runner.build/Objects-normal/arm64/Runner-OutputFileMap.json -use-frontend-parseable-output -save-temps -no-color-diagnostics -serialize-diagnostics -emit-dependencies -emit-module -emit-module-path /Users/admin/builder/spi-builder-workspace/.derivedData/Build/Intermediates.noindex/Coverage.build/Debug/Runner.build/Objects-normal/arm64/Runner.swiftmodule -validate-clang-modules-once -clang-build-session-file /Users/admin/builder/spi-builder-workspace/.derivedData/ModuleCache.noindex/Session.modulevalidation -Xcc -I/Users/admin/builder/spi-builder-workspace/.derivedData/Build/Intermediates.noindex/Coverage.build/Debug/Runner.build/swift-overrides.hmap -emit-const-values -Xfrontend -const-gather-protocols-file -Xfrontend /Users/admin/builder/spi-builder-workspace/.derivedData/Build/Intermediates.noindex/Coverage.build/Debug/Runner.build/Objects-normal/arm64/Runner_const_extract_protocols.json -Xcc -I/Users/admin/builder/spi-builder-workspace/.derivedData/Build/Products/Debug/include -Xcc -I/Users/admin/builder/spi-builder-workspace/.derivedData/Build/Intermediates.noindex/Coverage.build/Debug/Runner.build/DerivedSources-normal/arm64 -Xcc -I/Users/admin/builder/spi-builder-workspace/.derivedData/Build/Intermediates.noindex/Coverage.build/Debug/Runner.build/DerivedSources/arm64 -Xcc -I/Users/admin/builder/spi-builder-workspace/.derivedData/Build/Intermediates.noindex/Coverage.build/Debug/Runner.build/DerivedSources -Xcc -DSWIFT_PACKAGE\=1 -Xcc -DDEBUG\=1 -emit-objc-header -emit-objc-header-path /Users/admin/builder/spi-builder-workspace/.derivedData/Build/Intermediates.noindex/Coverage.build/Debug/Runner.build/Objects-normal/arm64/Runner-Swift.h -working-directory /Users/admin/builder/spi-builder-workspace -experimental-emit-module-separately -disable-cmo
error: Build input file cannot be found: '/Users/admin/builder/spi-builder-workspace/.build/checkouts/Runner/Sources/Runner/Runner.swift'. Did you forget to declare this file as an output of a script phase or custom build rule which produces it? (in target 'Runner' from project 'Coverage')
SwiftDriver\ Compilation Logger normal arm64 com.apple.xcode.tools.swift.compiler (in target 'Logger' from project 'Coverage')
cd /Users/admin/builder/spi-builder-workspace
builtin-Swift-Compilation -- /Applications/Xcode-16.1.0.app/Contents/Developer/Toolchains/XcodeDefault.xctoolchain/usr/bin/swiftc -module-name Logger -Onone -enforce-exclusivity\=checked @/Users/admin/builder/spi-builder-workspace/.derivedData/Build/Intermediates.noindex/Coverage.build/Debug/Logger.build/Objects-normal/arm64/Logger.SwiftFileList -DSWIFT_PACKAGE -DDEBUG -stats-output-dir .stats -strict-concurrency\=complete -enable-upcoming-feature StrictConcurrency -enable-upcoming-feature DisableOutwardActorInference -enable-upcoming-feature GlobalActorIsolatedTypesUsability -enable-upcoming-feature InferSendableFromCaptures -enable-bare-slash-regex -enable-experimental-feature DebugDescriptionMacro -sdk /Applications/Xcode-16.1.0.app/Contents/Developer/Platforms/MacOSX.platform/Developer/SDKs/MacOSX15.1.sdk -target arm64-apple-macos10.10 -g -module-cache-path /Users/admin/builder/spi-builder-workspace/.derivedData/ModuleCache.noindex -Xfrontend -serialize-debugging-options -enable-testing -index-store-path /Users/admin/builder/spi-builder-workspace/.derivedData/Index.noindex/DataStore -enable-experimental-feature OpaqueTypeErasure -Xcc -D_LIBCPP_HARDENING_MODE\=_LIBCPP_HARDENING_MODE_DEBUG -swift-version 4.2 -I /Users/admin/builder/spi-builder-workspace/.derivedData/Build/Products/Debug -F /Users/admin/builder/spi-builder-workspace/.derivedData/Build/Products/Debug -F /Applications/Xcode-16.1.0.app/Contents/Developer/Platforms/MacOSX.platform/Developer/Library/Frameworks -c -j10 -enable-batch-mode -incremental -Xcc -ivfsstatcache -Xcc /Users/admin/builder/spi-builder-workspace/.derivedData/SDKStatCaches.noindex/macosx15.1-24B75-44d23fded74b714c58e69ec4af40d824.sdkstatcache -output-file-map /Users/admin/builder/spi-builder-workspace/.derivedData/Build/Intermediates.noindex/Coverage.build/Debug/Logger.build/Objects-normal/arm64/Logger-OutputFileMap.json -use-frontend-parseable-output -save-temps -no-color-diagnostics -serialize-diagnostics -emit-dependencies -emit-module -emit-module-path /Users/admin/builder/spi-builder-workspace/.derivedData/Build/Intermediates.noindex/Coverage.build/Debug/Logger.build/Objects-normal/arm64/Logger.swiftmodule -validate-clang-modules-once -clang-build-session-file /Users/admin/builder/spi-builder-workspace/.derivedData/ModuleCache.noindex/Session.modulevalidation -Xcc -I/Users/admin/builder/spi-builder-workspace/.derivedData/Build/Intermediates.noindex/Coverage.build/Debug/Logger.build/swift-overrides.hmap -emit-const-values -Xfrontend -const-gather-protocols-file -Xfrontend /Users/admin/builder/spi-builder-workspace/.derivedData/Build/Intermediates.noindex/Coverage.build/Debug/Logger.build/Objects-normal/arm64/Logger_const_extract_protocols.json -Xcc -I/Users/admin/builder/spi-builder-workspace/.derivedData/Build/Products/Debug/include -Xcc -I/Users/admin/builder/spi-builder-workspace/.derivedData/Build/Intermediates.noindex/Coverage.build/Debug/Logger.build/DerivedSources-normal/arm64 -Xcc -I/Users/admin/builder/spi-builder-workspace/.derivedData/Build/Intermediates.noindex/Coverage.build/Debug/Logger.build/DerivedSources/arm64 -Xcc -I/Users/admin/builder/spi-builder-workspace/.derivedData/Build/Intermediates.noindex/Coverage.build/Debug/Logger.build/DerivedSources -Xcc -DSWIFT_PACKAGE\=1 -Xcc -DDEBUG\=1 -emit-objc-header -emit-objc-header-path /Users/admin/builder/spi-builder-workspace/.derivedData/Build/Intermediates.noindex/Coverage.build/Debug/Logger.build/Objects-normal/arm64/Logger-Swift.h -working-directory /Users/admin/builder/spi-builder-workspace -experimental-emit-module-separately -disable-cmo
error: Build input files cannot be found: '/Users/admin/builder/spi-builder-workspace/.build/checkouts/Logger/Sources/Logger/PrintHandler.swift', '/Users/admin/builder/spi-builder-workspace/.build/checkouts/Logger/Sources/Logger/OSLogHandler.swift', '/Users/admin/builder/spi-builder-workspace/.build/checkouts/Logger/Sources/Logger/NSLogHandler.swift', '/Users/admin/builder/spi-builder-workspace/.build/checkouts/Logger/Sources/Logger/Manager.swift', '/Users/admin/builder/spi-builder-workspace/.build/checkouts/Logger/Sources/Logger/Handler.swift', '/Users/admin/builder/spi-builder-workspace/.build/checkouts/Logger/Sources/Logger/Context.swift', '/Users/admin/builder/spi-builder-workspace/.build/checkouts/Logger/Sources/Logger/Channel.swift'. Did you forget to declare these files as outputs of any script phases or custom build rules which produce them? (in target 'Logger' from project 'Coverage')
SwiftDriver\ Compilation\ Requirements Docopt normal arm64 com.apple.xcode.tools.swift.compiler (in target 'Docopt' from project 'Coverage')
cd /Users/admin/builder/spi-builder-workspace
builtin-Swift-Compilation-Requirements -- /Applications/Xcode-16.1.0.app/Contents/Developer/Toolchains/XcodeDefault.xctoolchain/usr/bin/swiftc -module-name Docopt -Onone -enforce-exclusivity\=checked @/Users/admin/builder/spi-builder-workspace/.derivedData/Build/Intermediates.noindex/Coverage.build/Debug/Docopt.build/Objects-normal/arm64/Docopt.SwiftFileList -DSWIFT_PACKAGE -DDEBUG -stats-output-dir .stats -strict-concurrency\=complete -enable-upcoming-feature StrictConcurrency -enable-upcoming-feature DisableOutwardActorInference -enable-upcoming-feature GlobalActorIsolatedTypesUsability -enable-upcoming-feature InferSendableFromCaptures -enable-bare-slash-regex -enable-experimental-feature DebugDescriptionMacro -sdk /Applications/Xcode-16.1.0.app/Contents/Developer/Platforms/MacOSX.platform/Developer/SDKs/MacOSX15.1.sdk -target arm64-apple-macos10.10 -g -module-cache-path /Users/admin/builder/spi-builder-workspace/.derivedData/ModuleCache.noindex -Xfrontend -serialize-debugging-options -enable-testing -index-store-path /Users/admin/builder/spi-builder-workspace/.derivedData/Index.noindex/DataStore -enable-experimental-feature OpaqueTypeErasure -Xcc -D_LIBCPP_HARDENING_MODE\=_LIBCPP_HARDENING_MODE_DEBUG -swift-version 4 -I /Users/admin/builder/spi-builder-workspace/.derivedData/Build/Products/Debug -F /Users/admin/builder/spi-builder-workspace/.derivedData/Build/Products/Debug -F /Applications/Xcode-16.1.0.app/Contents/Developer/Platforms/MacOSX.platform/Developer/Library/Frameworks -c -j10 -enable-batch-mode -incremental -Xcc -ivfsstatcache -Xcc /Users/admin/builder/spi-builder-workspace/.derivedData/SDKStatCaches.noindex/macosx15.1-24B75-44d23fded74b714c58e69ec4af40d824.sdkstatcache -output-file-map /Users/admin/builder/spi-builder-workspace/.derivedData/Build/Intermediates.noindex/Coverage.build/Debug/Docopt.build/Objects-normal/arm64/Docopt-OutputFileMap.json -use-frontend-parseable-output -save-temps -no-color-diagnostics -serialize-diagnostics -emit-dependencies -emit-module -emit-module-path /Users/admin/builder/spi-builder-workspace/.derivedData/Build/Intermediates.noindex/Coverage.build/Debug/Docopt.build/Objects-normal/arm64/Docopt.swiftmodule -validate-clang-modules-once -clang-build-session-file /Users/admin/builder/spi-builder-workspace/.derivedData/ModuleCache.noindex/Session.modulevalidation -Xcc -I/Users/admin/builder/spi-builder-workspace/.derivedData/Build/Intermediates.noindex/Coverage.build/Debug/Docopt.build/swift-overrides.hmap -emit-const-values -Xfrontend -const-gather-protocols-file -Xfrontend /Users/admin/builder/spi-builder-workspace/.derivedData/Build/Intermediates.noindex/Coverage.build/Debug/Docopt.build/Objects-normal/arm64/Docopt_const_extract_protocols.json -Xcc -I/Users/admin/builder/spi-builder-workspace/.derivedData/Build/Products/Debug/include -Xcc -I/Users/admin/builder/spi-builder-workspace/.derivedData/Build/Intermediates.noindex/Coverage.build/Debug/Docopt.build/DerivedSources-normal/arm64 -Xcc -I/Users/admin/builder/spi-builder-workspace/.derivedData/Build/Intermediates.noindex/Coverage.build/Debug/Docopt.build/DerivedSources/arm64 -Xcc -I/Users/admin/builder/spi-builder-workspace/.derivedData/Build/Intermediates.noindex/Coverage.build/Debug/Docopt.build/DerivedSources -Xcc -DSWIFT_PACKAGE\=1 -Xcc -DDEBUG\=1 -emit-objc-header -emit-objc-header-path /Users/admin/builder/spi-builder-workspace/.derivedData/Build/Intermediates.noindex/Coverage.build/Debug/Docopt.build/Objects-normal/arm64/Docopt-Swift.h -working-directory /Users/admin/builder/spi-builder-workspace -experimental-emit-module-separately -disable-cmo
error: Build input files cannot be found: '/Users/admin/builder/spi-builder-workspace/.build/checkouts/docopt.swift/Sources/Docopt/Tokens.swift', '/Users/admin/builder/spi-builder-workspace/.build/checkouts/docopt.swift/Sources/Docopt/String.swift', '/Users/admin/builder/spi-builder-workspace/.build/checkouts/docopt.swift/Sources/Docopt/Required.swift', '/Users/admin/builder/spi-builder-workspace/.build/checkouts/docopt.swift/Sources/Docopt/Pattern.swift', '/Users/admin/builder/spi-builder-workspace/.build/checkouts/docopt.swift/Sources/Docopt/OptionsShortcut.swift', '/Users/admin/builder/spi-builder-workspace/.build/checkouts/docopt.swift/Sources/Docopt/Optional.swift', '/Users/admin/builder/spi-builder-workspace/.build/checkouts/docopt.swift/Sources/Docopt/Option.swift', '/Users/admin/builder/spi-builder-workspace/.build/checkouts/docopt.swift/Sources/Docopt/OneOrMore.swift', '/Users/admin/builder/spi-builder-workspace/.build/checkouts/docopt.swift/Sources/Docopt/LeafPattern.swift', '/Users/admin/builder/spi-builder-workspace/.build/checkouts/docopt.swift/Sources/Docopt/Either.swift', '/Users/admin/builder/spi-builder-workspace/.build/checkouts/docopt.swift/Sources/Docopt/DocoptError.swift', '/Users/admin/builder/spi-builder-workspace/.build/checkouts/docopt.swift/Sources/Docopt/Docopt.swift', '/Users/admin/builder/spi-builder-workspace/.build/checkouts/docopt.swift/Sources/Docopt/Command.swift', '/Users/admin/builder/spi-builder-workspace/.build/checkouts/docopt.swift/Sources/Docopt/BranchPattern.swift', '/Users/admin/builder/spi-builder-workspace/.build/checkouts/docopt.swift/Sources/Docopt/Argument.swift'. Did you forget to declare these files as outputs of any script phases or custom build rules which produce them? (in target 'Docopt' from project 'Coverage')
SwiftDriver\ Compilation Docopt normal arm64 com.apple.xcode.tools.swift.compiler (in target 'Docopt' from project 'Coverage')
cd /Users/admin/builder/spi-builder-workspace
builtin-Swift-Compilation -- /Applications/Xcode-16.1.0.app/Contents/Developer/Toolchains/XcodeDefault.xctoolchain/usr/bin/swiftc -module-name Docopt -Onone -enforce-exclusivity\=checked @/Users/admin/builder/spi-builder-workspace/.derivedData/Build/Intermediates.noindex/Coverage.build/Debug/Docopt.build/Objects-normal/arm64/Docopt.SwiftFileList -DSWIFT_PACKAGE -DDEBUG -stats-output-dir .stats -strict-concurrency\=complete -enable-upcoming-feature StrictConcurrency -enable-upcoming-feature DisableOutwardActorInference -enable-upcoming-feature GlobalActorIsolatedTypesUsability -enable-upcoming-feature InferSendableFromCaptures -enable-bare-slash-regex -enable-experimental-feature DebugDescriptionMacro -sdk /Applications/Xcode-16.1.0.app/Contents/Developer/Platforms/MacOSX.platform/Developer/SDKs/MacOSX15.1.sdk -target arm64-apple-macos10.10 -g -module-cache-path /Users/admin/builder/spi-builder-workspace/.derivedData/ModuleCache.noindex -Xfrontend -serialize-debugging-options -enable-testing -index-store-path /Users/admin/builder/spi-builder-workspace/.derivedData/Index.noindex/DataStore -enable-experimental-feature OpaqueTypeErasure -Xcc -D_LIBCPP_HARDENING_MODE\=_LIBCPP_HARDENING_MODE_DEBUG -swift-version 4 -I /Users/admin/builder/spi-builder-workspace/.derivedData/Build/Products/Debug -F /Users/admin/builder/spi-builder-workspace/.derivedData/Build/Products/Debug -F /Applications/Xcode-16.1.0.app/Contents/Developer/Platforms/MacOSX.platform/Developer/Library/Frameworks -c -j10 -enable-batch-mode -incremental -Xcc -ivfsstatcache -Xcc /Users/admin/builder/spi-builder-workspace/.derivedData/SDKStatCaches.noindex/macosx15.1-24B75-44d23fded74b714c58e69ec4af40d824.sdkstatcache -output-file-map /Users/admin/builder/spi-builder-workspace/.derivedData/Build/Intermediates.noindex/Coverage.build/Debug/Docopt.build/Objects-normal/arm64/Docopt-OutputFileMap.json -use-frontend-parseable-output -save-temps -no-color-diagnostics -serialize-diagnostics -emit-dependencies -emit-module -emit-module-path /Users/admin/builder/spi-builder-workspace/.derivedData/Build/Intermediates.noindex/Coverage.build/Debug/Docopt.build/Objects-normal/arm64/Docopt.swiftmodule -validate-clang-modules-once -clang-build-session-file /Users/admin/builder/spi-builder-workspace/.derivedData/ModuleCache.noindex/Session.modulevalidation -Xcc -I/Users/admin/builder/spi-builder-workspace/.derivedData/Build/Intermediates.noindex/Coverage.build/Debug/Docopt.build/swift-overrides.hmap -emit-const-values -Xfrontend -const-gather-protocols-file -Xfrontend /Users/admin/builder/spi-builder-workspace/.derivedData/Build/Intermediates.noindex/Coverage.build/Debug/Docopt.build/Objects-normal/arm64/Docopt_const_extract_protocols.json -Xcc -I/Users/admin/builder/spi-builder-workspace/.derivedData/Build/Products/Debug/include -Xcc -I/Users/admin/builder/spi-builder-workspace/.derivedData/Build/Intermediates.noindex/Coverage.build/Debug/Docopt.build/DerivedSources-normal/arm64 -Xcc -I/Users/admin/builder/spi-builder-workspace/.derivedData/Build/Intermediates.noindex/Coverage.build/Debug/Docopt.build/DerivedSources/arm64 -Xcc -I/Users/admin/builder/spi-builder-workspace/.derivedData/Build/Intermediates.noindex/Coverage.build/Debug/Docopt.build/DerivedSources -Xcc -DSWIFT_PACKAGE\=1 -Xcc -DDEBUG\=1 -emit-objc-header -emit-objc-header-path /Users/admin/builder/spi-builder-workspace/.derivedData/Build/Intermediates.noindex/Coverage.build/Debug/Docopt.build/Objects-normal/arm64/Docopt-Swift.h -working-directory /Users/admin/builder/spi-builder-workspace -experimental-emit-module-separately -disable-cmo
error: Build input files cannot be found: '/Users/admin/builder/spi-builder-workspace/.build/checkouts/docopt.swift/Sources/Docopt/Tokens.swift', '/Users/admin/builder/spi-builder-workspace/.build/checkouts/docopt.swift/Sources/Docopt/String.swift', '/Users/admin/builder/spi-builder-workspace/.build/checkouts/docopt.swift/Sources/Docopt/Required.swift', '/Users/admin/builder/spi-builder-workspace/.build/checkouts/docopt.swift/Sources/Docopt/Pattern.swift', '/Users/admin/builder/spi-builder-workspace/.build/checkouts/docopt.swift/Sources/Docopt/OptionsShortcut.swift', '/Users/admin/builder/spi-builder-workspace/.build/checkouts/docopt.swift/Sources/Docopt/Optional.swift', '/Users/admin/builder/spi-builder-workspace/.build/checkouts/docopt.swift/Sources/Docopt/Option.swift', '/Users/admin/builder/spi-builder-workspace/.build/checkouts/docopt.swift/Sources/Docopt/OneOrMore.swift', '/Users/admin/builder/spi-builder-workspace/.build/checkouts/docopt.swift/Sources/Docopt/LeafPattern.swift', '/Users/admin/builder/spi-builder-workspace/.build/checkouts/docopt.swift/Sources/Docopt/Either.swift', '/Users/admin/builder/spi-builder-workspace/.build/checkouts/docopt.swift/Sources/Docopt/DocoptError.swift', '/Users/admin/builder/spi-builder-workspace/.build/checkouts/docopt.swift/Sources/Docopt/Docopt.swift', '/Users/admin/builder/spi-builder-workspace/.build/checkouts/docopt.swift/Sources/Docopt/Command.swift', '/Users/admin/builder/spi-builder-workspace/.build/checkouts/docopt.swift/Sources/Docopt/BranchPattern.swift', '/Users/admin/builder/spi-builder-workspace/.build/checkouts/docopt.swift/Sources/Docopt/Argument.swift'. Did you forget to declare these files as outputs of any script phases or custom build rules which produce them? (in target 'Docopt' from project 'Coverage')
/Users/admin/builder/spi-builder-workspace/Coverage.xcodeproj: warning: The macOS deployment target 'MACOSX_DEPLOYMENT_TARGET' is set to 10.10, but the range of supported deployment target versions is 10.13 to 15.1.99. (in target 'Coverage' from project 'Coverage')
/Users/admin/builder/spi-builder-workspace/Coverage.xcodeproj: warning: The macOS deployment target 'MACOSX_DEPLOYMENT_TARGET' is set to 10.10, but the range of supported deployment target versions is 10.13 to 15.1.99. (in target 'Arguments' from project 'Coverage')
/Users/admin/builder/spi-builder-workspace/Coverage.xcodeproj: warning: The macOS deployment target 'MACOSX_DEPLOYMENT_TARGET' is set to 10.10, but the range of supported deployment target versions is 10.13 to 15.1.99. (in target 'Runner' from project 'Coverage')
/Users/admin/builder/spi-builder-workspace/Coverage.xcodeproj: warning: The macOS deployment target 'MACOSX_DEPLOYMENT_TARGET' is set to 10.10, but the range of supported deployment target versions is 10.13 to 15.1.99. (in target 'Docopt' from project 'Coverage')
** BUILD FAILED **
The following build commands failed:
SwiftDriver\ Compilation\ Requirements Logger normal arm64 com.apple.xcode.tools.swift.compiler (in target 'Logger' from project 'Coverage')
SwiftDriver\ Compilation\ Requirements Runner normal arm64 com.apple.xcode.tools.swift.compiler (in target 'Runner' from project 'Coverage')
SwiftDriver\ Compilation Runner normal arm64 com.apple.xcode.tools.swift.compiler (in target 'Runner' from project 'Coverage')
SwiftDriver\ Compilation Logger normal arm64 com.apple.xcode.tools.swift.compiler (in target 'Logger' from project 'Coverage')
SwiftDriver\ Compilation\ Requirements Docopt normal arm64 com.apple.xcode.tools.swift.compiler (in target 'Docopt' from project 'Coverage')
SwiftDriver\ Compilation Docopt normal arm64 com.apple.xcode.tools.swift.compiler (in target 'Docopt' from project 'Coverage')
Building project Coverage with scheme Coverage-Package
(7 failures)
BUILD FAILURE 6.0 macosXcodebuild