Build Information
Failed to build DynuREST, reference main (de5d03
), with Swift 6.1 for iOS using Xcode 16.3 on 26 Apr 2025 22:59:19 UTC.
Build Command
env DEVELOPER_DIR=/Applications/Xcode-16.3.0.app xcrun xcodebuild -IDEClonedSourcePackagesDirPathOverride=$PWD/.dependencies -skipMacroValidation -skipPackagePluginValidation -derivedDataPath $PWD/.derivedData build -scheme DynuREST-Package -destination generic/platform=iOS
Build Log
========================================
RunAll
========================================
Builder version: 4.61.0
Interrupt handler set up.
========================================
Checkout
========================================
Clone URL: https://github.com/richardpiazza/DynuREST.git
Reference: main
Initialized empty Git repository in /Users/admin/builder/spi-builder-workspace/.git/
From https://github.com/richardpiazza/DynuREST
* branch main -> FETCH_HEAD
* [new branch] main -> origin/main
HEAD is now at de5d038 Equatable conformance on IPAddress (#6)
Cloned https://github.com/richardpiazza/DynuREST.git
Revision (git rev-parse @):
de5d038b426cb5c639a0edad1911ddbe6a291f2c
SUCCESS checkout https://github.com/richardpiazza/DynuREST.git at main
========================================
Build
========================================
Selected platform: iOS
Swift version: 6.1
Building package at path: $PWD
https://github.com/richardpiazza/DynuREST.git
https://github.com/richardpiazza/DynuREST.git
{
"dependencies" : [
{
"identity" : "sessionplus",
"requirement" : {
"range" : [
{
"lower_bound" : "2.2.0",
"upper_bound" : "3.0.0"
}
]
},
"type" : "sourceControl",
"url" : "https://github.com/richardpiazza/SessionPlus.git"
},
{
"identity" : "swift-argument-parser",
"requirement" : {
"range" : [
{
"lower_bound" : "1.2.2",
"upper_bound" : "2.0.0"
}
]
},
"type" : "sourceControl",
"url" : "https://github.com/apple/swift-argument-parser.git"
},
{
"identity" : "shellout",
"requirement" : {
"range" : [
{
"lower_bound" : "2.3.0",
"upper_bound" : "3.0.0"
}
]
},
"type" : "sourceControl",
"url" : "https://github.com/johnsundell/ShellOut.git"
}
],
"manifest_display_name" : "DynuREST",
"name" : "DynuREST",
"path" : "/Users/admin/builder/spi-builder-workspace",
"platforms" : [
{
"name" : "macos",
"version" : "12.0"
},
{
"name" : "ios",
"version" : "15.0"
},
{
"name" : "tvos",
"version" : "15.0"
},
{
"name" : "watchos",
"version" : "8.0"
}
],
"products" : [
{
"name" : "DynuREST",
"targets" : [
"DynuREST"
],
"type" : {
"library" : [
"automatic"
]
}
},
{
"name" : "dynu",
"targets" : [
"cli"
],
"type" : {
"executable" : null
}
}
],
"swift_languages_versions" : [
"5"
],
"targets" : [
{
"c99name" : "cli",
"module_type" : "SwiftTarget",
"name" : "cli",
"path" : "Sources/cli",
"product_dependencies" : [
"ArgumentParser"
],
"product_memberships" : [
"dynu"
],
"sources" : [
"IPCommand.swift",
"MainCommand.swift",
"UpdateCommand.swift"
],
"target_dependencies" : [
"DynuREST"
],
"type" : "executable"
},
{
"c99name" : "DynuRESTTests",
"module_type" : "SwiftTarget",
"name" : "DynuRESTTests",
"path" : "Tests/DynuRESTTests",
"sources" : [
"DynuAPITests.swift",
"IPAddressTests.swift"
],
"target_dependencies" : [
"DynuREST"
],
"type" : "test"
},
{
"c99name" : "DynuREST",
"module_type" : "SwiftTarget",
"name" : "DynuREST",
"path" : "Sources/DynuREST",
"product_dependencies" : [
"SessionPlus",
"ShellOut"
],
"product_memberships" : [
"DynuREST",
"dynu"
],
"sources" : [
"DynuClient.swift",
"DynuIPUpdater.swift",
"DynuRESTError.swift",
"IFConfigClient.swift",
"IFConfigCommand.swift",
"IPAddress.swift",
"IPSource.swift",
"IPifyClient.swift",
"ResponseCode.swift",
"URL+DynuREST.swift"
],
"type" : "library"
}
],
"tools_version" : "5.5"
}
Command line invocation:
/Applications/Xcode-16.3.0.app/Contents/Developer/usr/bin/xcodebuild -IDEClonedSourcePackagesDirPathOverride=/Users/admin/builder/spi-builder-workspace/.dependencies -resolvePackageDependencies
Resolve Package Graph
Fetching from https://github.com/richardpiazza/SessionPlus.git
Fetching from https://github.com/johnsundell/ShellOut.git
Fetching from https://github.com/apple/swift-argument-parser.git (cached)
Fetching from https://github.com/richardpiazza/AsyncPlus.git
Creating working copy of package ‘AsyncPlus’
Checking out 0.3.2 of package ‘AsyncPlus’
Creating working copy of package ‘SessionPlus’
Checking out 2.2.0 of package ‘SessionPlus’
Creating working copy of package ‘ShellOut’
Checking out 2.3.0 of package ‘ShellOut’
Creating working copy of package ‘swift-argument-parser’
Checking out 1.5.0 of package ‘swift-argument-parser’
Resolve Package Graph
Resolved source packages:
AsyncPlus: https://github.com/richardpiazza/AsyncPlus.git @ 0.3.2
ShellOut: https://github.com/johnsundell/ShellOut.git @ 2.3.0
SessionPlus: https://github.com/richardpiazza/SessionPlus.git @ 2.2.0
DynuREST: /Users/admin/builder/spi-builder-workspace
swift-argument-parser: https://github.com/apple/swift-argument-parser.git @ 1.5.0
resolved source packages: AsyncPlus, ShellOut, SessionPlus, DynuREST, swift-argument-parser
{
"dependencies" : [
{
"identity" : "sessionplus",
"requirement" : {
"range" : [
{
"lower_bound" : "2.2.0",
"upper_bound" : "3.0.0"
}
]
},
"type" : "sourceControl",
"url" : "https://github.com/richardpiazza/SessionPlus.git"
},
{
"identity" : "swift-argument-parser",
"requirement" : {
"range" : [
{
"lower_bound" : "1.2.2",
"upper_bound" : "2.0.0"
}
]
},
"type" : "sourceControl",
"url" : "https://github.com/apple/swift-argument-parser.git"
},
{
"identity" : "shellout",
"requirement" : {
"range" : [
{
"lower_bound" : "2.3.0",
"upper_bound" : "3.0.0"
}
]
},
"type" : "sourceControl",
"url" : "https://github.com/johnsundell/ShellOut.git"
}
],
"manifest_display_name" : "DynuREST",
"name" : "DynuREST",
"path" : "/Users/admin/builder/spi-builder-workspace",
"platforms" : [
{
"name" : "macos",
"version" : "12.0"
},
{
"name" : "ios",
"version" : "15.0"
},
{
"name" : "tvos",
"version" : "15.0"
},
{
"name" : "watchos",
"version" : "8.0"
}
],
"products" : [
{
"name" : "DynuREST",
"targets" : [
"DynuREST"
],
"type" : {
"library" : [
"automatic"
]
}
},
{
"name" : "dynu",
"targets" : [
"cli"
],
"type" : {
"executable" : null
}
}
],
"swift_languages_versions" : [
"5"
],
"targets" : [
{
"c99name" : "cli",
"module_type" : "SwiftTarget",
"name" : "cli",
"path" : "Sources/cli",
"product_dependencies" : [
"ArgumentParser"
],
"product_memberships" : [
"dynu"
],
"sources" : [
"IPCommand.swift",
"MainCommand.swift",
"UpdateCommand.swift"
],
"target_dependencies" : [
"DynuREST"
],
"type" : "executable"
},
{
"c99name" : "DynuRESTTests",
"module_type" : "SwiftTarget",
"name" : "DynuRESTTests",
"path" : "Tests/DynuRESTTests",
"sources" : [
"DynuAPITests.swift",
"IPAddressTests.swift"
],
"target_dependencies" : [
"DynuREST"
],
"type" : "test"
},
{
"c99name" : "DynuREST",
"module_type" : "SwiftTarget",
"name" : "DynuREST",
"path" : "Sources/DynuREST",
"product_dependencies" : [
"SessionPlus",
"ShellOut"
],
"product_memberships" : [
"DynuREST",
"dynu"
],
"sources" : [
"DynuClient.swift",
"DynuIPUpdater.swift",
"DynuRESTError.swift",
"IFConfigClient.swift",
"IFConfigCommand.swift",
"IPAddress.swift",
"IPSource.swift",
"IPifyClient.swift",
"ResponseCode.swift",
"URL+DynuREST.swift"
],
"type" : "library"
}
],
"tools_version" : "5.5"
}
{
"workspace" : {
"name" : "spi-builder-workspace",
"schemes" : [
"dynu",
"DynuREST",
"DynuREST-Package"
]
}
}
Running build ...
env DEVELOPER_DIR=/Applications/Xcode-16.3.0.app xcrun xcodebuild -IDEClonedSourcePackagesDirPathOverride=$PWD/.dependencies -skipMacroValidation -skipPackagePluginValidation -derivedDataPath $PWD/.derivedData build -scheme DynuREST-Package -destination generic/platform=iOS OTHER_SWIFT_FLAGS=-stats-output-dir .stats -strict-concurrency=complete -enable-upcoming-feature StrictConcurrency -enable-upcoming-feature DisableOutwardActorInference -enable-upcoming-feature GlobalActorIsolatedTypesUsability -enable-upcoming-feature InferSendableFromCaptures
Command line invocation:
/Applications/Xcode-16.3.0.app/Contents/Developer/usr/bin/xcodebuild -IDEClonedSourcePackagesDirPathOverride=/Users/admin/builder/spi-builder-workspace/.dependencies -skipMacroValidation -skipPackagePluginValidation -derivedDataPath /Users/admin/builder/spi-builder-workspace/.derivedData build -scheme DynuREST-Package -destination generic/platform=iOS "OTHER_SWIFT_FLAGS=-stats-output-dir .stats -strict-concurrency=complete -enable-upcoming-feature StrictConcurrency -enable-upcoming-feature DisableOutwardActorInference -enable-upcoming-feature GlobalActorIsolatedTypesUsability -enable-upcoming-feature InferSendableFromCaptures"
Build settings from command line:
OTHER_SWIFT_FLAGS = -stats-output-dir .stats -strict-concurrency=complete -enable-upcoming-feature StrictConcurrency -enable-upcoming-feature DisableOutwardActorInference -enable-upcoming-feature GlobalActorIsolatedTypesUsability -enable-upcoming-feature InferSendableFromCaptures
Resolve Package Graph
Resolve Package Graph
Resolved source packages:
AsyncPlus: https://github.com/richardpiazza/AsyncPlus.git @ 0.3.2
swift-argument-parser: https://github.com/apple/swift-argument-parser.git @ 1.5.0
DynuREST: /Users/admin/builder/spi-builder-workspace
ShellOut: https://github.com/johnsundell/ShellOut.git @ 2.3.0
SessionPlus: https://github.com/richardpiazza/SessionPlus.git @ 2.2.0
ComputePackagePrebuildTargetDependencyGraph
Prepare packages
CreateBuildRequest
SendProjectDescription
CreateBuildOperation
ComputeTargetDependencyGraph
note: Building targets in dependency order
note: Target dependency graph (13 targets)
Target 'dynu' in project 'DynuREST'
➜ Explicit dependency on target 'DynuREST' in project 'DynuREST'
➜ Explicit dependency on target 'SessionPlus' in project 'SessionPlus'
➜ Explicit dependency on target 'ShellOut' in project 'ShellOut'
➜ Explicit dependency on target 'ArgumentParser' in project 'swift-argument-parser'
Target 'ArgumentParser' in project 'swift-argument-parser'
➜ Explicit dependency on target 'ArgumentParser' in project 'swift-argument-parser'
➜ Explicit dependency on target 'ArgumentParserToolInfo' in project 'swift-argument-parser'
Target 'ArgumentParser' in project 'swift-argument-parser'
➜ Explicit dependency on target 'ArgumentParserToolInfo' in project 'swift-argument-parser'
Target 'ArgumentParserToolInfo' in project 'swift-argument-parser' (no dependencies)
Target 'DynuREST' in project 'DynuREST'
➜ Explicit dependency on target 'DynuREST' in project 'DynuREST'
➜ Explicit dependency on target 'SessionPlus' in project 'SessionPlus'
➜ Explicit dependency on target 'ShellOut' in project 'ShellOut'
Target 'DynuREST' in project 'DynuREST'
➜ Explicit dependency on target 'SessionPlus' in project 'SessionPlus'
➜ Explicit dependency on target 'ShellOut' in project 'ShellOut'
Target 'ShellOut' in project 'ShellOut'
➜ Explicit dependency on target 'ShellOut' in project 'ShellOut'
Target 'ShellOut' in project 'ShellOut' (no dependencies)
Target 'SessionPlus' in project 'SessionPlus'
➜ Explicit dependency on target 'SessionPlus' in project 'SessionPlus'
➜ Explicit dependency on target 'SessionPlusEmulation' in project 'SessionPlus'
➜ Explicit dependency on target 'AsyncPlus' in project 'AsyncPlus'
Target 'SessionPlusEmulation' in project 'SessionPlus'
➜ Explicit dependency on target 'SessionPlus' in project 'SessionPlus'
➜ Explicit dependency on target 'AsyncPlus' in project 'AsyncPlus'
Target 'SessionPlus' in project 'SessionPlus'
➜ Explicit dependency on target 'AsyncPlus' in project 'AsyncPlus'
Target 'AsyncPlus' in project 'AsyncPlus'
➜ Explicit dependency on target 'AsyncPlus' in project 'AsyncPlus'
Target 'AsyncPlus' in project 'AsyncPlus' (no dependencies)
GatherProvisioningInputs
CreateBuildDescription
ExecuteExternalTool /Applications/Xcode-16.3.0.app/Contents/Developer/Toolchains/XcodeDefault.xctoolchain/usr/bin/swiftc --version
ExecuteExternalTool /Applications/Xcode-16.3.0.app/Contents/Developer/Toolchains/XcodeDefault.xctoolchain/usr/bin/clang -v -E -dM -isysroot /Applications/Xcode-16.3.0.app/Contents/Developer/Platforms/iPhoneOS.platform/Developer/SDKs/iPhoneOS18.4.sdk -x c -c /dev/null
ExecuteExternalTool /Applications/Xcode-16.3.0.app/Contents/Developer/Toolchains/XcodeDefault.xctoolchain/usr/bin/ld -version_details
ReadFileContents /Applications/Xcode-16.3.0.app/Contents/Developer/Toolchains/XcodeDefault.xctoolchain/usr/share/docc/features.json
Build description signature: b89517072c147b9b2f310493f8487888
Build description path: /Users/admin/builder/spi-builder-workspace/.derivedData/Build/Intermediates.noindex/XCBuildData/b89517072c147b9b2f310493f8487888.xcbuilddata
ClangStatCache /Applications/Xcode-16.3.0.app/Contents/Developer/Toolchains/XcodeDefault.xctoolchain/usr/bin/clang-stat-cache /Applications/Xcode-16.3.0.app/Contents/Developer/Platforms/iPhoneOS.platform/Developer/SDKs/iPhoneOS18.4.sdk /Users/admin/builder/spi-builder-workspace/.derivedData/SDKStatCaches.noindex/iphoneos18.4-22E235-339d34bc69d7fc736c3220795c36f340.sdkstatcache
cd /Users/admin/builder/spi-builder-workspace/.swiftpm/xcode
/Applications/Xcode-16.3.0.app/Contents/Developer/Toolchains/XcodeDefault.xctoolchain/usr/bin/clang-stat-cache /Applications/Xcode-16.3.0.app/Contents/Developer/Platforms/iPhoneOS.platform/Developer/SDKs/iPhoneOS18.4.sdk -o /Users/admin/builder/spi-builder-workspace/.derivedData/SDKStatCaches.noindex/iphoneos18.4-22E235-339d34bc69d7fc736c3220795c36f340.sdkstatcache
CreateBuildDirectory /Users/admin/builder/spi-builder-workspace/.derivedData/Build/Products
cd /Users/admin/builder/spi-builder-workspace/.swiftpm/xcode
builtin-create-build-directory /Users/admin/builder/spi-builder-workspace/.derivedData/Build/Products
CreateBuildDirectory /Users/admin/builder/spi-builder-workspace/.derivedData/Build/Intermediates.noindex
cd /Users/admin/builder/spi-builder-workspace/.swiftpm/xcode
builtin-create-build-directory /Users/admin/builder/spi-builder-workspace/.derivedData/Build/Intermediates.noindex
CreateBuildDirectory /Users/admin/builder/spi-builder-workspace/.derivedData/Build/Products/Debug-iphoneos
cd /Users/admin/builder/spi-builder-workspace/.swiftpm/xcode
builtin-create-build-directory /Users/admin/builder/spi-builder-workspace/.derivedData/Build/Products/Debug-iphoneos
CreateBuildDirectory /Users/admin/builder/spi-builder-workspace/.derivedData/Build/Intermediates.noindex/EagerLinkingTBDs/Debug-iphoneos
cd /Users/admin/builder/spi-builder-workspace/.swiftpm/xcode
builtin-create-build-directory /Users/admin/builder/spi-builder-workspace/.derivedData/Build/Intermediates.noindex/EagerLinkingTBDs/Debug-iphoneos
CreateBuildDirectory /Users/admin/builder/spi-builder-workspace/.derivedData/Build/Products/Debug-iphoneos/PackageFrameworks
cd /Users/admin/builder/spi-builder-workspace/.swiftpm/xcode
builtin-create-build-directory /Users/admin/builder/spi-builder-workspace/.derivedData/Build/Products/Debug-iphoneos/PackageFrameworks
WriteAuxiliaryFile /Users/admin/builder/spi-builder-workspace/.derivedData/Build/Intermediates.noindex/DynuREST.build/Debug-iphoneos/dynu.build/dynu.DependencyMetadataFileList (in target 'dynu' from project 'DynuREST')
cd /Users/admin/builder/spi-builder-workspace
write-file /Users/admin/builder/spi-builder-workspace/.derivedData/Build/Intermediates.noindex/DynuREST.build/Debug-iphoneos/dynu.build/dynu.DependencyMetadataFileList
WriteAuxiliaryFile /Users/admin/builder/spi-builder-workspace/.derivedData/Build/Intermediates.noindex/DynuREST.build/Debug-iphoneos/dynu.build/dynu.DependencyStaticMetadataFileList (in target 'dynu' from project 'DynuREST')
cd /Users/admin/builder/spi-builder-workspace
write-file /Users/admin/builder/spi-builder-workspace/.derivedData/Build/Intermediates.noindex/DynuREST.build/Debug-iphoneos/dynu.build/dynu.DependencyStaticMetadataFileList
WriteAuxiliaryFile /Users/admin/builder/spi-builder-workspace/.derivedData/Build/Intermediates.noindex/DynuREST.build/Debug-iphoneos/dynu.build/Objects-normal/arm64/dynu.LinkFileList (in target 'dynu' from project 'DynuREST')
cd /Users/admin/builder/spi-builder-workspace
write-file /Users/admin/builder/spi-builder-workspace/.derivedData/Build/Intermediates.noindex/DynuREST.build/Debug-iphoneos/dynu.build/Objects-normal/arm64/dynu.LinkFileList
WriteAuxiliaryFile /Users/admin/builder/spi-builder-workspace/.derivedData/Build/Intermediates.noindex/ShellOut.build/Debug-iphoneos/ShellOut.build/ShellOut.DependencyMetadataFileList (in target 'ShellOut' from project 'ShellOut')
cd /Users/admin/builder/spi-builder-workspace/.dependencies/checkouts/ShellOut
write-file /Users/admin/builder/spi-builder-workspace/.derivedData/Build/Intermediates.noindex/ShellOut.build/Debug-iphoneos/ShellOut.build/ShellOut.DependencyMetadataFileList
WriteAuxiliaryFile /Users/admin/builder/spi-builder-workspace/.derivedData/Build/Intermediates.noindex/ShellOut.build/Debug-iphoneos/ShellOut.build/ShellOut.DependencyStaticMetadataFileList (in target 'ShellOut' from project 'ShellOut')
cd /Users/admin/builder/spi-builder-workspace/.dependencies/checkouts/ShellOut
write-file /Users/admin/builder/spi-builder-workspace/.derivedData/Build/Intermediates.noindex/ShellOut.build/Debug-iphoneos/ShellOut.build/ShellOut.DependencyStaticMetadataFileList
WriteAuxiliaryFile /Users/admin/builder/spi-builder-workspace/.derivedData/Build/Intermediates.noindex/ShellOut.build/Debug-iphoneos/ShellOut.build/ShellOut.modulemap (in target 'ShellOut' from project 'ShellOut')
cd /Users/admin/builder/spi-builder-workspace/.dependencies/checkouts/ShellOut
write-file /Users/admin/builder/spi-builder-workspace/.derivedData/Build/Intermediates.noindex/ShellOut.build/Debug-iphoneos/ShellOut.build/ShellOut.modulemap
WriteAuxiliaryFile /Users/admin/builder/spi-builder-workspace/.derivedData/Build/Intermediates.noindex/DynuREST.build/Debug-iphoneos/dynu.build/Objects-normal/arm64/dynu-OutputFileMap.json (in target 'dynu' from project 'DynuREST')
cd /Users/admin/builder/spi-builder-workspace
write-file /Users/admin/builder/spi-builder-workspace/.derivedData/Build/Intermediates.noindex/DynuREST.build/Debug-iphoneos/dynu.build/Objects-normal/arm64/dynu-OutputFileMap.json
WriteAuxiliaryFile /Users/admin/builder/spi-builder-workspace/.derivedData/Build/Intermediates.noindex/DynuREST.build/Debug-iphoneos/dynu.build/Objects-normal/arm64/dynu.SwiftFileList (in target 'dynu' from project 'DynuREST')
cd /Users/admin/builder/spi-builder-workspace
write-file /Users/admin/builder/spi-builder-workspace/.derivedData/Build/Intermediates.noindex/DynuREST.build/Debug-iphoneos/dynu.build/Objects-normal/arm64/dynu.SwiftFileList
WriteAuxiliaryFile /Users/admin/builder/spi-builder-workspace/.derivedData/Build/Intermediates.noindex/DynuREST.build/Debug-iphoneos/dynu.build/Objects-normal/arm64/dynu_const_extract_protocols.json (in target 'dynu' from project 'DynuREST')
cd /Users/admin/builder/spi-builder-workspace
write-file /Users/admin/builder/spi-builder-workspace/.derivedData/Build/Intermediates.noindex/DynuREST.build/Debug-iphoneos/dynu.build/Objects-normal/arm64/dynu_const_extract_protocols.json
WriteAuxiliaryFile /Users/admin/builder/spi-builder-workspace/.derivedData/Build/Intermediates.noindex/ShellOut.build/Debug-iphoneos/ShellOut.build/Objects-normal/arm64/ShellOut_const_extract_protocols.json (in target 'ShellOut' from project 'ShellOut')
cd /Users/admin/builder/spi-builder-workspace/.dependencies/checkouts/ShellOut
write-file /Users/admin/builder/spi-builder-workspace/.derivedData/Build/Intermediates.noindex/ShellOut.build/Debug-iphoneos/ShellOut.build/Objects-normal/arm64/ShellOut_const_extract_protocols.json
WriteAuxiliaryFile /Users/admin/builder/spi-builder-workspace/.derivedData/Build/Intermediates.noindex/ShellOut.build/Debug-iphoneos/ShellOut.build/Objects-normal/arm64/ShellOut.SwiftFileList (in target 'ShellOut' from project 'ShellOut')
cd /Users/admin/builder/spi-builder-workspace/.dependencies/checkouts/ShellOut
write-file /Users/admin/builder/spi-builder-workspace/.derivedData/Build/Intermediates.noindex/ShellOut.build/Debug-iphoneos/ShellOut.build/Objects-normal/arm64/ShellOut.SwiftFileList
WriteAuxiliaryFile /Users/admin/builder/spi-builder-workspace/.derivedData/Build/Intermediates.noindex/ShellOut.build/Debug-iphoneos/ShellOut.build/Objects-normal/arm64/ShellOut.SwiftConstValuesFileList (in target 'ShellOut' from project 'ShellOut')
cd /Users/admin/builder/spi-builder-workspace/.dependencies/checkouts/ShellOut
write-file /Users/admin/builder/spi-builder-workspace/.derivedData/Build/Intermediates.noindex/ShellOut.build/Debug-iphoneos/ShellOut.build/Objects-normal/arm64/ShellOut.SwiftConstValuesFileList
WriteAuxiliaryFile /Users/admin/builder/spi-builder-workspace/.derivedData/Build/Intermediates.noindex/ShellOut.build/Debug-iphoneos/ShellOut.build/Objects-normal/arm64/ShellOut.LinkFileList (in target 'ShellOut' from project 'ShellOut')
cd /Users/admin/builder/spi-builder-workspace/.dependencies/checkouts/ShellOut
write-file /Users/admin/builder/spi-builder-workspace/.derivedData/Build/Intermediates.noindex/ShellOut.build/Debug-iphoneos/ShellOut.build/Objects-normal/arm64/ShellOut.LinkFileList
WriteAuxiliaryFile /Users/admin/builder/spi-builder-workspace/.derivedData/Build/Intermediates.noindex/ShellOut.build/Debug-iphoneos/ShellOut.build/Objects-normal/arm64/ShellOut-OutputFileMap.json (in target 'ShellOut' from project 'ShellOut')
cd /Users/admin/builder/spi-builder-workspace/.dependencies/checkouts/ShellOut
write-file /Users/admin/builder/spi-builder-workspace/.derivedData/Build/Intermediates.noindex/ShellOut.build/Debug-iphoneos/ShellOut.build/Objects-normal/arm64/ShellOut-OutputFileMap.json
WriteAuxiliaryFile /Users/admin/builder/spi-builder-workspace/.derivedData/Build/Intermediates.noindex/SessionPlus.build/Debug-iphoneos/SessionPlusEmulation.build/SessionPlusEmulation.DependencyMetadataFileList (in target 'SessionPlusEmulation' from project 'SessionPlus')
cd /Users/admin/builder/spi-builder-workspace/.dependencies/checkouts/SessionPlus
write-file /Users/admin/builder/spi-builder-workspace/.derivedData/Build/Intermediates.noindex/SessionPlus.build/Debug-iphoneos/SessionPlusEmulation.build/SessionPlusEmulation.DependencyMetadataFileList
WriteAuxiliaryFile /Users/admin/builder/spi-builder-workspace/.derivedData/Build/Intermediates.noindex/SessionPlus.build/Debug-iphoneos/SessionPlusEmulation.build/SessionPlusEmulation.modulemap (in target 'SessionPlusEmulation' from project 'SessionPlus')
cd /Users/admin/builder/spi-builder-workspace/.dependencies/checkouts/SessionPlus
write-file /Users/admin/builder/spi-builder-workspace/.derivedData/Build/Intermediates.noindex/SessionPlus.build/Debug-iphoneos/SessionPlusEmulation.build/SessionPlusEmulation.modulemap
WriteAuxiliaryFile /Users/admin/builder/spi-builder-workspace/.derivedData/Build/Intermediates.noindex/SessionPlus.build/Debug-iphoneos/SessionPlusEmulation.build/SessionPlusEmulation.DependencyStaticMetadataFileList (in target 'SessionPlusEmulation' from project 'SessionPlus')
cd /Users/admin/builder/spi-builder-workspace/.dependencies/checkouts/SessionPlus
write-file /Users/admin/builder/spi-builder-workspace/.derivedData/Build/Intermediates.noindex/SessionPlus.build/Debug-iphoneos/SessionPlusEmulation.build/SessionPlusEmulation.DependencyStaticMetadataFileList
Copy /Users/admin/builder/spi-builder-workspace/.derivedData/Build/Intermediates.noindex/GeneratedModuleMaps-iphoneos/ShellOut.modulemap /Users/admin/builder/spi-builder-workspace/.derivedData/Build/Intermediates.noindex/ShellOut.build/Debug-iphoneos/ShellOut.build/ShellOut.modulemap (in target 'ShellOut' from project 'ShellOut')
cd /Users/admin/builder/spi-builder-workspace/.dependencies/checkouts/ShellOut
builtin-copy -exclude .DS_Store -exclude CVS -exclude .svn -exclude .git -exclude .hg -resolve-src-symlinks /Users/admin/builder/spi-builder-workspace/.derivedData/Build/Intermediates.noindex/ShellOut.build/Debug-iphoneos/ShellOut.build/ShellOut.modulemap /Users/admin/builder/spi-builder-workspace/.derivedData/Build/Intermediates.noindex/GeneratedModuleMaps-iphoneos
WriteAuxiliaryFile /Users/admin/builder/spi-builder-workspace/.derivedData/Build/Intermediates.noindex/SessionPlus.build/Debug-iphoneos/SessionPlusEmulation.build/Objects-normal/arm64/SessionPlusEmulation_const_extract_protocols.json (in target 'SessionPlusEmulation' from project 'SessionPlus')
cd /Users/admin/builder/spi-builder-workspace/.dependencies/checkouts/SessionPlus
write-file /Users/admin/builder/spi-builder-workspace/.derivedData/Build/Intermediates.noindex/SessionPlus.build/Debug-iphoneos/SessionPlusEmulation.build/Objects-normal/arm64/SessionPlusEmulation_const_extract_protocols.json
WriteAuxiliaryFile /Users/admin/builder/spi-builder-workspace/.derivedData/Build/Intermediates.noindex/SessionPlus.build/Debug-iphoneos/SessionPlusEmulation.build/Objects-normal/arm64/SessionPlusEmulation.SwiftFileList (in target 'SessionPlusEmulation' from project 'SessionPlus')
cd /Users/admin/builder/spi-builder-workspace/.dependencies/checkouts/SessionPlus
write-file /Users/admin/builder/spi-builder-workspace/.derivedData/Build/Intermediates.noindex/SessionPlus.build/Debug-iphoneos/SessionPlusEmulation.build/Objects-normal/arm64/SessionPlusEmulation.SwiftFileList
WriteAuxiliaryFile /Users/admin/builder/spi-builder-workspace/.derivedData/Build/Intermediates.noindex/SessionPlus.build/Debug-iphoneos/SessionPlusEmulation.build/Objects-normal/arm64/SessionPlusEmulation.SwiftConstValuesFileList (in target 'SessionPlusEmulation' from project 'SessionPlus')
cd /Users/admin/builder/spi-builder-workspace/.dependencies/checkouts/SessionPlus
write-file /Users/admin/builder/spi-builder-workspace/.derivedData/Build/Intermediates.noindex/SessionPlus.build/Debug-iphoneos/SessionPlusEmulation.build/Objects-normal/arm64/SessionPlusEmulation.SwiftConstValuesFileList
WriteAuxiliaryFile /Users/admin/builder/spi-builder-workspace/.derivedData/Build/Intermediates.noindex/SessionPlus.build/Debug-iphoneos/SessionPlusEmulation.build/Objects-normal/arm64/SessionPlusEmulation.LinkFileList (in target 'SessionPlusEmulation' from project 'SessionPlus')
cd /Users/admin/builder/spi-builder-workspace/.dependencies/checkouts/SessionPlus
write-file /Users/admin/builder/spi-builder-workspace/.derivedData/Build/Intermediates.noindex/SessionPlus.build/Debug-iphoneos/SessionPlusEmulation.build/Objects-normal/arm64/SessionPlusEmulation.LinkFileList
WriteAuxiliaryFile /Users/admin/builder/spi-builder-workspace/.derivedData/Build/Intermediates.noindex/SessionPlus.build/Debug-iphoneos/SessionPlusEmulation.build/Objects-normal/arm64/SessionPlusEmulation-OutputFileMap.json (in target 'SessionPlusEmulation' from project 'SessionPlus')
cd /Users/admin/builder/spi-builder-workspace/.dependencies/checkouts/SessionPlus
write-file /Users/admin/builder/spi-builder-workspace/.derivedData/Build/Intermediates.noindex/SessionPlus.build/Debug-iphoneos/SessionPlusEmulation.build/Objects-normal/arm64/SessionPlusEmulation-OutputFileMap.json
WriteAuxiliaryFile /Users/admin/builder/spi-builder-workspace/.derivedData/Build/Intermediates.noindex/SessionPlus.build/Debug-iphoneos/SessionPlus.build/SessionPlus.modulemap (in target 'SessionPlus' from project 'SessionPlus')
cd /Users/admin/builder/spi-builder-workspace/.dependencies/checkouts/SessionPlus
write-file /Users/admin/builder/spi-builder-workspace/.derivedData/Build/Intermediates.noindex/SessionPlus.build/Debug-iphoneos/SessionPlus.build/SessionPlus.modulemap
WriteAuxiliaryFile /Users/admin/builder/spi-builder-workspace/.derivedData/Build/Intermediates.noindex/SessionPlus.build/Debug-iphoneos/SessionPlus.build/SessionPlus.DependencyStaticMetadataFileList (in target 'SessionPlus' from project 'SessionPlus')
cd /Users/admin/builder/spi-builder-workspace/.dependencies/checkouts/SessionPlus
write-file /Users/admin/builder/spi-builder-workspace/.derivedData/Build/Intermediates.noindex/SessionPlus.build/Debug-iphoneos/SessionPlus.build/SessionPlus.DependencyStaticMetadataFileList
WriteAuxiliaryFile /Users/admin/builder/spi-builder-workspace/.derivedData/Build/Intermediates.noindex/SessionPlus.build/Debug-iphoneos/SessionPlus.build/SessionPlus.DependencyMetadataFileList (in target 'SessionPlus' from project 'SessionPlus')
cd /Users/admin/builder/spi-builder-workspace/.dependencies/checkouts/SessionPlus
write-file /Users/admin/builder/spi-builder-workspace/.derivedData/Build/Intermediates.noindex/SessionPlus.build/Debug-iphoneos/SessionPlus.build/SessionPlus.DependencyMetadataFileList
Copy /Users/admin/builder/spi-builder-workspace/.derivedData/Build/Intermediates.noindex/GeneratedModuleMaps-iphoneos/SessionPlusEmulation.modulemap /Users/admin/builder/spi-builder-workspace/.derivedData/Build/Intermediates.noindex/SessionPlus.build/Debug-iphoneos/SessionPlusEmulation.build/SessionPlusEmulation.modulemap (in target 'SessionPlusEmulation' from project 'SessionPlus')
cd /Users/admin/builder/spi-builder-workspace/.dependencies/checkouts/SessionPlus
builtin-copy -exclude .DS_Store -exclude CVS -exclude .svn -exclude .git -exclude .hg -resolve-src-symlinks /Users/admin/builder/spi-builder-workspace/.derivedData/Build/Intermediates.noindex/SessionPlus.build/Debug-iphoneos/SessionPlusEmulation.build/SessionPlusEmulation.modulemap /Users/admin/builder/spi-builder-workspace/.derivedData/Build/Intermediates.noindex/GeneratedModuleMaps-iphoneos
WriteAuxiliaryFile /Users/admin/builder/spi-builder-workspace/.derivedData/Build/Intermediates.noindex/SessionPlus.build/Debug-iphoneos/SessionPlus.build/Objects-normal/arm64/SessionPlus_const_extract_protocols.json (in target 'SessionPlus' from project 'SessionPlus')
cd /Users/admin/builder/spi-builder-workspace/.dependencies/checkouts/SessionPlus
write-file /Users/admin/builder/spi-builder-workspace/.derivedData/Build/Intermediates.noindex/SessionPlus.build/Debug-iphoneos/SessionPlus.build/Objects-normal/arm64/SessionPlus_const_extract_protocols.json
WriteAuxiliaryFile /Users/admin/builder/spi-builder-workspace/.derivedData/Build/Intermediates.noindex/SessionPlus.build/Debug-iphoneos/SessionPlus.build/Objects-normal/arm64/SessionPlus.SwiftFileList (in target 'SessionPlus' from project 'SessionPlus')
cd /Users/admin/builder/spi-builder-workspace/.dependencies/checkouts/SessionPlus
write-file /Users/admin/builder/spi-builder-workspace/.derivedData/Build/Intermediates.noindex/SessionPlus.build/Debug-iphoneos/SessionPlus.build/Objects-normal/arm64/SessionPlus.SwiftFileList
WriteAuxiliaryFile /Users/admin/builder/spi-builder-workspace/.derivedData/Build/Intermediates.noindex/SessionPlus.build/Debug-iphoneos/SessionPlus.build/Objects-normal/arm64/SessionPlus.SwiftConstValuesFileList (in target 'SessionPlus' from project 'SessionPlus')
cd /Users/admin/builder/spi-builder-workspace/.dependencies/checkouts/SessionPlus
write-file /Users/admin/builder/spi-builder-workspace/.derivedData/Build/Intermediates.noindex/SessionPlus.build/Debug-iphoneos/SessionPlus.build/Objects-normal/arm64/SessionPlus.SwiftConstValuesFileList
WriteAuxiliaryFile /Users/admin/builder/spi-builder-workspace/.derivedData/Build/Intermediates.noindex/SessionPlus.build/Debug-iphoneos/SessionPlus.build/Objects-normal/arm64/SessionPlus.LinkFileList (in target 'SessionPlus' from project 'SessionPlus')
cd /Users/admin/builder/spi-builder-workspace/.dependencies/checkouts/SessionPlus
write-file /Users/admin/builder/spi-builder-workspace/.derivedData/Build/Intermediates.noindex/SessionPlus.build/Debug-iphoneos/SessionPlus.build/Objects-normal/arm64/SessionPlus.LinkFileList
WriteAuxiliaryFile /Users/admin/builder/spi-builder-workspace/.derivedData/Build/Intermediates.noindex/SessionPlus.build/Debug-iphoneos/SessionPlus.build/Objects-normal/arm64/SessionPlus-OutputFileMap.json (in target 'SessionPlus' from project 'SessionPlus')
cd /Users/admin/builder/spi-builder-workspace/.dependencies/checkouts/SessionPlus
write-file /Users/admin/builder/spi-builder-workspace/.derivedData/Build/Intermediates.noindex/SessionPlus.build/Debug-iphoneos/SessionPlus.build/Objects-normal/arm64/SessionPlus-OutputFileMap.json
WriteAuxiliaryFile /Users/admin/builder/spi-builder-workspace/.derivedData/Build/Intermediates.noindex/DynuREST.build/Debug-iphoneos/DynuREST.build/Objects-normal/arm64/DynuREST_const_extract_protocols.json (in target 'DynuREST' from project 'DynuREST')
cd /Users/admin/builder/spi-builder-workspace
write-file /Users/admin/builder/spi-builder-workspace/.derivedData/Build/Intermediates.noindex/DynuREST.build/Debug-iphoneos/DynuREST.build/Objects-normal/arm64/DynuREST_const_extract_protocols.json
Copy /Users/admin/builder/spi-builder-workspace/.derivedData/Build/Intermediates.noindex/GeneratedModuleMaps-iphoneos/SessionPlus.modulemap /Users/admin/builder/spi-builder-workspace/.derivedData/Build/Intermediates.noindex/SessionPlus.build/Debug-iphoneos/SessionPlus.build/SessionPlus.modulemap (in target 'SessionPlus' from project 'SessionPlus')
cd /Users/admin/builder/spi-builder-workspace/.dependencies/checkouts/SessionPlus
builtin-copy -exclude .DS_Store -exclude CVS -exclude .svn -exclude .git -exclude .hg -resolve-src-symlinks /Users/admin/builder/spi-builder-workspace/.derivedData/Build/Intermediates.noindex/SessionPlus.build/Debug-iphoneos/SessionPlus.build/SessionPlus.modulemap /Users/admin/builder/spi-builder-workspace/.derivedData/Build/Intermediates.noindex/GeneratedModuleMaps-iphoneos
WriteAuxiliaryFile /Users/admin/builder/spi-builder-workspace/.derivedData/Build/Intermediates.noindex/DynuREST.build/Debug-iphoneos/DynuREST.build/Objects-normal/arm64/DynuREST.SwiftFileList (in target 'DynuREST' from project 'DynuREST')
cd /Users/admin/builder/spi-builder-workspace
write-file /Users/admin/builder/spi-builder-workspace/.derivedData/Build/Intermediates.noindex/DynuREST.build/Debug-iphoneos/DynuREST.build/Objects-normal/arm64/DynuREST.SwiftFileList
WriteAuxiliaryFile /Users/admin/builder/spi-builder-workspace/.derivedData/Build/Intermediates.noindex/DynuREST.build/Debug-iphoneos/DynuREST.build/Objects-normal/arm64/DynuREST.SwiftConstValuesFileList (in target 'DynuREST' from project 'DynuREST')
cd /Users/admin/builder/spi-builder-workspace
write-file /Users/admin/builder/spi-builder-workspace/.derivedData/Build/Intermediates.noindex/DynuREST.build/Debug-iphoneos/DynuREST.build/Objects-normal/arm64/DynuREST.SwiftConstValuesFileList
WriteAuxiliaryFile /Users/admin/builder/spi-builder-workspace/.derivedData/Build/Intermediates.noindex/DynuREST.build/Debug-iphoneos/DynuREST.build/Objects-normal/arm64/DynuREST.LinkFileList (in target 'DynuREST' from project 'DynuREST')
cd /Users/admin/builder/spi-builder-workspace
write-file /Users/admin/builder/spi-builder-workspace/.derivedData/Build/Intermediates.noindex/DynuREST.build/Debug-iphoneos/DynuREST.build/Objects-normal/arm64/DynuREST.LinkFileList
WriteAuxiliaryFile /Users/admin/builder/spi-builder-workspace/.derivedData/Build/Intermediates.noindex/DynuREST.build/Debug-iphoneos/DynuREST.build/Objects-normal/arm64/DynuREST-OutputFileMap.json (in target 'DynuREST' from project 'DynuREST')
cd /Users/admin/builder/spi-builder-workspace
write-file /Users/admin/builder/spi-builder-workspace/.derivedData/Build/Intermediates.noindex/DynuREST.build/Debug-iphoneos/DynuREST.build/Objects-normal/arm64/DynuREST-OutputFileMap.json
WriteAuxiliaryFile /Users/admin/builder/spi-builder-workspace/.derivedData/Build/Intermediates.noindex/DynuREST.build/Debug-iphoneos/DynuREST.build/DynuREST.modulemap (in target 'DynuREST' from project 'DynuREST')
cd /Users/admin/builder/spi-builder-workspace
write-file /Users/admin/builder/spi-builder-workspace/.derivedData/Build/Intermediates.noindex/DynuREST.build/Debug-iphoneos/DynuREST.build/DynuREST.modulemap
WriteAuxiliaryFile /Users/admin/builder/spi-builder-workspace/.derivedData/Build/Intermediates.noindex/DynuREST.build/Debug-iphoneos/DynuREST.build/DynuREST.DependencyStaticMetadataFileList (in target 'DynuREST' from project 'DynuREST')
cd /Users/admin/builder/spi-builder-workspace
write-file /Users/admin/builder/spi-builder-workspace/.derivedData/Build/Intermediates.noindex/DynuREST.build/Debug-iphoneos/DynuREST.build/DynuREST.DependencyStaticMetadataFileList
WriteAuxiliaryFile /Users/admin/builder/spi-builder-workspace/.derivedData/Build/Intermediates.noindex/DynuREST.build/Debug-iphoneos/DynuREST.build/DynuREST.DependencyMetadataFileList (in target 'DynuREST' from project 'DynuREST')
cd /Users/admin/builder/spi-builder-workspace
write-file /Users/admin/builder/spi-builder-workspace/.derivedData/Build/Intermediates.noindex/DynuREST.build/Debug-iphoneos/DynuREST.build/DynuREST.DependencyMetadataFileList
WriteAuxiliaryFile /Users/admin/builder/spi-builder-workspace/.derivedData/Build/Intermediates.noindex/AsyncPlus.build/Debug-iphoneos/AsyncPlus.build/Objects-normal/arm64/AsyncPlus_const_extract_protocols.json (in target 'AsyncPlus' from project 'AsyncPlus')
cd /Users/admin/builder/spi-builder-workspace/.dependencies/checkouts/AsyncPlus
write-file /Users/admin/builder/spi-builder-workspace/.derivedData/Build/Intermediates.noindex/AsyncPlus.build/Debug-iphoneos/AsyncPlus.build/Objects-normal/arm64/AsyncPlus_const_extract_protocols.json
WriteAuxiliaryFile /Users/admin/builder/spi-builder-workspace/.derivedData/Build/Intermediates.noindex/AsyncPlus.build/Debug-iphoneos/AsyncPlus.build/Objects-normal/arm64/AsyncPlus.SwiftFileList (in target 'AsyncPlus' from project 'AsyncPlus')
cd /Users/admin/builder/spi-builder-workspace/.dependencies/checkouts/AsyncPlus
write-file /Users/admin/builder/spi-builder-workspace/.derivedData/Build/Intermediates.noindex/AsyncPlus.build/Debug-iphoneos/AsyncPlus.build/Objects-normal/arm64/AsyncPlus.SwiftFileList
WriteAuxiliaryFile /Users/admin/builder/spi-builder-workspace/.derivedData/Build/Intermediates.noindex/AsyncPlus.build/Debug-iphoneos/AsyncPlus.build/Objects-normal/arm64/AsyncPlus.SwiftConstValuesFileList (in target 'AsyncPlus' from project 'AsyncPlus')
cd /Users/admin/builder/spi-builder-workspace/.dependencies/checkouts/AsyncPlus
write-file /Users/admin/builder/spi-builder-workspace/.derivedData/Build/Intermediates.noindex/AsyncPlus.build/Debug-iphoneos/AsyncPlus.build/Objects-normal/arm64/AsyncPlus.SwiftConstValuesFileList
WriteAuxiliaryFile /Users/admin/builder/spi-builder-workspace/.derivedData/Build/Intermediates.noindex/AsyncPlus.build/Debug-iphoneos/AsyncPlus.build/Objects-normal/arm64/AsyncPlus.LinkFileList (in target 'AsyncPlus' from project 'AsyncPlus')
cd /Users/admin/builder/spi-builder-workspace/.dependencies/checkouts/AsyncPlus
write-file /Users/admin/builder/spi-builder-workspace/.derivedData/Build/Intermediates.noindex/AsyncPlus.build/Debug-iphoneos/AsyncPlus.build/Objects-normal/arm64/AsyncPlus.LinkFileList
WriteAuxiliaryFile /Users/admin/builder/spi-builder-workspace/.derivedData/Build/Intermediates.noindex/AsyncPlus.build/Debug-iphoneos/AsyncPlus.build/Objects-normal/arm64/AsyncPlus-OutputFileMap.json (in target 'AsyncPlus' from project 'AsyncPlus')
cd /Users/admin/builder/spi-builder-workspace/.dependencies/checkouts/AsyncPlus
write-file /Users/admin/builder/spi-builder-workspace/.derivedData/Build/Intermediates.noindex/AsyncPlus.build/Debug-iphoneos/AsyncPlus.build/Objects-normal/arm64/AsyncPlus-OutputFileMap.json
WriteAuxiliaryFile /Users/admin/builder/spi-builder-workspace/.derivedData/Build/Intermediates.noindex/AsyncPlus.build/Debug-iphoneos/AsyncPlus.build/AsyncPlus.modulemap (in target 'AsyncPlus' from project 'AsyncPlus')
cd /Users/admin/builder/spi-builder-workspace/.dependencies/checkouts/AsyncPlus
write-file /Users/admin/builder/spi-builder-workspace/.derivedData/Build/Intermediates.noindex/AsyncPlus.build/Debug-iphoneos/AsyncPlus.build/AsyncPlus.modulemap
WriteAuxiliaryFile /Users/admin/builder/spi-builder-workspace/.derivedData/Build/Intermediates.noindex/AsyncPlus.build/Debug-iphoneos/AsyncPlus.build/AsyncPlus.DependencyStaticMetadataFileList (in target 'AsyncPlus' from project 'AsyncPlus')
cd /Users/admin/builder/spi-builder-workspace/.dependencies/checkouts/AsyncPlus
write-file /Users/admin/builder/spi-builder-workspace/.derivedData/Build/Intermediates.noindex/AsyncPlus.build/Debug-iphoneos/AsyncPlus.build/AsyncPlus.DependencyStaticMetadataFileList
Copy /Users/admin/builder/spi-builder-workspace/.derivedData/Build/Intermediates.noindex/GeneratedModuleMaps-iphoneos/DynuREST.modulemap /Users/admin/builder/spi-builder-workspace/.derivedData/Build/Intermediates.noindex/DynuREST.build/Debug-iphoneos/DynuREST.build/DynuREST.modulemap (in target 'DynuREST' from project 'DynuREST')
cd /Users/admin/builder/spi-builder-workspace
builtin-copy -exclude .DS_Store -exclude CVS -exclude .svn -exclude .git -exclude .hg -resolve-src-symlinks /Users/admin/builder/spi-builder-workspace/.derivedData/Build/Intermediates.noindex/DynuREST.build/Debug-iphoneos/DynuREST.build/DynuREST.modulemap /Users/admin/builder/spi-builder-workspace/.derivedData/Build/Intermediates.noindex/GeneratedModuleMaps-iphoneos
WriteAuxiliaryFile /Users/admin/builder/spi-builder-workspace/.derivedData/Build/Intermediates.noindex/AsyncPlus.build/Debug-iphoneos/AsyncPlus.build/AsyncPlus.DependencyMetadataFileList (in target 'AsyncPlus' from project 'AsyncPlus')
cd /Users/admin/builder/spi-builder-workspace/.dependencies/checkouts/AsyncPlus
write-file /Users/admin/builder/spi-builder-workspace/.derivedData/Build/Intermediates.noindex/AsyncPlus.build/Debug-iphoneos/AsyncPlus.build/AsyncPlus.DependencyMetadataFileList
WriteAuxiliaryFile /Users/admin/builder/spi-builder-workspace/.derivedData/Build/Intermediates.noindex/swift-argument-parser.build/Debug-iphoneos/ArgumentParserToolInfo.build/Objects-normal/arm64/ArgumentParserToolInfo_const_extract_protocols.json (in target 'ArgumentParserToolInfo' from project 'swift-argument-parser')
cd /Users/admin/builder/spi-builder-workspace/.dependencies/checkouts/swift-argument-parser
write-file /Users/admin/builder/spi-builder-workspace/.derivedData/Build/Intermediates.noindex/swift-argument-parser.build/Debug-iphoneos/ArgumentParserToolInfo.build/Objects-normal/arm64/ArgumentParserToolInfo_const_extract_protocols.json
WriteAuxiliaryFile /Users/admin/builder/spi-builder-workspace/.derivedData/Build/Intermediates.noindex/swift-argument-parser.build/Debug-iphoneos/ArgumentParserToolInfo.build/Objects-normal/arm64/ArgumentParserToolInfo.SwiftFileList (in target 'ArgumentParserToolInfo' from project 'swift-argument-parser')
cd /Users/admin/builder/spi-builder-workspace/.dependencies/checkouts/swift-argument-parser
write-file /Users/admin/builder/spi-builder-workspace/.derivedData/Build/Intermediates.noindex/swift-argument-parser.build/Debug-iphoneos/ArgumentParserToolInfo.build/Objects-normal/arm64/ArgumentParserToolInfo.SwiftFileList
WriteAuxiliaryFile /Users/admin/builder/spi-builder-workspace/.derivedData/Build/Intermediates.noindex/swift-argument-parser.build/Debug-iphoneos/ArgumentParserToolInfo.build/Objects-normal/arm64/ArgumentParserToolInfo.SwiftConstValuesFileList (in target 'ArgumentParserToolInfo' from project 'swift-argument-parser')
cd /Users/admin/builder/spi-builder-workspace/.dependencies/checkouts/swift-argument-parser
write-file /Users/admin/builder/spi-builder-workspace/.derivedData/Build/Intermediates.noindex/swift-argument-parser.build/Debug-iphoneos/ArgumentParserToolInfo.build/Objects-normal/arm64/ArgumentParserToolInfo.SwiftConstValuesFileList
WriteAuxiliaryFile /Users/admin/builder/spi-builder-workspace/.derivedData/Build/Intermediates.noindex/swift-argument-parser.build/Debug-iphoneos/ArgumentParserToolInfo.build/Objects-normal/arm64/ArgumentParserToolInfo.LinkFileList (in target 'ArgumentParserToolInfo' from project 'swift-argument-parser')
cd /Users/admin/builder/spi-builder-workspace/.dependencies/checkouts/swift-argument-parser
write-file /Users/admin/builder/spi-builder-workspace/.derivedData/Build/Intermediates.noindex/swift-argument-parser.build/Debug-iphoneos/ArgumentParserToolInfo.build/Objects-normal/arm64/ArgumentParserToolInfo.LinkFileList
WriteAuxiliaryFile /Users/admin/builder/spi-builder-workspace/.derivedData/Build/Intermediates.noindex/swift-argument-parser.build/Debug-iphoneos/ArgumentParserToolInfo.build/Objects-normal/arm64/ArgumentParserToolInfo-OutputFileMap.json (in target 'ArgumentParserToolInfo' from project 'swift-argument-parser')
cd /Users/admin/builder/spi-builder-workspace/.dependencies/checkouts/swift-argument-parser
write-file /Users/admin/builder/spi-builder-workspace/.derivedData/Build/Intermediates.noindex/swift-argument-parser.build/Debug-iphoneos/ArgumentParserToolInfo.build/Objects-normal/arm64/ArgumentParserToolInfo-OutputFileMap.json
WriteAuxiliaryFile /Users/admin/builder/spi-builder-workspace/.derivedData/Build/Intermediates.noindex/swift-argument-parser.build/Debug-iphoneos/ArgumentParserToolInfo.build/ArgumentParserToolInfo.modulemap (in target 'ArgumentParserToolInfo' from project 'swift-argument-parser')
cd /Users/admin/builder/spi-builder-workspace/.dependencies/checkouts/swift-argument-parser
write-file /Users/admin/builder/spi-builder-workspace/.derivedData/Build/Intermediates.noindex/swift-argument-parser.build/Debug-iphoneos/ArgumentParserToolInfo.build/ArgumentParserToolInfo.modulemap
Copy /Users/admin/builder/spi-builder-workspace/.derivedData/Build/Intermediates.noindex/GeneratedModuleMaps-iphoneos/AsyncPlus.modulemap /Users/admin/builder/spi-builder-workspace/.derivedData/Build/Intermediates.noindex/AsyncPlus.build/Debug-iphoneos/AsyncPlus.build/AsyncPlus.modulemap (in target 'AsyncPlus' from project 'AsyncPlus')
cd /Users/admin/builder/spi-builder-workspace/.dependencies/checkouts/AsyncPlus
builtin-copy -exclude .DS_Store -exclude CVS -exclude .svn -exclude .git -exclude .hg -resolve-src-symlinks /Users/admin/builder/spi-builder-workspace/.derivedData/Build/Intermediates.noindex/AsyncPlus.build/Debug-iphoneos/AsyncPlus.build/AsyncPlus.modulemap /Users/admin/builder/spi-builder-workspace/.derivedData/Build/Intermediates.noindex/GeneratedModuleMaps-iphoneos
WriteAuxiliaryFile /Users/admin/builder/spi-builder-workspace/.derivedData/Build/Intermediates.noindex/swift-argument-parser.build/Debug-iphoneos/ArgumentParserToolInfo.build/ArgumentParserToolInfo.DependencyStaticMetadataFileList (in target 'ArgumentParserToolInfo' from project 'swift-argument-parser')
cd /Users/admin/builder/spi-builder-workspace/.dependencies/checkouts/swift-argument-parser
write-file /Users/admin/builder/spi-builder-workspace/.derivedData/Build/Intermediates.noindex/swift-argument-parser.build/Debug-iphoneos/ArgumentParserToolInfo.build/ArgumentParserToolInfo.DependencyStaticMetadataFileList
WriteAuxiliaryFile /Users/admin/builder/spi-builder-workspace/.derivedData/Build/Intermediates.noindex/swift-argument-parser.build/Debug-iphoneos/ArgumentParserToolInfo.build/ArgumentParserToolInfo.DependencyMetadataFileList (in target 'ArgumentParserToolInfo' from project 'swift-argument-parser')
cd /Users/admin/builder/spi-builder-workspace/.dependencies/checkouts/swift-argument-parser
write-file /Users/admin/builder/spi-builder-workspace/.derivedData/Build/Intermediates.noindex/swift-argument-parser.build/Debug-iphoneos/ArgumentParserToolInfo.build/ArgumentParserToolInfo.DependencyMetadataFileList
WriteAuxiliaryFile /Users/admin/builder/spi-builder-workspace/.derivedData/Build/Intermediates.noindex/swift-argument-parser.build/Debug-iphoneos/ArgumentParser.build/Objects-normal/arm64/ArgumentParser.SwiftFileList (in target 'ArgumentParser' from project 'swift-argument-parser')
cd /Users/admin/builder/spi-builder-workspace/.dependencies/checkouts/swift-argument-parser
write-file /Users/admin/builder/spi-builder-workspace/.derivedData/Build/Intermediates.noindex/swift-argument-parser.build/Debug-iphoneos/ArgumentParser.build/Objects-normal/arm64/ArgumentParser.SwiftFileList
WriteAuxiliaryFile /Users/admin/builder/spi-builder-workspace/.derivedData/Build/Intermediates.noindex/swift-argument-parser.build/Debug-iphoneos/ArgumentParser.build/Objects-normal/arm64/ArgumentParser_const_extract_protocols.json (in target 'ArgumentParser' from project 'swift-argument-parser')
cd /Users/admin/builder/spi-builder-workspace/.dependencies/checkouts/swift-argument-parser
write-file /Users/admin/builder/spi-builder-workspace/.derivedData/Build/Intermediates.noindex/swift-argument-parser.build/Debug-iphoneos/ArgumentParser.build/Objects-normal/arm64/ArgumentParser_const_extract_protocols.json
WriteAuxiliaryFile /Users/admin/builder/spi-builder-workspace/.derivedData/Build/Intermediates.noindex/swift-argument-parser.build/Debug-iphoneos/ArgumentParser.build/Objects-normal/arm64/ArgumentParser.SwiftConstValuesFileList (in target 'ArgumentParser' from project 'swift-argument-parser')
cd /Users/admin/builder/spi-builder-workspace/.dependencies/checkouts/swift-argument-parser
write-file /Users/admin/builder/spi-builder-workspace/.derivedData/Build/Intermediates.noindex/swift-argument-parser.build/Debug-iphoneos/ArgumentParser.build/Objects-normal/arm64/ArgumentParser.SwiftConstValuesFileList
WriteAuxiliaryFile /Users/admin/builder/spi-builder-workspace/.derivedData/Build/Intermediates.noindex/swift-argument-parser.build/Debug-iphoneos/ArgumentParser.build/Objects-normal/arm64/ArgumentParser.LinkFileList (in target 'ArgumentParser' from project 'swift-argument-parser')
cd /Users/admin/builder/spi-builder-workspace/.dependencies/checkouts/swift-argument-parser
write-file /Users/admin/builder/spi-builder-workspace/.derivedData/Build/Intermediates.noindex/swift-argument-parser.build/Debug-iphoneos/ArgumentParser.build/Objects-normal/arm64/ArgumentParser.LinkFileList
WriteAuxiliaryFile /Users/admin/builder/spi-builder-workspace/.derivedData/Build/Intermediates.noindex/swift-argument-parser.build/Debug-iphoneos/ArgumentParser.build/Objects-normal/arm64/ArgumentParser-OutputFileMap.json (in target 'ArgumentParser' from project 'swift-argument-parser')
cd /Users/admin/builder/spi-builder-workspace/.dependencies/checkouts/swift-argument-parser
write-file /Users/admin/builder/spi-builder-workspace/.derivedData/Build/Intermediates.noindex/swift-argument-parser.build/Debug-iphoneos/ArgumentParser.build/Objects-normal/arm64/ArgumentParser-OutputFileMap.json
WriteAuxiliaryFile /Users/admin/builder/spi-builder-workspace/.derivedData/Build/Intermediates.noindex/swift-argument-parser.build/Debug-iphoneos/ArgumentParser.build/ArgumentParser.modulemap (in target 'ArgumentParser' from project 'swift-argument-parser')
cd /Users/admin/builder/spi-builder-workspace/.dependencies/checkouts/swift-argument-parser
write-file /Users/admin/builder/spi-builder-workspace/.derivedData/Build/Intermediates.noindex/swift-argument-parser.build/Debug-iphoneos/ArgumentParser.build/ArgumentParser.modulemap
Copy /Users/admin/builder/spi-builder-workspace/.derivedData/Build/Intermediates.noindex/GeneratedModuleMaps-iphoneos/ArgumentParserToolInfo.modulemap /Users/admin/builder/spi-builder-workspace/.derivedData/Build/Intermediates.noindex/swift-argument-parser.build/Debug-iphoneos/ArgumentParserToolInfo.build/ArgumentParserToolInfo.modulemap (in target 'ArgumentParserToolInfo' from project 'swift-argument-parser')
cd /Users/admin/builder/spi-builder-workspace/.dependencies/checkouts/swift-argument-parser
builtin-copy -exclude .DS_Store -exclude CVS -exclude .svn -exclude .git -exclude .hg -resolve-src-symlinks /Users/admin/builder/spi-builder-workspace/.derivedData/Build/Intermediates.noindex/swift-argument-parser.build/Debug-iphoneos/ArgumentParserToolInfo.build/ArgumentParserToolInfo.modulemap /Users/admin/builder/spi-builder-workspace/.derivedData/Build/Intermediates.noindex/GeneratedModuleMaps-iphoneos
WriteAuxiliaryFile /Users/admin/builder/spi-builder-workspace/.derivedData/Build/Intermediates.noindex/swift-argument-parser.build/Debug-iphoneos/ArgumentParser.build/ArgumentParser.DependencyStaticMetadataFileList (in target 'ArgumentParser' from project 'swift-argument-parser')
cd /Users/admin/builder/spi-builder-workspace/.dependencies/checkouts/swift-argument-parser
write-file /Users/admin/builder/spi-builder-workspace/.derivedData/Build/Intermediates.noindex/swift-argument-parser.build/Debug-iphoneos/ArgumentParser.build/ArgumentParser.DependencyStaticMetadataFileList
WriteAuxiliaryFile /Users/admin/builder/spi-builder-workspace/.derivedData/Build/Intermediates.noindex/swift-argument-parser.build/Debug-iphoneos/ArgumentParser.build/ArgumentParser.DependencyMetadataFileList (in target 'ArgumentParser' from project 'swift-argument-parser')
cd /Users/admin/builder/spi-builder-workspace/.dependencies/checkouts/swift-argument-parser
write-file /Users/admin/builder/spi-builder-workspace/.derivedData/Build/Intermediates.noindex/swift-argument-parser.build/Debug-iphoneos/ArgumentParser.build/ArgumentParser.DependencyMetadataFileList
Copy /Users/admin/builder/spi-builder-workspace/.derivedData/Build/Intermediates.noindex/GeneratedModuleMaps-iphoneos/ArgumentParser.modulemap /Users/admin/builder/spi-builder-workspace/.derivedData/Build/Intermediates.noindex/swift-argument-parser.build/Debug-iphoneos/ArgumentParser.build/ArgumentParser.modulemap (in target 'ArgumentParser' from project 'swift-argument-parser')
cd /Users/admin/builder/spi-builder-workspace/.dependencies/checkouts/swift-argument-parser
builtin-copy -exclude .DS_Store -exclude CVS -exclude .svn -exclude .git -exclude .hg -resolve-src-symlinks /Users/admin/builder/spi-builder-workspace/.derivedData/Build/Intermediates.noindex/swift-argument-parser.build/Debug-iphoneos/ArgumentParser.build/ArgumentParser.modulemap /Users/admin/builder/spi-builder-workspace/.derivedData/Build/Intermediates.noindex/GeneratedModuleMaps-iphoneos
SwiftDriver AsyncPlus normal arm64 com.apple.xcode.tools.swift.compiler (in target 'AsyncPlus' from project 'AsyncPlus')
cd /Users/admin/builder/spi-builder-workspace/.swiftpm/xcode
builtin-SwiftDriver -- /Applications/Xcode-16.3.0.app/Contents/Developer/Toolchains/XcodeDefault.xctoolchain/usr/bin/swiftc -module-name AsyncPlus -Onone -enforce-exclusivity\=checked @/Users/admin/builder/spi-builder-workspace/.derivedData/Build/Intermediates.noindex/AsyncPlus.build/Debug-iphoneos/AsyncPlus.build/Objects-normal/arm64/AsyncPlus.SwiftFileList -DSWIFT_PACKAGE -DDEBUG -stats-output-dir .stats -strict-concurrency\=complete -enable-upcoming-feature StrictConcurrency -enable-upcoming-feature DisableOutwardActorInference -enable-upcoming-feature GlobalActorIsolatedTypesUsability -enable-upcoming-feature InferSendableFromCaptures -plugin-path /Applications/Xcode-16.3.0.app/Contents/Developer/Toolchains/XcodeDefault.xctoolchain/usr/lib/swift/host/plugins/testing -enable-experimental-feature DebugDescriptionMacro -sdk /Applications/Xcode-16.3.0.app/Contents/Developer/Platforms/iPhoneOS.platform/Developer/SDKs/iPhoneOS18.4.sdk -target arm64-apple-ios15.0 -g -module-cache-path /Users/admin/builder/spi-builder-workspace/.derivedData/ModuleCache.noindex -Xfrontend -serialize-debugging-options -profile-coverage-mapping -profile-generate -enable-testing -suppress-warnings -index-store-path /Users/admin/builder/spi-builder-workspace/.derivedData/Index.noindex/DataStore -swift-version 5 -I /Users/admin/builder/spi-builder-workspace/.derivedData/Build/Products/Debug-iphoneos -I /Applications/Xcode-16.3.0.app/Contents/Developer/Platforms/iPhoneOS.platform/Developer/usr/lib -F /Users/admin/builder/spi-builder-workspace/.derivedData/Build/Products/Debug-iphoneos -F /Applications/Xcode-16.3.0.app/Contents/Developer/Platforms/iPhoneOS.platform/Developer/Library/Frameworks -F /Applications/Xcode-16.3.0.app/Contents/Developer/Platforms/iPhoneOS.platform/Developer/SDKs/iPhoneOS18.4.sdk/Developer/Library/Frameworks -c -j10 -enable-batch-mode -incremental -Xcc -ivfsstatcache -Xcc /Users/admin/builder/spi-builder-workspace/.derivedData/SDKStatCaches.noindex/iphoneos18.4-22E235-339d34bc69d7fc736c3220795c36f340.sdkstatcache -output-file-map /Users/admin/builder/spi-builder-workspace/.derivedData/Build/Intermediates.noindex/AsyncPlus.build/Debug-iphoneos/AsyncPlus.build/Objects-normal/arm64/AsyncPlus-OutputFileMap.json -use-frontend-parseable-output -save-temps -no-color-diagnostics -serialize-diagnostics -emit-dependencies -emit-module -emit-module-path /Users/admin/builder/spi-builder-workspace/.derivedData/Build/Intermediates.noindex/AsyncPlus.build/Debug-iphoneos/AsyncPlus.build/Objects-normal/arm64/AsyncPlus.swiftmodule -validate-clang-modules-once -clang-build-session-file /Users/admin/builder/spi-builder-workspace/.derivedData/ModuleCache.noindex/Session.modulevalidation -Xcc -I/Users/admin/builder/spi-builder-workspace/.derivedData/Build/Intermediates.noindex/AsyncPlus.build/Debug-iphoneos/AsyncPlus.build/swift-overrides.hmap -emit-const-values -Xfrontend -const-gather-protocols-file -Xfrontend /Users/admin/builder/spi-builder-workspace/.derivedData/Build/Intermediates.noindex/AsyncPlus.build/Debug-iphoneos/AsyncPlus.build/Objects-normal/arm64/AsyncPlus_const_extract_protocols.json -Xcc -I/Users/admin/builder/spi-builder-workspace/.derivedData/Build/Products/Debug-iphoneos/include -Xcc -I/Users/admin/builder/spi-builder-workspace/.derivedData/Build/Intermediates.noindex/AsyncPlus.build/Debug-iphoneos/AsyncPlus.build/DerivedSources-normal/arm64 -Xcc -I/Users/admin/builder/spi-builder-workspace/.derivedData/Build/Intermediates.noindex/AsyncPlus.build/Debug-iphoneos/AsyncPlus.build/DerivedSources/arm64 -Xcc -I/Users/admin/builder/spi-builder-workspace/.derivedData/Build/Intermediates.noindex/AsyncPlus.build/Debug-iphoneos/AsyncPlus.build/DerivedSources -Xcc -DSWIFT_PACKAGE -Xcc -DDEBUG\=1 -emit-objc-header -emit-objc-header-path /Users/admin/builder/spi-builder-workspace/.derivedData/Build/Intermediates.noindex/AsyncPlus.build/Debug-iphoneos/AsyncPlus.build/Objects-normal/arm64/AsyncPlus-Swift.h -working-directory /Users/admin/builder/spi-builder-workspace/.swiftpm/xcode -experimental-emit-module-separately -disable-cmo
SwiftDriver ShellOut normal arm64 com.apple.xcode.tools.swift.compiler (in target 'ShellOut' from project 'ShellOut')
cd /Users/admin/builder/spi-builder-workspace/.swiftpm/xcode
builtin-SwiftDriver -- /Applications/Xcode-16.3.0.app/Contents/Developer/Toolchains/XcodeDefault.xctoolchain/usr/bin/swiftc -module-name ShellOut -Onone -enforce-exclusivity\=checked @/Users/admin/builder/spi-builder-workspace/.derivedData/Build/Intermediates.noindex/ShellOut.build/Debug-iphoneos/ShellOut.build/Objects-normal/arm64/ShellOut.SwiftFileList -DSWIFT_PACKAGE -DDEBUG -stats-output-dir .stats -strict-concurrency\=complete -enable-upcoming-feature StrictConcurrency -enable-upcoming-feature DisableOutwardActorInference -enable-upcoming-feature GlobalActorIsolatedTypesUsability -enable-upcoming-feature InferSendableFromCaptures -plugin-path /Applications/Xcode-16.3.0.app/Contents/Developer/Toolchains/XcodeDefault.xctoolchain/usr/lib/swift/host/plugins/testing -enable-experimental-feature DebugDescriptionMacro -sdk /Applications/Xcode-16.3.0.app/Contents/Developer/Platforms/iPhoneOS.platform/Developer/SDKs/iPhoneOS18.4.sdk -target arm64-apple-ios12.0 -g -module-cache-path /Users/admin/builder/spi-builder-workspace/.derivedData/ModuleCache.noindex -Xfrontend -serialize-debugging-options -profile-coverage-mapping -profile-generate -enable-testing -suppress-warnings -index-store-path /Users/admin/builder/spi-builder-workspace/.derivedData/Index.noindex/DataStore -swift-version 4.2 -I /Users/admin/builder/spi-builder-workspace/.derivedData/Build/Products/Debug-iphoneos -I /Applications/Xcode-16.3.0.app/Contents/Developer/Platforms/iPhoneOS.platform/Developer/usr/lib -F /Users/admin/builder/spi-builder-workspace/.derivedData/Build/Products/Debug-iphoneos -F /Applications/Xcode-16.3.0.app/Contents/Developer/Platforms/iPhoneOS.platform/Developer/Library/Frameworks -F /Applications/Xcode-16.3.0.app/Contents/Developer/Platforms/iPhoneOS.platform/Developer/SDKs/iPhoneOS18.4.sdk/Developer/Library/Frameworks -parse-as-library -c -j10 -enable-batch-mode -incremental -Xcc -ivfsstatcache -Xcc /Users/admin/builder/spi-builder-workspace/.derivedData/SDKStatCaches.noindex/iphoneos18.4-22E235-339d34bc69d7fc736c3220795c36f340.sdkstatcache -output-file-map /Users/admin/builder/spi-builder-workspace/.derivedData/Build/Intermediates.noindex/ShellOut.build/Debug-iphoneos/ShellOut.build/Objects-normal/arm64/ShellOut-OutputFileMap.json -use-frontend-parseable-output -save-temps -no-color-diagnostics -serialize-diagnostics -emit-dependencies -emit-module -emit-module-path /Users/admin/builder/spi-builder-workspace/.derivedData/Build/Intermediates.noindex/ShellOut.build/Debug-iphoneos/ShellOut.build/Objects-normal/arm64/ShellOut.swiftmodule -validate-clang-modules-once -clang-build-session-file /Users/admin/builder/spi-builder-workspace/.derivedData/ModuleCache.noindex/Session.modulevalidation -Xcc -I/Users/admin/builder/spi-builder-workspace/.derivedData/Build/Intermediates.noindex/ShellOut.build/Debug-iphoneos/ShellOut.build/swift-overrides.hmap -emit-const-values -Xfrontend -const-gather-protocols-file -Xfrontend /Users/admin/builder/spi-builder-workspace/.derivedData/Build/Intermediates.noindex/ShellOut.build/Debug-iphoneos/ShellOut.build/Objects-normal/arm64/ShellOut_const_extract_protocols.json -Xcc -I/Users/admin/builder/spi-builder-workspace/.derivedData/Build/Products/Debug-iphoneos/include -Xcc -I/Users/admin/builder/spi-builder-workspace/.derivedData/Build/Intermediates.noindex/ShellOut.build/Debug-iphoneos/ShellOut.build/DerivedSources-normal/arm64 -Xcc -I/Users/admin/builder/spi-builder-workspace/.derivedData/Build/Intermediates.noindex/ShellOut.build/Debug-iphoneos/ShellOut.build/DerivedSources/arm64 -Xcc -I/Users/admin/builder/spi-builder-workspace/.derivedData/Build/Intermediates.noindex/ShellOut.build/Debug-iphoneos/ShellOut.build/DerivedSources -Xcc -DSWIFT_PACKAGE -Xcc -DDEBUG\=1 -emit-objc-header -emit-objc-header-path /Users/admin/builder/spi-builder-workspace/.derivedData/Build/Intermediates.noindex/ShellOut.build/Debug-iphoneos/ShellOut.build/Objects-normal/arm64/ShellOut-Swift.h -working-directory /Users/admin/builder/spi-builder-workspace/.swiftpm/xcode -experimental-emit-module-separately -disable-cmo
SwiftDriver ArgumentParserToolInfo normal arm64 com.apple.xcode.tools.swift.compiler (in target 'ArgumentParserToolInfo' from project 'swift-argument-parser')
cd /Users/admin/builder/spi-builder-workspace/.swiftpm/xcode
builtin-SwiftDriver -- /Applications/Xcode-16.3.0.app/Contents/Developer/Toolchains/XcodeDefault.xctoolchain/usr/bin/swiftc -module-name ArgumentParserToolInfo -Onone -enforce-exclusivity\=checked @/Users/admin/builder/spi-builder-workspace/.derivedData/Build/Intermediates.noindex/swift-argument-parser.build/Debug-iphoneos/ArgumentParserToolInfo.build/Objects-normal/arm64/ArgumentParserToolInfo.SwiftFileList -DSWIFT_PACKAGE -DDEBUG -stats-output-dir .stats -strict-concurrency\=complete -enable-upcoming-feature StrictConcurrency -enable-upcoming-feature DisableOutwardActorInference -enable-upcoming-feature GlobalActorIsolatedTypesUsability -enable-upcoming-feature InferSendableFromCaptures -plugin-path /Applications/Xcode-16.3.0.app/Contents/Developer/Toolchains/XcodeDefault.xctoolchain/usr/lib/swift/host/plugins/testing -enable-experimental-feature DebugDescriptionMacro -sdk /Applications/Xcode-16.3.0.app/Contents/Developer/Platforms/iPhoneOS.platform/Developer/SDKs/iPhoneOS18.4.sdk -target arm64-apple-ios12.0 -g -module-cache-path /Users/admin/builder/spi-builder-workspace/.derivedData/ModuleCache.noindex -Xfrontend -serialize-debugging-options -profile-coverage-mapping -profile-generate -enable-testing -suppress-warnings -index-store-path /Users/admin/builder/spi-builder-workspace/.derivedData/Index.noindex/DataStore -swift-version 5 -I /Users/admin/builder/spi-builder-workspace/.derivedData/Build/Products/Debug-iphoneos -I /Applications/Xcode-16.3.0.app/Contents/Developer/Platforms/iPhoneOS.platform/Developer/usr/lib -F /Users/admin/builder/spi-builder-workspace/.derivedData/Build/Products/Debug-iphoneos -F /Applications/Xcode-16.3.0.app/Contents/Developer/Platforms/iPhoneOS.platform/Developer/Library/Frameworks -F /Applications/Xcode-16.3.0.app/Contents/Developer/Platforms/iPhoneOS.platform/Developer/SDKs/iPhoneOS18.4.sdk/Developer/Library/Frameworks -parse-as-library -c -j10 -enable-batch-mode -incremental -Xcc -ivfsstatcache -Xcc /Users/admin/builder/spi-builder-workspace/.derivedData/SDKStatCaches.noindex/iphoneos18.4-22E235-339d34bc69d7fc736c3220795c36f340.sdkstatcache -output-file-map /Users/admin/builder/spi-builder-workspace/.derivedData/Build/Intermediates.noindex/swift-argument-parser.build/Debug-iphoneos/ArgumentParserToolInfo.build/Objects-normal/arm64/ArgumentParserToolInfo-OutputFileMap.json -use-frontend-parseable-output -save-temps -no-color-diagnostics -serialize-diagnostics -emit-dependencies -emit-module -emit-module-path /Users/admin/builder/spi-builder-workspace/.derivedData/Build/Intermediates.noindex/swift-argument-parser.build/Debug-iphoneos/ArgumentParserToolInfo.build/Objects-normal/arm64/ArgumentParserToolInfo.swiftmodule -validate-clang-modules-once -clang-build-session-file /Users/admin/builder/spi-builder-workspace/.derivedData/ModuleCache.noindex/Session.modulevalidation -Xcc -I/Users/admin/builder/spi-builder-workspace/.derivedData/Build/Intermediates.noindex/swift-argument-parser.build/Debug-iphoneos/ArgumentParserToolInfo.build/swift-overrides.hmap -emit-const-values -Xfrontend -const-gather-protocols-file -Xfrontend /Users/admin/builder/spi-builder-workspace/.derivedData/Build/Intermediates.noindex/swift-argument-parser.build/Debug-iphoneos/ArgumentParserToolInfo.build/Objects-normal/arm64/ArgumentParserToolInfo_const_extract_protocols.json -Xcc -I/Users/admin/builder/spi-builder-workspace/.derivedData/Build/Products/Debug-iphoneos/include -Xcc -I/Users/admin/builder/spi-builder-workspace/.derivedData/Build/Intermediates.noindex/swift-argument-parser.build/Debug-iphoneos/ArgumentParserToolInfo.build/DerivedSources-normal/arm64 -Xcc -I/Users/admin/builder/spi-builder-workspace/.derivedData/Build/Intermediates.noindex/swift-argument-parser.build/Debug-iphoneos/ArgumentParserToolInfo.build/DerivedSources/arm64 -Xcc -I/Users/admin/builder/spi-builder-workspace/.derivedData/Build/Intermediates.noindex/swift-argument-parser.build/Debug-iphoneos/ArgumentParserToolInfo.build/DerivedSources -Xcc -DSWIFT_PACKAGE -Xcc -DDEBUG\=1 -emit-objc-header -emit-objc-header-path /Users/admin/builder/spi-builder-workspace/.derivedData/Build/Intermediates.noindex/swift-argument-parser.build/Debug-iphoneos/ArgumentParserToolInfo.build/Objects-normal/arm64/ArgumentParserToolInfo-Swift.h -working-directory /Users/admin/builder/spi-builder-workspace/.swiftpm/xcode -experimental-emit-module-separately -disable-cmo
SwiftEmitModule normal arm64 Emitting\ module\ for\ ShellOut (in target 'ShellOut' from project 'ShellOut')
SwiftCompile normal arm64 /Users/admin/builder/spi-builder-workspace/.dependencies/checkouts/ShellOut/Sources/ShellOut.swift (in target 'ShellOut' from project 'ShellOut')
cd /Users/admin/builder/spi-builder-workspace/.swiftpm/xcode
/Users/admin/builder/spi-builder-workspace/.dependencies/checkouts/ShellOut/Sources/ShellOut.swift:34:14: error: cannot find type 'Process' in scope
process: Process = .init(),
^~~~~~~
/Users/admin/builder/spi-builder-workspace/.dependencies/checkouts/ShellOut/Sources/ShellOut.swift:67:14: error: cannot find type 'Process' in scope
process: Process = .init(),
^~~~~~~
/Users/admin/builder/spi-builder-workspace/.dependencies/checkouts/ShellOut/Sources/ShellOut.swift:102:14: error: cannot find type 'Process' in scope
process: Process = .init(),
^~~~~~~
/Users/admin/builder/spi-builder-workspace/.dependencies/checkouts/ShellOut/Sources/ShellOut.swift:377:19: error: cannot find type 'Process' in scope
private extension Process {
^~~~~~~
Failed frontend command:
/Applications/Xcode-16.3.0.app/Contents/Developer/Toolchains/XcodeDefault.xctoolchain/usr/bin/swift-frontend -frontend -emit-module -experimental-skip-non-inlinable-function-bodies-without-types /Users/admin/builder/spi-builder-workspace/.dependencies/checkouts/ShellOut/Sources/ShellOut.swift -target arm64-apple-ios12.0 -Xllvm -aarch64-use-tbi -enable-objc-interop -sdk /Applications/Xcode-16.3.0.app/Contents/Developer/Platforms/iPhoneOS.platform/Developer/SDKs/iPhoneOS18.4.sdk -I /Users/admin/builder/spi-builder-workspace/.derivedData/Build/Products/Debug-iphoneos -I /Applications/Xcode-16.3.0.app/Contents/Developer/Platforms/iPhoneOS.platform/Developer/usr/lib -F /Users/admin/builder/spi-builder-workspace/.derivedData/Build/Products/Debug-iphoneos -F /Applications/Xcode-16.3.0.app/Contents/Developer/Platforms/iPhoneOS.platform/Developer/Library/Frameworks -F /Applications/Xcode-16.3.0.app/Contents/Developer/Platforms/iPhoneOS.platform/Developer/SDKs/iPhoneOS18.4.sdk/Developer/Library/Frameworks -no-color-diagnostics -enable-testing -g -debug-info-format\=dwarf -dwarf-version\=4 -module-cache-path /Users/admin/builder/spi-builder-workspace/.derivedData/ModuleCache.noindex -suppress-warnings -profile-generate -profile-coverage-mapping -swift-version 4.2 -enforce-exclusivity\=checked -stats-output-dir /Users/admin/builder/spi-builder-workspace/.swiftpm/xcode/.stats -Onone -D SWIFT_PACKAGE -D DEBUG -serialize-debugging-options -const-gather-protocols-file /Users/admin/builder/spi-builder-workspace/.derivedData/Build/Intermediates.noindex/ShellOut.build/Debug-iphoneos/ShellOut.build/Objects-normal/arm64/ShellOut_const_extract_protocols.json -enable-upcoming-feature StrictConcurrency -enable-upcoming-feature DisableOutwardActorInference -enable-upcoming-feature GlobalActorIsolatedTypesUsability -enable-upcoming-feature InferSendableFromCaptures -enable-experimental-feature DebugDescriptionMacro -strict-concurrency\=complete -empty-abi-descriptor -plugin-path /Applications/Xcode-16.3.0.app/Contents/Developer/Toolchains/XcodeDefault.xctoolchain/usr/lib/swift/host/plugins/testing -validate-clang-modules-once -clang-build-session-file /Users/admin/builder/spi-builder-workspace/.derivedData/ModuleCache.noindex/Session.modulevalidation -Xcc -working-directory -Xcc /Users/admin/builder/spi-builder-workspace/.swiftpm/xcode -resource-dir /Applications/Xcode-16.3.0.app/Contents/Developer/Toolchains/XcodeDefault.xctoolchain/usr/lib/swift -enable-anonymous-context-mangled-names -file-compilation-dir /Users/admin/builder/spi-builder-workspace/.swiftpm/xcode -Xcc -ivfsstatcache -Xcc /Users/admin/builder/spi-builder-workspace/.derivedData/SDKStatCaches.noindex/iphoneos18.4-22E235-339d34bc69d7fc736c3220795c36f340.sdkstatcache -Xcc -I/Users/admin/builder/spi-builder-workspace/.derivedData/Build/Intermediates.noindex/ShellOut.build/Debug-iphoneos/ShellOut.build/swift-overrides.hmap -Xcc -I/Users/admin/builder/spi-builder-workspace/.derivedData/Build/Products/Debug-iphoneos/include -Xcc -I/Users/admin/builder/spi-builder-workspace/.derivedData/Build/Intermediates.noindex/ShellOut.build/Debug-iphoneos/ShellOut.build/DerivedSources-normal/arm64 -Xcc -I/Users/admin/builder/spi-builder-workspace/.derivedData/Build/Intermediates.noindex/ShellOut.build/Debug-iphoneos/ShellOut.build/DerivedSources/arm64 -Xcc -I/Users/admin/builder/spi-builder-workspace/.derivedData/Build/Intermediates.noindex/ShellOut.build/Debug-iphoneos/ShellOut.build/DerivedSources -Xcc -DSWIFT_PACKAGE -Xcc -DDEBUG\=1 -module-name ShellOut -frontend-parseable-output -disable-clang-spi -target-sdk-version 18.4 -target-sdk-name iphoneos18.4 -external-plugin-path /Applications/Xcode-16.3.0.app/Contents/Developer/Platforms/iPhoneOS.platform/Developer/usr/lib/swift/host/plugins\#/Applications/Xcode-16.3.0.app/Contents/Developer/Platforms/iPhoneOS.platform/Developer/usr/bin/swift-plugin-server -external-plugin-path /Applications/Xcode-16.3.0.app/Contents/Developer/Platforms/iPhoneOS.platform/Developer/usr/local/lib/swift/host/plugins\#/Applications/Xcode-16.3.0.app/Contents/Developer/Platforms/iPhoneOS.platform/Developer/usr/bin/swift-plugin-server -in-process-plugin-server-path /Applications/Xcode-16.3.0.app/Contents/Developer/Toolchains/XcodeDefault.xctoolchain/usr/lib/swift/host/libSwiftInProcPluginServer.dylib -plugin-path /Applications/Xcode-16.3.0.app/Contents/Developer/Toolchains/XcodeDefault.xctoolchain/usr/lib/swift/host/plugins -plugin-path /Applications/Xcode-16.3.0.app/Contents/Developer/Toolchains/XcodeDefault.xctoolchain/usr/local/lib/swift/host/plugins -emit-module-doc-path /Users/admin/builder/spi-builder-workspace/.derivedData/Build/Intermediates.noindex/ShellOut.build/Debug-iphoneos/ShellOut.build/Objects-normal/arm64/ShellOut.swiftdoc -emit-module-source-info-path /Users/admin/builder/spi-builder-workspace/.derivedData/Build/Intermediates.noindex/ShellOut.build/Debug-iphoneos/ShellOut.build/Objects-normal/arm64/ShellOut.swiftsourceinfo -emit-objc-header-path /Users/admin/builder/spi-builder-workspace/.derivedData/Build/Intermediates.noindex/ShellOut.build/Debug-iphoneos/ShellOut.build/Objects-normal/arm64/ShellOut-Swift.h -serialize-diagnostics-path /Users/admin/builder/spi-builder-workspace/.derivedData/Build/Intermediates.noindex/ShellOut.build/Debug-iphoneos/ShellOut.build/Objects-normal/arm64/ShellOut-master-emit-module.dia -emit-dependencies-path /Users/admin/builder/spi-builder-workspace/.derivedData/Build/Intermediates.noindex/ShellOut.build/Debug-iphoneos/ShellOut.build/Objects-normal/arm64/ShellOut-master-emit-module.d -parse-as-library -o /Users/admin/builder/spi-builder-workspace/.derivedData/Build/Intermediates.noindex/ShellOut.build/Debug-iphoneos/ShellOut.build/Objects-normal/arm64/ShellOut.swiftmodule -emit-abi-descriptor-path /Users/admin/builder/spi-builder-workspace/.derivedData/Build/Intermediates.noindex/ShellOut.build/Debug-iphoneos/ShellOut.build/Objects-normal/arm64/ShellOut.abi.json
SwiftEmitModule normal arm64 Emitting\ module\ for\ ArgumentParserToolInfo (in target 'ArgumentParserToolInfo' from project 'swift-argument-parser')
SwiftCompile normal arm64 /Users/admin/builder/spi-builder-workspace/.dependencies/checkouts/swift-argument-parser/Sources/ArgumentParserToolInfo/ToolInfo.swift (in target 'ArgumentParserToolInfo' from project 'swift-argument-parser')
cd /Users/admin/builder/spi-builder-workspace/.swiftpm/xcode
SwiftCompile normal arm64 Compiling\ ShellOut.swift /Users/admin/builder/spi-builder-workspace/.dependencies/checkouts/ShellOut/Sources/ShellOut.swift (in target 'ShellOut' from project 'ShellOut')
SwiftCompile normal arm64 /Users/admin/builder/spi-builder-workspace/.dependencies/checkouts/ShellOut/Sources/ShellOut.swift (in target 'ShellOut' from project 'ShellOut')
cd /Users/admin/builder/spi-builder-workspace/.swiftpm/xcode
SwiftCompile normal arm64 Compiling\ ToolInfo.swift /Users/admin/builder/spi-builder-workspace/.dependencies/checkouts/swift-argument-parser/Sources/ArgumentParserToolInfo/ToolInfo.swift (in target 'ArgumentParserToolInfo' from project 'swift-argument-parser')
SwiftCompile normal arm64 /Users/admin/builder/spi-builder-workspace/.dependencies/checkouts/swift-argument-parser/Sources/ArgumentParserToolInfo/ToolInfo.swift (in target 'ArgumentParserToolInfo' from project 'swift-argument-parser')
cd /Users/admin/builder/spi-builder-workspace/.swiftpm/xcode
SwiftCompile normal arm64 Compiling\ CurrentValueAsyncThrowingSubject.swift /Users/admin/builder/spi-builder-workspace/.dependencies/checkouts/AsyncPlus/Sources/AsyncPlus/CurrentValueAsyncThrowingSubject.swift (in target 'AsyncPlus' from project 'AsyncPlus')
SwiftCompile normal arm64 /Users/admin/builder/spi-builder-workspace/.dependencies/checkouts/AsyncPlus/Sources/AsyncPlus/CurrentValueAsyncThrowingSubject.swift (in target 'AsyncPlus' from project 'AsyncPlus')
cd /Users/admin/builder/spi-builder-workspace/.swiftpm/xcode
SwiftEmitModule normal arm64 Emitting\ module\ for\ AsyncPlus (in target 'AsyncPlus' from project 'AsyncPlus')
EmitSwiftModule normal arm64 (in target 'AsyncPlus' from project 'AsyncPlus')
cd /Users/admin/builder/spi-builder-workspace/.swiftpm/xcode
SwiftCompile normal arm64 Compiling\ PassthroughAsyncSubject.swift /Users/admin/builder/spi-builder-workspace/.dependencies/checkouts/AsyncPlus/Sources/AsyncPlus/PassthroughAsyncSubject.swift (in target 'AsyncPlus' from project 'AsyncPlus')
SwiftCompile normal arm64 /Users/admin/builder/spi-builder-workspace/.dependencies/checkouts/AsyncPlus/Sources/AsyncPlus/PassthroughAsyncSubject.swift (in target 'AsyncPlus' from project 'AsyncPlus')
cd /Users/admin/builder/spi-builder-workspace/.swiftpm/xcode
SwiftCompile normal arm64 Compiling\ PassthroughAsyncThrowingSequence.swift /Users/admin/builder/spi-builder-workspace/.dependencies/checkouts/AsyncPlus/Sources/AsyncPlus/PassthroughAsyncThrowingSequence.swift (in target 'AsyncPlus' from project 'AsyncPlus')
SwiftCompile normal arm64 /Users/admin/builder/spi-builder-workspace/.dependencies/checkouts/AsyncPlus/Sources/AsyncPlus/PassthroughAsyncThrowingSequence.swift (in target 'AsyncPlus' from project 'AsyncPlus')
cd /Users/admin/builder/spi-builder-workspace/.swiftpm/xcode
SwiftCompile normal arm64 Compiling\ PassthroughAsyncSequence.swift /Users/admin/builder/spi-builder-workspace/.dependencies/checkouts/AsyncPlus/Sources/AsyncPlus/PassthroughAsyncSequence.swift (in target 'AsyncPlus' from project 'AsyncPlus')
SwiftCompile normal arm64 /Users/admin/builder/spi-builder-workspace/.dependencies/checkouts/AsyncPlus/Sources/AsyncPlus/PassthroughAsyncSequence.swift (in target 'AsyncPlus' from project 'AsyncPlus')
cd /Users/admin/builder/spi-builder-workspace/.swiftpm/xcode
SwiftCompile normal arm64 Compiling\ PassthroughAsyncThrowingSubject.swift /Users/admin/builder/spi-builder-workspace/.dependencies/checkouts/AsyncPlus/Sources/AsyncPlus/PassthroughAsyncThrowingSubject.swift (in target 'AsyncPlus' from project 'AsyncPlus')
SwiftCompile normal arm64 /Users/admin/builder/spi-builder-workspace/.dependencies/checkouts/AsyncPlus/Sources/AsyncPlus/PassthroughAsyncThrowingSubject.swift (in target 'AsyncPlus' from project 'AsyncPlus')
cd /Users/admin/builder/spi-builder-workspace/.swiftpm/xcode
SwiftCompile normal arm64 Compiling\ CurrentValueAsyncSubject.swift /Users/admin/builder/spi-builder-workspace/.dependencies/checkouts/AsyncPlus/Sources/AsyncPlus/CurrentValueAsyncSubject.swift (in target 'AsyncPlus' from project 'AsyncPlus')
SwiftCompile normal arm64 /Users/admin/builder/spi-builder-workspace/.dependencies/checkouts/AsyncPlus/Sources/AsyncPlus/CurrentValueAsyncSubject.swift (in target 'AsyncPlus' from project 'AsyncPlus')
cd /Users/admin/builder/spi-builder-workspace/.swiftpm/xcode
SwiftDriverJobDiscovery normal arm64 Emitting module for ArgumentParserToolInfo (in target 'ArgumentParserToolInfo' from project 'swift-argument-parser')
SwiftDriver\ Compilation\ Requirements ArgumentParserToolInfo normal arm64 com.apple.xcode.tools.swift.compiler (in target 'ArgumentParserToolInfo' from project 'swift-argument-parser')
cd /Users/admin/builder/spi-builder-workspace/.swiftpm/xcode
builtin-Swift-Compilation-Requirements -- /Applications/Xcode-16.3.0.app/Contents/Developer/Toolchains/XcodeDefault.xctoolchain/usr/bin/swiftc -module-name ArgumentParserToolInfo -Onone -enforce-exclusivity\=checked @/Users/admin/builder/spi-builder-workspace/.derivedData/Build/Intermediates.noindex/swift-argument-parser.build/Debug-iphoneos/ArgumentParserToolInfo.build/Objects-normal/arm64/ArgumentParserToolInfo.SwiftFileList -DSWIFT_PACKAGE -DDEBUG -stats-output-dir .stats -strict-concurrency\=complete -enable-upcoming-feature StrictConcurrency -enable-upcoming-feature DisableOutwardActorInference -enable-upcoming-feature GlobalActorIsolatedTypesUsability -enable-upcoming-feature InferSendableFromCaptures -plugin-path /Applications/Xcode-16.3.0.app/Contents/Developer/Toolchains/XcodeDefault.xctoolchain/usr/lib/swift/host/plugins/testing -enable-experimental-feature DebugDescriptionMacro -sdk /Applications/Xcode-16.3.0.app/Contents/Developer/Platforms/iPhoneOS.platform/Developer/SDKs/iPhoneOS18.4.sdk -target arm64-apple-ios12.0 -g -module-cache-path /Users/admin/builder/spi-builder-workspace/.derivedData/ModuleCache.noindex -Xfrontend -serialize-debugging-options -profile-coverage-mapping -profile-generate -enable-testing -suppress-warnings -index-store-path /Users/admin/builder/spi-builder-workspace/.derivedData/Index.noindex/DataStore -swift-version 5 -I /Users/admin/builder/spi-builder-workspace/.derivedData/Build/Products/Debug-iphoneos -I /Applications/Xcode-16.3.0.app/Contents/Developer/Platforms/iPhoneOS.platform/Developer/usr/lib -F /Users/admin/builder/spi-builder-workspace/.derivedData/Build/Products/Debug-iphoneos -F /Applications/Xcode-16.3.0.app/Contents/Developer/Platforms/iPhoneOS.platform/Developer/Library/Frameworks -F /Applications/Xcode-16.3.0.app/Contents/Developer/Platforms/iPhoneOS.platform/Developer/SDKs/iPhoneOS18.4.sdk/Developer/Library/Frameworks -parse-as-library -c -j10 -enable-batch-mode -incremental -Xcc -ivfsstatcache -Xcc /Users/admin/builder/spi-builder-workspace/.derivedData/SDKStatCaches.noindex/iphoneos18.4-22E235-339d34bc69d7fc736c3220795c36f340.sdkstatcache -output-file-map /Users/admin/builder/spi-builder-workspace/.derivedData/Build/Intermediates.noindex/swift-argument-parser.build/Debug-iphoneos/ArgumentParserToolInfo.build/Objects-normal/arm64/ArgumentParserToolInfo-OutputFileMap.json -use-frontend-parseable-output -save-temps -no-color-diagnostics -serialize-diagnostics -emit-dependencies -emit-module -emit-module-path /Users/admin/builder/spi-builder-workspace/.derivedData/Build/Intermediates.noindex/swift-argument-parser.build/Debug-iphoneos/ArgumentParserToolInfo.build/Objects-normal/arm64/ArgumentParserToolInfo.swiftmodule -validate-clang-modules-once -clang-build-session-file /Users/admin/builder/spi-builder-workspace/.derivedData/ModuleCache.noindex/Session.modulevalidation -Xcc -I/Users/admin/builder/spi-builder-workspace/.derivedData/Build/Intermediates.noindex/swift-argument-parser.build/Debug-iphoneos/ArgumentParserToolInfo.build/swift-overrides.hmap -emit-const-values -Xfrontend -const-gather-protocols-file -Xfrontend /Users/admin/builder/spi-builder-workspace/.derivedData/Build/Intermediates.noindex/swift-argument-parser.build/Debug-iphoneos/ArgumentParserToolInfo.build/Objects-normal/arm64/ArgumentParserToolInfo_const_extract_protocols.json -Xcc -I/Users/admin/builder/spi-builder-workspace/.derivedData/Build/Products/Debug-iphoneos/include -Xcc -I/Users/admin/builder/spi-builder-workspace/.derivedData/Build/Intermediates.noindex/swift-argument-parser.build/Debug-iphoneos/ArgumentParserToolInfo.build/DerivedSources-normal/arm64 -Xcc -I/Users/admin/builder/spi-builder-workspace/.derivedData/Build/Intermediates.noindex/swift-argument-parser.build/Debug-iphoneos/ArgumentParserToolInfo.build/DerivedSources/arm64 -Xcc -I/Users/admin/builder/spi-builder-workspace/.derivedData/Build/Intermediates.noindex/swift-argument-parser.build/Debug-iphoneos/ArgumentParserToolInfo.build/DerivedSources -Xcc -DSWIFT_PACKAGE -Xcc -DDEBUG\=1 -emit-objc-header -emit-objc-header-path /Users/admin/builder/spi-builder-workspace/.derivedData/Build/Intermediates.noindex/swift-argument-parser.build/Debug-iphoneos/ArgumentParserToolInfo.build/Objects-normal/arm64/ArgumentParserToolInfo-Swift.h -working-directory /Users/admin/builder/spi-builder-workspace/.swiftpm/xcode -experimental-emit-module-separately -disable-cmo
SwiftDriverJobDiscovery normal arm64 Compiling ToolInfo.swift (in target 'ArgumentParserToolInfo' from project 'swift-argument-parser')
SwiftDriver\ Compilation ArgumentParserToolInfo normal arm64 com.apple.xcode.tools.swift.compiler (in target 'ArgumentParserToolInfo' from project 'swift-argument-parser')
cd /Users/admin/builder/spi-builder-workspace/.swiftpm/xcode
builtin-Swift-Compilation -- /Applications/Xcode-16.3.0.app/Contents/Developer/Toolchains/XcodeDefault.xctoolchain/usr/bin/swiftc -module-name ArgumentParserToolInfo -Onone -enforce-exclusivity\=checked @/Users/admin/builder/spi-builder-workspace/.derivedData/Build/Intermediates.noindex/swift-argument-parser.build/Debug-iphoneos/ArgumentParserToolInfo.build/Objects-normal/arm64/ArgumentParserToolInfo.SwiftFileList -DSWIFT_PACKAGE -DDEBUG -stats-output-dir .stats -strict-concurrency\=complete -enable-upcoming-feature StrictConcurrency -enable-upcoming-feature DisableOutwardActorInference -enable-upcoming-feature GlobalActorIsolatedTypesUsability -enable-upcoming-feature InferSendableFromCaptures -plugin-path /Applications/Xcode-16.3.0.app/Contents/Developer/Toolchains/XcodeDefault.xctoolchain/usr/lib/swift/host/plugins/testing -enable-experimental-feature DebugDescriptionMacro -sdk /Applications/Xcode-16.3.0.app/Contents/Developer/Platforms/iPhoneOS.platform/Developer/SDKs/iPhoneOS18.4.sdk -target arm64-apple-ios12.0 -g -module-cache-path /Users/admin/builder/spi-builder-workspace/.derivedData/ModuleCache.noindex -Xfrontend -serialize-debugging-options -profile-coverage-mapping -profile-generate -enable-testing -suppress-warnings -index-store-path /Users/admin/builder/spi-builder-workspace/.derivedData/Index.noindex/DataStore -swift-version 5 -I /Users/admin/builder/spi-builder-workspace/.derivedData/Build/Products/Debug-iphoneos -I /Applications/Xcode-16.3.0.app/Contents/Developer/Platforms/iPhoneOS.platform/Developer/usr/lib -F /Users/admin/builder/spi-builder-workspace/.derivedData/Build/Products/Debug-iphoneos -F /Applications/Xcode-16.3.0.app/Contents/Developer/Platforms/iPhoneOS.platform/Developer/Library/Frameworks -F /Applications/Xcode-16.3.0.app/Contents/Developer/Platforms/iPhoneOS.platform/Developer/SDKs/iPhoneOS18.4.sdk/Developer/Library/Frameworks -parse-as-library -c -j10 -enable-batch-mode -incremental -Xcc -ivfsstatcache -Xcc /Users/admin/builder/spi-builder-workspace/.derivedData/SDKStatCaches.noindex/iphoneos18.4-22E235-339d34bc69d7fc736c3220795c36f340.sdkstatcache -output-file-map /Users/admin/builder/spi-builder-workspace/.derivedData/Build/Intermediates.noindex/swift-argument-parser.build/Debug-iphoneos/ArgumentParserToolInfo.build/Objects-normal/arm64/ArgumentParserToolInfo-OutputFileMap.json -use-frontend-parseable-output -save-temps -no-color-diagnostics -serialize-diagnostics -emit-dependencies -emit-module -emit-module-path /Users/admin/builder/spi-builder-workspace/.derivedData/Build/Intermediates.noindex/swift-argument-parser.build/Debug-iphoneos/ArgumentParserToolInfo.build/Objects-normal/arm64/ArgumentParserToolInfo.swiftmodule -validate-clang-modules-once -clang-build-session-file /Users/admin/builder/spi-builder-workspace/.derivedData/ModuleCache.noindex/Session.modulevalidation -Xcc -I/Users/admin/builder/spi-builder-workspace/.derivedData/Build/Intermediates.noindex/swift-argument-parser.build/Debug-iphoneos/ArgumentParserToolInfo.build/swift-overrides.hmap -emit-const-values -Xfrontend -const-gather-protocols-file -Xfrontend /Users/admin/builder/spi-builder-workspace/.derivedData/Build/Intermediates.noindex/swift-argument-parser.build/Debug-iphoneos/ArgumentParserToolInfo.build/Objects-normal/arm64/ArgumentParserToolInfo_const_extract_protocols.json -Xcc -I/Users/admin/builder/spi-builder-workspace/.derivedData/Build/Products/Debug-iphoneos/include -Xcc -I/Users/admin/builder/spi-builder-workspace/.derivedData/Build/Intermediates.noindex/swift-argument-parser.build/Debug-iphoneos/ArgumentParserToolInfo.build/DerivedSources-normal/arm64 -Xcc -I/Users/admin/builder/spi-builder-workspace/.derivedData/Build/Intermediates.noindex/swift-argument-parser.build/Debug-iphoneos/ArgumentParserToolInfo.build/DerivedSources/arm64 -Xcc -I/Users/admin/builder/spi-builder-workspace/.derivedData/Build/Intermediates.noindex/swift-argument-parser.build/Debug-iphoneos/ArgumentParserToolInfo.build/DerivedSources -Xcc -DSWIFT_PACKAGE -Xcc -DDEBUG\=1 -emit-objc-header -emit-objc-header-path /Users/admin/builder/spi-builder-workspace/.derivedData/Build/Intermediates.noindex/swift-argument-parser.build/Debug-iphoneos/ArgumentParserToolInfo.build/Objects-normal/arm64/ArgumentParserToolInfo-Swift.h -working-directory /Users/admin/builder/spi-builder-workspace/.swiftpm/xcode -experimental-emit-module-separately -disable-cmo
SwiftMergeGeneratedHeaders /Users/admin/builder/spi-builder-workspace/.derivedData/Build/Intermediates.noindex/GeneratedModuleMaps-iphoneos/ArgumentParserToolInfo-Swift.h /Users/admin/builder/spi-builder-workspace/.derivedData/Build/Intermediates.noindex/swift-argument-parser.build/Debug-iphoneos/ArgumentParserToolInfo.build/Objects-normal/arm64/ArgumentParserToolInfo-Swift.h (in target 'ArgumentParserToolInfo' from project 'swift-argument-parser')
cd /Users/admin/builder/spi-builder-workspace/.dependencies/checkouts/swift-argument-parser
builtin-swiftHeaderTool -arch arm64 /Users/admin/builder/spi-builder-workspace/.derivedData/Build/Intermediates.noindex/swift-argument-parser.build/Debug-iphoneos/ArgumentParserToolInfo.build/Objects-normal/arm64/ArgumentParserToolInfo-Swift.h -o /Users/admin/builder/spi-builder-workspace/.derivedData/Build/Intermediates.noindex/GeneratedModuleMaps-iphoneos/ArgumentParserToolInfo-Swift.h
Copy /Users/admin/builder/spi-builder-workspace/.derivedData/Build/Products/Debug-iphoneos/ArgumentParserToolInfo.swiftmodule/arm64-apple-ios.swiftmodule /Users/admin/builder/spi-builder-workspace/.derivedData/Build/Intermediates.noindex/swift-argument-parser.build/Debug-iphoneos/ArgumentParserToolInfo.build/Objects-normal/arm64/ArgumentParserToolInfo.swiftmodule (in target 'ArgumentParserToolInfo' from project 'swift-argument-parser')
cd /Users/admin/builder/spi-builder-workspace/.dependencies/checkouts/swift-argument-parser
builtin-copy -exclude .DS_Store -exclude CVS -exclude .svn -exclude .git -exclude .hg -resolve-src-symlinks -rename /Users/admin/builder/spi-builder-workspace/.derivedData/Build/Intermediates.noindex/swift-argument-parser.build/Debug-iphoneos/ArgumentParserToolInfo.build/Objects-normal/arm64/ArgumentParserToolInfo.swiftmodule /Users/admin/builder/spi-builder-workspace/.derivedData/Build/Products/Debug-iphoneos/ArgumentParserToolInfo.swiftmodule/arm64-apple-ios.swiftmodule
Copy /Users/admin/builder/spi-builder-workspace/.derivedData/Build/Products/Debug-iphoneos/ArgumentParserToolInfo.swiftmodule/arm64-apple-ios.swiftdoc /Users/admin/builder/spi-builder-workspace/.derivedData/Build/Intermediates.noindex/swift-argument-parser.build/Debug-iphoneos/ArgumentParserToolInfo.build/Objects-normal/arm64/ArgumentParserToolInfo.swiftdoc (in target 'ArgumentParserToolInfo' from project 'swift-argument-parser')
cd /Users/admin/builder/spi-builder-workspace/.dependencies/checkouts/swift-argument-parser
builtin-copy -exclude .DS_Store -exclude CVS -exclude .svn -exclude .git -exclude .hg -resolve-src-symlinks -rename /Users/admin/builder/spi-builder-workspace/.derivedData/Build/Intermediates.noindex/swift-argument-parser.build/Debug-iphoneos/ArgumentParserToolInfo.build/Objects-normal/arm64/ArgumentParserToolInfo.swiftdoc /Users/admin/builder/spi-builder-workspace/.derivedData/Build/Products/Debug-iphoneos/ArgumentParserToolInfo.swiftmodule/arm64-apple-ios.swiftdoc
Copy /Users/admin/builder/spi-builder-workspace/.derivedData/Build/Products/Debug-iphoneos/ArgumentParserToolInfo.swiftmodule/arm64-apple-ios.abi.json /Users/admin/builder/spi-builder-workspace/.derivedData/Build/Intermediates.noindex/swift-argument-parser.build/Debug-iphoneos/ArgumentParserToolInfo.build/Objects-normal/arm64/ArgumentParserToolInfo.abi.json (in target 'ArgumentParserToolInfo' from project 'swift-argument-parser')
cd /Users/admin/builder/spi-builder-workspace/.dependencies/checkouts/swift-argument-parser
builtin-copy -exclude .DS_Store -exclude CVS -exclude .svn -exclude .git -exclude .hg -resolve-src-symlinks -rename /Users/admin/builder/spi-builder-workspace/.derivedData/Build/Intermediates.noindex/swift-argument-parser.build/Debug-iphoneos/ArgumentParserToolInfo.build/Objects-normal/arm64/ArgumentParserToolInfo.abi.json /Users/admin/builder/spi-builder-workspace/.derivedData/Build/Products/Debug-iphoneos/ArgumentParserToolInfo.swiftmodule/arm64-apple-ios.abi.json
Copy /Users/admin/builder/spi-builder-workspace/.derivedData/Build/Products/Debug-iphoneos/ArgumentParserToolInfo.swiftmodule/Project/arm64-apple-ios.swiftsourceinfo /Users/admin/builder/spi-builder-workspace/.derivedData/Build/Intermediates.noindex/swift-argument-parser.build/Debug-iphoneos/ArgumentParserToolInfo.build/Objects-normal/arm64/ArgumentParserToolInfo.swiftsourceinfo (in target 'ArgumentParserToolInfo' from project 'swift-argument-parser')
cd /Users/admin/builder/spi-builder-workspace/.dependencies/checkouts/swift-argument-parser
builtin-copy -exclude .DS_Store -exclude CVS -exclude .svn -exclude .git -exclude .hg -resolve-src-symlinks -rename /Users/admin/builder/spi-builder-workspace/.derivedData/Build/Intermediates.noindex/swift-argument-parser.build/Debug-iphoneos/ArgumentParserToolInfo.build/Objects-normal/arm64/ArgumentParserToolInfo.swiftsourceinfo /Users/admin/builder/spi-builder-workspace/.derivedData/Build/Products/Debug-iphoneos/ArgumentParserToolInfo.swiftmodule/Project/arm64-apple-ios.swiftsourceinfo
Ld /Users/admin/builder/spi-builder-workspace/.derivedData/Build/Products/Debug-iphoneos/ArgumentParserToolInfo.o normal (in target 'ArgumentParserToolInfo' from project 'swift-argument-parser')
cd /Users/admin/builder/spi-builder-workspace/.dependencies/checkouts/swift-argument-parser
/Applications/Xcode-16.3.0.app/Contents/Developer/Toolchains/XcodeDefault.xctoolchain/usr/bin/clang -Xlinker -reproducible -target arm64-apple-ios12.0 -r -isysroot /Applications/Xcode-16.3.0.app/Contents/Developer/Platforms/iPhoneOS.platform/Developer/SDKs/iPhoneOS18.4.sdk -O0 -w -L/Users/admin/builder/spi-builder-workspace/.derivedData/Build/Intermediates.noindex/EagerLinkingTBDs/Debug-iphoneos -L/Users/admin/builder/spi-builder-workspace/.derivedData/Build/Products/Debug-iphoneos -L/Applications/Xcode-16.3.0.app/Contents/Developer/Platforms/iPhoneOS.platform/Developer/usr/lib -F/Users/admin/builder/spi-builder-workspace/.derivedData/Build/Intermediates.noindex/EagerLinkingTBDs/Debug-iphoneos -F/Users/admin/builder/spi-builder-workspace/.derivedData/Build/Products/Debug-iphoneos -iframework /Applications/Xcode-16.3.0.app/Contents/Developer/Platforms/iPhoneOS.platform/Developer/Library/Frameworks -iframework /Applications/Xcode-16.3.0.app/Contents/Developer/Platforms/iPhoneOS.platform/Developer/SDKs/iPhoneOS18.4.sdk/Developer/Library/Frameworks -filelist /Users/admin/builder/spi-builder-workspace/.derivedData/Build/Intermediates.noindex/swift-argument-parser.build/Debug-iphoneos/ArgumentParserToolInfo.build/Objects-normal/arm64/ArgumentParserToolInfo.LinkFileList -nostdlib -Xlinker -object_path_lto -Xlinker /Users/admin/builder/spi-builder-workspace/.derivedData/Build/Intermediates.noindex/swift-argument-parser.build/Debug-iphoneos/ArgumentParserToolInfo.build/Objects-normal/arm64/ArgumentParserToolInfo_lto.o -rdynamic -Xlinker -no_deduplicate -Xlinker -debug_variant -Xlinker -dependency_info -Xlinker /Users/admin/builder/spi-builder-workspace/.derivedData/Build/Intermediates.noindex/swift-argument-parser.build/Debug-iphoneos/ArgumentParserToolInfo.build/Objects-normal/arm64/ArgumentParserToolInfo_dependency_info.dat -fobjc-link-runtime -L/Applications/Xcode-16.3.0.app/Contents/Developer/Toolchains/XcodeDefault.xctoolchain/usr/lib/swift/iphoneos -L/usr/lib/swift -Xlinker -add_ast_path -Xlinker /Users/admin/builder/spi-builder-workspace/.derivedData/Build/Intermediates.noindex/swift-argument-parser.build/Debug-iphoneos/ArgumentParserToolInfo.build/Objects-normal/arm64/ArgumentParserToolInfo.swiftmodule -o /Users/admin/builder/spi-builder-workspace/.derivedData/Build/Products/Debug-iphoneos/ArgumentParserToolInfo.o
ExtractAppIntentsMetadata (in target 'ArgumentParserToolInfo' from project 'swift-argument-parser')
cd /Users/admin/builder/spi-builder-workspace/.dependencies/checkouts/swift-argument-parser
/Applications/Xcode-16.3.0.app/Contents/Developer/Toolchains/XcodeDefault.xctoolchain/usr/bin/appintentsmetadataprocessor --toolchain-dir /Applications/Xcode-16.3.0.app/Contents/Developer/Toolchains/XcodeDefault.xctoolchain --module-name ArgumentParserToolInfo --sdk-root /Applications/Xcode-16.3.0.app/Contents/Developer/Platforms/iPhoneOS.platform/Developer/SDKs/iPhoneOS18.4.sdk --xcode-version 16E140 --platform-family iOS --deployment-target 12.0 --bundle-identifier swift-argument-parser.ArgumentParserToolInfo --output /Users/admin/builder/spi-builder-workspace/.derivedData/Build/Products/Debug-iphoneos/ArgumentParserToolInfo.appintents --target-triple arm64-apple-ios12.0 --binary-file /Users/admin/builder/spi-builder-workspace/.derivedData/Build/Products/Debug-iphoneos/ArgumentParserToolInfo.o --dependency-file /Users/admin/builder/spi-builder-workspace/.derivedData/Build/Intermediates.noindex/swift-argument-parser.build/Debug-iphoneos/ArgumentParserToolInfo.build/Objects-normal/arm64/ArgumentParserToolInfo_dependency_info.dat --stringsdata-file /Users/admin/builder/spi-builder-workspace/.derivedData/Build/Intermediates.noindex/swift-argument-parser.build/Debug-iphoneos/ArgumentParserToolInfo.build/Objects-normal/arm64/ExtractedAppShortcutsMetadata.stringsdata --source-file-list /Users/admin/builder/spi-builder-workspace/.derivedData/Build/Intermediates.noindex/swift-argument-parser.build/Debug-iphoneos/ArgumentParserToolInfo.build/Objects-normal/arm64/ArgumentParserToolInfo.SwiftFileList --metadata-file-list /Users/admin/builder/spi-builder-workspace/.derivedData/Build/Intermediates.noindex/swift-argument-parser.build/Debug-iphoneos/ArgumentParserToolInfo.build/ArgumentParserToolInfo.DependencyMetadataFileList --static-metadata-file-list /Users/admin/builder/spi-builder-workspace/.derivedData/Build/Intermediates.noindex/swift-argument-parser.build/Debug-iphoneos/ArgumentParserToolInfo.build/ArgumentParserToolInfo.DependencyStaticMetadataFileList --swift-const-vals-list /Users/admin/builder/spi-builder-workspace/.derivedData/Build/Intermediates.noindex/swift-argument-parser.build/Debug-iphoneos/ArgumentParserToolInfo.build/Objects-normal/arm64/ArgumentParserToolInfo.SwiftConstValuesFileList --force --compile-time-extraction --deployment-aware-processing --validate-assistant-intents --no-app-shortcuts-localization
2025-04-26 15:59:13.759 appintentsmetadataprocessor[893:4894] Starting appintentsmetadataprocessor export
2025-04-26 15:59:13.798 appintentsmetadataprocessor[893:4894] Extracted no relevant App Intents symbols, skipping writing output
SwiftDriver ArgumentParser normal arm64 com.apple.xcode.tools.swift.compiler (in target 'ArgumentParser' from project 'swift-argument-parser')
cd /Users/admin/builder/spi-builder-workspace/.swiftpm/xcode
builtin-SwiftDriver -- /Applications/Xcode-16.3.0.app/Contents/Developer/Toolchains/XcodeDefault.xctoolchain/usr/bin/swiftc -module-name ArgumentParser -Onone -enforce-exclusivity\=checked @/Users/admin/builder/spi-builder-workspace/.derivedData/Build/Intermediates.noindex/swift-argument-parser.build/Debug-iphoneos/ArgumentParser.build/Objects-normal/arm64/ArgumentParser.SwiftFileList -DSWIFT_PACKAGE -DDEBUG -stats-output-dir .stats -strict-concurrency\=complete -enable-upcoming-feature StrictConcurrency -enable-upcoming-feature DisableOutwardActorInference -enable-upcoming-feature GlobalActorIsolatedTypesUsability -enable-upcoming-feature InferSendableFromCaptures -plugin-path /Applications/Xcode-16.3.0.app/Contents/Developer/Toolchains/XcodeDefault.xctoolchain/usr/lib/swift/host/plugins/testing -enable-experimental-feature DebugDescriptionMacro -sdk /Applications/Xcode-16.3.0.app/Contents/Developer/Platforms/iPhoneOS.platform/Developer/SDKs/iPhoneOS18.4.sdk -target arm64-apple-ios12.0 -g -module-cache-path /Users/admin/builder/spi-builder-workspace/.derivedData/ModuleCache.noindex -Xfrontend -serialize-debugging-options -profile-coverage-mapping -profile-generate -enable-testing -suppress-warnings -index-store-path /Users/admin/builder/spi-builder-workspace/.derivedData/Index.noindex/DataStore -swift-version 5 -I /Users/admin/builder/spi-builder-workspace/.derivedData/Build/Products/Debug-iphoneos -I /Applications/Xcode-16.3.0.app/Contents/Developer/Platforms/iPhoneOS.platform/Developer/usr/lib -F /Users/admin/builder/spi-builder-workspace/.derivedData/Build/Products/Debug-iphoneos/PackageFrameworks -F /Users/admin/builder/spi-builder-workspace/.derivedData/Build/Products/Debug-iphoneos -F /Applications/Xcode-16.3.0.app/Contents/Developer/Platforms/iPhoneOS.platform/Developer/Library/Frameworks -F /Applications/Xcode-16.3.0.app/Contents/Developer/Platforms/iPhoneOS.platform/Developer/SDKs/iPhoneOS18.4.sdk/Developer/Library/Frameworks -c -j10 -enable-batch-mode -incremental -Xcc -ivfsstatcache -Xcc /Users/admin/builder/spi-builder-workspace/.derivedData/SDKStatCaches.noindex/iphoneos18.4-22E235-339d34bc69d7fc736c3220795c36f340.sdkstatcache -output-file-map /Users/admin/builder/spi-builder-workspace/.derivedData/Build/Intermediates.noindex/swift-argument-parser.build/Debug-iphoneos/ArgumentParser.build/Objects-normal/arm64/ArgumentParser-OutputFileMap.json -use-frontend-parseable-output -save-temps -no-color-diagnostics -serialize-diagnostics -emit-dependencies -emit-module -emit-module-path /Users/admin/builder/spi-builder-workspace/.derivedData/Build/Intermediates.noindex/swift-argument-parser.build/Debug-iphoneos/ArgumentParser.build/Objects-normal/arm64/ArgumentParser.swiftmodule -validate-clang-modules-once -clang-build-session-file /Users/admin/builder/spi-builder-workspace/.derivedData/ModuleCache.noindex/Session.modulevalidation -Xcc -I/Users/admin/builder/spi-builder-workspace/.derivedData/Build/Intermediates.noindex/swift-argument-parser.build/Debug-iphoneos/ArgumentParser.build/swift-overrides.hmap -emit-const-values -Xfrontend -const-gather-protocols-file -Xfrontend /Users/admin/builder/spi-builder-workspace/.derivedData/Build/Intermediates.noindex/swift-argument-parser.build/Debug-iphoneos/ArgumentParser.build/Objects-normal/arm64/ArgumentParser_const_extract_protocols.json -Xcc -I/Users/admin/builder/spi-builder-workspace/.derivedData/Build/Products/Debug-iphoneos/include -Xcc -I/Users/admin/builder/spi-builder-workspace/.derivedData/Build/Intermediates.noindex/swift-argument-parser.build/Debug-iphoneos/ArgumentParser.build/DerivedSources-normal/arm64 -Xcc -I/Users/admin/builder/spi-builder-workspace/.derivedData/Build/Intermediates.noindex/swift-argument-parser.build/Debug-iphoneos/ArgumentParser.build/DerivedSources/arm64 -Xcc -I/Users/admin/builder/spi-builder-workspace/.derivedData/Build/Intermediates.noindex/swift-argument-parser.build/Debug-iphoneos/ArgumentParser.build/DerivedSources -Xcc -DSWIFT_PACKAGE -Xcc -DDEBUG\=1 -emit-objc-header -emit-objc-header-path /Users/admin/builder/spi-builder-workspace/.derivedData/Build/Intermediates.noindex/swift-argument-parser.build/Debug-iphoneos/ArgumentParser.build/Objects-normal/arm64/ArgumentParser-Swift.h -working-directory /Users/admin/builder/spi-builder-workspace/.swiftpm/xcode -experimental-emit-module-separately -disable-cmo
SwiftEmitModule normal arm64 Emitting\ module\ for\ ArgumentParser (in target 'ArgumentParser' from project 'swift-argument-parser')
EmitSwiftModule normal arm64 (in target 'ArgumentParser' from project 'swift-argument-parser')
cd /Users/admin/builder/spi-builder-workspace/.swiftpm/xcode
SwiftCompile normal arm64 Compiling\ ArgumentHelp.swift,\ ArgumentVisibility.swift,\ CompletionKind.swift,\ Errors.swift,\ Flag.swift /Users/admin/builder/spi-builder-workspace/.dependencies/checkouts/swift-argument-parser/Sources/ArgumentParser/Parsable\ Properties/ArgumentHelp.swift /Users/admin/builder/spi-builder-workspace/.dependencies/checkouts/swift-argument-parser/Sources/ArgumentParser/Parsable\ Properties/ArgumentVisibility.swift /Users/admin/builder/spi-builder-workspace/.dependencies/checkouts/swift-argument-parser/Sources/ArgumentParser/Parsable\ Properties/CompletionKind.swift /Users/admin/builder/spi-builder-workspace/.dependencies/checkouts/swift-argument-parser/Sources/ArgumentParser/Parsable\ Properties/Errors.swift /Users/admin/builder/spi-builder-workspace/.dependencies/checkouts/swift-argument-parser/Sources/ArgumentParser/Parsable\ Properties/Flag.swift (in target 'ArgumentParser' from project 'swift-argument-parser')
Command SwiftCompile failed with a nonzero exit code
** BUILD FAILED **
The following build commands failed:
SwiftCompile normal arm64 /Users/admin/builder/spi-builder-workspace/.dependencies/checkouts/ShellOut/Sources/ShellOut.swift (in target 'ShellOut' from project 'ShellOut')
SwiftEmitModule normal arm64 Emitting\ module\ for\ ShellOut (in target 'ShellOut' from project 'ShellOut')
SwiftCompile normal arm64 Compiling\ ArgumentHelp.swift,\ ArgumentVisibility.swift,\ CompletionKind.swift,\ Errors.swift,\ Flag.swift /Users/admin/builder/spi-builder-workspace/.dependencies/checkouts/swift-argument-parser/Sources/ArgumentParser/Parsable\ Properties/ArgumentHelp.swift /Users/admin/builder/spi-builder-workspace/.dependencies/checkouts/swift-argument-parser/Sources/ArgumentParser/Parsable\ Properties/ArgumentVisibility.swift /Users/admin/builder/spi-builder-workspace/.dependencies/checkouts/swift-argument-parser/Sources/ArgumentParser/Parsable\ Properties/CompletionKind.swift /Users/admin/builder/spi-builder-workspace/.dependencies/checkouts/swift-argument-parser/Sources/ArgumentParser/Parsable\ Properties/Errors.swift /Users/admin/builder/spi-builder-workspace/.dependencies/checkouts/swift-argument-parser/Sources/ArgumentParser/Parsable\ Properties/Flag.swift (in target 'ArgumentParser' from project 'swift-argument-parser')
Building workspace spi-builder-workspace with scheme DynuREST-Package
(4 failures)
Command line invocation:
/Applications/Xcode-16.3.0.app/Contents/Developer/usr/bin/xcodebuild -IDEClonedSourcePackagesDirPathOverride=/Users/admin/builder/spi-builder-workspace/.dependencies -resolvePackageDependencies
Resolve Package Graph
Resolved source packages:
AsyncPlus: https://github.com/richardpiazza/AsyncPlus.git @ 0.3.2
DynuREST: /Users/admin/builder/spi-builder-workspace
ShellOut: https://github.com/johnsundell/ShellOut.git @ 2.3.0
swift-argument-parser: https://github.com/apple/swift-argument-parser.git @ 1.5.0
SessionPlus: https://github.com/richardpiazza/SessionPlus.git @ 2.2.0
resolved source packages: AsyncPlus, DynuREST, ShellOut, swift-argument-parser, SessionPlus
{
"dependencies" : [
{
"identity" : "sessionplus",
"requirement" : {
"range" : [
{
"lower_bound" : "2.2.0",
"upper_bound" : "3.0.0"
}
]
},
"type" : "sourceControl",
"url" : "https://github.com/richardpiazza/SessionPlus.git"
},
{
"identity" : "swift-argument-parser",
"requirement" : {
"range" : [
{
"lower_bound" : "1.2.2",
"upper_bound" : "2.0.0"
}
]
},
"type" : "sourceControl",
"url" : "https://github.com/apple/swift-argument-parser.git"
},
{
"identity" : "shellout",
"requirement" : {
"range" : [
{
"lower_bound" : "2.3.0",
"upper_bound" : "3.0.0"
}
]
},
"type" : "sourceControl",
"url" : "https://github.com/johnsundell/ShellOut.git"
}
],
"manifest_display_name" : "DynuREST",
"name" : "DynuREST",
"path" : "/Users/admin/builder/spi-builder-workspace",
"platforms" : [
{
"name" : "macos",
"version" : "12.0"
},
{
"name" : "ios",
"version" : "15.0"
},
{
"name" : "tvos",
"version" : "15.0"
},
{
"name" : "watchos",
"version" : "8.0"
}
],
"products" : [
{
"name" : "DynuREST",
"targets" : [
"DynuREST"
],
"type" : {
"library" : [
"automatic"
]
}
},
{
"name" : "dynu",
"targets" : [
"cli"
],
"type" : {
"executable" : null
}
}
],
"swift_languages_versions" : [
"5"
],
"targets" : [
{
"c99name" : "cli",
"module_type" : "SwiftTarget",
"name" : "cli",
"path" : "Sources/cli",
"product_dependencies" : [
"ArgumentParser"
],
"product_memberships" : [
"dynu"
],
"sources" : [
"IPCommand.swift",
"MainCommand.swift",
"UpdateCommand.swift"
],
"target_dependencies" : [
"DynuREST"
],
"type" : "executable"
},
{
"c99name" : "DynuRESTTests",
"module_type" : "SwiftTarget",
"name" : "DynuRESTTests",
"path" : "Tests/DynuRESTTests",
"sources" : [
"DynuAPITests.swift",
"IPAddressTests.swift"
],
"target_dependencies" : [
"DynuREST"
],
"type" : "test"
},
{
"c99name" : "DynuREST",
"module_type" : "SwiftTarget",
"name" : "DynuREST",
"path" : "Sources/DynuREST",
"product_dependencies" : [
"SessionPlus",
"ShellOut"
],
"product_memberships" : [
"DynuREST",
"dynu"
],
"sources" : [
"DynuClient.swift",
"DynuIPUpdater.swift",
"DynuRESTError.swift",
"IFConfigClient.swift",
"IFConfigCommand.swift",
"IPAddress.swift",
"IPSource.swift",
"IPifyClient.swift",
"ResponseCode.swift",
"URL+DynuREST.swift"
],
"type" : "library"
}
],
"tools_version" : "5.5"
}
{
"workspace" : {
"name" : "spi-builder-workspace",
"schemes" : [
"dynu",
"DynuREST",
"DynuREST-Package"
]
}
}
Running build ...
env DEVELOPER_DIR=/Applications/Xcode-16.3.0.app xcrun xcodebuild -IDEClonedSourcePackagesDirPathOverride=$PWD/.dependencies -skipMacroValidation -skipPackagePluginValidation -derivedDataPath $PWD/.derivedData build -scheme DynuREST-Package -destination generic/platform=iOS
Command line invocation:
/Applications/Xcode-16.3.0.app/Contents/Developer/usr/bin/xcodebuild -IDEClonedSourcePackagesDirPathOverride=/Users/admin/builder/spi-builder-workspace/.dependencies -skipMacroValidation -skipPackagePluginValidation -derivedDataPath /Users/admin/builder/spi-builder-workspace/.derivedData build -scheme DynuREST-Package -destination generic/platform=iOS
Resolve Package Graph
Resolved source packages:
swift-argument-parser: https://github.com/apple/swift-argument-parser.git @ 1.5.0
SessionPlus: https://github.com/richardpiazza/SessionPlus.git @ 2.2.0
DynuREST: /Users/admin/builder/spi-builder-workspace
ShellOut: https://github.com/johnsundell/ShellOut.git @ 2.3.0
AsyncPlus: https://github.com/richardpiazza/AsyncPlus.git @ 0.3.2
ComputePackagePrebuildTargetDependencyGraph
Prepare packages
CreateBuildRequest
SendProjectDescription
CreateBuildOperation
ComputeTargetDependencyGraph
note: Building targets in dependency order
note: Target dependency graph (13 targets)
Target 'dynu' in project 'DynuREST'
➜ Explicit dependency on target 'DynuREST' in project 'DynuREST'
➜ Explicit dependency on target 'SessionPlus' in project 'SessionPlus'
➜ Explicit dependency on target 'ShellOut' in project 'ShellOut'
➜ Explicit dependency on target 'ArgumentParser' in project 'swift-argument-parser'
Target 'ArgumentParser' in project 'swift-argument-parser'
➜ Explicit dependency on target 'ArgumentParser' in project 'swift-argument-parser'
➜ Explicit dependency on target 'ArgumentParserToolInfo' in project 'swift-argument-parser'
Target 'ArgumentParser' in project 'swift-argument-parser'
➜ Explicit dependency on target 'ArgumentParserToolInfo' in project 'swift-argument-parser'
Target 'ArgumentParserToolInfo' in project 'swift-argument-parser' (no dependencies)
Target 'DynuREST' in project 'DynuREST'
➜ Explicit dependency on target 'DynuREST' in project 'DynuREST'
➜ Explicit dependency on target 'SessionPlus' in project 'SessionPlus'
➜ Explicit dependency on target 'ShellOut' in project 'ShellOut'
Target 'DynuREST' in project 'DynuREST'
➜ Explicit dependency on target 'SessionPlus' in project 'SessionPlus'
➜ Explicit dependency on target 'ShellOut' in project 'ShellOut'
Target 'ShellOut' in project 'ShellOut'
➜ Explicit dependency on target 'ShellOut' in project 'ShellOut'
Target 'ShellOut' in project 'ShellOut' (no dependencies)
Target 'SessionPlus' in project 'SessionPlus'
➜ Explicit dependency on target 'SessionPlus' in project 'SessionPlus'
➜ Explicit dependency on target 'SessionPlusEmulation' in project 'SessionPlus'
➜ Explicit dependency on target 'AsyncPlus' in project 'AsyncPlus'
Target 'SessionPlusEmulation' in project 'SessionPlus'
➜ Explicit dependency on target 'SessionPlus' in project 'SessionPlus'
➜ Explicit dependency on target 'AsyncPlus' in project 'AsyncPlus'
Target 'SessionPlus' in project 'SessionPlus'
➜ Explicit dependency on target 'AsyncPlus' in project 'AsyncPlus'
Target 'AsyncPlus' in project 'AsyncPlus'
➜ Explicit dependency on target 'AsyncPlus' in project 'AsyncPlus'
Target 'AsyncPlus' in project 'AsyncPlus' (no dependencies)
GatherProvisioningInputs
CreateBuildDescription
ExecuteExternalTool /Applications/Xcode-16.3.0.app/Contents/Developer/Toolchains/XcodeDefault.xctoolchain/usr/bin/swiftc --version
ExecuteExternalTool /Applications/Xcode-16.3.0.app/Contents/Developer/Toolchains/XcodeDefault.xctoolchain/usr/bin/clang -v -E -dM -isysroot /Applications/Xcode-16.3.0.app/Contents/Developer/Platforms/iPhoneOS.platform/Developer/SDKs/iPhoneOS18.4.sdk -x c -c /dev/null
ExecuteExternalTool /Applications/Xcode-16.3.0.app/Contents/Developer/Toolchains/XcodeDefault.xctoolchain/usr/bin/ld -version_details
ReadFileContents /Applications/Xcode-16.3.0.app/Contents/Developer/Toolchains/XcodeDefault.xctoolchain/usr/share/docc/features.json
Build description signature: b3169dbb4c216ac924ae5c517b0c9b50
Build description path: /Users/admin/builder/spi-builder-workspace/.derivedData/Build/Intermediates.noindex/XCBuildData/b3169dbb4c216ac924ae5c517b0c9b50.xcbuilddata
ClangStatCache /Applications/Xcode-16.3.0.app/Contents/Developer/Toolchains/XcodeDefault.xctoolchain/usr/bin/clang-stat-cache /Applications/Xcode-16.3.0.app/Contents/Developer/Platforms/iPhoneOS.platform/Developer/SDKs/iPhoneOS18.4.sdk /Users/admin/builder/spi-builder-workspace/.derivedData/SDKStatCaches.noindex/iphoneos18.4-22E235-339d34bc69d7fc736c3220795c36f340.sdkstatcache
cd /Users/admin/builder/spi-builder-workspace/.swiftpm/xcode
/Applications/Xcode-16.3.0.app/Contents/Developer/Toolchains/XcodeDefault.xctoolchain/usr/bin/clang-stat-cache /Applications/Xcode-16.3.0.app/Contents/Developer/Platforms/iPhoneOS.platform/Developer/SDKs/iPhoneOS18.4.sdk -o /Users/admin/builder/spi-builder-workspace/.derivedData/SDKStatCaches.noindex/iphoneos18.4-22E235-339d34bc69d7fc736c3220795c36f340.sdkstatcache
SwiftDriver ShellOut normal arm64 com.apple.xcode.tools.swift.compiler (in target 'ShellOut' from project 'ShellOut')
cd /Users/admin/builder/spi-builder-workspace/.swiftpm/xcode
builtin-SwiftDriver -- /Applications/Xcode-16.3.0.app/Contents/Developer/Toolchains/XcodeDefault.xctoolchain/usr/bin/swiftc -module-name ShellOut -Onone -enforce-exclusivity\=checked @/Users/admin/builder/spi-builder-workspace/.derivedData/Build/Intermediates.noindex/ShellOut.build/Debug-iphoneos/ShellOut.build/Objects-normal/arm64/ShellOut.SwiftFileList -DSWIFT_PACKAGE -DDEBUG -DXcode -plugin-path /Applications/Xcode-16.3.0.app/Contents/Developer/Toolchains/XcodeDefault.xctoolchain/usr/lib/swift/host/plugins/testing -enable-experimental-feature DebugDescriptionMacro -sdk /Applications/Xcode-16.3.0.app/Contents/Developer/Platforms/iPhoneOS.platform/Developer/SDKs/iPhoneOS18.4.sdk -target arm64-apple-ios12.0 -g -module-cache-path /Users/admin/builder/spi-builder-workspace/.derivedData/ModuleCache.noindex -Xfrontend -serialize-debugging-options -profile-coverage-mapping -profile-generate -enable-testing -suppress-warnings -index-store-path /Users/admin/builder/spi-builder-workspace/.derivedData/Index.noindex/DataStore -swift-version 4.2 -I /Users/admin/builder/spi-builder-workspace/.derivedData/Build/Products/Debug-iphoneos -I /Applications/Xcode-16.3.0.app/Contents/Developer/Platforms/iPhoneOS.platform/Developer/usr/lib -F /Users/admin/builder/spi-builder-workspace/.derivedData/Build/Products/Debug-iphoneos -F /Applications/Xcode-16.3.0.app/Contents/Developer/Platforms/iPhoneOS.platform/Developer/Library/Frameworks -F /Applications/Xcode-16.3.0.app/Contents/Developer/Platforms/iPhoneOS.platform/Developer/SDKs/iPhoneOS18.4.sdk/Developer/Library/Frameworks -parse-as-library -c -j10 -enable-batch-mode -incremental -Xcc -ivfsstatcache -Xcc /Users/admin/builder/spi-builder-workspace/.derivedData/SDKStatCaches.noindex/iphoneos18.4-22E235-339d34bc69d7fc736c3220795c36f340.sdkstatcache -output-file-map /Users/admin/builder/spi-builder-workspace/.derivedData/Build/Intermediates.noindex/ShellOut.build/Debug-iphoneos/ShellOut.build/Objects-normal/arm64/ShellOut-OutputFileMap.json -use-frontend-parseable-output -save-temps -no-color-diagnostics -serialize-diagnostics -emit-dependencies -emit-module -emit-module-path /Users/admin/builder/spi-builder-workspace/.derivedData/Build/Intermediates.noindex/ShellOut.build/Debug-iphoneos/ShellOut.build/Objects-normal/arm64/ShellOut.swiftmodule -validate-clang-modules-once -clang-build-session-file /Users/admin/builder/spi-builder-workspace/.derivedData/ModuleCache.noindex/Session.modulevalidation -Xcc -I/Users/admin/builder/spi-builder-workspace/.derivedData/Build/Intermediates.noindex/ShellOut.build/Debug-iphoneos/ShellOut.build/swift-overrides.hmap -emit-const-values -Xfrontend -const-gather-protocols-file -Xfrontend /Users/admin/builder/spi-builder-workspace/.derivedData/Build/Intermediates.noindex/ShellOut.build/Debug-iphoneos/ShellOut.build/Objects-normal/arm64/ShellOut_const_extract_protocols.json -Xcc -I/Users/admin/builder/spi-builder-workspace/.derivedData/Build/Products/Debug-iphoneos/include -Xcc -I/Users/admin/builder/spi-builder-workspace/.derivedData/Build/Intermediates.noindex/ShellOut.build/Debug-iphoneos/ShellOut.build/DerivedSources-normal/arm64 -Xcc -I/Users/admin/builder/spi-builder-workspace/.derivedData/Build/Intermediates.noindex/ShellOut.build/Debug-iphoneos/ShellOut.build/DerivedSources/arm64 -Xcc -I/Users/admin/builder/spi-builder-workspace/.derivedData/Build/Intermediates.noindex/ShellOut.build/Debug-iphoneos/ShellOut.build/DerivedSources -Xcc -DSWIFT_PACKAGE -Xcc -DDEBUG\=1 -emit-objc-header -emit-objc-header-path /Users/admin/builder/spi-builder-workspace/.derivedData/Build/Intermediates.noindex/ShellOut.build/Debug-iphoneos/ShellOut.build/Objects-normal/arm64/ShellOut-Swift.h -working-directory /Users/admin/builder/spi-builder-workspace/.swiftpm/xcode -experimental-emit-module-separately -disable-cmo
SwiftDriver ArgumentParserToolInfo normal arm64 com.apple.xcode.tools.swift.compiler (in target 'ArgumentParserToolInfo' from project 'swift-argument-parser')
cd /Users/admin/builder/spi-builder-workspace/.swiftpm/xcode
builtin-SwiftDriver -- /Applications/Xcode-16.3.0.app/Contents/Developer/Toolchains/XcodeDefault.xctoolchain/usr/bin/swiftc -module-name ArgumentParserToolInfo -Onone -enforce-exclusivity\=checked @/Users/admin/builder/spi-builder-workspace/.derivedData/Build/Intermediates.noindex/swift-argument-parser.build/Debug-iphoneos/ArgumentParserToolInfo.build/Objects-normal/arm64/ArgumentParserToolInfo.SwiftFileList -DSWIFT_PACKAGE -DDEBUG -DXcode -plugin-path /Applications/Xcode-16.3.0.app/Contents/Developer/Toolchains/XcodeDefault.xctoolchain/usr/lib/swift/host/plugins/testing -enable-experimental-feature DebugDescriptionMacro -sdk /Applications/Xcode-16.3.0.app/Contents/Developer/Platforms/iPhoneOS.platform/Developer/SDKs/iPhoneOS18.4.sdk -target arm64-apple-ios12.0 -g -module-cache-path /Users/admin/builder/spi-builder-workspace/.derivedData/ModuleCache.noindex -Xfrontend -serialize-debugging-options -profile-coverage-mapping -profile-generate -enable-testing -suppress-warnings -index-store-path /Users/admin/builder/spi-builder-workspace/.derivedData/Index.noindex/DataStore -swift-version 5 -I /Users/admin/builder/spi-builder-workspace/.derivedData/Build/Products/Debug-iphoneos -I /Applications/Xcode-16.3.0.app/Contents/Developer/Platforms/iPhoneOS.platform/Developer/usr/lib -F /Users/admin/builder/spi-builder-workspace/.derivedData/Build/Products/Debug-iphoneos -F /Applications/Xcode-16.3.0.app/Contents/Developer/Platforms/iPhoneOS.platform/Developer/Library/Frameworks -F /Applications/Xcode-16.3.0.app/Contents/Developer/Platforms/iPhoneOS.platform/Developer/SDKs/iPhoneOS18.4.sdk/Developer/Library/Frameworks -parse-as-library -c -j10 -enable-batch-mode -incremental -Xcc -ivfsstatcache -Xcc /Users/admin/builder/spi-builder-workspace/.derivedData/SDKStatCaches.noindex/iphoneos18.4-22E235-339d34bc69d7fc736c3220795c36f340.sdkstatcache -output-file-map /Users/admin/builder/spi-builder-workspace/.derivedData/Build/Intermediates.noindex/swift-argument-parser.build/Debug-iphoneos/ArgumentParserToolInfo.build/Objects-normal/arm64/ArgumentParserToolInfo-OutputFileMap.json -use-frontend-parseable-output -save-temps -no-color-diagnostics -serialize-diagnostics -emit-dependencies -emit-module -emit-module-path /Users/admin/builder/spi-builder-workspace/.derivedData/Build/Intermediates.noindex/swift-argument-parser.build/Debug-iphoneos/ArgumentParserToolInfo.build/Objects-normal/arm64/ArgumentParserToolInfo.swiftmodule -validate-clang-modules-once -clang-build-session-file /Users/admin/builder/spi-builder-workspace/.derivedData/ModuleCache.noindex/Session.modulevalidation -Xcc -I/Users/admin/builder/spi-builder-workspace/.derivedData/Build/Intermediates.noindex/swift-argument-parser.build/Debug-iphoneos/ArgumentParserToolInfo.build/swift-overrides.hmap -emit-const-values -Xfrontend -const-gather-protocols-file -Xfrontend /Users/admin/builder/spi-builder-workspace/.derivedData/Build/Intermediates.noindex/swift-argument-parser.build/Debug-iphoneos/ArgumentParserToolInfo.build/Objects-normal/arm64/ArgumentParserToolInfo_const_extract_protocols.json -Xcc -I/Users/admin/builder/spi-builder-workspace/.derivedData/Build/Products/Debug-iphoneos/include -Xcc -I/Users/admin/builder/spi-builder-workspace/.derivedData/Build/Intermediates.noindex/swift-argument-parser.build/Debug-iphoneos/ArgumentParserToolInfo.build/DerivedSources-normal/arm64 -Xcc -I/Users/admin/builder/spi-builder-workspace/.derivedData/Build/Intermediates.noindex/swift-argument-parser.build/Debug-iphoneos/ArgumentParserToolInfo.build/DerivedSources/arm64 -Xcc -I/Users/admin/builder/spi-builder-workspace/.derivedData/Build/Intermediates.noindex/swift-argument-parser.build/Debug-iphoneos/ArgumentParserToolInfo.build/DerivedSources -Xcc -DSWIFT_PACKAGE -Xcc -DDEBUG\=1 -emit-objc-header -emit-objc-header-path /Users/admin/builder/spi-builder-workspace/.derivedData/Build/Intermediates.noindex/swift-argument-parser.build/Debug-iphoneos/ArgumentParserToolInfo.build/Objects-normal/arm64/ArgumentParserToolInfo-Swift.h -working-directory /Users/admin/builder/spi-builder-workspace/.swiftpm/xcode -experimental-emit-module-separately -disable-cmo
SwiftDriver AsyncPlus normal arm64 com.apple.xcode.tools.swift.compiler (in target 'AsyncPlus' from project 'AsyncPlus')
cd /Users/admin/builder/spi-builder-workspace/.swiftpm/xcode
builtin-SwiftDriver -- /Applications/Xcode-16.3.0.app/Contents/Developer/Toolchains/XcodeDefault.xctoolchain/usr/bin/swiftc -module-name AsyncPlus -Onone -enforce-exclusivity\=checked @/Users/admin/builder/spi-builder-workspace/.derivedData/Build/Intermediates.noindex/AsyncPlus.build/Debug-iphoneos/AsyncPlus.build/Objects-normal/arm64/AsyncPlus.SwiftFileList -DSWIFT_PACKAGE -DDEBUG -DXcode -enable-experimental-feature StrictConcurrency -plugin-path /Applications/Xcode-16.3.0.app/Contents/Developer/Toolchains/XcodeDefault.xctoolchain/usr/lib/swift/host/plugins/testing -enable-experimental-feature DebugDescriptionMacro -sdk /Applications/Xcode-16.3.0.app/Contents/Developer/Platforms/iPhoneOS.platform/Developer/SDKs/iPhoneOS18.4.sdk -target arm64-apple-ios15.0 -g -module-cache-path /Users/admin/builder/spi-builder-workspace/.derivedData/ModuleCache.noindex -Xfrontend -serialize-debugging-options -profile-coverage-mapping -profile-generate -enable-testing -suppress-warnings -index-store-path /Users/admin/builder/spi-builder-workspace/.derivedData/Index.noindex/DataStore -swift-version 5 -I /Users/admin/builder/spi-builder-workspace/.derivedData/Build/Products/Debug-iphoneos -I /Applications/Xcode-16.3.0.app/Contents/Developer/Platforms/iPhoneOS.platform/Developer/usr/lib -F /Users/admin/builder/spi-builder-workspace/.derivedData/Build/Products/Debug-iphoneos -F /Applications/Xcode-16.3.0.app/Contents/Developer/Platforms/iPhoneOS.platform/Developer/Library/Frameworks -F /Applications/Xcode-16.3.0.app/Contents/Developer/Platforms/iPhoneOS.platform/Developer/SDKs/iPhoneOS18.4.sdk/Developer/Library/Frameworks -c -j10 -enable-batch-mode -incremental -Xcc -ivfsstatcache -Xcc /Users/admin/builder/spi-builder-workspace/.derivedData/SDKStatCaches.noindex/iphoneos18.4-22E235-339d34bc69d7fc736c3220795c36f340.sdkstatcache -output-file-map /Users/admin/builder/spi-builder-workspace/.derivedData/Build/Intermediates.noindex/AsyncPlus.build/Debug-iphoneos/AsyncPlus.build/Objects-normal/arm64/AsyncPlus-OutputFileMap.json -use-frontend-parseable-output -save-temps -no-color-diagnostics -serialize-diagnostics -emit-dependencies -emit-module -emit-module-path /Users/admin/builder/spi-builder-workspace/.derivedData/Build/Intermediates.noindex/AsyncPlus.build/Debug-iphoneos/AsyncPlus.build/Objects-normal/arm64/AsyncPlus.swiftmodule -validate-clang-modules-once -clang-build-session-file /Users/admin/builder/spi-builder-workspace/.derivedData/ModuleCache.noindex/Session.modulevalidation -Xcc -I/Users/admin/builder/spi-builder-workspace/.derivedData/Build/Intermediates.noindex/AsyncPlus.build/Debug-iphoneos/AsyncPlus.build/swift-overrides.hmap -emit-const-values -Xfrontend -const-gather-protocols-file -Xfrontend /Users/admin/builder/spi-builder-workspace/.derivedData/Build/Intermediates.noindex/AsyncPlus.build/Debug-iphoneos/AsyncPlus.build/Objects-normal/arm64/AsyncPlus_const_extract_protocols.json -Xcc -I/Users/admin/builder/spi-builder-workspace/.derivedData/Build/Products/Debug-iphoneos/include -Xcc -I/Users/admin/builder/spi-builder-workspace/.derivedData/Build/Intermediates.noindex/AsyncPlus.build/Debug-iphoneos/AsyncPlus.build/DerivedSources-normal/arm64 -Xcc -I/Users/admin/builder/spi-builder-workspace/.derivedData/Build/Intermediates.noindex/AsyncPlus.build/Debug-iphoneos/AsyncPlus.build/DerivedSources/arm64 -Xcc -I/Users/admin/builder/spi-builder-workspace/.derivedData/Build/Intermediates.noindex/AsyncPlus.build/Debug-iphoneos/AsyncPlus.build/DerivedSources -Xcc -DSWIFT_PACKAGE -Xcc -DDEBUG\=1 -emit-objc-header -emit-objc-header-path /Users/admin/builder/spi-builder-workspace/.derivedData/Build/Intermediates.noindex/AsyncPlus.build/Debug-iphoneos/AsyncPlus.build/Objects-normal/arm64/AsyncPlus-Swift.h -working-directory /Users/admin/builder/spi-builder-workspace/.swiftpm/xcode -experimental-emit-module-separately -disable-cmo
SwiftEmitModule normal arm64 Emitting\ module\ for\ ShellOut (in target 'ShellOut' from project 'ShellOut')
SwiftCompile normal arm64 /Users/admin/builder/spi-builder-workspace/.dependencies/checkouts/ShellOut/Sources/ShellOut.swift (in target 'ShellOut' from project 'ShellOut')
cd /Users/admin/builder/spi-builder-workspace/.swiftpm/xcode
/Users/admin/builder/spi-builder-workspace/.dependencies/checkouts/ShellOut/Sources/ShellOut.swift:34:14: error: cannot find type 'Process' in scope
process: Process = .init(),
^~~~~~~
/Users/admin/builder/spi-builder-workspace/.dependencies/checkouts/ShellOut/Sources/ShellOut.swift:67:14: error: cannot find type 'Process' in scope
process: Process = .init(),
^~~~~~~
/Users/admin/builder/spi-builder-workspace/.dependencies/checkouts/ShellOut/Sources/ShellOut.swift:102:14: error: cannot find type 'Process' in scope
process: Process = .init(),
^~~~~~~
/Users/admin/builder/spi-builder-workspace/.dependencies/checkouts/ShellOut/Sources/ShellOut.swift:377:19: error: cannot find type 'Process' in scope
private extension Process {
^~~~~~~
Failed frontend command:
/Applications/Xcode-16.3.0.app/Contents/Developer/Toolchains/XcodeDefault.xctoolchain/usr/bin/swift-frontend -frontend -emit-module -experimental-skip-non-inlinable-function-bodies-without-types /Users/admin/builder/spi-builder-workspace/.dependencies/checkouts/ShellOut/Sources/ShellOut.swift -target arm64-apple-ios12.0 -Xllvm -aarch64-use-tbi -enable-objc-interop -sdk /Applications/Xcode-16.3.0.app/Contents/Developer/Platforms/iPhoneOS.platform/Developer/SDKs/iPhoneOS18.4.sdk -I /Users/admin/builder/spi-builder-workspace/.derivedData/Build/Products/Debug-iphoneos -I /Applications/Xcode-16.3.0.app/Contents/Developer/Platforms/iPhoneOS.platform/Developer/usr/lib -F /Users/admin/builder/spi-builder-workspace/.derivedData/Build/Products/Debug-iphoneos -F /Applications/Xcode-16.3.0.app/Contents/Developer/Platforms/iPhoneOS.platform/Developer/Library/Frameworks -F /Applications/Xcode-16.3.0.app/Contents/Developer/Platforms/iPhoneOS.platform/Developer/SDKs/iPhoneOS18.4.sdk/Developer/Library/Frameworks -no-color-diagnostics -enable-testing -g -debug-info-format\=dwarf -dwarf-version\=4 -module-cache-path /Users/admin/builder/spi-builder-workspace/.derivedData/ModuleCache.noindex -suppress-warnings -profile-generate -profile-coverage-mapping -swift-version 4.2 -enforce-exclusivity\=checked -Onone -D SWIFT_PACKAGE -D DEBUG -D Xcode -serialize-debugging-options -const-gather-protocols-file /Users/admin/builder/spi-builder-workspace/.derivedData/Build/Intermediates.noindex/ShellOut.build/Debug-iphoneos/ShellOut.build/Objects-normal/arm64/ShellOut_const_extract_protocols.json -enable-experimental-feature DebugDescriptionMacro -empty-abi-descriptor -plugin-path /Applications/Xcode-16.3.0.app/Contents/Developer/Toolchains/XcodeDefault.xctoolchain/usr/lib/swift/host/plugins/testing -validate-clang-modules-once -clang-build-session-file /Users/admin/builder/spi-builder-workspace/.derivedData/ModuleCache.noindex/Session.modulevalidation -Xcc -working-directory -Xcc /Users/admin/builder/spi-builder-workspace/.swiftpm/xcode -resource-dir /Applications/Xcode-16.3.0.app/Contents/Developer/Toolchains/XcodeDefault.xctoolchain/usr/lib/swift -enable-anonymous-context-mangled-names -file-compilation-dir /Users/admin/builder/spi-builder-workspace/.swiftpm/xcode -Xcc -ivfsstatcache -Xcc /Users/admin/builder/spi-builder-workspace/.derivedData/SDKStatCaches.noindex/iphoneos18.4-22E235-339d34bc69d7fc736c3220795c36f340.sdkstatcache -Xcc -I/Users/admin/builder/spi-builder-workspace/.derivedData/Build/Intermediates.noindex/ShellOut.build/Debug-iphoneos/ShellOut.build/swift-overrides.hmap -Xcc -I/Users/admin/builder/spi-builder-workspace/.derivedData/Build/Products/Debug-iphoneos/include -Xcc -I/Users/admin/builder/spi-builder-workspace/.derivedData/Build/Intermediates.noindex/ShellOut.build/Debug-iphoneos/ShellOut.build/DerivedSources-normal/arm64 -Xcc -I/Users/admin/builder/spi-builder-workspace/.derivedData/Build/Intermediates.noindex/ShellOut.build/Debug-iphoneos/ShellOut.build/DerivedSources/arm64 -Xcc -I/Users/admin/builder/spi-builder-workspace/.derivedData/Build/Intermediates.noindex/ShellOut.build/Debug-iphoneos/ShellOut.build/DerivedSources -Xcc -DSWIFT_PACKAGE -Xcc -DDEBUG\=1 -module-name ShellOut -frontend-parseable-output -disable-clang-spi -target-sdk-version 18.4 -target-sdk-name iphoneos18.4 -external-plugin-path /Applications/Xcode-16.3.0.app/Contents/Developer/Platforms/iPhoneOS.platform/Developer/usr/lib/swift/host/plugins\#/Applications/Xcode-16.3.0.app/Contents/Developer/Platforms/iPhoneOS.platform/Developer/usr/bin/swift-plugin-server -external-plugin-path /Applications/Xcode-16.3.0.app/Contents/Developer/Platforms/iPhoneOS.platform/Developer/usr/local/lib/swift/host/plugins\#/Applications/Xcode-16.3.0.app/Contents/Developer/Platforms/iPhoneOS.platform/Developer/usr/bin/swift-plugin-server -in-process-plugin-server-path /Applications/Xcode-16.3.0.app/Contents/Developer/Toolchains/XcodeDefault.xctoolchain/usr/lib/swift/host/libSwiftInProcPluginServer.dylib -plugin-path /Applications/Xcode-16.3.0.app/Contents/Developer/Toolchains/XcodeDefault.xctoolchain/usr/lib/swift/host/plugins -plugin-path /Applications/Xcode-16.3.0.app/Contents/Developer/Toolchains/XcodeDefault.xctoolchain/usr/local/lib/swift/host/plugins -emit-module-doc-path /Users/admin/builder/spi-builder-workspace/.derivedData/Build/Intermediates.noindex/ShellOut.build/Debug-iphoneos/ShellOut.build/Objects-normal/arm64/ShellOut.swiftdoc -emit-module-source-info-path /Users/admin/builder/spi-builder-workspace/.derivedData/Build/Intermediates.noindex/ShellOut.build/Debug-iphoneos/ShellOut.build/Objects-normal/arm64/ShellOut.swiftsourceinfo -emit-objc-header-path /Users/admin/builder/spi-builder-workspace/.derivedData/Build/Intermediates.noindex/ShellOut.build/Debug-iphoneos/ShellOut.build/Objects-normal/arm64/ShellOut-Swift.h -serialize-diagnostics-path /Users/admin/builder/spi-builder-workspace/.derivedData/Build/Intermediates.noindex/ShellOut.build/Debug-iphoneos/ShellOut.build/Objects-normal/arm64/ShellOut-master-emit-module.dia -emit-dependencies-path /Users/admin/builder/spi-builder-workspace/.derivedData/Build/Intermediates.noindex/ShellOut.build/Debug-iphoneos/ShellOut.build/Objects-normal/arm64/ShellOut-master-emit-module.d -parse-as-library -o /Users/admin/builder/spi-builder-workspace/.derivedData/Build/Intermediates.noindex/ShellOut.build/Debug-iphoneos/ShellOut.build/Objects-normal/arm64/ShellOut.swiftmodule -emit-abi-descriptor-path /Users/admin/builder/spi-builder-workspace/.derivedData/Build/Intermediates.noindex/ShellOut.build/Debug-iphoneos/ShellOut.build/Objects-normal/arm64/ShellOut.abi.json
SwiftCompile normal arm64 Compiling\ ShellOut.swift /Users/admin/builder/spi-builder-workspace/.dependencies/checkouts/ShellOut/Sources/ShellOut.swift (in target 'ShellOut' from project 'ShellOut')
SwiftCompile normal arm64 /Users/admin/builder/spi-builder-workspace/.dependencies/checkouts/ShellOut/Sources/ShellOut.swift (in target 'ShellOut' from project 'ShellOut')
cd /Users/admin/builder/spi-builder-workspace/.swiftpm/xcode
SwiftCompile normal arm64 Compiling\ CurrentValueAsyncThrowingSubject.swift /Users/admin/builder/spi-builder-workspace/.dependencies/checkouts/AsyncPlus/Sources/AsyncPlus/CurrentValueAsyncThrowingSubject.swift (in target 'AsyncPlus' from project 'AsyncPlus')
SwiftCompile normal arm64 /Users/admin/builder/spi-builder-workspace/.dependencies/checkouts/AsyncPlus/Sources/AsyncPlus/CurrentValueAsyncThrowingSubject.swift (in target 'AsyncPlus' from project 'AsyncPlus')
cd /Users/admin/builder/spi-builder-workspace/.swiftpm/xcode
SwiftEmitModule normal arm64 Emitting\ module\ for\ ArgumentParserToolInfo (in target 'ArgumentParserToolInfo' from project 'swift-argument-parser')
SwiftCompile normal arm64 /Users/admin/builder/spi-builder-workspace/.dependencies/checkouts/swift-argument-parser/Sources/ArgumentParserToolInfo/ToolInfo.swift (in target 'ArgumentParserToolInfo' from project 'swift-argument-parser')
cd /Users/admin/builder/spi-builder-workspace/.swiftpm/xcode
SwiftCompile normal arm64 Compiling\ CurrentValueAsyncSubject.swift /Users/admin/builder/spi-builder-workspace/.dependencies/checkouts/AsyncPlus/Sources/AsyncPlus/CurrentValueAsyncSubject.swift (in target 'AsyncPlus' from project 'AsyncPlus')
SwiftCompile normal arm64 /Users/admin/builder/spi-builder-workspace/.dependencies/checkouts/AsyncPlus/Sources/AsyncPlus/CurrentValueAsyncSubject.swift (in target 'AsyncPlus' from project 'AsyncPlus')
cd /Users/admin/builder/spi-builder-workspace/.swiftpm/xcode
SwiftCompile normal arm64 Compiling\ PassthroughAsyncSequence.swift /Users/admin/builder/spi-builder-workspace/.dependencies/checkouts/AsyncPlus/Sources/AsyncPlus/PassthroughAsyncSequence.swift (in target 'AsyncPlus' from project 'AsyncPlus')
SwiftCompile normal arm64 /Users/admin/builder/spi-builder-workspace/.dependencies/checkouts/AsyncPlus/Sources/AsyncPlus/PassthroughAsyncSequence.swift (in target 'AsyncPlus' from project 'AsyncPlus')
cd /Users/admin/builder/spi-builder-workspace/.swiftpm/xcode
SwiftCompile normal arm64 Compiling\ PassthroughAsyncThrowingSequence.swift /Users/admin/builder/spi-builder-workspace/.dependencies/checkouts/AsyncPlus/Sources/AsyncPlus/PassthroughAsyncThrowingSequence.swift (in target 'AsyncPlus' from project 'AsyncPlus')
SwiftCompile normal arm64 /Users/admin/builder/spi-builder-workspace/.dependencies/checkouts/AsyncPlus/Sources/AsyncPlus/PassthroughAsyncThrowingSequence.swift (in target 'AsyncPlus' from project 'AsyncPlus')
cd /Users/admin/builder/spi-builder-workspace/.swiftpm/xcode
SwiftCompile normal arm64 Compiling\ PassthroughAsyncSubject.swift /Users/admin/builder/spi-builder-workspace/.dependencies/checkouts/AsyncPlus/Sources/AsyncPlus/PassthroughAsyncSubject.swift (in target 'AsyncPlus' from project 'AsyncPlus')
SwiftCompile normal arm64 /Users/admin/builder/spi-builder-workspace/.dependencies/checkouts/AsyncPlus/Sources/AsyncPlus/PassthroughAsyncSubject.swift (in target 'AsyncPlus' from project 'AsyncPlus')
cd /Users/admin/builder/spi-builder-workspace/.swiftpm/xcode
SwiftEmitModule normal arm64 Emitting\ module\ for\ AsyncPlus (in target 'AsyncPlus' from project 'AsyncPlus')
EmitSwiftModule normal arm64 (in target 'AsyncPlus' from project 'AsyncPlus')
cd /Users/admin/builder/spi-builder-workspace/.swiftpm/xcode
SwiftCompile normal arm64 Compiling\ PassthroughAsyncThrowingSubject.swift /Users/admin/builder/spi-builder-workspace/.dependencies/checkouts/AsyncPlus/Sources/AsyncPlus/PassthroughAsyncThrowingSubject.swift (in target 'AsyncPlus' from project 'AsyncPlus')
SwiftCompile normal arm64 /Users/admin/builder/spi-builder-workspace/.dependencies/checkouts/AsyncPlus/Sources/AsyncPlus/PassthroughAsyncThrowingSubject.swift (in target 'AsyncPlus' from project 'AsyncPlus')
cd /Users/admin/builder/spi-builder-workspace/.swiftpm/xcode
SwiftCompile normal arm64 Compiling\ ToolInfo.swift /Users/admin/builder/spi-builder-workspace/.dependencies/checkouts/swift-argument-parser/Sources/ArgumentParserToolInfo/ToolInfo.swift (in target 'ArgumentParserToolInfo' from project 'swift-argument-parser')
SwiftDriverJobDiscovery normal arm64 Emitting module for ArgumentParserToolInfo (in target 'ArgumentParserToolInfo' from project 'swift-argument-parser')
SwiftDriver\ Compilation\ Requirements ArgumentParserToolInfo normal arm64 com.apple.xcode.tools.swift.compiler (in target 'ArgumentParserToolInfo' from project 'swift-argument-parser')
cd /Users/admin/builder/spi-builder-workspace/.swiftpm/xcode
builtin-Swift-Compilation-Requirements -- /Applications/Xcode-16.3.0.app/Contents/Developer/Toolchains/XcodeDefault.xctoolchain/usr/bin/swiftc -module-name ArgumentParserToolInfo -Onone -enforce-exclusivity\=checked @/Users/admin/builder/spi-builder-workspace/.derivedData/Build/Intermediates.noindex/swift-argument-parser.build/Debug-iphoneos/ArgumentParserToolInfo.build/Objects-normal/arm64/ArgumentParserToolInfo.SwiftFileList -DSWIFT_PACKAGE -DDEBUG -DXcode -plugin-path /Applications/Xcode-16.3.0.app/Contents/Developer/Toolchains/XcodeDefault.xctoolchain/usr/lib/swift/host/plugins/testing -enable-experimental-feature DebugDescriptionMacro -sdk /Applications/Xcode-16.3.0.app/Contents/Developer/Platforms/iPhoneOS.platform/Developer/SDKs/iPhoneOS18.4.sdk -target arm64-apple-ios12.0 -g -module-cache-path /Users/admin/builder/spi-builder-workspace/.derivedData/ModuleCache.noindex -Xfrontend -serialize-debugging-options -profile-coverage-mapping -profile-generate -enable-testing -suppress-warnings -index-store-path /Users/admin/builder/spi-builder-workspace/.derivedData/Index.noindex/DataStore -swift-version 5 -I /Users/admin/builder/spi-builder-workspace/.derivedData/Build/Products/Debug-iphoneos -I /Applications/Xcode-16.3.0.app/Contents/Developer/Platforms/iPhoneOS.platform/Developer/usr/lib -F /Users/admin/builder/spi-builder-workspace/.derivedData/Build/Products/Debug-iphoneos -F /Applications/Xcode-16.3.0.app/Contents/Developer/Platforms/iPhoneOS.platform/Developer/Library/Frameworks -F /Applications/Xcode-16.3.0.app/Contents/Developer/Platforms/iPhoneOS.platform/Developer/SDKs/iPhoneOS18.4.sdk/Developer/Library/Frameworks -parse-as-library -c -j10 -enable-batch-mode -incremental -Xcc -ivfsstatcache -Xcc /Users/admin/builder/spi-builder-workspace/.derivedData/SDKStatCaches.noindex/iphoneos18.4-22E235-339d34bc69d7fc736c3220795c36f340.sdkstatcache -output-file-map /Users/admin/builder/spi-builder-workspace/.derivedData/Build/Intermediates.noindex/swift-argument-parser.build/Debug-iphoneos/ArgumentParserToolInfo.build/Objects-normal/arm64/ArgumentParserToolInfo-OutputFileMap.json -use-frontend-parseable-output -save-temps -no-color-diagnostics -serialize-diagnostics -emit-dependencies -emit-module -emit-module-path /Users/admin/builder/spi-builder-workspace/.derivedData/Build/Intermediates.noindex/swift-argument-parser.build/Debug-iphoneos/ArgumentParserToolInfo.build/Objects-normal/arm64/ArgumentParserToolInfo.swiftmodule -validate-clang-modules-once -clang-build-session-file /Users/admin/builder/spi-builder-workspace/.derivedData/ModuleCache.noindex/Session.modulevalidation -Xcc -I/Users/admin/builder/spi-builder-workspace/.derivedData/Build/Intermediates.noindex/swift-argument-parser.build/Debug-iphoneos/ArgumentParserToolInfo.build/swift-overrides.hmap -emit-const-values -Xfrontend -const-gather-protocols-file -Xfrontend /Users/admin/builder/spi-builder-workspace/.derivedData/Build/Intermediates.noindex/swift-argument-parser.build/Debug-iphoneos/ArgumentParserToolInfo.build/Objects-normal/arm64/ArgumentParserToolInfo_const_extract_protocols.json -Xcc -I/Users/admin/builder/spi-builder-workspace/.derivedData/Build/Products/Debug-iphoneos/include -Xcc -I/Users/admin/builder/spi-builder-workspace/.derivedData/Build/Intermediates.noindex/swift-argument-parser.build/Debug-iphoneos/ArgumentParserToolInfo.build/DerivedSources-normal/arm64 -Xcc -I/Users/admin/builder/spi-builder-workspace/.derivedData/Build/Intermediates.noindex/swift-argument-parser.build/Debug-iphoneos/ArgumentParserToolInfo.build/DerivedSources/arm64 -Xcc -I/Users/admin/builder/spi-builder-workspace/.derivedData/Build/Intermediates.noindex/swift-argument-parser.build/Debug-iphoneos/ArgumentParserToolInfo.build/DerivedSources -Xcc -DSWIFT_PACKAGE -Xcc -DDEBUG\=1 -emit-objc-header -emit-objc-header-path /Users/admin/builder/spi-builder-workspace/.derivedData/Build/Intermediates.noindex/swift-argument-parser.build/Debug-iphoneos/ArgumentParserToolInfo.build/Objects-normal/arm64/ArgumentParserToolInfo-Swift.h -working-directory /Users/admin/builder/spi-builder-workspace/.swiftpm/xcode -experimental-emit-module-separately -disable-cmo
** BUILD FAILED **
The following build commands failed:
SwiftCompile normal arm64 /Users/admin/builder/spi-builder-workspace/.dependencies/checkouts/ShellOut/Sources/ShellOut.swift (in target 'ShellOut' from project 'ShellOut')
SwiftEmitModule normal arm64 Emitting\ module\ for\ ShellOut (in target 'ShellOut' from project 'ShellOut')
Building workspace spi-builder-workspace with scheme DynuREST-Package
(3 failures)
BUILD FAILURE 6.1 iOS