The Swift Package Index logo.Swift Package Index

Track the adoption of Swift 6 strict concurrency checks for data race safety. How many packages are Ready for Swift 6?

Build Information

Failed to build RakuyoKit, reference main (f3ac70), with Swift 6.1 for watchOS using Xcode 16.3 on 1 May 2025 04:41:34 UTC.

Build Command

env DEVELOPER_DIR=/Applications/Xcode-16.3.0.app xcrun xcodebuild -IDEClonedSourcePackagesDirPathOverride=$PWD/.dependencies -skipMacroValidation -skipPackagePluginValidation -derivedDataPath $PWD/.derivedData build -scheme RakuyoKit-Package -destination generic/platform=watchOS

Build Log

SwiftDriverJobDiscovery normal arm64_32 Compiling Gradient+Position.swift (in target 'RAKGradient' from project 'RakuyoKit')
SwiftCompile normal arm64_32 Compiling\ ColorConfig.swift /Users/admin/builder/spi-builder-workspace/Sources/Config/Model/ColorConfig.swift (in target 'RAKConfig' from project 'RakuyoKit')
SwiftCompile normal arm64_32 /Users/admin/builder/spi-builder-workspace/Sources/Config/Model/ColorConfig.swift (in target 'RAKConfig' from project 'RakuyoKit')
    cd /Users/admin/builder/spi-builder-workspace/.swiftpm/xcode

SwiftDriver RAKBase normal arm64 com.apple.xcode.tools.swift.compiler (in target 'RAKBase' from project 'RakuyoKit')
    cd /Users/admin/builder/spi-builder-workspace/.swiftpm/xcode
    builtin-SwiftDriver -- /Applications/Xcode-16.3.0.app/Contents/Developer/Toolchains/XcodeDefault.xctoolchain/usr/bin/swiftc -module-name RAKBase -Onone -enforce-exclusivity\=checked @/Users/admin/builder/spi-builder-workspace/.derivedData/Build/Intermediates.noindex/RakuyoKit.build/Debug-watchos/RAKBase.build/Objects-normal/arm64/RAKBase.SwiftFileList -DSWIFT_PACKAGE -DDEBUG -DXcode -plugin-path /Applications/Xcode-16.3.0.app/Contents/Developer/Toolchains/XcodeDefault.xctoolchain/usr/lib/swift/host/plugins/testing -enable-experimental-feature DebugDescriptionMacro -sdk /Applications/Xcode-16.3.0.app/Contents/Developer/Platforms/WatchOS.platform/Developer/SDKs/WatchOS11.4.sdk -target arm64-apple-watchos6.0 -g -module-cache-path /Users/admin/builder/spi-builder-workspace/.derivedData/ModuleCache.noindex -Xfrontend -serialize-debugging-options -profile-coverage-mapping -profile-generate -enable-testing -index-store-path /Users/admin/builder/spi-builder-workspace/.derivedData/Index.noindex/DataStore -swift-version 5 -I /Users/admin/builder/spi-builder-workspace/.derivedData/Build/Products/Debug-watchos -I /Applications/Xcode-16.3.0.app/Contents/Developer/Platforms/WatchOS.platform/Developer/usr/lib -F /Users/admin/builder/spi-builder-workspace/.derivedData/Build/Products/Debug-watchos/PackageFrameworks -F /Users/admin/builder/spi-builder-workspace/.derivedData/Build/Products/Debug-watchos/PackageFrameworks -F /Users/admin/builder/spi-builder-workspace/.derivedData/Build/Products/Debug-watchos/PackageFrameworks -F /Users/admin/builder/spi-builder-workspace/.derivedData/Build/Products/Debug-watchos/PackageFrameworks -F /Users/admin/builder/spi-builder-workspace/.derivedData/Build/Products/Debug-watchos -F /Applications/Xcode-16.3.0.app/Contents/Developer/Platforms/WatchOS.platform/Developer/Library/Frameworks -F /Applications/Xcode-16.3.0.app/Contents/Developer/Platforms/WatchOS.platform/Developer/SDKs/WatchOS11.4.sdk/Developer/Library/Frameworks -c -j10 -enable-batch-mode -incremental -Xcc -ivfsstatcache -Xcc /Users/admin/builder/spi-builder-workspace/.derivedData/SDKStatCaches.noindex/watchos11.4-22T246-43efb940ff07ba2497b70ec94253f576.sdkstatcache -output-file-map /Users/admin/builder/spi-builder-workspace/.derivedData/Build/Intermediates.noindex/RakuyoKit.build/Debug-watchos/RAKBase.build/Objects-normal/arm64/RAKBase-OutputFileMap.json -use-frontend-parseable-output -save-temps -no-color-diagnostics -serialize-diagnostics -emit-dependencies -emit-module -emit-module-path /Users/admin/builder/spi-builder-workspace/.derivedData/Build/Intermediates.noindex/RakuyoKit.build/Debug-watchos/RAKBase.build/Objects-normal/arm64/RAKBase.swiftmodule -validate-clang-modules-once -clang-build-session-file /Users/admin/builder/spi-builder-workspace/.derivedData/ModuleCache.noindex/Session.modulevalidation -package-name spi_builder_workspace -Xcc -I/Users/admin/builder/spi-builder-workspace/.derivedData/Build/Intermediates.noindex/RakuyoKit.build/Debug-watchos/RAKBase.build/swift-overrides.hmap -emit-const-values -Xfrontend -const-gather-protocols-file -Xfrontend /Users/admin/builder/spi-builder-workspace/.derivedData/Build/Intermediates.noindex/RakuyoKit.build/Debug-watchos/RAKBase.build/Objects-normal/arm64/RAKBase_const_extract_protocols.json -Xcc -I/Users/admin/builder/spi-builder-workspace/.derivedData/Build/Products/Debug-watchos/include -Xcc -I/Users/admin/builder/spi-builder-workspace/.derivedData/Build/Intermediates.noindex/RakuyoKit.build/Debug-watchos/RAKBase.build/DerivedSources-normal/arm64 -Xcc -I/Users/admin/builder/spi-builder-workspace/.derivedData/Build/Intermediates.noindex/RakuyoKit.build/Debug-watchos/RAKBase.build/DerivedSources/arm64 -Xcc -I/Users/admin/builder/spi-builder-workspace/.derivedData/Build/Intermediates.noindex/RakuyoKit.build/Debug-watchos/RAKBase.build/DerivedSources -Xcc -DSWIFT_PACKAGE -Xcc -DDEBUG\=1 -emit-objc-header -emit-objc-header-path /Users/admin/builder/spi-builder-workspace/.derivedData/Build/Intermediates.noindex/RakuyoKit.build/Debug-watchos/RAKBase.build/Objects-normal/arm64/RAKBase-Swift.h -working-directory /Users/admin/builder/spi-builder-workspace/.swiftpm/xcode -experimental-emit-module-separately -disable-cmo
SwiftDriverJobDiscovery normal arm64_32 Compiling UIView+Gradient.swift (in target 'RAKGradient' from project 'RakuyoKit')
SwiftDriver RAKBase normal arm64_32 com.apple.xcode.tools.swift.compiler (in target 'RAKBase' from project 'RakuyoKit')
    cd /Users/admin/builder/spi-builder-workspace/.swiftpm/xcode
    builtin-SwiftDriver -- /Applications/Xcode-16.3.0.app/Contents/Developer/Toolchains/XcodeDefault.xctoolchain/usr/bin/swiftc -module-name RAKBase -Onone -enforce-exclusivity\=checked @/Users/admin/builder/spi-builder-workspace/.derivedData/Build/Intermediates.noindex/RakuyoKit.build/Debug-watchos/RAKBase.build/Objects-normal/arm64_32/RAKBase.SwiftFileList -DSWIFT_PACKAGE -DDEBUG -DXcode -plugin-path /Applications/Xcode-16.3.0.app/Contents/Developer/Toolchains/XcodeDefault.xctoolchain/usr/lib/swift/host/plugins/testing -enable-experimental-feature DebugDescriptionMacro -sdk /Applications/Xcode-16.3.0.app/Contents/Developer/Platforms/WatchOS.platform/Developer/SDKs/WatchOS11.4.sdk -target arm64_32-apple-watchos6.0 -g -module-cache-path /Users/admin/builder/spi-builder-workspace/.derivedData/ModuleCache.noindex -Xfrontend -serialize-debugging-options -profile-coverage-mapping -profile-generate -enable-testing -index-store-path /Users/admin/builder/spi-builder-workspace/.derivedData/Index.noindex/DataStore -swift-version 5 -I /Users/admin/builder/spi-builder-workspace/.derivedData/Build/Products/Debug-watchos -I /Applications/Xcode-16.3.0.app/Contents/Developer/Platforms/WatchOS.platform/Developer/usr/lib -F /Users/admin/builder/spi-builder-workspace/.derivedData/Build/Products/Debug-watchos/PackageFrameworks -F /Users/admin/builder/spi-builder-workspace/.derivedData/Build/Products/Debug-watchos/PackageFrameworks -F /Users/admin/builder/spi-builder-workspace/.derivedData/Build/Products/Debug-watchos/PackageFrameworks -F /Users/admin/builder/spi-builder-workspace/.derivedData/Build/Products/Debug-watchos/PackageFrameworks -F /Users/admin/builder/spi-builder-workspace/.derivedData/Build/Products/Debug-watchos -F /Applications/Xcode-16.3.0.app/Contents/Developer/Platforms/WatchOS.platform/Developer/Library/Frameworks -F /Applications/Xcode-16.3.0.app/Contents/Developer/Platforms/WatchOS.platform/Developer/SDKs/WatchOS11.4.sdk/Developer/Library/Frameworks -c -j10 -enable-batch-mode -incremental -Xcc -ivfsstatcache -Xcc /Users/admin/builder/spi-builder-workspace/.derivedData/SDKStatCaches.noindex/watchos11.4-22T246-43efb940ff07ba2497b70ec94253f576.sdkstatcache -output-file-map /Users/admin/builder/spi-builder-workspace/.derivedData/Build/Intermediates.noindex/RakuyoKit.build/Debug-watchos/RAKBase.build/Objects-normal/arm64_32/RAKBase-OutputFileMap.json -use-frontend-parseable-output -save-temps -no-color-diagnostics -serialize-diagnostics -emit-dependencies -emit-module -emit-module-path /Users/admin/builder/spi-builder-workspace/.derivedData/Build/Intermediates.noindex/RakuyoKit.build/Debug-watchos/RAKBase.build/Objects-normal/arm64_32/RAKBase.swiftmodule -validate-clang-modules-once -clang-build-session-file /Users/admin/builder/spi-builder-workspace/.derivedData/ModuleCache.noindex/Session.modulevalidation -package-name spi_builder_workspace -Xcc -I/Users/admin/builder/spi-builder-workspace/.derivedData/Build/Intermediates.noindex/RakuyoKit.build/Debug-watchos/RAKBase.build/swift-overrides.hmap -emit-const-values -Xfrontend -const-gather-protocols-file -Xfrontend /Users/admin/builder/spi-builder-workspace/.derivedData/Build/Intermediates.noindex/RakuyoKit.build/Debug-watchos/RAKBase.build/Objects-normal/arm64_32/RAKBase_const_extract_protocols.json -Xcc -I/Users/admin/builder/spi-builder-workspace/.derivedData/Build/Products/Debug-watchos/include -Xcc -I/Users/admin/builder/spi-builder-workspace/.derivedData/Build/Intermediates.noindex/RakuyoKit.build/Debug-watchos/RAKBase.build/DerivedSources-normal/arm64_32 -Xcc -I/Users/admin/builder/spi-builder-workspace/.derivedData/Build/Intermediates.noindex/RakuyoKit.build/Debug-watchos/RAKBase.build/DerivedSources/arm64_32 -Xcc -I/Users/admin/builder/spi-builder-workspace/.derivedData/Build/Intermediates.noindex/RakuyoKit.build/Debug-watchos/RAKBase.build/DerivedSources -Xcc -DSWIFT_PACKAGE -Xcc -DDEBUG\=1 -emit-objc-header -emit-objc-header-path /Users/admin/builder/spi-builder-workspace/.derivedData/Build/Intermediates.noindex/RakuyoKit.build/Debug-watchos/RAKBase.build/Objects-normal/arm64_32/RAKBase-Swift.h -working-directory /Users/admin/builder/spi-builder-workspace/.swiftpm/xcode -experimental-emit-module-separately -disable-cmo
SwiftDriverJobDiscovery normal arm64_32 Compiling Gradient+Direction.swift (in target 'RAKGradient' from project 'RakuyoKit')
SwiftDriver RAKBase normal armv7k com.apple.xcode.tools.swift.compiler (in target 'RAKBase' from project 'RakuyoKit')
    cd /Users/admin/builder/spi-builder-workspace/.swiftpm/xcode
    builtin-SwiftDriver -- /Applications/Xcode-16.3.0.app/Contents/Developer/Toolchains/XcodeDefault.xctoolchain/usr/bin/swiftc -module-name RAKBase -Onone -enforce-exclusivity\=checked @/Users/admin/builder/spi-builder-workspace/.derivedData/Build/Intermediates.noindex/RakuyoKit.build/Debug-watchos/RAKBase.build/Objects-normal/armv7k/RAKBase.SwiftFileList -DSWIFT_PACKAGE -DDEBUG -DXcode -plugin-path /Applications/Xcode-16.3.0.app/Contents/Developer/Toolchains/XcodeDefault.xctoolchain/usr/lib/swift/host/plugins/testing -enable-experimental-feature DebugDescriptionMacro -sdk /Applications/Xcode-16.3.0.app/Contents/Developer/Platforms/WatchOS.platform/Developer/SDKs/WatchOS11.4.sdk -target armv7k-apple-watchos6.0 -g -module-cache-path /Users/admin/builder/spi-builder-workspace/.derivedData/ModuleCache.noindex -Xfrontend -serialize-debugging-options -profile-coverage-mapping -profile-generate -enable-testing -index-store-path /Users/admin/builder/spi-builder-workspace/.derivedData/Index.noindex/DataStore -swift-version 5 -I /Users/admin/builder/spi-builder-workspace/.derivedData/Build/Products/Debug-watchos -I /Applications/Xcode-16.3.0.app/Contents/Developer/Platforms/WatchOS.platform/Developer/usr/lib -F /Users/admin/builder/spi-builder-workspace/.derivedData/Build/Products/Debug-watchos/PackageFrameworks -F /Users/admin/builder/spi-builder-workspace/.derivedData/Build/Products/Debug-watchos/PackageFrameworks -F /Users/admin/builder/spi-builder-workspace/.derivedData/Build/Products/Debug-watchos/PackageFrameworks -F /Users/admin/builder/spi-builder-workspace/.derivedData/Build/Products/Debug-watchos/PackageFrameworks -F /Users/admin/builder/spi-builder-workspace/.derivedData/Build/Products/Debug-watchos -F /Applications/Xcode-16.3.0.app/Contents/Developer/Platforms/WatchOS.platform/Developer/Library/Frameworks -F /Applications/Xcode-16.3.0.app/Contents/Developer/Platforms/WatchOS.platform/Developer/SDKs/WatchOS11.4.sdk/Developer/Library/Frameworks -c -j10 -enable-batch-mode -incremental -Xcc -ivfsstatcache -Xcc /Users/admin/builder/spi-builder-workspace/.derivedData/SDKStatCaches.noindex/watchos11.4-22T246-43efb940ff07ba2497b70ec94253f576.sdkstatcache -output-file-map /Users/admin/builder/spi-builder-workspace/.derivedData/Build/Intermediates.noindex/RakuyoKit.build/Debug-watchos/RAKBase.build/Objects-normal/armv7k/RAKBase-OutputFileMap.json -use-frontend-parseable-output -save-temps -no-color-diagnostics -serialize-diagnostics -emit-dependencies -emit-module -emit-module-path /Users/admin/builder/spi-builder-workspace/.derivedData/Build/Intermediates.noindex/RakuyoKit.build/Debug-watchos/RAKBase.build/Objects-normal/armv7k/RAKBase.swiftmodule -validate-clang-modules-once -clang-build-session-file /Users/admin/builder/spi-builder-workspace/.derivedData/ModuleCache.noindex/Session.modulevalidation -package-name spi_builder_workspace -Xcc -I/Users/admin/builder/spi-builder-workspace/.derivedData/Build/Intermediates.noindex/RakuyoKit.build/Debug-watchos/RAKBase.build/swift-overrides.hmap -emit-const-values -Xfrontend -const-gather-protocols-file -Xfrontend /Users/admin/builder/spi-builder-workspace/.derivedData/Build/Intermediates.noindex/RakuyoKit.build/Debug-watchos/RAKBase.build/Objects-normal/armv7k/RAKBase_const_extract_protocols.json -Xcc -I/Users/admin/builder/spi-builder-workspace/.derivedData/Build/Products/Debug-watchos/include -Xcc -I/Users/admin/builder/spi-builder-workspace/.derivedData/Build/Intermediates.noindex/RakuyoKit.build/Debug-watchos/RAKBase.build/DerivedSources-normal/armv7k -Xcc -I/Users/admin/builder/spi-builder-workspace/.derivedData/Build/Intermediates.noindex/RakuyoKit.build/Debug-watchos/RAKBase.build/DerivedSources/armv7k -Xcc -I/Users/admin/builder/spi-builder-workspace/.derivedData/Build/Intermediates.noindex/RakuyoKit.build/Debug-watchos/RAKBase.build/DerivedSources -Xcc -DSWIFT_PACKAGE -Xcc -DDEBUG\=1 -emit-objc-header -emit-objc-header-path /Users/admin/builder/spi-builder-workspace/.derivedData/Build/Intermediates.noindex/RakuyoKit.build/Debug-watchos/RAKBase.build/Objects-normal/armv7k/RAKBase-Swift.h -working-directory /Users/admin/builder/spi-builder-workspace/.swiftpm/xcode -experimental-emit-module-separately -disable-cmo
SwiftDriverJobDiscovery normal armv7k Compiling Gradient+Direction.swift (in target 'RAKGradient' from project 'RakuyoKit')
SwiftDriver\ Compilation RAKGradient normal arm64_32 com.apple.xcode.tools.swift.compiler (in target 'RAKGradient' from project 'RakuyoKit')
    cd /Users/admin/builder/spi-builder-workspace/.swiftpm/xcode
    builtin-Swift-Compilation -- /Applications/Xcode-16.3.0.app/Contents/Developer/Toolchains/XcodeDefault.xctoolchain/usr/bin/swiftc -module-name RAKGradient -Onone -enforce-exclusivity\=checked @/Users/admin/builder/spi-builder-workspace/.derivedData/Build/Intermediates.noindex/RakuyoKit.build/Debug-watchos/RAKGradient.build/Objects-normal/arm64_32/RAKGradient.SwiftFileList -DSWIFT_PACKAGE -DDEBUG -DXcode -plugin-path /Applications/Xcode-16.3.0.app/Contents/Developer/Toolchains/XcodeDefault.xctoolchain/usr/lib/swift/host/plugins/testing -enable-experimental-feature DebugDescriptionMacro -sdk /Applications/Xcode-16.3.0.app/Contents/Developer/Platforms/WatchOS.platform/Developer/SDKs/WatchOS11.4.sdk -target arm64_32-apple-watchos6.0 -g -module-cache-path /Users/admin/builder/spi-builder-workspace/.derivedData/ModuleCache.noindex -Xfrontend -serialize-debugging-options -profile-coverage-mapping -profile-generate -enable-testing -index-store-path /Users/admin/builder/spi-builder-workspace/.derivedData/Index.noindex/DataStore -swift-version 5 -I /Users/admin/builder/spi-builder-workspace/.derivedData/Build/Products/Debug-watchos -I /Applications/Xcode-16.3.0.app/Contents/Developer/Platforms/WatchOS.platform/Developer/usr/lib -F /Users/admin/builder/spi-builder-workspace/.derivedData/Build/Products/Debug-watchos/PackageFrameworks -F /Users/admin/builder/spi-builder-workspace/.derivedData/Build/Products/Debug-watchos/PackageFrameworks -F /Users/admin/builder/spi-builder-workspace/.derivedData/Build/Products/Debug-watchos/PackageFrameworks -F /Users/admin/builder/spi-builder-workspace/.derivedData/Build/Products/Debug-watchos -F /Applications/Xcode-16.3.0.app/Contents/Developer/Platforms/WatchOS.platform/Developer/Library/Frameworks -F /Applications/Xcode-16.3.0.app/Contents/Developer/Platforms/WatchOS.platform/Developer/SDKs/WatchOS11.4.sdk/Developer/Library/Frameworks -c -j10 -enable-batch-mode -incremental -Xcc -ivfsstatcache -Xcc /Users/admin/builder/spi-builder-workspace/.derivedData/SDKStatCaches.noindex/watchos11.4-22T246-43efb940ff07ba2497b70ec94253f576.sdkstatcache -output-file-map /Users/admin/builder/spi-builder-workspace/.derivedData/Build/Intermediates.noindex/RakuyoKit.build/Debug-watchos/RAKGradient.build/Objects-normal/arm64_32/RAKGradient-OutputFileMap.json -use-frontend-parseable-output -save-temps -no-color-diagnostics -serialize-diagnostics -emit-dependencies -emit-module -emit-module-path /Users/admin/builder/spi-builder-workspace/.derivedData/Build/Intermediates.noindex/RakuyoKit.build/Debug-watchos/RAKGradient.build/Objects-normal/arm64_32/RAKGradient.swiftmodule -validate-clang-modules-once -clang-build-session-file /Users/admin/builder/spi-builder-workspace/.derivedData/ModuleCache.noindex/Session.modulevalidation -package-name spi_builder_workspace -Xcc -I/Users/admin/builder/spi-builder-workspace/.derivedData/Build/Intermediates.noindex/RakuyoKit.build/Debug-watchos/RAKGradient.build/swift-overrides.hmap -emit-const-values -Xfrontend -const-gather-protocols-file -Xfrontend /Users/admin/builder/spi-builder-workspace/.derivedData/Build/Intermediates.noindex/RakuyoKit.build/Debug-watchos/RAKGradient.build/Objects-normal/arm64_32/RAKGradient_const_extract_protocols.json -Xcc -I/Users/admin/builder/spi-builder-workspace/.derivedData/Build/Products/Debug-watchos/include -Xcc -I/Users/admin/builder/spi-builder-workspace/.derivedData/Build/Intermediates.noindex/RakuyoKit.build/Debug-watchos/RAKGradient.build/DerivedSources-normal/arm64_32 -Xcc -I/Users/admin/builder/spi-builder-workspace/.derivedData/Build/Intermediates.noindex/RakuyoKit.build/Debug-watchos/RAKGradient.build/DerivedSources/arm64_32 -Xcc -I/Users/admin/builder/spi-builder-workspace/.derivedData/Build/Intermediates.noindex/RakuyoKit.build/Debug-watchos/RAKGradient.build/DerivedSources -Xcc -DSWIFT_PACKAGE -Xcc -DDEBUG\=1 -emit-objc-header -emit-objc-header-path /Users/admin/builder/spi-builder-workspace/.derivedData/Build/Intermediates.noindex/RakuyoKit.build/Debug-watchos/RAKGradient.build/Objects-normal/arm64_32/RAKGradient-Swift.h -working-directory /Users/admin/builder/spi-builder-workspace/.swiftpm/xcode -experimental-emit-module-separately -disable-cmo
SwiftCompile normal arm64_32 Compiling\ ConfigMediatorProtocol.swift /Users/admin/builder/spi-builder-workspace/Sources/Config/Mediator/ConfigMediatorProtocol.swift (in target 'RAKConfig' from project 'RakuyoKit')
SwiftCompile normal arm64_32 /Users/admin/builder/spi-builder-workspace/Sources/Config/Mediator/ConfigMediatorProtocol.swift (in target 'RAKConfig' from project 'RakuyoKit')
    cd /Users/admin/builder/spi-builder-workspace/.swiftpm/xcode

SwiftCompile normal armv7k Compiling\ ConfigMediatorProtocol.swift /Users/admin/builder/spi-builder-workspace/Sources/Config/Mediator/ConfigMediatorProtocol.swift (in target 'RAKConfig' from project 'RakuyoKit')
SwiftCompile normal armv7k /Users/admin/builder/spi-builder-workspace/Sources/Config/Mediator/ConfigMediatorProtocol.swift (in target 'RAKConfig' from project 'RakuyoKit')
    cd /Users/admin/builder/spi-builder-workspace/.swiftpm/xcode

SwiftEmitModule normal arm64_32 Emitting\ module\ for\ RAKBase (in target 'RAKBase' from project 'RakuyoKit')
EmitSwiftModule normal arm64_32 (in target 'RAKBase' from project 'RakuyoKit')
    cd /Users/admin/builder/spi-builder-workspace/.swiftpm/xcode

SwiftDriverJobDiscovery normal armv7k Compiling Gradient+Colors.swift (in target 'RAKGradient' from project 'RakuyoKit')
SwiftEmitModule normal arm64 Emitting\ module\ for\ RAKBase (in target 'RAKBase' from project 'RakuyoKit')
EmitSwiftModule normal arm64 (in target 'RAKBase' from project 'RakuyoKit')
    cd /Users/admin/builder/spi-builder-workspace/.swiftpm/xcode

SwiftEmitModule normal armv7k Emitting\ module\ for\ RAKBase (in target 'RAKBase' from project 'RakuyoKit')
EmitSwiftModule normal armv7k (in target 'RAKBase' from project 'RakuyoKit')
    cd /Users/admin/builder/spi-builder-workspace/.swiftpm/xcode

SwiftDriverJobDiscovery normal arm64_32 Compiling ConfigMediator.swift (in target 'RAKConfig' from project 'RakuyoKit')
SwiftDriver\ Compilation RAKGradient normal armv7k com.apple.xcode.tools.swift.compiler (in target 'RAKGradient' from project 'RakuyoKit')
    cd /Users/admin/builder/spi-builder-workspace/.swiftpm/xcode
    builtin-Swift-Compilation -- /Applications/Xcode-16.3.0.app/Contents/Developer/Toolchains/XcodeDefault.xctoolchain/usr/bin/swiftc -module-name RAKGradient -Onone -enforce-exclusivity\=checked @/Users/admin/builder/spi-builder-workspace/.derivedData/Build/Intermediates.noindex/RakuyoKit.build/Debug-watchos/RAKGradient.build/Objects-normal/armv7k/RAKGradient.SwiftFileList -DSWIFT_PACKAGE -DDEBUG -DXcode -plugin-path /Applications/Xcode-16.3.0.app/Contents/Developer/Toolchains/XcodeDefault.xctoolchain/usr/lib/swift/host/plugins/testing -enable-experimental-feature DebugDescriptionMacro -sdk /Applications/Xcode-16.3.0.app/Contents/Developer/Platforms/WatchOS.platform/Developer/SDKs/WatchOS11.4.sdk -target armv7k-apple-watchos6.0 -g -module-cache-path /Users/admin/builder/spi-builder-workspace/.derivedData/ModuleCache.noindex -Xfrontend -serialize-debugging-options -profile-coverage-mapping -profile-generate -enable-testing -index-store-path /Users/admin/builder/spi-builder-workspace/.derivedData/Index.noindex/DataStore -swift-version 5 -I /Users/admin/builder/spi-builder-workspace/.derivedData/Build/Products/Debug-watchos -I /Applications/Xcode-16.3.0.app/Contents/Developer/Platforms/WatchOS.platform/Developer/usr/lib -F /Users/admin/builder/spi-builder-workspace/.derivedData/Build/Products/Debug-watchos/PackageFrameworks -F /Users/admin/builder/spi-builder-workspace/.derivedData/Build/Products/Debug-watchos/PackageFrameworks -F /Users/admin/builder/spi-builder-workspace/.derivedData/Build/Products/Debug-watchos/PackageFrameworks -F /Users/admin/builder/spi-builder-workspace/.derivedData/Build/Products/Debug-watchos -F /Applications/Xcode-16.3.0.app/Contents/Developer/Platforms/WatchOS.platform/Developer/Library/Frameworks -F /Applications/Xcode-16.3.0.app/Contents/Developer/Platforms/WatchOS.platform/Developer/SDKs/WatchOS11.4.sdk/Developer/Library/Frameworks -c -j10 -enable-batch-mode -incremental -Xcc -ivfsstatcache -Xcc /Users/admin/builder/spi-builder-workspace/.derivedData/SDKStatCaches.noindex/watchos11.4-22T246-43efb940ff07ba2497b70ec94253f576.sdkstatcache -output-file-map /Users/admin/builder/spi-builder-workspace/.derivedData/Build/Intermediates.noindex/RakuyoKit.build/Debug-watchos/RAKGradient.build/Objects-normal/armv7k/RAKGradient-OutputFileMap.json -use-frontend-parseable-output -save-temps -no-color-diagnostics -serialize-diagnostics -emit-dependencies -emit-module -emit-module-path /Users/admin/builder/spi-builder-workspace/.derivedData/Build/Intermediates.noindex/RakuyoKit.build/Debug-watchos/RAKGradient.build/Objects-normal/armv7k/RAKGradient.swiftmodule -validate-clang-modules-once -clang-build-session-file /Users/admin/builder/spi-builder-workspace/.derivedData/ModuleCache.noindex/Session.modulevalidation -package-name spi_builder_workspace -Xcc -I/Users/admin/builder/spi-builder-workspace/.derivedData/Build/Intermediates.noindex/RakuyoKit.build/Debug-watchos/RAKGradient.build/swift-overrides.hmap -emit-const-values -Xfrontend -const-gather-protocols-file -Xfrontend /Users/admin/builder/spi-builder-workspace/.derivedData/Build/Intermediates.noindex/RakuyoKit.build/Debug-watchos/RAKGradient.build/Objects-normal/armv7k/RAKGradient_const_extract_protocols.json -Xcc -I/Users/admin/builder/spi-builder-workspace/.derivedData/Build/Products/Debug-watchos/include -Xcc -I/Users/admin/builder/spi-builder-workspace/.derivedData/Build/Intermediates.noindex/RakuyoKit.build/Debug-watchos/RAKGradient.build/DerivedSources-normal/armv7k -Xcc -I/Users/admin/builder/spi-builder-workspace/.derivedData/Build/Intermediates.noindex/RakuyoKit.build/Debug-watchos/RAKGradient.build/DerivedSources/armv7k -Xcc -I/Users/admin/builder/spi-builder-workspace/.derivedData/Build/Intermediates.noindex/RakuyoKit.build/Debug-watchos/RAKGradient.build/DerivedSources -Xcc -DSWIFT_PACKAGE -Xcc -DDEBUG\=1 -emit-objc-header -emit-objc-header-path /Users/admin/builder/spi-builder-workspace/.derivedData/Build/Intermediates.noindex/RakuyoKit.build/Debug-watchos/RAKGradient.build/Objects-normal/armv7k/RAKGradient-Swift.h -working-directory /Users/admin/builder/spi-builder-workspace/.swiftpm/xcode -experimental-emit-module-separately -disable-cmo
SwiftCompile normal arm64 Compiling\ ConfigMediatorProtocol.swift /Users/admin/builder/spi-builder-workspace/Sources/Config/Mediator/ConfigMediatorProtocol.swift (in target 'RAKConfig' from project 'RakuyoKit')
SwiftCompile normal arm64 /Users/admin/builder/spi-builder-workspace/Sources/Config/Mediator/ConfigMediatorProtocol.swift (in target 'RAKConfig' from project 'RakuyoKit')
    cd /Users/admin/builder/spi-builder-workspace/.swiftpm/xcode

SwiftDriverJobDiscovery normal armv7k Compiling ConfigMediator.swift (in target 'RAKConfig' from project 'RakuyoKit')
SwiftCompile normal arm64 Compiling\ ConfigSourceProtocol.swift /Users/admin/builder/spi-builder-workspace/Sources/Config/Mediator/ConfigSourceProtocol.swift (in target 'RAKConfig' from project 'RakuyoKit')
SwiftCompile normal arm64 /Users/admin/builder/spi-builder-workspace/Sources/Config/Mediator/ConfigSourceProtocol.swift (in target 'RAKConfig' from project 'RakuyoKit')
    cd /Users/admin/builder/spi-builder-workspace/.swiftpm/xcode

SwiftDriverJobDiscovery normal arm64 Compiling ColorConfig.swift (in target 'RAKConfig' from project 'RakuyoKit')
SwiftCompile normal armv7k Compiling\ ColorConfig.swift /Users/admin/builder/spi-builder-workspace/Sources/Config/Model/ColorConfig.swift (in target 'RAKConfig' from project 'RakuyoKit')
SwiftCompile normal armv7k /Users/admin/builder/spi-builder-workspace/Sources/Config/Model/ColorConfig.swift (in target 'RAKConfig' from project 'RakuyoKit')
    cd /Users/admin/builder/spi-builder-workspace/.swiftpm/xcode

SwiftDriverJobDiscovery normal arm64_32 Compiling ConfigSourceProtocol.swift (in target 'RAKConfig' from project 'RakuyoKit')
SwiftCompile normal armv7k Compiling\ EmptyConfig.swift /Users/admin/builder/spi-builder-workspace/Sources/Config/Model/EmptyConfig.swift (in target 'RAKConfig' from project 'RakuyoKit')
SwiftCompile normal armv7k /Users/admin/builder/spi-builder-workspace/Sources/Config/Model/EmptyConfig.swift (in target 'RAKConfig' from project 'RakuyoKit')
    cd /Users/admin/builder/spi-builder-workspace/.swiftpm/xcode

SwiftDriverJobDiscovery normal arm64_32 Compiling ConfigMediatorProtocol.swift (in target 'RAKConfig' from project 'RakuyoKit')
SwiftCompile normal arm64 Compiling\ ConfigMediator.swift /Users/admin/builder/spi-builder-workspace/Sources/Config/Mediator/ConfigMediator.swift (in target 'RAKConfig' from project 'RakuyoKit')
SwiftCompile normal arm64 /Users/admin/builder/spi-builder-workspace/Sources/Config/Mediator/ConfigMediator.swift (in target 'RAKConfig' from project 'RakuyoKit')
    cd /Users/admin/builder/spi-builder-workspace/.swiftpm/xcode

SwiftDriverJobDiscovery normal arm64_32 Compiling ColorConfig.swift (in target 'RAKConfig' from project 'RakuyoKit')
SwiftCompile normal arm64 Compiling\ EmptyConfig.swift /Users/admin/builder/spi-builder-workspace/Sources/Config/Model/EmptyConfig.swift (in target 'RAKConfig' from project 'RakuyoKit')
SwiftCompile normal arm64 /Users/admin/builder/spi-builder-workspace/Sources/Config/Model/EmptyConfig.swift (in target 'RAKConfig' from project 'RakuyoKit')
    cd /Users/admin/builder/spi-builder-workspace/.swiftpm/xcode

SwiftDriverJobDiscovery normal armv7k Compiling ConfigMediatorProtocol.swift (in target 'RAKConfig' from project 'RakuyoKit')
SwiftCompile normal armv7k Compiling\ ConfigSourceProtocol.swift /Users/admin/builder/spi-builder-workspace/Sources/Config/Mediator/ConfigSourceProtocol.swift (in target 'RAKConfig' from project 'RakuyoKit')
SwiftCompile normal armv7k /Users/admin/builder/spi-builder-workspace/Sources/Config/Mediator/ConfigSourceProtocol.swift (in target 'RAKConfig' from project 'RakuyoKit')
    cd /Users/admin/builder/spi-builder-workspace/.swiftpm/xcode

SwiftDriverJobDiscovery normal arm64_32 Emitting module for RAKBase (in target 'RAKBase' from project 'RakuyoKit')
SwiftCompile normal arm64_32 Compiling\ EmptyConfig.swift /Users/admin/builder/spi-builder-workspace/Sources/Config/Model/EmptyConfig.swift (in target 'RAKConfig' from project 'RakuyoKit')
SwiftCompile normal arm64_32 /Users/admin/builder/spi-builder-workspace/Sources/Config/Model/EmptyConfig.swift (in target 'RAKConfig' from project 'RakuyoKit')
    cd /Users/admin/builder/spi-builder-workspace/.swiftpm/xcode

SwiftDriverJobDiscovery normal arm64 Emitting module for RAKBase (in target 'RAKBase' from project 'RakuyoKit')
SwiftDriver\ Compilation\ Requirements RAKBase normal arm64_32 com.apple.xcode.tools.swift.compiler (in target 'RAKBase' from project 'RakuyoKit')
    cd /Users/admin/builder/spi-builder-workspace/.swiftpm/xcode
    builtin-Swift-Compilation-Requirements -- /Applications/Xcode-16.3.0.app/Contents/Developer/Toolchains/XcodeDefault.xctoolchain/usr/bin/swiftc -module-name RAKBase -Onone -enforce-exclusivity\=checked @/Users/admin/builder/spi-builder-workspace/.derivedData/Build/Intermediates.noindex/RakuyoKit.build/Debug-watchos/RAKBase.build/Objects-normal/arm64_32/RAKBase.SwiftFileList -DSWIFT_PACKAGE -DDEBUG -DXcode -plugin-path /Applications/Xcode-16.3.0.app/Contents/Developer/Toolchains/XcodeDefault.xctoolchain/usr/lib/swift/host/plugins/testing -enable-experimental-feature DebugDescriptionMacro -sdk /Applications/Xcode-16.3.0.app/Contents/Developer/Platforms/WatchOS.platform/Developer/SDKs/WatchOS11.4.sdk -target arm64_32-apple-watchos6.0 -g -module-cache-path /Users/admin/builder/spi-builder-workspace/.derivedData/ModuleCache.noindex -Xfrontend -serialize-debugging-options -profile-coverage-mapping -profile-generate -enable-testing -index-store-path /Users/admin/builder/spi-builder-workspace/.derivedData/Index.noindex/DataStore -swift-version 5 -I /Users/admin/builder/spi-builder-workspace/.derivedData/Build/Products/Debug-watchos -I /Applications/Xcode-16.3.0.app/Contents/Developer/Platforms/WatchOS.platform/Developer/usr/lib -F /Users/admin/builder/spi-builder-workspace/.derivedData/Build/Products/Debug-watchos/PackageFrameworks -F /Users/admin/builder/spi-builder-workspace/.derivedData/Build/Products/Debug-watchos/PackageFrameworks -F /Users/admin/builder/spi-builder-workspace/.derivedData/Build/Products/Debug-watchos/PackageFrameworks -F /Users/admin/builder/spi-builder-workspace/.derivedData/Build/Products/Debug-watchos/PackageFrameworks -F /Users/admin/builder/spi-builder-workspace/.derivedData/Build/Products/Debug-watchos -F /Applications/Xcode-16.3.0.app/Contents/Developer/Platforms/WatchOS.platform/Developer/Library/Frameworks -F /Applications/Xcode-16.3.0.app/Contents/Developer/Platforms/WatchOS.platform/Developer/SDKs/WatchOS11.4.sdk/Developer/Library/Frameworks -c -j10 -enable-batch-mode -incremental -Xcc -ivfsstatcache -Xcc /Users/admin/builder/spi-builder-workspace/.derivedData/SDKStatCaches.noindex/watchos11.4-22T246-43efb940ff07ba2497b70ec94253f576.sdkstatcache -output-file-map /Users/admin/builder/spi-builder-workspace/.derivedData/Build/Intermediates.noindex/RakuyoKit.build/Debug-watchos/RAKBase.build/Objects-normal/arm64_32/RAKBase-OutputFileMap.json -use-frontend-parseable-output -save-temps -no-color-diagnostics -serialize-diagnostics -emit-dependencies -emit-module -emit-module-path /Users/admin/builder/spi-builder-workspace/.derivedData/Build/Intermediates.noindex/RakuyoKit.build/Debug-watchos/RAKBase.build/Objects-normal/arm64_32/RAKBase.swiftmodule -validate-clang-modules-once -clang-build-session-file /Users/admin/builder/spi-builder-workspace/.derivedData/ModuleCache.noindex/Session.modulevalidation -package-name spi_builder_workspace -Xcc -I/Users/admin/builder/spi-builder-workspace/.derivedData/Build/Intermediates.noindex/RakuyoKit.build/Debug-watchos/RAKBase.build/swift-overrides.hmap -emit-const-values -Xfrontend -const-gather-protocols-file -Xfrontend /Users/admin/builder/spi-builder-workspace/.derivedData/Build/Intermediates.noindex/RakuyoKit.build/Debug-watchos/RAKBase.build/Objects-normal/arm64_32/RAKBase_const_extract_protocols.json -Xcc -I/Users/admin/builder/spi-builder-workspace/.derivedData/Build/Products/Debug-watchos/include -Xcc -I/Users/admin/builder/spi-builder-workspace/.derivedData/Build/Intermediates.noindex/RakuyoKit.build/Debug-watchos/RAKBase.build/DerivedSources-normal/arm64_32 -Xcc -I/Users/admin/builder/spi-builder-workspace/.derivedData/Build/Intermediates.noindex/RakuyoKit.build/Debug-watchos/RAKBase.build/DerivedSources/arm64_32 -Xcc -I/Users/admin/builder/spi-builder-workspace/.derivedData/Build/Intermediates.noindex/RakuyoKit.build/Debug-watchos/RAKBase.build/DerivedSources -Xcc -DSWIFT_PACKAGE -Xcc -DDEBUG\=1 -emit-objc-header -emit-objc-header-path /Users/admin/builder/spi-builder-workspace/.derivedData/Build/Intermediates.noindex/RakuyoKit.build/Debug-watchos/RAKBase.build/Objects-normal/arm64_32/RAKBase-Swift.h -working-directory /Users/admin/builder/spi-builder-workspace/.swiftpm/xcode -experimental-emit-module-separately -disable-cmo
SwiftDriverJobDiscovery normal armv7k Emitting module for RAKBase (in target 'RAKBase' from project 'RakuyoKit')
SwiftDriver\ Compilation\ Requirements RAKBase normal armv7k com.apple.xcode.tools.swift.compiler (in target 'RAKBase' from project 'RakuyoKit')
    cd /Users/admin/builder/spi-builder-workspace/.swiftpm/xcode
    builtin-Swift-Compilation-Requirements -- /Applications/Xcode-16.3.0.app/Contents/Developer/Toolchains/XcodeDefault.xctoolchain/usr/bin/swiftc -module-name RAKBase -Onone -enforce-exclusivity\=checked @/Users/admin/builder/spi-builder-workspace/.derivedData/Build/Intermediates.noindex/RakuyoKit.build/Debug-watchos/RAKBase.build/Objects-normal/armv7k/RAKBase.SwiftFileList -DSWIFT_PACKAGE -DDEBUG -DXcode -plugin-path /Applications/Xcode-16.3.0.app/Contents/Developer/Toolchains/XcodeDefault.xctoolchain/usr/lib/swift/host/plugins/testing -enable-experimental-feature DebugDescriptionMacro -sdk /Applications/Xcode-16.3.0.app/Contents/Developer/Platforms/WatchOS.platform/Developer/SDKs/WatchOS11.4.sdk -target armv7k-apple-watchos6.0 -g -module-cache-path /Users/admin/builder/spi-builder-workspace/.derivedData/ModuleCache.noindex -Xfrontend -serialize-debugging-options -profile-coverage-mapping -profile-generate -enable-testing -index-store-path /Users/admin/builder/spi-builder-workspace/.derivedData/Index.noindex/DataStore -swift-version 5 -I /Users/admin/builder/spi-builder-workspace/.derivedData/Build/Products/Debug-watchos -I /Applications/Xcode-16.3.0.app/Contents/Developer/Platforms/WatchOS.platform/Developer/usr/lib -F /Users/admin/builder/spi-builder-workspace/.derivedData/Build/Products/Debug-watchos/PackageFrameworks -F /Users/admin/builder/spi-builder-workspace/.derivedData/Build/Products/Debug-watchos/PackageFrameworks -F /Users/admin/builder/spi-builder-workspace/.derivedData/Build/Products/Debug-watchos/PackageFrameworks -F /Users/admin/builder/spi-builder-workspace/.derivedData/Build/Products/Debug-watchos/PackageFrameworks -F /Users/admin/builder/spi-builder-workspace/.derivedData/Build/Products/Debug-watchos -F /Applications/Xcode-16.3.0.app/Contents/Developer/Platforms/WatchOS.platform/Developer/Library/Frameworks -F /Applications/Xcode-16.3.0.app/Contents/Developer/Platforms/WatchOS.platform/Developer/SDKs/WatchOS11.4.sdk/Developer/Library/Frameworks -c -j10 -enable-batch-mode -incremental -Xcc -ivfsstatcache -Xcc /Users/admin/builder/spi-builder-workspace/.derivedData/SDKStatCaches.noindex/watchos11.4-22T246-43efb940ff07ba2497b70ec94253f576.sdkstatcache -output-file-map /Users/admin/builder/spi-builder-workspace/.derivedData/Build/Intermediates.noindex/RakuyoKit.build/Debug-watchos/RAKBase.build/Objects-normal/armv7k/RAKBase-OutputFileMap.json -use-frontend-parseable-output -save-temps -no-color-diagnostics -serialize-diagnostics -emit-dependencies -emit-module -emit-module-path /Users/admin/builder/spi-builder-workspace/.derivedData/Build/Intermediates.noindex/RakuyoKit.build/Debug-watchos/RAKBase.build/Objects-normal/armv7k/RAKBase.swiftmodule -validate-clang-modules-once -clang-build-session-file /Users/admin/builder/spi-builder-workspace/.derivedData/ModuleCache.noindex/Session.modulevalidation -package-name spi_builder_workspace -Xcc -I/Users/admin/builder/spi-builder-workspace/.derivedData/Build/Intermediates.noindex/RakuyoKit.build/Debug-watchos/RAKBase.build/swift-overrides.hmap -emit-const-values -Xfrontend -const-gather-protocols-file -Xfrontend /Users/admin/builder/spi-builder-workspace/.derivedData/Build/Intermediates.noindex/RakuyoKit.build/Debug-watchos/RAKBase.build/Objects-normal/armv7k/RAKBase_const_extract_protocols.json -Xcc -I/Users/admin/builder/spi-builder-workspace/.derivedData/Build/Products/Debug-watchos/include -Xcc -I/Users/admin/builder/spi-builder-workspace/.derivedData/Build/Intermediates.noindex/RakuyoKit.build/Debug-watchos/RAKBase.build/DerivedSources-normal/armv7k -Xcc -I/Users/admin/builder/spi-builder-workspace/.derivedData/Build/Intermediates.noindex/RakuyoKit.build/Debug-watchos/RAKBase.build/DerivedSources/armv7k -Xcc -I/Users/admin/builder/spi-builder-workspace/.derivedData/Build/Intermediates.noindex/RakuyoKit.build/Debug-watchos/RAKBase.build/DerivedSources -Xcc -DSWIFT_PACKAGE -Xcc -DDEBUG\=1 -emit-objc-header -emit-objc-header-path /Users/admin/builder/spi-builder-workspace/.derivedData/Build/Intermediates.noindex/RakuyoKit.build/Debug-watchos/RAKBase.build/Objects-normal/armv7k/RAKBase-Swift.h -working-directory /Users/admin/builder/spi-builder-workspace/.swiftpm/xcode -experimental-emit-module-separately -disable-cmo
SwiftDriver\ Compilation\ Requirements RAKBase normal arm64 com.apple.xcode.tools.swift.compiler (in target 'RAKBase' from project 'RakuyoKit')
    cd /Users/admin/builder/spi-builder-workspace/.swiftpm/xcode
    builtin-Swift-Compilation-Requirements -- /Applications/Xcode-16.3.0.app/Contents/Developer/Toolchains/XcodeDefault.xctoolchain/usr/bin/swiftc -module-name RAKBase -Onone -enforce-exclusivity\=checked @/Users/admin/builder/spi-builder-workspace/.derivedData/Build/Intermediates.noindex/RakuyoKit.build/Debug-watchos/RAKBase.build/Objects-normal/arm64/RAKBase.SwiftFileList -DSWIFT_PACKAGE -DDEBUG -DXcode -plugin-path /Applications/Xcode-16.3.0.app/Contents/Developer/Toolchains/XcodeDefault.xctoolchain/usr/lib/swift/host/plugins/testing -enable-experimental-feature DebugDescriptionMacro -sdk /Applications/Xcode-16.3.0.app/Contents/Developer/Platforms/WatchOS.platform/Developer/SDKs/WatchOS11.4.sdk -target arm64-apple-watchos6.0 -g -module-cache-path /Users/admin/builder/spi-builder-workspace/.derivedData/ModuleCache.noindex -Xfrontend -serialize-debugging-options -profile-coverage-mapping -profile-generate -enable-testing -index-store-path /Users/admin/builder/spi-builder-workspace/.derivedData/Index.noindex/DataStore -swift-version 5 -I /Users/admin/builder/spi-builder-workspace/.derivedData/Build/Products/Debug-watchos -I /Applications/Xcode-16.3.0.app/Contents/Developer/Platforms/WatchOS.platform/Developer/usr/lib -F /Users/admin/builder/spi-builder-workspace/.derivedData/Build/Products/Debug-watchos/PackageFrameworks -F /Users/admin/builder/spi-builder-workspace/.derivedData/Build/Products/Debug-watchos/PackageFrameworks -F /Users/admin/builder/spi-builder-workspace/.derivedData/Build/Products/Debug-watchos/PackageFrameworks -F /Users/admin/builder/spi-builder-workspace/.derivedData/Build/Products/Debug-watchos/PackageFrameworks -F /Users/admin/builder/spi-builder-workspace/.derivedData/Build/Products/Debug-watchos -F /Applications/Xcode-16.3.0.app/Contents/Developer/Platforms/WatchOS.platform/Developer/Library/Frameworks -F /Applications/Xcode-16.3.0.app/Contents/Developer/Platforms/WatchOS.platform/Developer/SDKs/WatchOS11.4.sdk/Developer/Library/Frameworks -c -j10 -enable-batch-mode -incremental -Xcc -ivfsstatcache -Xcc /Users/admin/builder/spi-builder-workspace/.derivedData/SDKStatCaches.noindex/watchos11.4-22T246-43efb940ff07ba2497b70ec94253f576.sdkstatcache -output-file-map /Users/admin/builder/spi-builder-workspace/.derivedData/Build/Intermediates.noindex/RakuyoKit.build/Debug-watchos/RAKBase.build/Objects-normal/arm64/RAKBase-OutputFileMap.json -use-frontend-parseable-output -save-temps -no-color-diagnostics -serialize-diagnostics -emit-dependencies -emit-module -emit-module-path /Users/admin/builder/spi-builder-workspace/.derivedData/Build/Intermediates.noindex/RakuyoKit.build/Debug-watchos/RAKBase.build/Objects-normal/arm64/RAKBase.swiftmodule -validate-clang-modules-once -clang-build-session-file /Users/admin/builder/spi-builder-workspace/.derivedData/ModuleCache.noindex/Session.modulevalidation -package-name spi_builder_workspace -Xcc -I/Users/admin/builder/spi-builder-workspace/.derivedData/Build/Intermediates.noindex/RakuyoKit.build/Debug-watchos/RAKBase.build/swift-overrides.hmap -emit-const-values -Xfrontend -const-gather-protocols-file -Xfrontend /Users/admin/builder/spi-builder-workspace/.derivedData/Build/Intermediates.noindex/RakuyoKit.build/Debug-watchos/RAKBase.build/Objects-normal/arm64/RAKBase_const_extract_protocols.json -Xcc -I/Users/admin/builder/spi-builder-workspace/.derivedData/Build/Products/Debug-watchos/include -Xcc -I/Users/admin/builder/spi-builder-workspace/.derivedData/Build/Intermediates.noindex/RakuyoKit.build/Debug-watchos/RAKBase.build/DerivedSources-normal/arm64 -Xcc -I/Users/admin/builder/spi-builder-workspace/.derivedData/Build/Intermediates.noindex/RakuyoKit.build/Debug-watchos/RAKBase.build/DerivedSources/arm64 -Xcc -I/Users/admin/builder/spi-builder-workspace/.derivedData/Build/Intermediates.noindex/RakuyoKit.build/Debug-watchos/RAKBase.build/DerivedSources -Xcc -DSWIFT_PACKAGE -Xcc -DDEBUG\=1 -emit-objc-header -emit-objc-header-path /Users/admin/builder/spi-builder-workspace/.derivedData/Build/Intermediates.noindex/RakuyoKit.build/Debug-watchos/RAKBase.build/Objects-normal/arm64/RAKBase-Swift.h -working-directory /Users/admin/builder/spi-builder-workspace/.swiftpm/xcode -experimental-emit-module-separately -disable-cmo
Copy /Users/admin/builder/spi-builder-workspace/.derivedData/Build/Products/Debug-watchos/RAKBase.swiftmodule/armv7k-apple-watchos.abi.json /Users/admin/builder/spi-builder-workspace/.derivedData/Build/Intermediates.noindex/RakuyoKit.build/Debug-watchos/RAKBase.build/Objects-normal/armv7k/RAKBase.abi.json (in target 'RAKBase' from project 'RakuyoKit')
    cd /Users/admin/builder/spi-builder-workspace
    builtin-copy -exclude .DS_Store -exclude CVS -exclude .svn -exclude .git -exclude .hg -resolve-src-symlinks -rename /Users/admin/builder/spi-builder-workspace/.derivedData/Build/Intermediates.noindex/RakuyoKit.build/Debug-watchos/RAKBase.build/Objects-normal/armv7k/RAKBase.abi.json /Users/admin/builder/spi-builder-workspace/.derivedData/Build/Products/Debug-watchos/RAKBase.swiftmodule/armv7k-apple-watchos.abi.json
Copy /Users/admin/builder/spi-builder-workspace/.derivedData/Build/Products/Debug-watchos/RAKBase.swiftmodule/arm64_32-apple-watchos.abi.json /Users/admin/builder/spi-builder-workspace/.derivedData/Build/Intermediates.noindex/RakuyoKit.build/Debug-watchos/RAKBase.build/Objects-normal/arm64_32/RAKBase.abi.json (in target 'RAKBase' from project 'RakuyoKit')
    cd /Users/admin/builder/spi-builder-workspace
    builtin-copy -exclude .DS_Store -exclude CVS -exclude .svn -exclude .git -exclude .hg -resolve-src-symlinks -rename /Users/admin/builder/spi-builder-workspace/.derivedData/Build/Intermediates.noindex/RakuyoKit.build/Debug-watchos/RAKBase.build/Objects-normal/arm64_32/RAKBase.abi.json /Users/admin/builder/spi-builder-workspace/.derivedData/Build/Products/Debug-watchos/RAKBase.swiftmodule/arm64_32-apple-watchos.abi.json
Copy /Users/admin/builder/spi-builder-workspace/.derivedData/Build/Products/Debug-watchos/RAKBase.swiftmodule/arm64-apple-watchos.abi.json /Users/admin/builder/spi-builder-workspace/.derivedData/Build/Intermediates.noindex/RakuyoKit.build/Debug-watchos/RAKBase.build/Objects-normal/arm64/RAKBase.abi.json (in target 'RAKBase' from project 'RakuyoKit')
    cd /Users/admin/builder/spi-builder-workspace
    builtin-copy -exclude .DS_Store -exclude CVS -exclude .svn -exclude .git -exclude .hg -resolve-src-symlinks -rename /Users/admin/builder/spi-builder-workspace/.derivedData/Build/Intermediates.noindex/RakuyoKit.build/Debug-watchos/RAKBase.build/Objects-normal/arm64/RAKBase.abi.json /Users/admin/builder/spi-builder-workspace/.derivedData/Build/Products/Debug-watchos/RAKBase.swiftmodule/arm64-apple-watchos.abi.json
SwiftCompile normal armv7k Compiling\ UIControl+Combine.swift,\ UITextView+Combine.swift /Users/admin/builder/spi-builder-workspace/Sources/Combine/Core/Extendable/UIControl+Combine.swift /Users/admin/builder/spi-builder-workspace/Sources/Combine/Core/Extendable/UITextView+Combine.swift (in target 'RAKCombine' from project 'RakuyoKit')
SwiftCompile normal armv7k /Users/admin/builder/spi-builder-workspace/Sources/Combine/Core/Extendable/UIControl+Combine.swift (in target 'RAKCombine' from project 'RakuyoKit')
    cd /Users/admin/builder/spi-builder-workspace/.swiftpm/xcode

SwiftCompile normal armv7k /Users/admin/builder/spi-builder-workspace/Sources/Combine/Core/Extendable/UITextView+Combine.swift (in target 'RAKCombine' from project 'RakuyoKit')
    cd /Users/admin/builder/spi-builder-workspace/.swiftpm/xcode

SwiftCompile normal arm64 Compiling\ ControlPropertyPublisher.swift,\ ControlTargetPublisher.swift /Users/admin/builder/spi-builder-workspace/Sources/Combine/Core/Publisher/ControlPropertyPublisher.swift /Users/admin/builder/spi-builder-workspace/Sources/Combine/Core/Publisher/ControlTargetPublisher.swift (in target 'RAKCombine' from project 'RakuyoKit')
SwiftCompile normal arm64 /Users/admin/builder/spi-builder-workspace/Sources/Combine/Core/Publisher/ControlPropertyPublisher.swift (in target 'RAKCombine' from project 'RakuyoKit')
    cd /Users/admin/builder/spi-builder-workspace/.swiftpm/xcode

SwiftCompile normal arm64 /Users/admin/builder/spi-builder-workspace/Sources/Combine/Core/Publisher/ControlTargetPublisher.swift (in target 'RAKCombine' from project 'RakuyoKit')
    cd /Users/admin/builder/spi-builder-workspace/.swiftpm/xcode

SwiftDriverJobDiscovery normal arm64 Compiling ConfigMediatorProtocol.swift (in target 'RAKConfig' from project 'RakuyoKit')
SwiftCompile normal armv7k Compiling\ KeyboardListenable.swift,\ NotificationCenter+CombineKeyboard.swift /Users/admin/builder/spi-builder-workspace/Sources/Combine/Core/Keyboard/KeyboardListenable.swift /Users/admin/builder/spi-builder-workspace/Sources/Combine/Core/Keyboard/NotificationCenter+CombineKeyboard.swift (in target 'RAKCombine' from project 'RakuyoKit')
SwiftCompile normal armv7k /Users/admin/builder/spi-builder-workspace/Sources/Combine/Core/Keyboard/KeyboardListenable.swift (in target 'RAKCombine' from project 'RakuyoKit')
    cd /Users/admin/builder/spi-builder-workspace/.swiftpm/xcode

SwiftCompile normal armv7k /Users/admin/builder/spi-builder-workspace/Sources/Combine/Core/Keyboard/NotificationCenter+CombineKeyboard.swift (in target 'RAKCombine' from project 'RakuyoKit')
    cd /Users/admin/builder/spi-builder-workspace/.swiftpm/xcode

SwiftDriverJobDiscovery normal arm64 Compiling ConfigSourceProtocol.swift (in target 'RAKConfig' from project 'RakuyoKit')
SwiftCompile normal arm64 Compiling\ BindableProperty.swift,\ ObservableProperty.swift /Users/admin/builder/spi-builder-workspace/Sources/Combine/Core/ObservableProperty/BindableProperty.swift /Users/admin/builder/spi-builder-workspace/Sources/Combine/Core/ObservableProperty/ObservableProperty.swift (in target 'RAKCombine' from project 'RakuyoKit')
SwiftCompile normal arm64 /Users/admin/builder/spi-builder-workspace/Sources/Combine/Core/ObservableProperty/BindableProperty.swift (in target 'RAKCombine' from project 'RakuyoKit')
    cd /Users/admin/builder/spi-builder-workspace/.swiftpm/xcode

SwiftCompile normal arm64 /Users/admin/builder/spi-builder-workspace/Sources/Combine/Core/ObservableProperty/ObservableProperty.swift (in target 'RAKCombine' from project 'RakuyoKit')
    cd /Users/admin/builder/spi-builder-workspace/.swiftpm/xcode

SwiftDriverJobDiscovery normal armv7k Compiling EmptyConfig.swift (in target 'RAKConfig' from project 'RakuyoKit')
SwiftCompile normal arm64 Compiling\ UIControl+Combine.swift,\ UITextView+Combine.swift /Users/admin/builder/spi-builder-workspace/Sources/Combine/Core/Extendable/UIControl+Combine.swift /Users/admin/builder/spi-builder-workspace/Sources/Combine/Core/Extendable/UITextView+Combine.swift (in target 'RAKCombine' from project 'RakuyoKit')
SwiftCompile normal arm64 /Users/admin/builder/spi-builder-workspace/Sources/Combine/Core/Extendable/UIControl+Combine.swift (in target 'RAKCombine' from project 'RakuyoKit')
    cd /Users/admin/builder/spi-builder-workspace/.swiftpm/xcode

SwiftCompile normal arm64 /Users/admin/builder/spi-builder-workspace/Sources/Combine/Core/Extendable/UITextView+Combine.swift (in target 'RAKCombine' from project 'RakuyoKit')
    cd /Users/admin/builder/spi-builder-workspace/.swiftpm/xcode

SwiftDriverJobDiscovery normal arm64 Compiling EmptyConfig.swift (in target 'RAKConfig' from project 'RakuyoKit')
SwiftCompile normal arm64 Compiling\ Publisher+UITextField.swift,\ Publisher+assign.swift /Users/admin/builder/spi-builder-workspace/Sources/Combine/Core/Extendable/Publisher+UITextField.swift /Users/admin/builder/spi-builder-workspace/Sources/Combine/Core/Extendable/Publisher+assign.swift (in target 'RAKCombine' from project 'RakuyoKit')
SwiftCompile normal arm64 /Users/admin/builder/spi-builder-workspace/Sources/Combine/Core/Extendable/Publisher+UITextField.swift (in target 'RAKCombine' from project 'RakuyoKit')
    cd /Users/admin/builder/spi-builder-workspace/.swiftpm/xcode

SwiftCompile normal arm64 /Users/admin/builder/spi-builder-workspace/Sources/Combine/Core/Extendable/Publisher+assign.swift (in target 'RAKCombine' from project 'RakuyoKit')
    cd /Users/admin/builder/spi-builder-workspace/.swiftpm/xcode

SwiftDriverJobDiscovery normal arm64_32 Compiling EmptyConfig.swift (in target 'RAKConfig' from project 'RakuyoKit')
SwiftDriver\ Compilation RAKConfig normal arm64_32 com.apple.xcode.tools.swift.compiler (in target 'RAKConfig' from project 'RakuyoKit')
    cd /Users/admin/builder/spi-builder-workspace/.swiftpm/xcode
    builtin-Swift-Compilation -- /Applications/Xcode-16.3.0.app/Contents/Developer/Toolchains/XcodeDefault.xctoolchain/usr/bin/swiftc -module-name RAKConfig -Onone -enforce-exclusivity\=checked @/Users/admin/builder/spi-builder-workspace/.derivedData/Build/Intermediates.noindex/RakuyoKit.build/Debug-watchos/RAKConfig.build/Objects-normal/arm64_32/RAKConfig.SwiftFileList -DSWIFT_PACKAGE -DDEBUG -DXcode -plugin-path /Applications/Xcode-16.3.0.app/Contents/Developer/Toolchains/XcodeDefault.xctoolchain/usr/lib/swift/host/plugins/testing -enable-experimental-feature DebugDescriptionMacro -sdk /Applications/Xcode-16.3.0.app/Contents/Developer/Platforms/WatchOS.platform/Developer/SDKs/WatchOS11.4.sdk -target arm64_32-apple-watchos6.0 -g -module-cache-path /Users/admin/builder/spi-builder-workspace/.derivedData/ModuleCache.noindex -Xfrontend -serialize-debugging-options -profile-coverage-mapping -profile-generate -enable-testing -index-store-path /Users/admin/builder/spi-builder-workspace/.derivedData/Index.noindex/DataStore -swift-version 5 -I /Users/admin/builder/spi-builder-workspace/.derivedData/Build/Products/Debug-watchos -I /Applications/Xcode-16.3.0.app/Contents/Developer/Platforms/WatchOS.platform/Developer/usr/lib -F /Users/admin/builder/spi-builder-workspace/.derivedData/Build/Products/Debug-watchos/PackageFrameworks -F /Users/admin/builder/spi-builder-workspace/.derivedData/Build/Products/Debug-watchos/PackageFrameworks -F /Users/admin/builder/spi-builder-workspace/.derivedData/Build/Products/Debug-watchos/PackageFrameworks -F /Users/admin/builder/spi-builder-workspace/.derivedData/Build/Products/Debug-watchos -F /Applications/Xcode-16.3.0.app/Contents/Developer/Platforms/WatchOS.platform/Developer/Library/Frameworks -F /Applications/Xcode-16.3.0.app/Contents/Developer/Platforms/WatchOS.platform/Developer/SDKs/WatchOS11.4.sdk/Developer/Library/Frameworks -c -j10 -enable-batch-mode -incremental -Xcc -ivfsstatcache -Xcc /Users/admin/builder/spi-builder-workspace/.derivedData/SDKStatCaches.noindex/watchos11.4-22T246-43efb940ff07ba2497b70ec94253f576.sdkstatcache -output-file-map /Users/admin/builder/spi-builder-workspace/.derivedData/Build/Intermediates.noindex/RakuyoKit.build/Debug-watchos/RAKConfig.build/Objects-normal/arm64_32/RAKConfig-OutputFileMap.json -use-frontend-parseable-output -save-temps -no-color-diagnostics -serialize-diagnostics -emit-dependencies -emit-module -emit-module-path /Users/admin/builder/spi-builder-workspace/.derivedData/Build/Intermediates.noindex/RakuyoKit.build/Debug-watchos/RAKConfig.build/Objects-normal/arm64_32/RAKConfig.swiftmodule -validate-clang-modules-once -clang-build-session-file /Users/admin/builder/spi-builder-workspace/.derivedData/ModuleCache.noindex/Session.modulevalidation -package-name spi_builder_workspace -Xcc -I/Users/admin/builder/spi-builder-workspace/.derivedData/Build/Intermediates.noindex/RakuyoKit.build/Debug-watchos/RAKConfig.build/swift-overrides.hmap -emit-const-values -Xfrontend -const-gather-protocols-file -Xfrontend /Users/admin/builder/spi-builder-workspace/.derivedData/Build/Intermediates.noindex/RakuyoKit.build/Debug-watchos/RAKConfig.build/Objects-normal/arm64_32/RAKConfig_const_extract_protocols.json -Xcc -I/Users/admin/builder/spi-builder-workspace/.derivedData/Build/Products/Debug-watchos/include -Xcc -I/Users/admin/builder/spi-builder-workspace/.derivedData/Build/Intermediates.noindex/RakuyoKit.build/Debug-watchos/RAKConfig.build/DerivedSources-normal/arm64_32 -Xcc -I/Users/admin/builder/spi-builder-workspace/.derivedData/Build/Intermediates.noindex/RakuyoKit.build/Debug-watchos/RAKConfig.build/DerivedSources/arm64_32 -Xcc -I/Users/admin/builder/spi-builder-workspace/.derivedData/Build/Intermediates.noindex/RakuyoKit.build/Debug-watchos/RAKConfig.build/DerivedSources -Xcc -DSWIFT_PACKAGE -Xcc -DDEBUG\=1 -emit-objc-header -emit-objc-header-path /Users/admin/builder/spi-builder-workspace/.derivedData/Build/Intermediates.noindex/RakuyoKit.build/Debug-watchos/RAKConfig.build/Objects-normal/arm64_32/RAKConfig-Swift.h -working-directory /Users/admin/builder/spi-builder-workspace/.swiftpm/xcode -experimental-emit-module-separately -disable-cmo
SwiftDriverJobDiscovery normal arm64 Compiling ConfigMediator.swift (in target 'RAKConfig' from project 'RakuyoKit')
SwiftCompile normal arm64_32 Compiling\ DelegateProxy.swift,\ DelegateProxyPublisher.swift,\ DelegateProxyType.swift /Users/admin/builder/spi-builder-workspace/Sources/Combine/Core/DelegateProxy/DelegateProxy.swift /Users/admin/builder/spi-builder-workspace/Sources/Combine/Core/DelegateProxy/DelegateProxyPublisher.swift /Users/admin/builder/spi-builder-workspace/Sources/Combine/Core/DelegateProxy/DelegateProxyType.swift (in target 'RAKCombine' from project 'RakuyoKit')
SwiftCompile normal arm64_32 /Users/admin/builder/spi-builder-workspace/Sources/Combine/Core/DelegateProxy/DelegateProxy.swift (in target 'RAKCombine' from project 'RakuyoKit')
    cd /Users/admin/builder/spi-builder-workspace/.swiftpm/xcode

SwiftCompile normal arm64_32 /Users/admin/builder/spi-builder-workspace/Sources/Combine/Core/DelegateProxy/DelegateProxyPublisher.swift (in target 'RAKCombine' from project 'RakuyoKit')
    cd /Users/admin/builder/spi-builder-workspace/.swiftpm/xcode

SwiftCompile normal arm64_32 /Users/admin/builder/spi-builder-workspace/Sources/Combine/Core/DelegateProxy/DelegateProxyType.swift (in target 'RAKCombine' from project 'RakuyoKit')
    cd /Users/admin/builder/spi-builder-workspace/.swiftpm/xcode

SwiftDriver\ Compilation RAKConfig normal arm64 com.apple.xcode.tools.swift.compiler (in target 'RAKConfig' from project 'RakuyoKit')
    cd /Users/admin/builder/spi-builder-workspace/.swiftpm/xcode
    builtin-Swift-Compilation -- /Applications/Xcode-16.3.0.app/Contents/Developer/Toolchains/XcodeDefault.xctoolchain/usr/bin/swiftc -module-name RAKConfig -Onone -enforce-exclusivity\=checked @/Users/admin/builder/spi-builder-workspace/.derivedData/Build/Intermediates.noindex/RakuyoKit.build/Debug-watchos/RAKConfig.build/Objects-normal/arm64/RAKConfig.SwiftFileList -DSWIFT_PACKAGE -DDEBUG -DXcode -plugin-path /Applications/Xcode-16.3.0.app/Contents/Developer/Toolchains/XcodeDefault.xctoolchain/usr/lib/swift/host/plugins/testing -enable-experimental-feature DebugDescriptionMacro -sdk /Applications/Xcode-16.3.0.app/Contents/Developer/Platforms/WatchOS.platform/Developer/SDKs/WatchOS11.4.sdk -target arm64-apple-watchos6.0 -g -module-cache-path /Users/admin/builder/spi-builder-workspace/.derivedData/ModuleCache.noindex -Xfrontend -serialize-debugging-options -profile-coverage-mapping -profile-generate -enable-testing -index-store-path /Users/admin/builder/spi-builder-workspace/.derivedData/Index.noindex/DataStore -swift-version 5 -I /Users/admin/builder/spi-builder-workspace/.derivedData/Build/Products/Debug-watchos -I /Applications/Xcode-16.3.0.app/Contents/Developer/Platforms/WatchOS.platform/Developer/usr/lib -F /Users/admin/builder/spi-builder-workspace/.derivedData/Build/Products/Debug-watchos/PackageFrameworks -F /Users/admin/builder/spi-builder-workspace/.derivedData/Build/Products/Debug-watchos/PackageFrameworks -F /Users/admin/builder/spi-builder-workspace/.derivedData/Build/Products/Debug-watchos/PackageFrameworks -F /Users/admin/builder/spi-builder-workspace/.derivedData/Build/Products/Debug-watchos -F /Applications/Xcode-16.3.0.app/Contents/Developer/Platforms/WatchOS.platform/Developer/Library/Frameworks -F /Applications/Xcode-16.3.0.app/Contents/Developer/Platforms/WatchOS.platform/Developer/SDKs/WatchOS11.4.sdk/Developer/Library/Frameworks -c -j10 -enable-batch-mode -incremental -Xcc -ivfsstatcache -Xcc /Users/admin/builder/spi-builder-workspace/.derivedData/SDKStatCaches.noindex/watchos11.4-22T246-43efb940ff07ba2497b70ec94253f576.sdkstatcache -output-file-map /Users/admin/builder/spi-builder-workspace/.derivedData/Build/Intermediates.noindex/RakuyoKit.build/Debug-watchos/RAKConfig.build/Objects-normal/arm64/RAKConfig-OutputFileMap.json -use-frontend-parseable-output -save-temps -no-color-diagnostics -serialize-diagnostics -emit-dependencies -emit-module -emit-module-path /Users/admin/builder/spi-builder-workspace/.derivedData/Build/Intermediates.noindex/RakuyoKit.build/Debug-watchos/RAKConfig.build/Objects-normal/arm64/RAKConfig.swiftmodule -validate-clang-modules-once -clang-build-session-file /Users/admin/builder/spi-builder-workspace/.derivedData/ModuleCache.noindex/Session.modulevalidation -package-name spi_builder_workspace -Xcc -I/Users/admin/builder/spi-builder-workspace/.derivedData/Build/Intermediates.noindex/RakuyoKit.build/Debug-watchos/RAKConfig.build/swift-overrides.hmap -emit-const-values -Xfrontend -const-gather-protocols-file -Xfrontend /Users/admin/builder/spi-builder-workspace/.derivedData/Build/Intermediates.noindex/RakuyoKit.build/Debug-watchos/RAKConfig.build/Objects-normal/arm64/RAKConfig_const_extract_protocols.json -Xcc -I/Users/admin/builder/spi-builder-workspace/.derivedData/Build/Products/Debug-watchos/include -Xcc -I/Users/admin/builder/spi-builder-workspace/.derivedData/Build/Intermediates.noindex/RakuyoKit.build/Debug-watchos/RAKConfig.build/DerivedSources-normal/arm64 -Xcc -I/Users/admin/builder/spi-builder-workspace/.derivedData/Build/Intermediates.noindex/RakuyoKit.build/Debug-watchos/RAKConfig.build/DerivedSources/arm64 -Xcc -I/Users/admin/builder/spi-builder-workspace/.derivedData/Build/Intermediates.noindex/RakuyoKit.build/Debug-watchos/RAKConfig.build/DerivedSources -Xcc -DSWIFT_PACKAGE -Xcc -DDEBUG\=1 -emit-objc-header -emit-objc-header-path /Users/admin/builder/spi-builder-workspace/.derivedData/Build/Intermediates.noindex/RakuyoKit.build/Debug-watchos/RAKConfig.build/Objects-normal/arm64/RAKConfig-Swift.h -working-directory /Users/admin/builder/spi-builder-workspace/.swiftpm/xcode -experimental-emit-module-separately -disable-cmo
SwiftDriverJobDiscovery normal armv7k Compiling ColorConfig.swift (in target 'RAKConfig' from project 'RakuyoKit')
SwiftCompile normal armv7k Compiling\ Publishers+CombineLatest.swift,\ UIBarButtonItem+Combine.swift /Users/admin/builder/spi-builder-workspace/Sources/Combine/Core/Extendable/Publishers+CombineLatest.swift /Users/admin/builder/spi-builder-workspace/Sources/Combine/Core/Extendable/UIBarButtonItem+Combine.swift (in target 'RAKCombine' from project 'RakuyoKit')
SwiftCompile normal armv7k /Users/admin/builder/spi-builder-workspace/Sources/Combine/Core/Extendable/Publishers+CombineLatest.swift (in target 'RAKCombine' from project 'RakuyoKit')
    cd /Users/admin/builder/spi-builder-workspace/.swiftpm/xcode

SwiftCompile normal armv7k /Users/admin/builder/spi-builder-workspace/Sources/Combine/Core/Extendable/UIBarButtonItem+Combine.swift (in target 'RAKCombine' from project 'RakuyoKit')
    cd /Users/admin/builder/spi-builder-workspace/.swiftpm/xcode

SwiftCompile normal arm64_32 Compiling\ BindableProperty.swift,\ ObservableProperty.swift /Users/admin/builder/spi-builder-workspace/Sources/Combine/Core/ObservableProperty/BindableProperty.swift /Users/admin/builder/spi-builder-workspace/Sources/Combine/Core/ObservableProperty/ObservableProperty.swift (in target 'RAKCombine' from project 'RakuyoKit')
SwiftCompile normal arm64_32 /Users/admin/builder/spi-builder-workspace/Sources/Combine/Core/ObservableProperty/BindableProperty.swift (in target 'RAKCombine' from project 'RakuyoKit')
    cd /Users/admin/builder/spi-builder-workspace/.swiftpm/xcode

SwiftCompile normal arm64_32 /Users/admin/builder/spi-builder-workspace/Sources/Combine/Core/ObservableProperty/ObservableProperty.swift (in target 'RAKCombine' from project 'RakuyoKit')
    cd /Users/admin/builder/spi-builder-workspace/.swiftpm/xcode

SwiftDriverJobDiscovery normal armv7k Compiling ConfigSourceProtocol.swift (in target 'RAKConfig' from project 'RakuyoKit')
SwiftDriver\ Compilation RAKConfig normal armv7k com.apple.xcode.tools.swift.compiler (in target 'RAKConfig' from project 'RakuyoKit')
    cd /Users/admin/builder/spi-builder-workspace/.swiftpm/xcode
    builtin-Swift-Compilation -- /Applications/Xcode-16.3.0.app/Contents/Developer/Toolchains/XcodeDefault.xctoolchain/usr/bin/swiftc -module-name RAKConfig -Onone -enforce-exclusivity\=checked @/Users/admin/builder/spi-builder-workspace/.derivedData/Build/Intermediates.noindex/RakuyoKit.build/Debug-watchos/RAKConfig.build/Objects-normal/armv7k/RAKConfig.SwiftFileList -DSWIFT_PACKAGE -DDEBUG -DXcode -plugin-path /Applications/Xcode-16.3.0.app/Contents/Developer/Toolchains/XcodeDefault.xctoolchain/usr/lib/swift/host/plugins/testing -enable-experimental-feature DebugDescriptionMacro -sdk /Applications/Xcode-16.3.0.app/Contents/Developer/Platforms/WatchOS.platform/Developer/SDKs/WatchOS11.4.sdk -target armv7k-apple-watchos6.0 -g -module-cache-path /Users/admin/builder/spi-builder-workspace/.derivedData/ModuleCache.noindex -Xfrontend -serialize-debugging-options -profile-coverage-mapping -profile-generate -enable-testing -index-store-path /Users/admin/builder/spi-builder-workspace/.derivedData/Index.noindex/DataStore -swift-version 5 -I /Users/admin/builder/spi-builder-workspace/.derivedData/Build/Products/Debug-watchos -I /Applications/Xcode-16.3.0.app/Contents/Developer/Platforms/WatchOS.platform/Developer/usr/lib -F /Users/admin/builder/spi-builder-workspace/.derivedData/Build/Products/Debug-watchos/PackageFrameworks -F /Users/admin/builder/spi-builder-workspace/.derivedData/Build/Products/Debug-watchos/PackageFrameworks -F /Users/admin/builder/spi-builder-workspace/.derivedData/Build/Products/Debug-watchos/PackageFrameworks -F /Users/admin/builder/spi-builder-workspace/.derivedData/Build/Products/Debug-watchos -F /Applications/Xcode-16.3.0.app/Contents/Developer/Platforms/WatchOS.platform/Developer/Library/Frameworks -F /Applications/Xcode-16.3.0.app/Contents/Developer/Platforms/WatchOS.platform/Developer/SDKs/WatchOS11.4.sdk/Developer/Library/Frameworks -c -j10 -enable-batch-mode -incremental -Xcc -ivfsstatcache -Xcc /Users/admin/builder/spi-builder-workspace/.derivedData/SDKStatCaches.noindex/watchos11.4-22T246-43efb940ff07ba2497b70ec94253f576.sdkstatcache -output-file-map /Users/admin/builder/spi-builder-workspace/.derivedData/Build/Intermediates.noindex/RakuyoKit.build/Debug-watchos/RAKConfig.build/Objects-normal/armv7k/RAKConfig-OutputFileMap.json -use-frontend-parseable-output -save-temps -no-color-diagnostics -serialize-diagnostics -emit-dependencies -emit-module -emit-module-path /Users/admin/builder/spi-builder-workspace/.derivedData/Build/Intermediates.noindex/RakuyoKit.build/Debug-watchos/RAKConfig.build/Objects-normal/armv7k/RAKConfig.swiftmodule -validate-clang-modules-once -clang-build-session-file /Users/admin/builder/spi-builder-workspace/.derivedData/ModuleCache.noindex/Session.modulevalidation -package-name spi_builder_workspace -Xcc -I/Users/admin/builder/spi-builder-workspace/.derivedData/Build/Intermediates.noindex/RakuyoKit.build/Debug-watchos/RAKConfig.build/swift-overrides.hmap -emit-const-values -Xfrontend -const-gather-protocols-file -Xfrontend /Users/admin/builder/spi-builder-workspace/.derivedData/Build/Intermediates.noindex/RakuyoKit.build/Debug-watchos/RAKConfig.build/Objects-normal/armv7k/RAKConfig_const_extract_protocols.json -Xcc -I/Users/admin/builder/spi-builder-workspace/.derivedData/Build/Products/Debug-watchos/include -Xcc -I/Users/admin/builder/spi-builder-workspace/.derivedData/Build/Intermediates.noindex/RakuyoKit.build/Debug-watchos/RAKConfig.build/DerivedSources-normal/armv7k -Xcc -I/Users/admin/builder/spi-builder-workspace/.derivedData/Build/Intermediates.noindex/RakuyoKit.build/Debug-watchos/RAKConfig.build/DerivedSources/armv7k -Xcc -I/Users/admin/builder/spi-builder-workspace/.derivedData/Build/Intermediates.noindex/RakuyoKit.build/Debug-watchos/RAKConfig.build/DerivedSources -Xcc -DSWIFT_PACKAGE -Xcc -DDEBUG\=1 -emit-objc-header -emit-objc-header-path /Users/admin/builder/spi-builder-workspace/.derivedData/Build/Intermediates.noindex/RakuyoKit.build/Debug-watchos/RAKConfig.build/Objects-normal/armv7k/RAKConfig-Swift.h -working-directory /Users/admin/builder/spi-builder-workspace/.swiftpm/xcode -experimental-emit-module-separately -disable-cmo
SwiftDriverJobDiscovery normal armv7k Compiling UIControl+Combine.swift, UITextView+Combine.swift (in target 'RAKCombine' from project 'RakuyoKit')
SwiftCompile normal armv7k Compiling\ ControlPropertyPublisher.swift,\ ControlTargetPublisher.swift /Users/admin/builder/spi-builder-workspace/Sources/Combine/Core/Publisher/ControlPropertyPublisher.swift /Users/admin/builder/spi-builder-workspace/Sources/Combine/Core/Publisher/ControlTargetPublisher.swift (in target 'RAKCombine' from project 'RakuyoKit')
SwiftCompile normal armv7k /Users/admin/builder/spi-builder-workspace/Sources/Combine/Core/Publisher/ControlPropertyPublisher.swift (in target 'RAKCombine' from project 'RakuyoKit')
    cd /Users/admin/builder/spi-builder-workspace/.swiftpm/xcode

SwiftCompile normal armv7k /Users/admin/builder/spi-builder-workspace/Sources/Combine/Core/Publisher/ControlTargetPublisher.swift (in target 'RAKCombine' from project 'RakuyoKit')
    cd /Users/admin/builder/spi-builder-workspace/.swiftpm/xcode

SwiftCompile normal arm64 Compiling\ DelegateProxy.swift,\ DelegateProxyPublisher.swift,\ DelegateProxyType.swift /Users/admin/builder/spi-builder-workspace/Sources/Combine/Core/DelegateProxy/DelegateProxy.swift /Users/admin/builder/spi-builder-workspace/Sources/Combine/Core/DelegateProxy/DelegateProxyPublisher.swift /Users/admin/builder/spi-builder-workspace/Sources/Combine/Core/DelegateProxy/DelegateProxyType.swift (in target 'RAKCombine' from project 'RakuyoKit')
SwiftCompile normal arm64 /Users/admin/builder/spi-builder-workspace/Sources/Combine/Core/DelegateProxy/DelegateProxy.swift (in target 'RAKCombine' from project 'RakuyoKit')
    cd /Users/admin/builder/spi-builder-workspace/.swiftpm/xcode

SwiftCompile normal arm64 /Users/admin/builder/spi-builder-workspace/Sources/Combine/Core/DelegateProxy/DelegateProxyPublisher.swift (in target 'RAKCombine' from project 'RakuyoKit')
    cd /Users/admin/builder/spi-builder-workspace/.swiftpm/xcode

SwiftCompile normal arm64 /Users/admin/builder/spi-builder-workspace/Sources/Combine/Core/DelegateProxy/DelegateProxyType.swift (in target 'RAKCombine' from project 'RakuyoKit')
    cd /Users/admin/builder/spi-builder-workspace/.swiftpm/xcode

SwiftDriverJobDiscovery normal arm64 Compiling ControlPropertyPublisher.swift, ControlTargetPublisher.swift (in target 'RAKCombine' from project 'RakuyoKit')
SwiftCompile normal arm64 Compiling\ Publishers+CombineLatest.swift,\ UIBarButtonItem+Combine.swift /Users/admin/builder/spi-builder-workspace/Sources/Combine/Core/Extendable/Publishers+CombineLatest.swift /Users/admin/builder/spi-builder-workspace/Sources/Combine/Core/Extendable/UIBarButtonItem+Combine.swift (in target 'RAKCombine' from project 'RakuyoKit')
SwiftCompile normal arm64 /Users/admin/builder/spi-builder-workspace/Sources/Combine/Core/Extendable/Publishers+CombineLatest.swift (in target 'RAKCombine' from project 'RakuyoKit')
    cd /Users/admin/builder/spi-builder-workspace/.swiftpm/xcode

SwiftCompile normal arm64 /Users/admin/builder/spi-builder-workspace/Sources/Combine/Core/Extendable/UIBarButtonItem+Combine.swift (in target 'RAKCombine' from project 'RakuyoKit')
    cd /Users/admin/builder/spi-builder-workspace/.swiftpm/xcode

SwiftDriverJobDiscovery normal armv7k Compiling KeyboardListenable.swift, NotificationCenter+CombineKeyboard.swift (in target 'RAKCombine' from project 'RakuyoKit')
SwiftCompile normal armv7k Compiling\ ObservablePropertyWrapper.swift,\ ControlEventsPublisher.swift /Users/admin/builder/spi-builder-workspace/Sources/Combine/Core/ObservableProperty/ObservablePropertyWrapper.swift /Users/admin/builder/spi-builder-workspace/Sources/Combine/Core/Publisher/ControlEventsPublisher.swift (in target 'RAKCombine' from project 'RakuyoKit')
SwiftCompile normal armv7k /Users/admin/builder/spi-builder-workspace/Sources/Combine/Core/ObservableProperty/ObservablePropertyWrapper.swift (in target 'RAKCombine' from project 'RakuyoKit')
    cd /Users/admin/builder/spi-builder-workspace/.swiftpm/xcode

SwiftCompile normal armv7k /Users/admin/builder/spi-builder-workspace/Sources/Combine/Core/Publisher/ControlEventsPublisher.swift (in target 'RAKCombine' from project 'RakuyoKit')
    cd /Users/admin/builder/spi-builder-workspace/.swiftpm/xcode

SwiftDriverJobDiscovery normal arm64 Compiling UIControl+Combine.swift, UITextView+Combine.swift (in target 'RAKCombine' from project 'RakuyoKit')
SwiftCompile normal arm64_32 Compiling\ ControlPropertyPublisher.swift,\ ControlTargetPublisher.swift /Users/admin/builder/spi-builder-workspace/Sources/Combine/Core/Publisher/ControlPropertyPublisher.swift /Users/admin/builder/spi-builder-workspace/Sources/Combine/Core/Publisher/ControlTargetPublisher.swift (in target 'RAKCombine' from project 'RakuyoKit')
SwiftCompile normal arm64_32 /Users/admin/builder/spi-builder-workspace/Sources/Combine/Core/Publisher/ControlPropertyPublisher.swift (in target 'RAKCombine' from project 'RakuyoKit')
    cd /Users/admin/builder/spi-builder-workspace/.swiftpm/xcode

SwiftCompile normal arm64_32 /Users/admin/builder/spi-builder-workspace/Sources/Combine/Core/Publisher/ControlTargetPublisher.swift (in target 'RAKCombine' from project 'RakuyoKit')
    cd /Users/admin/builder/spi-builder-workspace/.swiftpm/xcode

SwiftDriverJobDiscovery normal arm64 Compiling Publisher+UITextField.swift, Publisher+assign.swift (in target 'RAKCombine' from project 'RakuyoKit')
SwiftCompile normal armv7k Compiling\ Publisher+UITextField.swift,\ Publisher+assign.swift /Users/admin/builder/spi-builder-workspace/Sources/Combine/Core/Extendable/Publisher+UITextField.swift /Users/admin/builder/spi-builder-workspace/Sources/Combine/Core/Extendable/Publisher+assign.swift (in target 'RAKCombine' from project 'RakuyoKit')
SwiftCompile normal armv7k /Users/admin/builder/spi-builder-workspace/Sources/Combine/Core/Extendable/Publisher+UITextField.swift (in target 'RAKCombine' from project 'RakuyoKit')
    cd /Users/admin/builder/spi-builder-workspace/.swiftpm/xcode

SwiftCompile normal armv7k /Users/admin/builder/spi-builder-workspace/Sources/Combine/Core/Extendable/Publisher+assign.swift (in target 'RAKCombine' from project 'RakuyoKit')
    cd /Users/admin/builder/spi-builder-workspace/.swiftpm/xcode

SwiftDriverJobDiscovery normal arm64 Compiling BindableProperty.swift, ObservableProperty.swift (in target 'RAKCombine' from project 'RakuyoKit')
SwiftCompile normal armv7k Compiling\ AnyPublisher+SAK.swift,\ NSTextStorage+Combine.swift /Users/admin/builder/spi-builder-workspace/Sources/Combine/Core/Extendable/AnyPublisher+SAK.swift /Users/admin/builder/spi-builder-workspace/Sources/Combine/Core/Extendable/NSTextStorage+Combine.swift (in target 'RAKCombine' from project 'RakuyoKit')
SwiftCompile normal armv7k /Users/admin/builder/spi-builder-workspace/Sources/Combine/Core/Extendable/AnyPublisher+SAK.swift (in target 'RAKCombine' from project 'RakuyoKit')
    cd /Users/admin/builder/spi-builder-workspace/.swiftpm/xcode

SwiftCompile normal armv7k /Users/admin/builder/spi-builder-workspace/Sources/Combine/Core/Extendable/NSTextStorage+Combine.swift (in target 'RAKCombine' from project 'RakuyoKit')
    cd /Users/admin/builder/spi-builder-workspace/.swiftpm/xcode

SwiftDriverJobDiscovery normal armv7k Compiling Publishers+CombineLatest.swift, UIBarButtonItem+Combine.swift (in target 'RAKCombine' from project 'RakuyoKit')
SwiftCompile normal arm64_32 Compiling\ UIControl+Combine.swift,\ UITextView+Combine.swift /Users/admin/builder/spi-builder-workspace/Sources/Combine/Core/Extendable/UIControl+Combine.swift /Users/admin/builder/spi-builder-workspace/Sources/Combine/Core/Extendable/UITextView+Combine.swift (in target 'RAKCombine' from project 'RakuyoKit')
SwiftCompile normal arm64_32 /Users/admin/builder/spi-builder-workspace/Sources/Combine/Core/Extendable/UIControl+Combine.swift (in target 'RAKCombine' from project 'RakuyoKit')
    cd /Users/admin/builder/spi-builder-workspace/.swiftpm/xcode

SwiftCompile normal arm64_32 /Users/admin/builder/spi-builder-workspace/Sources/Combine/Core/Extendable/UITextView+Combine.swift (in target 'RAKCombine' from project 'RakuyoKit')
    cd /Users/admin/builder/spi-builder-workspace/.swiftpm/xcode

SwiftDriverJobDiscovery normal arm64_32 Compiling BindableProperty.swift, ObservableProperty.swift (in target 'RAKCombine' from project 'RakuyoKit')
SwiftCompile normal arm64 Compiling\ KeyboardChangeContext.swift,\ KeyboardEvent.swift /Users/admin/builder/spi-builder-workspace/Sources/Combine/Core/Keyboard/KeyboardChangeContext.swift /Users/admin/builder/spi-builder-workspace/Sources/Combine/Core/Keyboard/KeyboardEvent.swift (in target 'RAKCombine' from project 'RakuyoKit')
SwiftCompile normal arm64 /Users/admin/builder/spi-builder-workspace/Sources/Combine/Core/Keyboard/KeyboardChangeContext.swift (in target 'RAKCombine' from project 'RakuyoKit')
    cd /Users/admin/builder/spi-builder-workspace/.swiftpm/xcode

SwiftCompile normal arm64 /Users/admin/builder/spi-builder-workspace/Sources/Combine/Core/Keyboard/KeyboardEvent.swift (in target 'RAKCombine' from project 'RakuyoKit')
    cd /Users/admin/builder/spi-builder-workspace/.swiftpm/xcode

SwiftDriverJobDiscovery normal arm64_32 Compiling DelegateProxy.swift, DelegateProxyPublisher.swift, DelegateProxyType.swift (in target 'RAKCombine' from project 'RakuyoKit')
SwiftCompile normal arm64 Compiling\ AnyPublisher+SAK.swift,\ NSTextStorage+Combine.swift /Users/admin/builder/spi-builder-workspace/Sources/Combine/Core/Extendable/AnyPublisher+SAK.swift /Users/admin/builder/spi-builder-workspace/Sources/Combine/Core/Extendable/NSTextStorage+Combine.swift (in target 'RAKCombine' from project 'RakuyoKit')
SwiftCompile normal arm64 /Users/admin/builder/spi-builder-workspace/Sources/Combine/Core/Extendable/AnyPublisher+SAK.swift (in target 'RAKCombine' from project 'RakuyoKit')
    cd /Users/admin/builder/spi-builder-workspace/.swiftpm/xcode

SwiftCompile normal arm64 /Users/admin/builder/spi-builder-workspace/Sources/Combine/Core/Extendable/NSTextStorage+Combine.swift (in target 'RAKCombine' from project 'RakuyoKit')
    cd /Users/admin/builder/spi-builder-workspace/.swiftpm/xcode

SwiftDriverJobDiscovery normal armv7k Compiling ControlPropertyPublisher.swift, ControlTargetPublisher.swift (in target 'RAKCombine' from project 'RakuyoKit')
SwiftCompile normal arm64_32 Compiling\ KeyboardChangeContext.swift,\ KeyboardEvent.swift /Users/admin/builder/spi-builder-workspace/Sources/Combine/Core/Keyboard/KeyboardChangeContext.swift /Users/admin/builder/spi-builder-workspace/Sources/Combine/Core/Keyboard/KeyboardEvent.swift (in target 'RAKCombine' from project 'RakuyoKit')
SwiftCompile normal arm64_32 /Users/admin/builder/spi-builder-workspace/Sources/Combine/Core/Keyboard/KeyboardChangeContext.swift (in target 'RAKCombine' from project 'RakuyoKit')
    cd /Users/admin/builder/spi-builder-workspace/.swiftpm/xcode

SwiftCompile normal arm64_32 /Users/admin/builder/spi-builder-workspace/Sources/Combine/Core/Keyboard/KeyboardEvent.swift (in target 'RAKCombine' from project 'RakuyoKit')
    cd /Users/admin/builder/spi-builder-workspace/.swiftpm/xcode

SwiftDriverJobDiscovery normal arm64 Compiling Publishers+CombineLatest.swift, UIBarButtonItem+Combine.swift (in target 'RAKCombine' from project 'RakuyoKit')
SwiftCompile normal armv7k Compiling\ DelegateProxy.swift,\ DelegateProxyPublisher.swift,\ DelegateProxyType.swift /Users/admin/builder/spi-builder-workspace/Sources/Combine/Core/DelegateProxy/DelegateProxy.swift /Users/admin/builder/spi-builder-workspace/Sources/Combine/Core/DelegateProxy/DelegateProxyPublisher.swift /Users/admin/builder/spi-builder-workspace/Sources/Combine/Core/DelegateProxy/DelegateProxyType.swift (in target 'RAKCombine' from project 'RakuyoKit')
SwiftCompile normal armv7k /Users/admin/builder/spi-builder-workspace/Sources/Combine/Core/DelegateProxy/DelegateProxy.swift (in target 'RAKCombine' from project 'RakuyoKit')
    cd /Users/admin/builder/spi-builder-workspace/.swiftpm/xcode

SwiftCompile normal armv7k /Users/admin/builder/spi-builder-workspace/Sources/Combine/Core/DelegateProxy/DelegateProxyPublisher.swift (in target 'RAKCombine' from project 'RakuyoKit')
    cd /Users/admin/builder/spi-builder-workspace/.swiftpm/xcode

SwiftCompile normal armv7k /Users/admin/builder/spi-builder-workspace/Sources/Combine/Core/DelegateProxy/DelegateProxyType.swift (in target 'RAKCombine' from project 'RakuyoKit')
    cd /Users/admin/builder/spi-builder-workspace/.swiftpm/xcode

SwiftDriverJobDiscovery normal arm64 Compiling DelegateProxy.swift, DelegateProxyPublisher.swift, DelegateProxyType.swift (in target 'RAKCombine' from project 'RakuyoKit')
SwiftCompile normal arm64_32 Compiling\ Publisher+UITextField.swift,\ Publisher+assign.swift /Users/admin/builder/spi-builder-workspace/Sources/Combine/Core/Extendable/Publisher+UITextField.swift /Users/admin/builder/spi-builder-workspace/Sources/Combine/Core/Extendable/Publisher+assign.swift (in target 'RAKCombine' from project 'RakuyoKit')
SwiftCompile normal arm64_32 /Users/admin/builder/spi-builder-workspace/Sources/Combine/Core/Extendable/Publisher+UITextField.swift (in target 'RAKCombine' from project 'RakuyoKit')
    cd /Users/admin/builder/spi-builder-workspace/.swiftpm/xcode

SwiftCompile normal arm64_32 /Users/admin/builder/spi-builder-workspace/Sources/Combine/Core/Extendable/Publisher+assign.swift (in target 'RAKCombine' from project 'RakuyoKit')
    cd /Users/admin/builder/spi-builder-workspace/.swiftpm/xcode

SwiftDriverJobDiscovery normal armv7k Compiling ObservablePropertyWrapper.swift, ControlEventsPublisher.swift (in target 'RAKCombine' from project 'RakuyoKit')
SwiftCompile normal arm64_32 Compiling\ AnyPublisher+SAK.swift,\ NSTextStorage+Combine.swift /Users/admin/builder/spi-builder-workspace/Sources/Combine/Core/Extendable/AnyPublisher+SAK.swift /Users/admin/builder/spi-builder-workspace/Sources/Combine/Core/Extendable/NSTextStorage+Combine.swift (in target 'RAKCombine' from project 'RakuyoKit')
SwiftCompile normal arm64_32 /Users/admin/builder/spi-builder-workspace/Sources/Combine/Core/Extendable/AnyPublisher+SAK.swift (in target 'RAKCombine' from project 'RakuyoKit')
    cd /Users/admin/builder/spi-builder-workspace/.swiftpm/xcode

SwiftCompile normal arm64_32 /Users/admin/builder/spi-builder-workspace/Sources/Combine/Core/Extendable/NSTextStorage+Combine.swift (in target 'RAKCombine' from project 'RakuyoKit')
    cd /Users/admin/builder/spi-builder-workspace/.swiftpm/xcode

SwiftDriverJobDiscovery normal armv7k Compiling Publisher+UITextField.swift, Publisher+assign.swift (in target 'RAKCombine' from project 'RakuyoKit')
SwiftCompile normal arm64 Compiling\ ObservablePropertyWrapper.swift,\ ControlEventsPublisher.swift /Users/admin/builder/spi-builder-workspace/Sources/Combine/Core/ObservableProperty/ObservablePropertyWrapper.swift /Users/admin/builder/spi-builder-workspace/Sources/Combine/Core/Publisher/ControlEventsPublisher.swift (in target 'RAKCombine' from project 'RakuyoKit')
SwiftCompile normal arm64 /Users/admin/builder/spi-builder-workspace/Sources/Combine/Core/ObservableProperty/ObservablePropertyWrapper.swift (in target 'RAKCombine' from project 'RakuyoKit')
    cd /Users/admin/builder/spi-builder-workspace/.swiftpm/xcode

SwiftCompile normal arm64 /Users/admin/builder/spi-builder-workspace/Sources/Combine/Core/Publisher/ControlEventsPublisher.swift (in target 'RAKCombine' from project 'RakuyoKit')
    cd /Users/admin/builder/spi-builder-workspace/.swiftpm/xcode

SwiftDriverJobDiscovery normal armv7k Compiling AnyPublisher+SAK.swift, NSTextStorage+Combine.swift (in target 'RAKCombine' from project 'RakuyoKit')
SwiftCompile normal arm64 Compiling\ KeyboardListenable.swift,\ NotificationCenter+CombineKeyboard.swift /Users/admin/builder/spi-builder-workspace/Sources/Combine/Core/Keyboard/KeyboardListenable.swift /Users/admin/builder/spi-builder-workspace/Sources/Combine/Core/Keyboard/NotificationCenter+CombineKeyboard.swift (in target 'RAKCombine' from project 'RakuyoKit')
SwiftCompile normal arm64 /Users/admin/builder/spi-builder-workspace/Sources/Combine/Core/Keyboard/KeyboardListenable.swift (in target 'RAKCombine' from project 'RakuyoKit')
    cd /Users/admin/builder/spi-builder-workspace/.swiftpm/xcode

SwiftCompile normal arm64 /Users/admin/builder/spi-builder-workspace/Sources/Combine/Core/Keyboard/NotificationCenter+CombineKeyboard.swift (in target 'RAKCombine' from project 'RakuyoKit')
    cd /Users/admin/builder/spi-builder-workspace/.swiftpm/xcode

SwiftDriverJobDiscovery normal arm64_32 Compiling ControlPropertyPublisher.swift, ControlTargetPublisher.swift (in target 'RAKCombine' from project 'RakuyoKit')
SwiftCompile normal arm64_32 Compiling\ ObservablePropertyWrapper.swift,\ ControlEventsPublisher.swift /Users/admin/builder/spi-builder-workspace/Sources/Combine/Core/ObservableProperty/ObservablePropertyWrapper.swift /Users/admin/builder/spi-builder-workspace/Sources/Combine/Core/Publisher/ControlEventsPublisher.swift (in target 'RAKCombine' from project 'RakuyoKit')
SwiftCompile normal arm64_32 /Users/admin/builder/spi-builder-workspace/Sources/Combine/Core/ObservableProperty/ObservablePropertyWrapper.swift (in target 'RAKCombine' from project 'RakuyoKit')
    cd /Users/admin/builder/spi-builder-workspace/.swiftpm/xcode

SwiftCompile normal arm64_32 /Users/admin/builder/spi-builder-workspace/Sources/Combine/Core/Publisher/ControlEventsPublisher.swift (in target 'RAKCombine' from project 'RakuyoKit')
    cd /Users/admin/builder/spi-builder-workspace/.swiftpm/xcode

SwiftDriverJobDiscovery normal arm64_32 Compiling UIControl+Combine.swift, UITextView+Combine.swift (in target 'RAKCombine' from project 'RakuyoKit')
SwiftCompile normal arm64_32 Compiling\ KeyboardListenable.swift,\ NotificationCenter+CombineKeyboard.swift /Users/admin/builder/spi-builder-workspace/Sources/Combine/Core/Keyboard/KeyboardListenable.swift /Users/admin/builder/spi-builder-workspace/Sources/Combine/Core/Keyboard/NotificationCenter+CombineKeyboard.swift (in target 'RAKCombine' from project 'RakuyoKit')
SwiftCompile normal arm64_32 /Users/admin/builder/spi-builder-workspace/Sources/Combine/Core/Keyboard/KeyboardListenable.swift (in target 'RAKCombine' from project 'RakuyoKit')
    cd /Users/admin/builder/spi-builder-workspace/.swiftpm/xcode

SwiftCompile normal arm64_32 /Users/admin/builder/spi-builder-workspace/Sources/Combine/Core/Keyboard/NotificationCenter+CombineKeyboard.swift (in target 'RAKCombine' from project 'RakuyoKit')
    cd /Users/admin/builder/spi-builder-workspace/.swiftpm/xcode

SwiftDriverJobDiscovery normal arm64 Compiling KeyboardChangeContext.swift, KeyboardEvent.swift (in target 'RAKCombine' from project 'RakuyoKit')
SwiftCompile normal armv7k Compiling\ BindableProperty.swift,\ ObservableProperty.swift /Users/admin/builder/spi-builder-workspace/Sources/Combine/Core/ObservableProperty/BindableProperty.swift /Users/admin/builder/spi-builder-workspace/Sources/Combine/Core/ObservableProperty/ObservableProperty.swift (in target 'RAKCombine' from project 'RakuyoKit')
SwiftCompile normal armv7k /Users/admin/builder/spi-builder-workspace/Sources/Combine/Core/ObservableProperty/BindableProperty.swift (in target 'RAKCombine' from project 'RakuyoKit')
    cd /Users/admin/builder/spi-builder-workspace/.swiftpm/xcode

SwiftCompile normal armv7k /Users/admin/builder/spi-builder-workspace/Sources/Combine/Core/ObservableProperty/ObservableProperty.swift (in target 'RAKCombine' from project 'RakuyoKit')
    cd /Users/admin/builder/spi-builder-workspace/.swiftpm/xcode

SwiftDriverJobDiscovery normal arm64 Compiling AnyPublisher+SAK.swift, NSTextStorage+Combine.swift (in target 'RAKCombine' from project 'RakuyoKit')
SwiftCompile normal arm64_32 Compiling\ Publishers+CombineLatest.swift,\ UIBarButtonItem+Combine.swift /Users/admin/builder/spi-builder-workspace/Sources/Combine/Core/Extendable/Publishers+CombineLatest.swift /Users/admin/builder/spi-builder-workspace/Sources/Combine/Core/Extendable/UIBarButtonItem+Combine.swift (in target 'RAKCombine' from project 'RakuyoKit')
SwiftCompile normal arm64_32 /Users/admin/builder/spi-builder-workspace/Sources/Combine/Core/Extendable/Publishers+CombineLatest.swift (in target 'RAKCombine' from project 'RakuyoKit')
    cd /Users/admin/builder/spi-builder-workspace/.swiftpm/xcode

SwiftCompile normal arm64_32 /Users/admin/builder/spi-builder-workspace/Sources/Combine/Core/Extendable/UIBarButtonItem+Combine.swift (in target 'RAKCombine' from project 'RakuyoKit')
    cd /Users/admin/builder/spi-builder-workspace/.swiftpm/xcode

SwiftDriverJobDiscovery normal arm64_32 Compiling KeyboardChangeContext.swift, KeyboardEvent.swift (in target 'RAKCombine' from project 'RakuyoKit')
SwiftCompile normal armv7k Compiling\ KeyboardChangeContext.swift,\ KeyboardEvent.swift /Users/admin/builder/spi-builder-workspace/Sources/Combine/Core/Keyboard/KeyboardChangeContext.swift /Users/admin/builder/spi-builder-workspace/Sources/Combine/Core/Keyboard/KeyboardEvent.swift (in target 'RAKCombine' from project 'RakuyoKit')
SwiftCompile normal armv7k /Users/admin/builder/spi-builder-workspace/Sources/Combine/Core/Keyboard/KeyboardChangeContext.swift (in target 'RAKCombine' from project 'RakuyoKit')
    cd /Users/admin/builder/spi-builder-workspace/.swiftpm/xcode

SwiftCompile normal armv7k /Users/admin/builder/spi-builder-workspace/Sources/Combine/Core/Keyboard/KeyboardEvent.swift (in target 'RAKCombine' from project 'RakuyoKit')
    cd /Users/admin/builder/spi-builder-workspace/.swiftpm/xcode

SwiftDriverJobDiscovery normal arm64_32 Compiling Publisher+UITextField.swift, Publisher+assign.swift (in target 'RAKCombine' from project 'RakuyoKit')
SwiftCompile normal arm64_32 Compiling\ RAKDecodable+RAK.swift /Users/admin/builder/spi-builder-workspace/Sources/Codable/RAKDecodable+RAK.swift (in target 'RAKCodable' from project 'RakuyoKit')
SwiftCompile normal arm64_32 /Users/admin/builder/spi-builder-workspace/Sources/Codable/RAKDecodable+RAK.swift (in target 'RAKCodable' from project 'RakuyoKit')
    cd /Users/admin/builder/spi-builder-workspace/.swiftpm/xcode

SwiftDriverJobDiscovery normal arm64_32 Compiling AnyPublisher+SAK.swift, NSTextStorage+Combine.swift (in target 'RAKCombine' from project 'RakuyoKit')
SwiftCompile normal arm64_32 Compiling\ RAKDecodable.swift /Users/admin/builder/spi-builder-workspace/Sources/Codable/RAKDecodable.swift (in target 'RAKCodable' from project 'RakuyoKit')
SwiftCompile normal arm64_32 /Users/admin/builder/spi-builder-workspace/Sources/Codable/RAKDecodable.swift (in target 'RAKCodable' from project 'RakuyoKit')
    cd /Users/admin/builder/spi-builder-workspace/.swiftpm/xcode

SwiftDriverJobDiscovery normal arm64 Compiling KeyboardListenable.swift, NotificationCenter+CombineKeyboard.swift (in target 'RAKCombine' from project 'RakuyoKit')
SwiftCompile normal arm64 Compiling\ RAKDecodable+RAK.swift /Users/admin/builder/spi-builder-workspace/Sources/Codable/RAKDecodable+RAK.swift (in target 'RAKCodable' from project 'RakuyoKit')
SwiftCompile normal arm64 /Users/admin/builder/spi-builder-workspace/Sources/Codable/RAKDecodable+RAK.swift (in target 'RAKCodable' from project 'RakuyoKit')
    cd /Users/admin/builder/spi-builder-workspace/.swiftpm/xcode

SwiftDriverJobDiscovery normal arm64 Compiling ObservablePropertyWrapper.swift, ControlEventsPublisher.swift (in target 'RAKCombine' from project 'RakuyoKit')
SwiftDriverJobDiscovery normal arm64_32 Compiling KeyboardListenable.swift, NotificationCenter+CombineKeyboard.swift (in target 'RAKCombine' from project 'RakuyoKit')
SwiftDriver\ Compilation RAKCombine normal arm64 com.apple.xcode.tools.swift.compiler (in target 'RAKCombine' from project 'RakuyoKit')
    cd /Users/admin/builder/spi-builder-workspace/.swiftpm/xcode
    builtin-Swift-Compilation -- /Applications/Xcode-16.3.0.app/Contents/Developer/Toolchains/XcodeDefault.xctoolchain/usr/bin/swiftc -module-name RAKCombine -Onone -enforce-exclusivity\=checked @/Users/admin/builder/spi-builder-workspace/.derivedData/Build/Intermediates.noindex/RakuyoKit.build/Debug-watchos/RAKCombine.build/Objects-normal/arm64/RAKCombine.SwiftFileList -DSWIFT_PACKAGE -DDEBUG -DXcode -plugin-path /Applications/Xcode-16.3.0.app/Contents/Developer/Toolchains/XcodeDefault.xctoolchain/usr/lib/swift/host/plugins/testing -enable-experimental-feature DebugDescriptionMacro -sdk /Applications/Xcode-16.3.0.app/Contents/Developer/Platforms/WatchOS.platform/Developer/SDKs/WatchOS11.4.sdk -target arm64-apple-watchos6.0 -g -module-cache-path /Users/admin/builder/spi-builder-workspace/.derivedData/ModuleCache.noindex -Xfrontend -serialize-debugging-options -profile-coverage-mapping -profile-generate -enable-testing -index-store-path /Users/admin/builder/spi-builder-workspace/.derivedData/Index.noindex/DataStore -swift-version 5 -I /Users/admin/builder/spi-builder-workspace/.derivedData/Build/Products/Debug-watchos -I /Applications/Xcode-16.3.0.app/Contents/Developer/Platforms/WatchOS.platform/Developer/usr/lib -F /Users/admin/builder/spi-builder-workspace/.derivedData/Build/Products/Debug-watchos/PackageFrameworks -F /Users/admin/builder/spi-builder-workspace/.derivedData/Build/Products/Debug-watchos/PackageFrameworks -F /Users/admin/builder/spi-builder-workspace/.derivedData/Build/Products/Debug-watchos/PackageFrameworks -F /Users/admin/builder/spi-builder-workspace/.derivedData/Build/Products/Debug-watchos/PackageFrameworks -F /Users/admin/builder/spi-builder-workspace/.derivedData/Build/Products/Debug-watchos -F /Applications/Xcode-16.3.0.app/Contents/Developer/Platforms/WatchOS.platform/Developer/Library/Frameworks -F /Applications/Xcode-16.3.0.app/Contents/Developer/Platforms/WatchOS.platform/Developer/SDKs/WatchOS11.4.sdk/Developer/Library/Frameworks -c -j10 -enable-batch-mode -incremental -Xcc -ivfsstatcache -Xcc /Users/admin/builder/spi-builder-workspace/.derivedData/SDKStatCaches.noindex/watchos11.4-22T246-43efb940ff07ba2497b70ec94253f576.sdkstatcache -output-file-map /Users/admin/builder/spi-builder-workspace/.derivedData/Build/Intermediates.noindex/RakuyoKit.build/Debug-watchos/RAKCombine.build/Objects-normal/arm64/RAKCombine-OutputFileMap.json -use-frontend-parseable-output -save-temps -no-color-diagnostics -serialize-diagnostics -emit-dependencies -emit-module -emit-module-path /Users/admin/builder/spi-builder-workspace/.derivedData/Build/Intermediates.noindex/RakuyoKit.build/Debug-watchos/RAKCombine.build/Objects-normal/arm64/RAKCombine.swiftmodule -validate-clang-modules-once -clang-build-session-file /Users/admin/builder/spi-builder-workspace/.derivedData/ModuleCache.noindex/Session.modulevalidation -package-name spi_builder_workspace -Xcc -I/Users/admin/builder/spi-builder-workspace/.derivedData/Build/Intermediates.noindex/RakuyoKit.build/Debug-watchos/RAKCombine.build/swift-overrides.hmap -emit-const-values -Xfrontend -const-gather-protocols-file -Xfrontend /Users/admin/builder/spi-builder-workspace/.derivedData/Build/Intermediates.noindex/RakuyoKit.build/Debug-watchos/RAKCombine.build/Objects-normal/arm64/RAKCombine_const_extract_protocols.json -Xcc -I/Users/admin/builder/spi-builder-workspace/Sources/Combine/Runtime/include -Xcc -I/Users/admin/builder/spi-builder-workspace/.derivedData/Build/Products/Debug-watchos/include -Xcc -I/Users/admin/builder/spi-builder-workspace/.derivedData/Build/Intermediates.noindex/RakuyoKit.build/Debug-watchos/RAKCombine.build/DerivedSources-normal/arm64 -Xcc -I/Users/admin/builder/spi-builder-workspace/.derivedData/Build/Intermediates.noindex/RakuyoKit.build/Debug-watchos/RAKCombine.build/DerivedSources/arm64 -Xcc -I/Users/admin/builder/spi-builder-workspace/.derivedData/Build/Intermediates.noindex/RakuyoKit.build/Debug-watchos/RAKCombine.build/DerivedSources -Xcc -DSWIFT_PACKAGE -Xcc -DDEBUG\=1 -emit-objc-header -emit-objc-header-path /Users/admin/builder/spi-builder-workspace/.derivedData/Build/Intermediates.noindex/RakuyoKit.build/Debug-watchos/RAKCombine.build/Objects-normal/arm64/RAKCombine-Swift.h -working-directory /Users/admin/builder/spi-builder-workspace/.swiftpm/xcode -experimental-emit-module-separately -disable-cmo
SwiftCompile normal arm64_32 Compiling\ RAKCodable.swift /Users/admin/builder/spi-builder-workspace/Sources/Codable/RAKCodable.swift (in target 'RAKCodable' from project 'RakuyoKit')
SwiftCompile normal arm64_32 /Users/admin/builder/spi-builder-workspace/Sources/Codable/RAKCodable.swift (in target 'RAKCodable' from project 'RakuyoKit')
    cd /Users/admin/builder/spi-builder-workspace/.swiftpm/xcode

SwiftCompile normal armv7k Compiling\ RAKEncodable.swift /Users/admin/builder/spi-builder-workspace/Sources/Codable/RAKEncodable.swift (in target 'RAKCodable' from project 'RakuyoKit')
SwiftCompile normal armv7k /Users/admin/builder/spi-builder-workspace/Sources/Codable/RAKEncodable.swift (in target 'RAKCodable' from project 'RakuyoKit')
    cd /Users/admin/builder/spi-builder-workspace/.swiftpm/xcode

SwiftDriverJobDiscovery normal arm64_32 Compiling ObservablePropertyWrapper.swift, ControlEventsPublisher.swift (in target 'RAKCombine' from project 'RakuyoKit')
SwiftCompile normal arm64 Compiling\ RAKEncodable.swift /Users/admin/builder/spi-builder-workspace/Sources/Codable/RAKEncodable.swift (in target 'RAKCodable' from project 'RakuyoKit')
SwiftCompile normal arm64 /Users/admin/builder/spi-builder-workspace/Sources/Codable/RAKEncodable.swift (in target 'RAKCodable' from project 'RakuyoKit')
    cd /Users/admin/builder/spi-builder-workspace/.swiftpm/xcode

SwiftDriverJobDiscovery normal armv7k Compiling DelegateProxy.swift, DelegateProxyPublisher.swift, DelegateProxyType.swift (in target 'RAKCombine' from project 'RakuyoKit')
SwiftCompile normal arm64_32 Compiling\ RAKEncodable.swift /Users/admin/builder/spi-builder-workspace/Sources/Codable/RAKEncodable.swift (in target 'RAKCodable' from project 'RakuyoKit')
SwiftCompile normal arm64_32 /Users/admin/builder/spi-builder-workspace/Sources/Codable/RAKEncodable.swift (in target 'RAKCodable' from project 'RakuyoKit')
    cd /Users/admin/builder/spi-builder-workspace/.swiftpm/xcode

SwiftDriverJobDiscovery normal armv7k Emitting module for GRDB (in target 'GRDB' from project 'GRDB')
SwiftDriver\ Compilation\ Requirements GRDB normal armv7k com.apple.xcode.tools.swift.compiler (in target 'GRDB' from project 'GRDB')
    cd /Users/admin/builder/spi-builder-workspace/.swiftpm/xcode
    builtin-Swift-Compilation-Requirements -- /Applications/Xcode-16.3.0.app/Contents/Developer/Toolchains/XcodeDefault.xctoolchain/usr/bin/swiftc -module-name GRDB -Onone -enforce-exclusivity\=checked @/Users/admin/builder/spi-builder-workspace/.derivedData/Build/Intermediates.noindex/GRDB.build/Debug-watchos/GRDB.build/Objects-normal/armv7k/GRDB.SwiftFileList -DSWIFT_PACKAGE -DDEBUG -DSQLITE_ENABLE_FTS5 -Xcc -fmodule-map-file\=/Users/admin/builder/spi-builder-workspace/.dependencies/checkouts/GRDB.swift/Sources/CSQLite/module.modulemap -DXcode -plugin-path /Applications/Xcode-16.3.0.app/Contents/Developer/Toolchains/XcodeDefault.xctoolchain/usr/lib/swift/host/plugins/testing -enable-experimental-feature DebugDescriptionMacro -sdk /Applications/Xcode-16.3.0.app/Contents/Developer/Platforms/WatchOS.platform/Developer/SDKs/WatchOS11.4.sdk -target armv7k-apple-watchos4.0 -g -module-cache-path /Users/admin/builder/spi-builder-workspace/.derivedData/ModuleCache.noindex -Xfrontend -serialize-debugging-options -profile-coverage-mapping -profile-generate -enable-testing -suppress-warnings -index-store-path /Users/admin/builder/spi-builder-workspace/.derivedData/Index.noindex/DataStore -swift-version 5 -I /Users/admin/builder/spi-builder-workspace/.derivedData/Build/Products/Debug-watchos -I /Applications/Xcode-16.3.0.app/Contents/Developer/Platforms/WatchOS.platform/Developer/usr/lib -F /Users/admin/builder/spi-builder-workspace/.derivedData/Build/Products/Debug-watchos -F /Applications/Xcode-16.3.0.app/Contents/Developer/Platforms/WatchOS.platform/Developer/Library/Frameworks -F /Applications/Xcode-16.3.0.app/Contents/Developer/Platforms/WatchOS.platform/Developer/SDKs/WatchOS11.4.sdk/Developer/Library/Frameworks -emit-localized-strings -emit-localized-strings-path /Users/admin/builder/spi-builder-workspace/.derivedData/Build/Intermediates.noindex/GRDB.build/Debug-watchos/GRDB.build/Objects-normal/armv7k -c -j10 -enable-batch-mode -incremental -Xcc -ivfsstatcache -Xcc /Users/admin/builder/spi-builder-workspace/.derivedData/SDKStatCaches.noindex/watchos11.4-22T246-43efb940ff07ba2497b70ec94253f576.sdkstatcache -output-file-map /Users/admin/builder/spi-builder-workspace/.derivedData/Build/Intermediates.noindex/GRDB.build/Debug-watchos/GRDB.build/Objects-normal/armv7k/GRDB-OutputFileMap.json -use-frontend-parseable-output -save-temps -no-color-diagnostics -serialize-diagnostics -emit-dependencies -emit-module -emit-module-path /Users/admin/builder/spi-builder-workspace/.derivedData/Build/Intermediates.noindex/GRDB.build/Debug-watchos/GRDB.build/Objects-normal/armv7k/GRDB.swiftmodule -validate-clang-modules-once -clang-build-session-file /Users/admin/builder/spi-builder-workspace/.derivedData/ModuleCache.noindex/Session.modulevalidation -Xcc -I/Users/admin/builder/spi-builder-workspace/.derivedData/Build/Intermediates.noindex/GRDB.build/Debug-watchos/GRDB.build/swift-overrides.hmap -emit-const-values -Xfrontend -const-gather-protocols-file -Xfrontend /Users/admin/builder/spi-builder-workspace/.derivedData/Build/Intermediates.noindex/GRDB.build/Debug-watchos/GRDB.build/Objects-normal/armv7k/GRDB_const_extract_protocols.json -Xcc -I/Users/admin/builder/spi-builder-workspace/.derivedData/Build/Products/Debug-watchos/include -Xcc -I/Users/admin/builder/spi-builder-workspace/.derivedData/Build/Intermediates.noindex/GRDB.build/Debug-watchos/GRDB.build/DerivedSources-normal/armv7k -Xcc -I/Users/admin/builder/spi-builder-workspace/.derivedData/Build/Intermediates.noindex/GRDB.build/Debug-watchos/GRDB.build/DerivedSources/armv7k -Xcc -I/Users/admin/builder/spi-builder-workspace/.derivedData/Build/Intermediates.noindex/GRDB.build/Debug-watchos/GRDB.build/DerivedSources -Xcc -DSWIFT_PACKAGE -Xcc -DDEBUG\=1 -emit-objc-header -emit-objc-header-path /Users/admin/builder/spi-builder-workspace/.derivedData/Build/Intermediates.noindex/GRDB.build/Debug-watchos/GRDB.build/Objects-normal/armv7k/GRDB-Swift.h -working-directory /Users/admin/builder/spi-builder-workspace/.swiftpm/xcode -experimental-emit-module-separately -disable-cmo
SwiftDriverJobDiscovery normal armv7k Compiling BindableProperty.swift, ObservableProperty.swift (in target 'RAKCombine' from project 'RakuyoKit')
SwiftCompile normal armv7k Compiling\ RAKEncodable+RAK.swift /Users/admin/builder/spi-builder-workspace/Sources/Codable/RAKEncodable+RAK.swift (in target 'RAKCodable' from project 'RakuyoKit')
SwiftCompile normal armv7k /Users/admin/builder/spi-builder-workspace/Sources/Codable/RAKEncodable+RAK.swift (in target 'RAKCodable' from project 'RakuyoKit')
    cd /Users/admin/builder/spi-builder-workspace/.swiftpm/xcode

Copy /Users/admin/builder/spi-builder-workspace/.derivedData/Build/Products/Debug-watchos/GRDB.swiftmodule/arm64-apple-watchos.abi.json /Users/admin/builder/spi-builder-workspace/.derivedData/Build/Intermediates.noindex/GRDB.build/Debug-watchos/GRDB.build/Objects-normal/arm64/GRDB.abi.json (in target 'GRDB' from project 'GRDB')
    cd /Users/admin/builder/spi-builder-workspace/.dependencies/checkouts/GRDB.swift
    builtin-copy -exclude .DS_Store -exclude CVS -exclude .svn -exclude .git -exclude .hg -resolve-src-symlinks -rename /Users/admin/builder/spi-builder-workspace/.derivedData/Build/Intermediates.noindex/GRDB.build/Debug-watchos/GRDB.build/Objects-normal/arm64/GRDB.abi.json /Users/admin/builder/spi-builder-workspace/.derivedData/Build/Products/Debug-watchos/GRDB.swiftmodule/arm64-apple-watchos.abi.json
SwiftDriverJobDiscovery normal arm64_32 Compiling Publishers+CombineLatest.swift, UIBarButtonItem+Combine.swift (in target 'RAKCombine' from project 'RakuyoKit')
SwiftDriver\ Compilation RAKCombine normal arm64_32 com.apple.xcode.tools.swift.compiler (in target 'RAKCombine' from project 'RakuyoKit')
    cd /Users/admin/builder/spi-builder-workspace/.swiftpm/xcode
    builtin-Swift-Compilation -- /Applications/Xcode-16.3.0.app/Contents/Developer/Toolchains/XcodeDefault.xctoolchain/usr/bin/swiftc -module-name RAKCombine -Onone -enforce-exclusivity\=checked @/Users/admin/builder/spi-builder-workspace/.derivedData/Build/Intermediates.noindex/RakuyoKit.build/Debug-watchos/RAKCombine.build/Objects-normal/arm64_32/RAKCombine.SwiftFileList -DSWIFT_PACKAGE -DDEBUG -DXcode -plugin-path /Applications/Xcode-16.3.0.app/Contents/Developer/Toolchains/XcodeDefault.xctoolchain/usr/lib/swift/host/plugins/testing -enable-experimental-feature DebugDescriptionMacro -sdk /Applications/Xcode-16.3.0.app/Contents/Developer/Platforms/WatchOS.platform/Developer/SDKs/WatchOS11.4.sdk -target arm64_32-apple-watchos6.0 -g -module-cache-path /Users/admin/builder/spi-builder-workspace/.derivedData/ModuleCache.noindex -Xfrontend -serialize-debugging-options -profile-coverage-mapping -profile-generate -enable-testing -index-store-path /Users/admin/builder/spi-builder-workspace/.derivedData/Index.noindex/DataStore -swift-version 5 -I /Users/admin/builder/spi-builder-workspace/.derivedData/Build/Products/Debug-watchos -I /Applications/Xcode-16.3.0.app/Contents/Developer/Platforms/WatchOS.platform/Developer/usr/lib -F /Users/admin/builder/spi-builder-workspace/.derivedData/Build/Products/Debug-watchos/PackageFrameworks -F /Users/admin/builder/spi-builder-workspace/.derivedData/Build/Products/Debug-watchos/PackageFrameworks -F /Users/admin/builder/spi-builder-workspace/.derivedData/Build/Products/Debug-watchos/PackageFrameworks -F /Users/admin/builder/spi-builder-workspace/.derivedData/Build/Products/Debug-watchos/PackageFrameworks -F /Users/admin/builder/spi-builder-workspace/.derivedData/Build/Products/Debug-watchos -F /Applications/Xcode-16.3.0.app/Contents/Developer/Platforms/WatchOS.platform/Developer/Library/Frameworks -F /Applications/Xcode-16.3.0.app/Contents/Developer/Platforms/WatchOS.platform/Developer/SDKs/WatchOS11.4.sdk/Developer/Library/Frameworks -c -j10 -enable-batch-mode -incremental -Xcc -ivfsstatcache -Xcc /Users/admin/builder/spi-builder-workspace/.derivedData/SDKStatCaches.noindex/watchos11.4-22T246-43efb940ff07ba2497b70ec94253f576.sdkstatcache -output-file-map /Users/admin/builder/spi-builder-workspace/.derivedData/Build/Intermediates.noindex/RakuyoKit.build/Debug-watchos/RAKCombine.build/Objects-normal/arm64_32/RAKCombine-OutputFileMap.json -use-frontend-parseable-output -save-temps -no-color-diagnostics -serialize-diagnostics -emit-dependencies -emit-module -emit-module-path /Users/admin/builder/spi-builder-workspace/.derivedData/Build/Intermediates.noindex/RakuyoKit.build/Debug-watchos/RAKCombine.build/Objects-normal/arm64_32/RAKCombine.swiftmodule -validate-clang-modules-once -clang-build-session-file /Users/admin/builder/spi-builder-workspace/.derivedData/ModuleCache.noindex/Session.modulevalidation -package-name spi_builder_workspace -Xcc -I/Users/admin/builder/spi-builder-workspace/.derivedData/Build/Intermediates.noindex/RakuyoKit.build/Debug-watchos/RAKCombine.build/swift-overrides.hmap -emit-const-values -Xfrontend -const-gather-protocols-file -Xfrontend /Users/admin/builder/spi-builder-workspace/.derivedData/Build/Intermediates.noindex/RakuyoKit.build/Debug-watchos/RAKCombine.build/Objects-normal/arm64_32/RAKCombine_const_extract_protocols.json -Xcc -I/Users/admin/builder/spi-builder-workspace/Sources/Combine/Runtime/include -Xcc -I/Users/admin/builder/spi-builder-workspace/.derivedData/Build/Products/Debug-watchos/include -Xcc -I/Users/admin/builder/spi-builder-workspace/.derivedData/Build/Intermediates.noindex/RakuyoKit.build/Debug-watchos/RAKCombine.build/DerivedSources-normal/arm64_32 -Xcc -I/Users/admin/builder/spi-builder-workspace/.derivedData/Build/Intermediates.noindex/RakuyoKit.build/Debug-watchos/RAKCombine.build/DerivedSources/arm64_32 -Xcc -I/Users/admin/builder/spi-builder-workspace/.derivedData/Build/Intermediates.noindex/RakuyoKit.build/Debug-watchos/RAKCombine.build/DerivedSources -Xcc -DSWIFT_PACKAGE -Xcc -DDEBUG\=1 -emit-objc-header -emit-objc-header-path /Users/admin/builder/spi-builder-workspace/.derivedData/Build/Intermediates.noindex/RakuyoKit.build/Debug-watchos/RAKCombine.build/Objects-normal/arm64_32/RAKCombine-Swift.h -working-directory /Users/admin/builder/spi-builder-workspace/.swiftpm/xcode -experimental-emit-module-separately -disable-cmo
Copy /Users/admin/builder/spi-builder-workspace/.derivedData/Build/Products/Debug-watchos/GRDB.swiftmodule/armv7k-apple-watchos.swiftmodule /Users/admin/builder/spi-builder-workspace/.derivedData/Build/Intermediates.noindex/GRDB.build/Debug-watchos/GRDB.build/Objects-normal/armv7k/GRDB.swiftmodule (in target 'GRDB' from project 'GRDB')
    cd /Users/admin/builder/spi-builder-workspace/.dependencies/checkouts/GRDB.swift
    builtin-copy -exclude .DS_Store -exclude CVS -exclude .svn -exclude .git -exclude .hg -resolve-src-symlinks -rename /Users/admin/builder/spi-builder-workspace/.derivedData/Build/Intermediates.noindex/GRDB.build/Debug-watchos/GRDB.build/Objects-normal/armv7k/GRDB.swiftmodule /Users/admin/builder/spi-builder-workspace/.derivedData/Build/Products/Debug-watchos/GRDB.swiftmodule/armv7k-apple-watchos.swiftmodule
Copy /Users/admin/builder/spi-builder-workspace/.derivedData/Build/Products/Debug-watchos/GRDB.swiftmodule/armv7k-apple-watchos.abi.json /Users/admin/builder/spi-builder-workspace/.derivedData/Build/Intermediates.noindex/GRDB.build/Debug-watchos/GRDB.build/Objects-normal/armv7k/GRDB.abi.json (in target 'GRDB' from project 'GRDB')
    cd /Users/admin/builder/spi-builder-workspace/.dependencies/checkouts/GRDB.swift
    builtin-copy -exclude .DS_Store -exclude CVS -exclude .svn -exclude .git -exclude .hg -resolve-src-symlinks -rename /Users/admin/builder/spi-builder-workspace/.derivedData/Build/Intermediates.noindex/GRDB.build/Debug-watchos/GRDB.build/Objects-normal/armv7k/GRDB.abi.json /Users/admin/builder/spi-builder-workspace/.derivedData/Build/Products/Debug-watchos/GRDB.swiftmodule/armv7k-apple-watchos.abi.json
SwiftDriverJobDiscovery normal armv7k Compiling KeyboardChangeContext.swift, KeyboardEvent.swift (in target 'RAKCombine' from project 'RakuyoKit')
Copy /Users/admin/builder/spi-builder-workspace/.derivedData/Build/Products/Debug-watchos/GRDB.swiftmodule/arm64_32-apple-watchos.swiftmodule /Users/admin/builder/spi-builder-workspace/.derivedData/Build/Intermediates.noindex/GRDB.build/Debug-watchos/GRDB.build/Objects-normal/arm64_32/GRDB.swiftmodule (in target 'GRDB' from project 'GRDB')
    cd /Users/admin/builder/spi-builder-workspace/.dependencies/checkouts/GRDB.swift
    builtin-copy -exclude .DS_Store -exclude CVS -exclude .svn -exclude .git -exclude .hg -resolve-src-symlinks -rename /Users/admin/builder/spi-builder-workspace/.derivedData/Build/Intermediates.noindex/GRDB.build/Debug-watchos/GRDB.build/Objects-normal/arm64_32/GRDB.swiftmodule /Users/admin/builder/spi-builder-workspace/.derivedData/Build/Products/Debug-watchos/GRDB.swiftmodule/arm64_32-apple-watchos.swiftmodule
Copy /Users/admin/builder/spi-builder-workspace/.derivedData/Build/Products/Debug-watchos/GRDB.swiftmodule/arm64_32-apple-watchos.abi.json /Users/admin/builder/spi-builder-workspace/.derivedData/Build/Intermediates.noindex/GRDB.build/Debug-watchos/GRDB.build/Objects-normal/arm64_32/GRDB.abi.json (in target 'GRDB' from project 'GRDB')
    cd /Users/admin/builder/spi-builder-workspace/.dependencies/checkouts/GRDB.swift
    builtin-copy -exclude .DS_Store -exclude CVS -exclude .svn -exclude .git -exclude .hg -resolve-src-symlinks -rename /Users/admin/builder/spi-builder-workspace/.derivedData/Build/Intermediates.noindex/GRDB.build/Debug-watchos/GRDB.build/Objects-normal/arm64_32/GRDB.abi.json /Users/admin/builder/spi-builder-workspace/.derivedData/Build/Products/Debug-watchos/GRDB.swiftmodule/arm64_32-apple-watchos.abi.json
Copy /Users/admin/builder/spi-builder-workspace/.derivedData/Build/Products/Debug-watchos/GRDB.swiftmodule/arm64-apple-watchos.swiftmodule /Users/admin/builder/spi-builder-workspace/.derivedData/Build/Intermediates.noindex/GRDB.build/Debug-watchos/GRDB.build/Objects-normal/arm64/GRDB.swiftmodule (in target 'GRDB' from project 'GRDB')
    cd /Users/admin/builder/spi-builder-workspace/.dependencies/checkouts/GRDB.swift
    builtin-copy -exclude .DS_Store -exclude CVS -exclude .svn -exclude .git -exclude .hg -resolve-src-symlinks -rename /Users/admin/builder/spi-builder-workspace/.derivedData/Build/Intermediates.noindex/GRDB.build/Debug-watchos/GRDB.build/Objects-normal/arm64/GRDB.swiftmodule /Users/admin/builder/spi-builder-workspace/.derivedData/Build/Products/Debug-watchos/GRDB.swiftmodule/arm64-apple-watchos.swiftmodule
SwiftDriver\ Compilation RAKCombine normal armv7k com.apple.xcode.tools.swift.compiler (in target 'RAKCombine' from project 'RakuyoKit')
    cd /Users/admin/builder/spi-builder-workspace/.swiftpm/xcode
    builtin-Swift-Compilation -- /Applications/Xcode-16.3.0.app/Contents/Developer/Toolchains/XcodeDefault.xctoolchain/usr/bin/swiftc -module-name RAKCombine -Onone -enforce-exclusivity\=checked @/Users/admin/builder/spi-builder-workspace/.derivedData/Build/Intermediates.noindex/RakuyoKit.build/Debug-watchos/RAKCombine.build/Objects-normal/armv7k/RAKCombine.SwiftFileList -DSWIFT_PACKAGE -DDEBUG -DXcode -plugin-path /Applications/Xcode-16.3.0.app/Contents/Developer/Toolchains/XcodeDefault.xctoolchain/usr/lib/swift/host/plugins/testing -enable-experimental-feature DebugDescriptionMacro -sdk /Applications/Xcode-16.3.0.app/Contents/Developer/Platforms/WatchOS.platform/Developer/SDKs/WatchOS11.4.sdk -target armv7k-apple-watchos6.0 -g -module-cache-path /Users/admin/builder/spi-builder-workspace/.derivedData/ModuleCache.noindex -Xfrontend -serialize-debugging-options -profile-coverage-mapping -profile-generate -enable-testing -index-store-path /Users/admin/builder/spi-builder-workspace/.derivedData/Index.noindex/DataStore -swift-version 5 -I /Users/admin/builder/spi-builder-workspace/.derivedData/Build/Products/Debug-watchos -I /Applications/Xcode-16.3.0.app/Contents/Developer/Platforms/WatchOS.platform/Developer/usr/lib -F /Users/admin/builder/spi-builder-workspace/.derivedData/Build/Products/Debug-watchos/PackageFrameworks -F /Users/admin/builder/spi-builder-workspace/.derivedData/Build/Products/Debug-watchos/PackageFrameworks -F /Users/admin/builder/spi-builder-workspace/.derivedData/Build/Products/Debug-watchos/PackageFrameworks -F /Users/admin/builder/spi-builder-workspace/.derivedData/Build/Products/Debug-watchos/PackageFrameworks -F /Users/admin/builder/spi-builder-workspace/.derivedData/Build/Products/Debug-watchos -F /Applications/Xcode-16.3.0.app/Contents/Developer/Platforms/WatchOS.platform/Developer/Library/Frameworks -F /Applications/Xcode-16.3.0.app/Contents/Developer/Platforms/WatchOS.platform/Developer/SDKs/WatchOS11.4.sdk/Developer/Library/Frameworks -c -j10 -enable-batch-mode -incremental -Xcc -ivfsstatcache -Xcc /Users/admin/builder/spi-builder-workspace/.derivedData/SDKStatCaches.noindex/watchos11.4-22T246-43efb940ff07ba2497b70ec94253f576.sdkstatcache -output-file-map /Users/admin/builder/spi-builder-workspace/.derivedData/Build/Intermediates.noindex/RakuyoKit.build/Debug-watchos/RAKCombine.build/Objects-normal/armv7k/RAKCombine-OutputFileMap.json -use-frontend-parseable-output -save-temps -no-color-diagnostics -serialize-diagnostics -emit-dependencies -emit-module -emit-module-path /Users/admin/builder/spi-builder-workspace/.derivedData/Build/Intermediates.noindex/RakuyoKit.build/Debug-watchos/RAKCombine.build/Objects-normal/armv7k/RAKCombine.swiftmodule -validate-clang-modules-once -clang-build-session-file /Users/admin/builder/spi-builder-workspace/.derivedData/ModuleCache.noindex/Session.modulevalidation -package-name spi_builder_workspace -Xcc -I/Users/admin/builder/spi-builder-workspace/.derivedData/Build/Intermediates.noindex/RakuyoKit.build/Debug-watchos/RAKCombine.build/swift-overrides.hmap -emit-const-values -Xfrontend -const-gather-protocols-file -Xfrontend /Users/admin/builder/spi-builder-workspace/.derivedData/Build/Intermediates.noindex/RakuyoKit.build/Debug-watchos/RAKCombine.build/Objects-normal/armv7k/RAKCombine_const_extract_protocols.json -Xcc -I/Users/admin/builder/spi-builder-workspace/Sources/Combine/Runtime/include -Xcc -I/Users/admin/builder/spi-builder-workspace/.derivedData/Build/Products/Debug-watchos/include -Xcc -I/Users/admin/builder/spi-builder-workspace/.derivedData/Build/Intermediates.noindex/RakuyoKit.build/Debug-watchos/RAKCombine.build/DerivedSources-normal/armv7k -Xcc -I/Users/admin/builder/spi-builder-workspace/.derivedData/Build/Intermediates.noindex/RakuyoKit.build/Debug-watchos/RAKCombine.build/DerivedSources/armv7k -Xcc -I/Users/admin/builder/spi-builder-workspace/.derivedData/Build/Intermediates.noindex/RakuyoKit.build/Debug-watchos/RAKCombine.build/DerivedSources -Xcc -DSWIFT_PACKAGE -Xcc -DDEBUG\=1 -emit-objc-header -emit-objc-header-path /Users/admin/builder/spi-builder-workspace/.derivedData/Build/Intermediates.noindex/RakuyoKit.build/Debug-watchos/RAKCombine.build/Objects-normal/armv7k/RAKCombine-Swift.h -working-directory /Users/admin/builder/spi-builder-workspace/.swiftpm/xcode -experimental-emit-module-separately -disable-cmo
SwiftCompile normal arm64 Compiling\ RAKEncodable+RAK.swift /Users/admin/builder/spi-builder-workspace/Sources/Codable/RAKEncodable+RAK.swift (in target 'RAKCodable' from project 'RakuyoKit')
SwiftCompile normal arm64 /Users/admin/builder/spi-builder-workspace/Sources/Codable/RAKEncodable+RAK.swift (in target 'RAKCodable' from project 'RakuyoKit')
    cd /Users/admin/builder/spi-builder-workspace/.swiftpm/xcode

SwiftCompile normal armv7k Compiling\ RAKDecodable+RAK.swift /Users/admin/builder/spi-builder-workspace/Sources/Codable/RAKDecodable+RAK.swift (in target 'RAKCodable' from project 'RakuyoKit')
SwiftCompile normal armv7k /Users/admin/builder/spi-builder-workspace/Sources/Codable/RAKDecodable+RAK.swift (in target 'RAKCodable' from project 'RakuyoKit')
    cd /Users/admin/builder/spi-builder-workspace/.swiftpm/xcode

SwiftCompile normal arm64 Compiling\ RAKDecodable.swift /Users/admin/builder/spi-builder-workspace/Sources/Codable/RAKDecodable.swift (in target 'RAKCodable' from project 'RakuyoKit')
SwiftCompile normal arm64 /Users/admin/builder/spi-builder-workspace/Sources/Codable/RAKDecodable.swift (in target 'RAKCodable' from project 'RakuyoKit')
    cd /Users/admin/builder/spi-builder-workspace/.swiftpm/xcode

SwiftDriverJobDiscovery normal arm64_32 Compiling RAKDecodable+RAK.swift (in target 'RAKCodable' from project 'RakuyoKit')
SwiftCompile normal armv7k Compiling\ RAKCodable.swift /Users/admin/builder/spi-builder-workspace/Sources/Codable/RAKCodable.swift (in target 'RAKCodable' from project 'RakuyoKit')
SwiftCompile normal armv7k /Users/admin/builder/spi-builder-workspace/Sources/Codable/RAKCodable.swift (in target 'RAKCodable' from project 'RakuyoKit')
    cd /Users/admin/builder/spi-builder-workspace/.swiftpm/xcode

SwiftDriverJobDiscovery normal arm64_32 Compiling RAKDecodable.swift (in target 'RAKCodable' from project 'RakuyoKit')
SwiftCompile normal arm64_32 Compiling\ RAKEncodable+RAK.swift /Users/admin/builder/spi-builder-workspace/Sources/Codable/RAKEncodable+RAK.swift (in target 'RAKCodable' from project 'RakuyoKit')
SwiftCompile normal arm64_32 /Users/admin/builder/spi-builder-workspace/Sources/Codable/RAKEncodable+RAK.swift (in target 'RAKCodable' from project 'RakuyoKit')
    cd /Users/admin/builder/spi-builder-workspace/.swiftpm/xcode

SwiftDriverJobDiscovery normal arm64 Compiling RAKDecodable+RAK.swift (in target 'RAKCodable' from project 'RakuyoKit')
SwiftCompile normal arm64 Compiling\ RAKCodable.swift /Users/admin/builder/spi-builder-workspace/Sources/Codable/RAKCodable.swift (in target 'RAKCodable' from project 'RakuyoKit')
SwiftCompile normal arm64 /Users/admin/builder/spi-builder-workspace/Sources/Codable/RAKCodable.swift (in target 'RAKCodable' from project 'RakuyoKit')
    cd /Users/admin/builder/spi-builder-workspace/.swiftpm/xcode

SwiftDriverJobDiscovery normal arm64_32 Compiling RAKCodable.swift (in target 'RAKCodable' from project 'RakuyoKit')
SwiftCompile normal armv7k Compiling\ RAKDecodable.swift /Users/admin/builder/spi-builder-workspace/Sources/Codable/RAKDecodable.swift (in target 'RAKCodable' from project 'RakuyoKit')
SwiftCompile normal armv7k /Users/admin/builder/spi-builder-workspace/Sources/Codable/RAKDecodable.swift (in target 'RAKCodable' from project 'RakuyoKit')
    cd /Users/admin/builder/spi-builder-workspace/.swiftpm/xcode

SwiftDriverJobDiscovery normal armv7k Compiling RAKEncodable+RAK.swift (in target 'RAKCodable' from project 'RakuyoKit')
SwiftCompile normal armv7k Compiling\ FastListView.swift /Users/admin/builder/spi-builder-workspace/Sources/Base/View/Fast/FastListView.swift (in target 'RAKBase' from project 'RakuyoKit')
SwiftCompile normal armv7k /Users/admin/builder/spi-builder-workspace/Sources/Base/View/Fast/FastListView.swift (in target 'RAKBase' from project 'RakuyoKit')
    cd /Users/admin/builder/spi-builder-workspace/.swiftpm/xcode

SwiftDriverJobDiscovery normal armv7k Compiling RAKEncodable.swift (in target 'RAKCodable' from project 'RakuyoKit')
SwiftCompile normal arm64 Compiling\ RAKFinalFastCell.swift /Users/admin/builder/spi-builder-workspace/Sources/Base/View/Cell/RAKFinalFastCell.swift (in target 'RAKBase' from project 'RakuyoKit')
SwiftCompile normal arm64 /Users/admin/builder/spi-builder-workspace/Sources/Base/View/Cell/RAKFinalFastCell.swift (in target 'RAKBase' from project 'RakuyoKit')
    cd /Users/admin/builder/spi-builder-workspace/.swiftpm/xcode

SwiftDriverJobDiscovery normal arm64 Compiling RAKEncodable.swift (in target 'RAKCodable' from project 'RakuyoKit')
SwiftCompile normal arm64 Compiling\ RAKTextField.swift /Users/admin/builder/spi-builder-workspace/Sources/Base/View/RAKTextField.swift (in target 'RAKBase' from project 'RakuyoKit')
SwiftCompile normal arm64 /Users/admin/builder/spi-builder-workspace/Sources/Base/View/RAKTextField.swift (in target 'RAKBase' from project 'RakuyoKit')
    cd /Users/admin/builder/spi-builder-workspace/.swiftpm/xcode

SwiftDriverJobDiscovery normal arm64_32 Compiling RAKEncodable.swift (in target 'RAKCodable' from project 'RakuyoKit')
SwiftCompile normal arm64 Compiling\ FastListView.swift /Users/admin/builder/spi-builder-workspace/Sources/Base/View/Fast/FastListView.swift (in target 'RAKBase' from project 'RakuyoKit')
SwiftCompile normal arm64 /Users/admin/builder/spi-builder-workspace/Sources/Base/View/Fast/FastListView.swift (in target 'RAKBase' from project 'RakuyoKit')
    cd /Users/admin/builder/spi-builder-workspace/.swiftpm/xcode

SwiftDriverJobDiscovery normal arm64 Compiling RAKEncodable+RAK.swift (in target 'RAKCodable' from project 'RakuyoKit')
SwiftCompile normal arm64 Compiling\ RAKRotatableViewController.swift /Users/admin/builder/spi-builder-workspace/Sources/Base/Controller/RAKRotatableViewController.swift (in target 'RAKBase' from project 'RakuyoKit')
SwiftCompile normal arm64 /Users/admin/builder/spi-builder-workspace/Sources/Base/Controller/RAKRotatableViewController.swift (in target 'RAKBase' from project 'RakuyoKit')
    cd /Users/admin/builder/spi-builder-workspace/.swiftpm/xcode

SwiftDriverJobDiscovery normal armv7k Compiling RAKDecodable+RAK.swift (in target 'RAKCodable' from project 'RakuyoKit')
SwiftCompile normal arm64 Compiling\ NavigationControllerPopDelegateProxy.swift,\ RAKBaseNavigationController.swift /Users/admin/builder/spi-builder-workspace/Sources/Base/Controller/NavigationControllerPopDelegateProxy.swift /Users/admin/builder/spi-builder-workspace/Sources/Base/Controller/RAKBaseNavigationController.swift (in target 'RAKBase' from project 'RakuyoKit')
SwiftCompile normal arm64 /Users/admin/builder/spi-builder-workspace/Sources/Base/Controller/NavigationControllerPopDelegateProxy.swift (in target 'RAKBase' from project 'RakuyoKit')
    cd /Users/admin/builder/spi-builder-workspace/.swiftpm/xcode

SwiftCompile normal arm64 /Users/admin/builder/spi-builder-workspace/Sources/Base/Controller/RAKBaseNavigationController.swift (in target 'RAKBase' from project 'RakuyoKit')
    cd /Users/admin/builder/spi-builder-workspace/.swiftpm/xcode

SwiftDriverJobDiscovery normal armv7k Compiling RAKCodable.swift (in target 'RAKCodable' from project 'RakuyoKit')
SwiftCompile normal arm64 Compiling\ RAKBaseCollectionViewCell.swift /Users/admin/builder/spi-builder-workspace/Sources/Base/View/Cell/RAKBaseCollectionViewCell.swift (in target 'RAKBase' from project 'RakuyoKit')
SwiftCompile normal arm64 /Users/admin/builder/spi-builder-workspace/Sources/Base/View/Cell/RAKBaseCollectionViewCell.swift (in target 'RAKBase' from project 'RakuyoKit')
    cd /Users/admin/builder/spi-builder-workspace/.swiftpm/xcode

SwiftDriverJobDiscovery normal arm64 Compiling RAKCodable.swift (in target 'RAKCodable' from project 'RakuyoKit')
SwiftCompile normal arm64 Compiling\ RAKBaseTableViewCell.swift /Users/admin/builder/spi-builder-workspace/Sources/Base/View/Cell/RAKBaseTableViewCell.swift (in target 'RAKBase' from project 'RakuyoKit')
SwiftCompile normal arm64 /Users/admin/builder/spi-builder-workspace/Sources/Base/View/Cell/RAKBaseTableViewCell.swift (in target 'RAKBase' from project 'RakuyoKit')
    cd /Users/admin/builder/spi-builder-workspace/.swiftpm/xcode

SwiftDriverJobDiscovery normal arm64 Compiling RAKDecodable.swift (in target 'RAKCodable' from project 'RakuyoKit')
SwiftCompile normal armv7k Compiling\ NavigationControllerPopDelegateProxy.swift,\ RAKBaseNavigationController.swift /Users/admin/builder/spi-builder-workspace/Sources/Base/Controller/NavigationControllerPopDelegateProxy.swift /Users/admin/builder/spi-builder-workspace/Sources/Base/Controller/RAKBaseNavigationController.swift (in target 'RAKBase' from project 'RakuyoKit')
SwiftCompile normal armv7k /Users/admin/builder/spi-builder-workspace/Sources/Base/Controller/NavigationControllerPopDelegateProxy.swift (in target 'RAKBase' from project 'RakuyoKit')
    cd /Users/admin/builder/spi-builder-workspace/.swiftpm/xcode

SwiftCompile normal armv7k /Users/admin/builder/spi-builder-workspace/Sources/Base/Controller/RAKBaseNavigationController.swift (in target 'RAKBase' from project 'RakuyoKit')
    cd /Users/admin/builder/spi-builder-workspace/.swiftpm/xcode

SwiftCompile normal arm64 Compiling\ FastCell.swift /Users/admin/builder/spi-builder-workspace/Sources/Base/View/Fast/FastCell.swift (in target 'RAKBase' from project 'RakuyoKit')
SwiftCompile normal arm64 /Users/admin/builder/spi-builder-workspace/Sources/Base/View/Fast/FastCell.swift (in target 'RAKBase' from project 'RakuyoKit')
    cd /Users/admin/builder/spi-builder-workspace/.swiftpm/xcode

SwiftDriverJobDiscovery normal armv7k Compiling FastListView.swift (in target 'RAKBase' from project 'RakuyoKit')
SwiftDriver\ Compilation RAKCodable normal arm64 com.apple.xcode.tools.swift.compiler (in target 'RAKCodable' from project 'RakuyoKit')
    cd /Users/admin/builder/spi-builder-workspace/.swiftpm/xcode
    builtin-Swift-Compilation -- /Applications/Xcode-16.3.0.app/Contents/Developer/Toolchains/XcodeDefault.xctoolchain/usr/bin/swiftc -module-name RAKCodable -Onone -enforce-exclusivity\=checked @/Users/admin/builder/spi-builder-workspace/.derivedData/Build/Intermediates.noindex/RakuyoKit.build/Debug-watchos/RAKCodable.build/Objects-normal/arm64/RAKCodable.SwiftFileList -DSWIFT_PACKAGE -DDEBUG -DXcode -plugin-path /Applications/Xcode-16.3.0.app/Contents/Developer/Toolchains/XcodeDefault.xctoolchain/usr/lib/swift/host/plugins/testing -enable-experimental-feature DebugDescriptionMacro -sdk /Applications/Xcode-16.3.0.app/Contents/Developer/Platforms/WatchOS.platform/Developer/SDKs/WatchOS11.4.sdk -target arm64-apple-watchos6.0 -g -module-cache-path /Users/admin/builder/spi-builder-workspace/.derivedData/ModuleCache.noindex -Xfrontend -serialize-debugging-options -profile-coverage-mapping -profile-generate -enable-testing -index-store-path /Users/admin/builder/spi-builder-workspace/.derivedData/Index.noindex/DataStore -swift-version 5 -I /Users/admin/builder/spi-builder-workspace/.derivedData/Build/Products/Debug-watchos -I /Applications/Xcode-16.3.0.app/Contents/Developer/Platforms/WatchOS.platform/Developer/usr/lib -F /Users/admin/builder/spi-builder-workspace/.derivedData/Build/Products/Debug-watchos/PackageFrameworks -F /Users/admin/builder/spi-builder-workspace/.derivedData/Build/Products/Debug-watchos/PackageFrameworks -F /Users/admin/builder/spi-builder-workspace/.derivedData/Build/Products/Debug-watchos/PackageFrameworks -F /Users/admin/builder/spi-builder-workspace/.derivedData/Build/Products/Debug-watchos -F /Applications/Xcode-16.3.0.app/Contents/Developer/Platforms/WatchOS.platform/Developer/Library/Frameworks -F /Applications/Xcode-16.3.0.app/Contents/Developer/Platforms/WatchOS.platform/Developer/SDKs/WatchOS11.4.sdk/Developer/Library/Frameworks -c -j10 -enable-batch-mode -incremental -Xcc -ivfsstatcache -Xcc /Users/admin/builder/spi-builder-workspace/.derivedData/SDKStatCaches.noindex/watchos11.4-22T246-43efb940ff07ba2497b70ec94253f576.sdkstatcache -output-file-map /Users/admin/builder/spi-builder-workspace/.derivedData/Build/Intermediates.noindex/RakuyoKit.build/Debug-watchos/RAKCodable.build/Objects-normal/arm64/RAKCodable-OutputFileMap.json -use-frontend-parseable-output -save-temps -no-color-diagnostics -serialize-diagnostics -emit-dependencies -emit-module -emit-module-path /Users/admin/builder/spi-builder-workspace/.derivedData/Build/Intermediates.noindex/RakuyoKit.build/Debug-watchos/RAKCodable.build/Objects-normal/arm64/RAKCodable.swiftmodule -validate-clang-modules-once -clang-build-session-file /Users/admin/builder/spi-builder-workspace/.derivedData/ModuleCache.noindex/Session.modulevalidation -package-name spi_builder_workspace -Xcc -I/Users/admin/builder/spi-builder-workspace/.derivedData/Build/Intermediates.noindex/RakuyoKit.build/Debug-watchos/RAKCodable.build/swift-overrides.hmap -emit-const-values -Xfrontend -const-gather-protocols-file -Xfrontend /Users/admin/builder/spi-builder-workspace/.derivedData/Build/Intermediates.noindex/RakuyoKit.build/Debug-watchos/RAKCodable.build/Objects-normal/arm64/RAKCodable_const_extract_protocols.json -Xcc -I/Users/admin/builder/spi-builder-workspace/.derivedData/Build/Products/Debug-watchos/include -Xcc -I/Users/admin/builder/spi-builder-workspace/.derivedData/Build/Intermediates.noindex/RakuyoKit.build/Debug-watchos/RAKCodable.build/DerivedSources-normal/arm64 -Xcc -I/Users/admin/builder/spi-builder-workspace/.derivedData/Build/Intermediates.noindex/RakuyoKit.build/Debug-watchos/RAKCodable.build/DerivedSources/arm64 -Xcc -I/Users/admin/builder/spi-builder-workspace/.derivedData/Build/Intermediates.noindex/RakuyoKit.build/Debug-watchos/RAKCodable.build/DerivedSources -Xcc -DSWIFT_PACKAGE -Xcc -DDEBUG\=1 -emit-objc-header -emit-objc-header-path /Users/admin/builder/spi-builder-workspace/.derivedData/Build/Intermediates.noindex/RakuyoKit.build/Debug-watchos/RAKCodable.build/Objects-normal/arm64/RAKCodable-Swift.h -working-directory /Users/admin/builder/spi-builder-workspace/.swiftpm/xcode -experimental-emit-module-separately -disable-cmo
SwiftCompile normal arm64_32 Compiling\ RAKBaseTableViewCell.swift /Users/admin/builder/spi-builder-workspace/Sources/Base/View/Cell/RAKBaseTableViewCell.swift (in target 'RAKBase' from project 'RakuyoKit')
SwiftCompile normal arm64_32 /Users/admin/builder/spi-builder-workspace/Sources/Base/View/Cell/RAKBaseTableViewCell.swift (in target 'RAKBase' from project 'RakuyoKit')
    cd /Users/admin/builder/spi-builder-workspace/.swiftpm/xcode

SwiftDriverJobDiscovery normal arm64 Compiling RAKFinalFastCell.swift (in target 'RAKBase' from project 'RakuyoKit')
SwiftDriverJobDiscovery normal arm64_32 Compiling RAKEncodable+RAK.swift (in target 'RAKCodable' from project 'RakuyoKit')
SwiftCompile normal armv7k Compiling\ RAKRotatableViewController.swift /Users/admin/builder/spi-builder-workspace/Sources/Base/Controller/RAKRotatableViewController.swift (in target 'RAKBase' from project 'RakuyoKit')
SwiftCompile normal armv7k /Users/admin/builder/spi-builder-workspace/Sources/Base/Controller/RAKRotatableViewController.swift (in target 'RAKBase' from project 'RakuyoKit')
    cd /Users/admin/builder/spi-builder-workspace/.swiftpm/xcode

SwiftCompile normal armv7k Compiling\ RAKFinalFastCell.swift /Users/admin/builder/spi-builder-workspace/Sources/Base/View/Cell/RAKFinalFastCell.swift (in target 'RAKBase' from project 'RakuyoKit')
SwiftCompile normal armv7k /Users/admin/builder/spi-builder-workspace/Sources/Base/View/Cell/RAKFinalFastCell.swift (in target 'RAKBase' from project 'RakuyoKit')
    cd /Users/admin/builder/spi-builder-workspace/.swiftpm/xcode

SwiftCompile normal arm64_32 Compiling\ FastCell.swift /Users/admin/builder/spi-builder-workspace/Sources/Base/View/Fast/FastCell.swift (in target 'RAKBase' from project 'RakuyoKit')
SwiftCompile normal arm64_32 /Users/admin/builder/spi-builder-workspace/Sources/Base/View/Fast/FastCell.swift (in target 'RAKBase' from project 'RakuyoKit')
    cd /Users/admin/builder/spi-builder-workspace/.swiftpm/xcode

SwiftDriverJobDiscovery normal arm64 Compiling RAKRotatableViewController.swift (in target 'RAKBase' from project 'RakuyoKit')
SwiftDriverJobDiscovery normal arm64 Compiling RAKTextField.swift (in target 'RAKBase' from project 'RakuyoKit')
SwiftDriverJobDiscovery normal arm64 Compiling FastListView.swift (in target 'RAKBase' from project 'RakuyoKit')
SwiftDriver\ Compilation RAKCodable normal arm64_32 com.apple.xcode.tools.swift.compiler (in target 'RAKCodable' from project 'RakuyoKit')
    cd /Users/admin/builder/spi-builder-workspace/.swiftpm/xcode
    builtin-Swift-Compilation -- /Applications/Xcode-16.3.0.app/Contents/Developer/Toolchains/XcodeDefault.xctoolchain/usr/bin/swiftc -module-name RAKCodable -Onone -enforce-exclusivity\=checked @/Users/admin/builder/spi-builder-workspace/.derivedData/Build/Intermediates.noindex/RakuyoKit.build/Debug-watchos/RAKCodable.build/Objects-normal/arm64_32/RAKCodable.SwiftFileList -DSWIFT_PACKAGE -DDEBUG -DXcode -plugin-path /Applications/Xcode-16.3.0.app/Contents/Developer/Toolchains/XcodeDefault.xctoolchain/usr/lib/swift/host/plugins/testing -enable-experimental-feature DebugDescriptionMacro -sdk /Applications/Xcode-16.3.0.app/Contents/Developer/Platforms/WatchOS.platform/Developer/SDKs/WatchOS11.4.sdk -target arm64_32-apple-watchos6.0 -g -module-cache-path /Users/admin/builder/spi-builder-workspace/.derivedData/ModuleCache.noindex -Xfrontend -serialize-debugging-options -profile-coverage-mapping -profile-generate -enable-testing -index-store-path /Users/admin/builder/spi-builder-workspace/.derivedData/Index.noindex/DataStore -swift-version 5 -I /Users/admin/builder/spi-builder-workspace/.derivedData/Build/Products/Debug-watchos -I /Applications/Xcode-16.3.0.app/Contents/Developer/Platforms/WatchOS.platform/Developer/usr/lib -F /Users/admin/builder/spi-builder-workspace/.derivedData/Build/Products/Debug-watchos/PackageFrameworks -F /Users/admin/builder/spi-builder-workspace/.derivedData/Build/Products/Debug-watchos/PackageFrameworks -F /Users/admin/builder/spi-builder-workspace/.derivedData/Build/Products/Debug-watchos/PackageFrameworks -F /Users/admin/builder/spi-builder-workspace/.derivedData/Build/Products/Debug-watchos -F /Applications/Xcode-16.3.0.app/Contents/Developer/Platforms/WatchOS.platform/Developer/Library/Frameworks -F /Applications/Xcode-16.3.0.app/Contents/Developer/Platforms/WatchOS.platform/Developer/SDKs/WatchOS11.4.sdk/Developer/Library/Frameworks -c -j10 -enable-batch-mode -incremental -Xcc -ivfsstatcache -Xcc /Users/admin/builder/spi-builder-workspace/.derivedData/SDKStatCaches.noindex/watchos11.4-22T246-43efb940ff07ba2497b70ec94253f576.sdkstatcache -output-file-map /Users/admin/builder/spi-builder-workspace/.derivedData/Build/Intermediates.noindex/RakuyoKit.build/Debug-watchos/RAKCodable.build/Objects-normal/arm64_32/RAKCodable-OutputFileMap.json -use-frontend-parseable-output -save-temps -no-color-diagnostics -serialize-diagnostics -emit-dependencies -emit-module -emit-module-path /Users/admin/builder/spi-builder-workspace/.derivedData/Build/Intermediates.noindex/RakuyoKit.build/Debug-watchos/RAKCodable.build/Objects-normal/arm64_32/RAKCodable.swiftmodule -validate-clang-modules-once -clang-build-session-file /Users/admin/builder/spi-builder-workspace/.derivedData/ModuleCache.noindex/Session.modulevalidation -package-name spi_builder_workspace -Xcc -I/Users/admin/builder/spi-builder-workspace/.derivedData/Build/Intermediates.noindex/RakuyoKit.build/Debug-watchos/RAKCodable.build/swift-overrides.hmap -emit-const-values -Xfrontend -const-gather-protocols-file -Xfrontend /Users/admin/builder/spi-builder-workspace/.derivedData/Build/Intermediates.noindex/RakuyoKit.build/Debug-watchos/RAKCodable.build/Objects-normal/arm64_32/RAKCodable_const_extract_protocols.json -Xcc -I/Users/admin/builder/spi-builder-workspace/.derivedData/Build/Products/Debug-watchos/include -Xcc -I/Users/admin/builder/spi-builder-workspace/.derivedData/Build/Intermediates.noindex/RakuyoKit.build/Debug-watchos/RAKCodable.build/DerivedSources-normal/arm64_32 -Xcc -I/Users/admin/builder/spi-builder-workspace/.derivedData/Build/Intermediates.noindex/RakuyoKit.build/Debug-watchos/RAKCodable.build/DerivedSources/arm64_32 -Xcc -I/Users/admin/builder/spi-builder-workspace/.derivedData/Build/Intermediates.noindex/RakuyoKit.build/Debug-watchos/RAKCodable.build/DerivedSources -Xcc -DSWIFT_PACKAGE -Xcc -DDEBUG\=1 -emit-objc-header -emit-objc-header-path /Users/admin/builder/spi-builder-workspace/.derivedData/Build/Intermediates.noindex/RakuyoKit.build/Debug-watchos/RAKCodable.build/Objects-normal/arm64_32/RAKCodable-Swift.h -working-directory /Users/admin/builder/spi-builder-workspace/.swiftpm/xcode -experimental-emit-module-separately -disable-cmo
SwiftDriverJobDiscovery normal armv7k Compiling RAKDecodable.swift (in target 'RAKCodable' from project 'RakuyoKit')
SwiftCompile normal arm64 Compiling\ RAKBaseViewController.swift /Users/admin/builder/spi-builder-workspace/Sources/Base/Controller/RAKBaseViewController.swift (in target 'RAKBase' from project 'RakuyoKit')
SwiftCompile normal arm64 /Users/admin/builder/spi-builder-workspace/Sources/Base/Controller/RAKBaseViewController.swift (in target 'RAKBase' from project 'RakuyoKit')
    cd /Users/admin/builder/spi-builder-workspace/.swiftpm/xcode

SwiftDriver\ Compilation RAKCodable normal armv7k com.apple.xcode.tools.swift.compiler (in target 'RAKCodable' from project 'RakuyoKit')
    cd /Users/admin/builder/spi-builder-workspace/.swiftpm/xcode
    builtin-Swift-Compilation -- /Applications/Xcode-16.3.0.app/Contents/Developer/Toolchains/XcodeDefault.xctoolchain/usr/bin/swiftc -module-name RAKCodable -Onone -enforce-exclusivity\=checked @/Users/admin/builder/spi-builder-workspace/.derivedData/Build/Intermediates.noindex/RakuyoKit.build/Debug-watchos/RAKCodable.build/Objects-normal/armv7k/RAKCodable.SwiftFileList -DSWIFT_PACKAGE -DDEBUG -DXcode -plugin-path /Applications/Xcode-16.3.0.app/Contents/Developer/Toolchains/XcodeDefault.xctoolchain/usr/lib/swift/host/plugins/testing -enable-experimental-feature DebugDescriptionMacro -sdk /Applications/Xcode-16.3.0.app/Contents/Developer/Platforms/WatchOS.platform/Developer/SDKs/WatchOS11.4.sdk -target armv7k-apple-watchos6.0 -g -module-cache-path /Users/admin/builder/spi-builder-workspace/.derivedData/ModuleCache.noindex -Xfrontend -serialize-debugging-options -profile-coverage-mapping -profile-generate -enable-testing -index-store-path /Users/admin/builder/spi-builder-workspace/.derivedData/Index.noindex/DataStore -swift-version 5 -I /Users/admin/builder/spi-builder-workspace/.derivedData/Build/Products/Debug-watchos -I /Applications/Xcode-16.3.0.app/Contents/Developer/Platforms/WatchOS.platform/Developer/usr/lib -F /Users/admin/builder/spi-builder-workspace/.derivedData/Build/Products/Debug-watchos/PackageFrameworks -F /Users/admin/builder/spi-builder-workspace/.derivedData/Build/Products/Debug-watchos/PackageFrameworks -F /Users/admin/builder/spi-builder-workspace/.derivedData/Build/Products/Debug-watchos/PackageFrameworks -F /Users/admin/builder/spi-builder-workspace/.derivedData/Build/Products/Debug-watchos -F /Applications/Xcode-16.3.0.app/Contents/Developer/Platforms/WatchOS.platform/Developer/Library/Frameworks -F /Applications/Xcode-16.3.0.app/Contents/Developer/Platforms/WatchOS.platform/Developer/SDKs/WatchOS11.4.sdk/Developer/Library/Frameworks -c -j10 -enable-batch-mode -incremental -Xcc -ivfsstatcache -Xcc /Users/admin/builder/spi-builder-workspace/.derivedData/SDKStatCaches.noindex/watchos11.4-22T246-43efb940ff07ba2497b70ec94253f576.sdkstatcache -output-file-map /Users/admin/builder/spi-builder-workspace/.derivedData/Build/Intermediates.noindex/RakuyoKit.build/Debug-watchos/RAKCodable.build/Objects-normal/armv7k/RAKCodable-OutputFileMap.json -use-frontend-parseable-output -save-temps -no-color-diagnostics -serialize-diagnostics -emit-dependencies -emit-module -emit-module-path /Users/admin/builder/spi-builder-workspace/.derivedData/Build/Intermediates.noindex/RakuyoKit.build/Debug-watchos/RAKCodable.build/Objects-normal/armv7k/RAKCodable.swiftmodule -validate-clang-modules-once -clang-build-session-file /Users/admin/builder/spi-builder-workspace/.derivedData/ModuleCache.noindex/Session.modulevalidation -package-name spi_builder_workspace -Xcc -I/Users/admin/builder/spi-builder-workspace/.derivedData/Build/Intermediates.noindex/RakuyoKit.build/Debug-watchos/RAKCodable.build/swift-overrides.hmap -emit-const-values -Xfrontend -const-gather-protocols-file -Xfrontend /Users/admin/builder/spi-builder-workspace/.derivedData/Build/Intermediates.noindex/RakuyoKit.build/Debug-watchos/RAKCodable.build/Objects-normal/armv7k/RAKCodable_const_extract_protocols.json -Xcc -I/Users/admin/builder/spi-builder-workspace/.derivedData/Build/Products/Debug-watchos/include -Xcc -I/Users/admin/builder/spi-builder-workspace/.derivedData/Build/Intermediates.noindex/RakuyoKit.build/Debug-watchos/RAKCodable.build/DerivedSources-normal/armv7k -Xcc -I/Users/admin/builder/spi-builder-workspace/.derivedData/Build/Intermediates.noindex/RakuyoKit.build/Debug-watchos/RAKCodable.build/DerivedSources/armv7k -Xcc -I/Users/admin/builder/spi-builder-workspace/.derivedData/Build/Intermediates.noindex/RakuyoKit.build/Debug-watchos/RAKCodable.build/DerivedSources -Xcc -DSWIFT_PACKAGE -Xcc -DDEBUG\=1 -emit-objc-header -emit-objc-header-path /Users/admin/builder/spi-builder-workspace/.derivedData/Build/Intermediates.noindex/RakuyoKit.build/Debug-watchos/RAKCodable.build/Objects-normal/armv7k/RAKCodable-Swift.h -working-directory /Users/admin/builder/spi-builder-workspace/.swiftpm/xcode -experimental-emit-module-separately -disable-cmo
SwiftDriverJobDiscovery normal arm64 Compiling NavigationControllerPopDelegateProxy.swift, RAKBaseNavigationController.swift (in target 'RAKBase' from project 'RakuyoKit')
SwiftCompile normal arm64_32 Compiling\ RAKRotatableViewController.swift /Users/admin/builder/spi-builder-workspace/Sources/Base/Controller/RAKRotatableViewController.swift (in target 'RAKBase' from project 'RakuyoKit')
SwiftCompile normal arm64_32 /Users/admin/builder/spi-builder-workspace/Sources/Base/Controller/RAKRotatableViewController.swift (in target 'RAKBase' from project 'RakuyoKit')
    cd /Users/admin/builder/spi-builder-workspace/.swiftpm/xcode

SwiftDriver RAKEpoxy normal arm64_32 com.apple.xcode.tools.swift.compiler (in target 'RAKEpoxy' from project 'RakuyoKit')
    cd /Users/admin/builder/spi-builder-workspace/.swiftpm/xcode
    builtin-SwiftDriver -- /Applications/Xcode-16.3.0.app/Contents/Developer/Toolchains/XcodeDefault.xctoolchain/usr/bin/swiftc -module-name RAKEpoxy -Onone -enforce-exclusivity\=checked @/Users/admin/builder/spi-builder-workspace/.derivedData/Build/Intermediates.noindex/RakuyoKit.build/Debug-watchos/RAKEpoxy.build/Objects-normal/arm64_32/RAKEpoxy.SwiftFileList -DSWIFT_PACKAGE -DDEBUG -DXcode -plugin-path /Applications/Xcode-16.3.0.app/Contents/Developer/Toolchains/XcodeDefault.xctoolchain/usr/lib/swift/host/plugins/testing -enable-experimental-feature DebugDescriptionMacro -sdk /Applications/Xcode-16.3.0.app/Contents/Developer/Platforms/WatchOS.platform/Developer/SDKs/WatchOS11.4.sdk -target arm64_32-apple-watchos6.0 -g -module-cache-path /Users/admin/builder/spi-builder-workspace/.derivedData/ModuleCache.noindex -Xfrontend -serialize-debugging-options -profile-coverage-mapping -profile-generate -enable-testing -index-store-path /Users/admin/builder/spi-builder-workspace/.derivedData/Index.noindex/DataStore -swift-version 5 -I /Users/admin/builder/spi-builder-workspace/.derivedData/Build/Products/Debug-watchos -I /Applications/Xcode-16.3.0.app/Contents/Developer/Platforms/WatchOS.platform/Developer/usr/lib -F /Users/admin/builder/spi-builder-workspace/.derivedData/Build/Products/Debug-watchos/PackageFrameworks -F /Users/admin/builder/spi-builder-workspace/.derivedData/Build/Products/Debug-watchos/PackageFrameworks -F /Users/admin/builder/spi-builder-workspace/.derivedData/Build/Products/Debug-watchos/PackageFrameworks -F /Users/admin/builder/spi-builder-workspace/.derivedData/Build/Products/Debug-watchos/PackageFrameworks -F /Users/admin/builder/spi-builder-workspace/.derivedData/Build/Products/Debug-watchos/PackageFrameworks -F /Users/admin/builder/spi-builder-workspace/.derivedData/Build/Products/Debug-watchos -F /Applications/Xcode-16.3.0.app/Contents/Developer/Platforms/WatchOS.platform/Developer/Library/Frameworks -F /Applications/Xcode-16.3.0.app/Contents/Developer/Platforms/WatchOS.platform/Developer/SDKs/WatchOS11.4.sdk/Developer/Library/Frameworks -c -j10 -enable-batch-mode -incremental -Xcc -ivfsstatcache -Xcc /Users/admin/builder/spi-builder-workspace/.derivedData/SDKStatCaches.noindex/watchos11.4-22T246-43efb940ff07ba2497b70ec94253f576.sdkstatcache -output-file-map /Users/admin/builder/spi-builder-workspace/.derivedData/Build/Intermediates.noindex/RakuyoKit.build/Debug-watchos/RAKEpoxy.build/Objects-normal/arm64_32/RAKEpoxy-OutputFileMap.json -use-frontend-parseable-output -save-temps -no-color-diagnostics -serialize-diagnostics -emit-dependencies -emit-module -emit-module-path /Users/admin/builder/spi-builder-workspace/.derivedData/Build/Intermediates.noindex/RakuyoKit.build/Debug-watchos/RAKEpoxy.build/Objects-normal/arm64_32/RAKEpoxy.swiftmodule -validate-clang-modules-once -clang-build-session-file /Users/admin/builder/spi-builder-workspace/.derivedData/ModuleCache.noindex/Session.modulevalidation -package-name spi_builder_workspace -Xcc -I/Users/admin/builder/spi-builder-workspace/.derivedData/Build/Intermediates.noindex/RakuyoKit.build/Debug-watchos/RAKEpoxy.build/swift-overrides.hmap -emit-const-values -Xfrontend -const-gather-protocols-file -Xfrontend /Users/admin/builder/spi-builder-workspace/.derivedData/Build/Intermediates.noindex/RakuyoKit.build/Debug-watchos/RAKEpoxy.build/Objects-normal/arm64_32/RAKEpoxy_const_extract_protocols.json -Xcc -I/Users/admin/builder/spi-builder-workspace/.derivedData/Build/Products/Debug-watchos/include -Xcc -I/Users/admin/builder/spi-builder-workspace/.derivedData/Build/Intermediates.noindex/RakuyoKit.build/Debug-watchos/RAKEpoxy.build/DerivedSources-normal/arm64_32 -Xcc -I/Users/admin/builder/spi-builder-workspace/.derivedData/Build/Intermediates.noindex/RakuyoKit.build/Debug-watchos/RAKEpoxy.build/DerivedSources/arm64_32 -Xcc -I/Users/admin/builder/spi-builder-workspace/.derivedData/Build/Intermediates.noindex/RakuyoKit.build/Debug-watchos/RAKEpoxy.build/DerivedSources -Xcc -DSWIFT_PACKAGE -Xcc -DDEBUG\=1 -emit-objc-header -emit-objc-header-path /Users/admin/builder/spi-builder-workspace/.derivedData/Build/Intermediates.noindex/RakuyoKit.build/Debug-watchos/RAKEpoxy.build/Objects-normal/arm64_32/RAKEpoxy-Swift.h -working-directory /Users/admin/builder/spi-builder-workspace/.swiftpm/xcode -experimental-emit-module-separately -disable-cmo
SwiftDriverJobDiscovery normal arm64 Compiling RAKBaseCollectionViewCell.swift (in target 'RAKBase' from project 'RakuyoKit')
SwiftDriver RAKEpoxy normal armv7k com.apple.xcode.tools.swift.compiler (in target 'RAKEpoxy' from project 'RakuyoKit')
    cd /Users/admin/builder/spi-builder-workspace/.swiftpm/xcode
    builtin-SwiftDriver -- /Applications/Xcode-16.3.0.app/Contents/Developer/Toolchains/XcodeDefault.xctoolchain/usr/bin/swiftc -module-name RAKEpoxy -Onone -enforce-exclusivity\=checked @/Users/admin/builder/spi-builder-workspace/.derivedData/Build/Intermediates.noindex/RakuyoKit.build/Debug-watchos/RAKEpoxy.build/Objects-normal/armv7k/RAKEpoxy.SwiftFileList -DSWIFT_PACKAGE -DDEBUG -DXcode -plugin-path /Applications/Xcode-16.3.0.app/Contents/Developer/Toolchains/XcodeDefault.xctoolchain/usr/lib/swift/host/plugins/testing -enable-experimental-feature DebugDescriptionMacro -sdk /Applications/Xcode-16.3.0.app/Contents/Developer/Platforms/WatchOS.platform/Developer/SDKs/WatchOS11.4.sdk -target armv7k-apple-watchos6.0 -g -module-cache-path /Users/admin/builder/spi-builder-workspace/.derivedData/ModuleCache.noindex -Xfrontend -serialize-debugging-options -profile-coverage-mapping -profile-generate -enable-testing -index-store-path /Users/admin/builder/spi-builder-workspace/.derivedData/Index.noindex/DataStore -swift-version 5 -I /Users/admin/builder/spi-builder-workspace/.derivedData/Build/Products/Debug-watchos -I /Applications/Xcode-16.3.0.app/Contents/Developer/Platforms/WatchOS.platform/Developer/usr/lib -F /Users/admin/builder/spi-builder-workspace/.derivedData/Build/Products/Debug-watchos/PackageFrameworks -F /Users/admin/builder/spi-builder-workspace/.derivedData/Build/Products/Debug-watchos/PackageFrameworks -F /Users/admin/builder/spi-builder-workspace/.derivedData/Build/Products/Debug-watchos/PackageFrameworks -F /Users/admin/builder/spi-builder-workspace/.derivedData/Build/Products/Debug-watchos/PackageFrameworks -F /Users/admin/builder/spi-builder-workspace/.derivedData/Build/Products/Debug-watchos/PackageFrameworks -F /Users/admin/builder/spi-builder-workspace/.derivedData/Build/Products/Debug-watchos -F /Applications/Xcode-16.3.0.app/Contents/Developer/Platforms/WatchOS.platform/Developer/Library/Frameworks -F /Applications/Xcode-16.3.0.app/Contents/Developer/Platforms/WatchOS.platform/Developer/SDKs/WatchOS11.4.sdk/Developer/Library/Frameworks -c -j10 -enable-batch-mode -incremental -Xcc -ivfsstatcache -Xcc /Users/admin/builder/spi-builder-workspace/.derivedData/SDKStatCaches.noindex/watchos11.4-22T246-43efb940ff07ba2497b70ec94253f576.sdkstatcache -output-file-map /Users/admin/builder/spi-builder-workspace/.derivedData/Build/Intermediates.noindex/RakuyoKit.build/Debug-watchos/RAKEpoxy.build/Objects-normal/armv7k/RAKEpoxy-OutputFileMap.json -use-frontend-parseable-output -save-temps -no-color-diagnostics -serialize-diagnostics -emit-dependencies -emit-module -emit-module-path /Users/admin/builder/spi-builder-workspace/.derivedData/Build/Intermediates.noindex/RakuyoKit.build/Debug-watchos/RAKEpoxy.build/Objects-normal/armv7k/RAKEpoxy.swiftmodule -validate-clang-modules-once -clang-build-session-file /Users/admin/builder/spi-builder-workspace/.derivedData/ModuleCache.noindex/Session.modulevalidation -package-name spi_builder_workspace -Xcc -I/Users/admin/builder/spi-builder-workspace/.derivedData/Build/Intermediates.noindex/RakuyoKit.build/Debug-watchos/RAKEpoxy.build/swift-overrides.hmap -emit-const-values -Xfrontend -const-gather-protocols-file -Xfrontend /Users/admin/builder/spi-builder-workspace/.derivedData/Build/Intermediates.noindex/RakuyoKit.build/Debug-watchos/RAKEpoxy.build/Objects-normal/armv7k/RAKEpoxy_const_extract_protocols.json -Xcc -I/Users/admin/builder/spi-builder-workspace/.derivedData/Build/Products/Debug-watchos/include -Xcc -I/Users/admin/builder/spi-builder-workspace/.derivedData/Build/Intermediates.noindex/RakuyoKit.build/Debug-watchos/RAKEpoxy.build/DerivedSources-normal/armv7k -Xcc -I/Users/admin/builder/spi-builder-workspace/.derivedData/Build/Intermediates.noindex/RakuyoKit.build/Debug-watchos/RAKEpoxy.build/DerivedSources/armv7k -Xcc -I/Users/admin/builder/spi-builder-workspace/.derivedData/Build/Intermediates.noindex/RakuyoKit.build/Debug-watchos/RAKEpoxy.build/DerivedSources -Xcc -DSWIFT_PACKAGE -Xcc -DDEBUG\=1 -emit-objc-header -emit-objc-header-path /Users/admin/builder/spi-builder-workspace/.derivedData/Build/Intermediates.noindex/RakuyoKit.build/Debug-watchos/RAKEpoxy.build/Objects-normal/armv7k/RAKEpoxy-Swift.h -working-directory /Users/admin/builder/spi-builder-workspace/.swiftpm/xcode -experimental-emit-module-separately -disable-cmo
SwiftEmitModule normal arm64_32 Emitting\ module\ for\ RAKEpoxy (in target 'RAKEpoxy' from project 'RakuyoKit')
EmitSwiftModule normal arm64_32 (in target 'RAKEpoxy' from project 'RakuyoKit')
    cd /Users/admin/builder/spi-builder-workspace/.swiftpm/xcode

SwiftDriverJobDiscovery normal arm64 Compiling RAKBaseTableViewCell.swift (in target 'RAKBase' from project 'RakuyoKit')
SwiftDriver RAKEpoxy normal arm64 com.apple.xcode.tools.swift.compiler (in target 'RAKEpoxy' from project 'RakuyoKit')
    cd /Users/admin/builder/spi-builder-workspace/.swiftpm/xcode
    builtin-SwiftDriver -- /Applications/Xcode-16.3.0.app/Contents/Developer/Toolchains/XcodeDefault.xctoolchain/usr/bin/swiftc -module-name RAKEpoxy -Onone -enforce-exclusivity\=checked @/Users/admin/builder/spi-builder-workspace/.derivedData/Build/Intermediates.noindex/RakuyoKit.build/Debug-watchos/RAKEpoxy.build/Objects-normal/arm64/RAKEpoxy.SwiftFileList -DSWIFT_PACKAGE -DDEBUG -DXcode -plugin-path /Applications/Xcode-16.3.0.app/Contents/Developer/Toolchains/XcodeDefault.xctoolchain/usr/lib/swift/host/plugins/testing -enable-experimental-feature DebugDescriptionMacro -sdk /Applications/Xcode-16.3.0.app/Contents/Developer/Platforms/WatchOS.platform/Developer/SDKs/WatchOS11.4.sdk -target arm64-apple-watchos6.0 -g -module-cache-path /Users/admin/builder/spi-builder-workspace/.derivedData/ModuleCache.noindex -Xfrontend -serialize-debugging-options -profile-coverage-mapping -profile-generate -enable-testing -index-store-path /Users/admin/builder/spi-builder-workspace/.derivedData/Index.noindex/DataStore -swift-version 5 -I /Users/admin/builder/spi-builder-workspace/.derivedData/Build/Products/Debug-watchos -I /Applications/Xcode-16.3.0.app/Contents/Developer/Platforms/WatchOS.platform/Developer/usr/lib -F /Users/admin/builder/spi-builder-workspace/.derivedData/Build/Products/Debug-watchos/PackageFrameworks -F /Users/admin/builder/spi-builder-workspace/.derivedData/Build/Products/Debug-watchos/PackageFrameworks -F /Users/admin/builder/spi-builder-workspace/.derivedData/Build/Products/Debug-watchos/PackageFrameworks -F /Users/admin/builder/spi-builder-workspace/.derivedData/Build/Products/Debug-watchos/PackageFrameworks -F /Users/admin/builder/spi-builder-workspace/.derivedData/Build/Products/Debug-watchos/PackageFrameworks -F /Users/admin/builder/spi-builder-workspace/.derivedData/Build/Products/Debug-watchos -F /Applications/Xcode-16.3.0.app/Contents/Developer/Platforms/WatchOS.platform/Developer/Library/Frameworks -F /Applications/Xcode-16.3.0.app/Contents/Developer/Platforms/WatchOS.platform/Developer/SDKs/WatchOS11.4.sdk/Developer/Library/Frameworks -c -j10 -enable-batch-mode -incremental -Xcc -ivfsstatcache -Xcc /Users/admin/builder/spi-builder-workspace/.derivedData/SDKStatCaches.noindex/watchos11.4-22T246-43efb940ff07ba2497b70ec94253f576.sdkstatcache -output-file-map /Users/admin/builder/spi-builder-workspace/.derivedData/Build/Intermediates.noindex/RakuyoKit.build/Debug-watchos/RAKEpoxy.build/Objects-normal/arm64/RAKEpoxy-OutputFileMap.json -use-frontend-parseable-output -save-temps -no-color-diagnostics -serialize-diagnostics -emit-dependencies -emit-module -emit-module-path /Users/admin/builder/spi-builder-workspace/.derivedData/Build/Intermediates.noindex/RakuyoKit.build/Debug-watchos/RAKEpoxy.build/Objects-normal/arm64/RAKEpoxy.swiftmodule -validate-clang-modules-once -clang-build-session-file /Users/admin/builder/spi-builder-workspace/.derivedData/ModuleCache.noindex/Session.modulevalidation -package-name spi_builder_workspace -Xcc -I/Users/admin/builder/spi-builder-workspace/.derivedData/Build/Intermediates.noindex/RakuyoKit.build/Debug-watchos/RAKEpoxy.build/swift-overrides.hmap -emit-const-values -Xfrontend -const-gather-protocols-file -Xfrontend /Users/admin/builder/spi-builder-workspace/.derivedData/Build/Intermediates.noindex/RakuyoKit.build/Debug-watchos/RAKEpoxy.build/Objects-normal/arm64/RAKEpoxy_const_extract_protocols.json -Xcc -I/Users/admin/builder/spi-builder-workspace/.derivedData/Build/Products/Debug-watchos/include -Xcc -I/Users/admin/builder/spi-builder-workspace/.derivedData/Build/Intermediates.noindex/RakuyoKit.build/Debug-watchos/RAKEpoxy.build/DerivedSources-normal/arm64 -Xcc -I/Users/admin/builder/spi-builder-workspace/.derivedData/Build/Intermediates.noindex/RakuyoKit.build/Debug-watchos/RAKEpoxy.build/DerivedSources/arm64 -Xcc -I/Users/admin/builder/spi-builder-workspace/.derivedData/Build/Intermediates.noindex/RakuyoKit.build/Debug-watchos/RAKEpoxy.build/DerivedSources -Xcc -DSWIFT_PACKAGE -Xcc -DDEBUG\=1 -emit-objc-header -emit-objc-header-path /Users/admin/builder/spi-builder-workspace/.derivedData/Build/Intermediates.noindex/RakuyoKit.build/Debug-watchos/RAKEpoxy.build/Objects-normal/arm64/RAKEpoxy-Swift.h -working-directory /Users/admin/builder/spi-builder-workspace/.swiftpm/xcode -experimental-emit-module-separately -disable-cmo
SwiftDriverJobDiscovery normal arm64 Compiling FastCell.swift (in target 'RAKBase' from project 'RakuyoKit')
SwiftCompile normal arm64_32 Compiling\ Layout+Custom.swift,\ Layout+Flow.swift,\ Layout+General.swift,\ Layout+List.swift,\ DecorationStyle.swift /Users/admin/builder/spi-builder-workspace/Sources/Epoxy/CollectionView/Layout/LayoutImplement/Layout+Custom.swift /Users/admin/builder/spi-builder-workspace/Sources/Epoxy/CollectionView/Layout/LayoutImplement/Layout+Flow.swift /Users/admin/builder/spi-builder-workspace/Sources/Epoxy/CollectionView/Layout/LayoutImplement/Layout+General.swift /Users/admin/builder/spi-builder-workspace/Sources/Epoxy/CollectionView/Layout/LayoutImplement/Layout+List.swift /Users/admin/builder/spi-builder-workspace/Sources/Epoxy/CollectionView/Layout/Model/DecorationStyle.swift (in target 'RAKEpoxy' from project 'RakuyoKit')
Failed frontend command:
/Applications/Xcode-16.3.0.app/Contents/Developer/Toolchains/XcodeDefault.xctoolchain/usr/bin/swift-frontend -frontend -c /Users/admin/builder/spi-builder-workspace/Sources/Epoxy/CollectionView/CollectionView.swift /Users/admin/builder/spi-builder-workspace/Sources/Epoxy/CollectionView/ContextMenu/AnyItemModel+ContextMenu.swift /Users/admin/builder/spi-builder-workspace/Sources/Epoxy/CollectionView/ContextMenu/CollectionViewContextMenuDelegate.swift /Users/admin/builder/spi-builder-workspace/Sources/Epoxy/CollectionView/ContextMenu/ContextMenuProviding.swift /Users/admin/builder/spi-builder-workspace/Sources/Epoxy/CollectionView/ContextMenu/ItemModel+ContextMenu.swift /Users/admin/builder/spi-builder-workspace/Sources/Epoxy/CollectionView/ContextMenu/RAKInternalItemModeling.swift /Users/admin/builder/spi-builder-workspace/Sources/Epoxy/CollectionView/DecorationView/BaseDecorationView.swift /Users/admin/builder/spi-builder-workspace/Sources/Epoxy/CollectionView/DecorationView/DecorationViewConfig.swift /Users/admin/builder/spi-builder-workspace/Sources/Epoxy/CollectionView/DecorationView/GrayBackgroundDecorationView.swift /Users/admin/builder/spi-builder-workspace/Sources/Epoxy/CollectionView/DecorationView/WhiteBackgroundDecorationView.swift -primary-file /Users/admin/builder/spi-builder-workspace/Sources/Epoxy/CollectionView/Layout/LayoutImplement/Layout+Custom.swift -primary-file /Users/admin/builder/spi-builder-workspace/Sources/Epoxy/CollectionView/Layout/LayoutImplement/Layout+Flow.swift -primary-file /Users/admin/builder/spi-builder-workspace/Sources/Epoxy/CollectionView/Layout/LayoutImplement/Layout+General.swift -primary-file /Users/admin/builder/spi-builder-workspace/Sources/Epoxy/CollectionView/Layout/LayoutImplement/Layout+List.swift -primary-file /Users/admin/builder/spi-builder-workspace/Sources/Epoxy/CollectionView/Layout/Model/DecorationStyle.swift /Users/admin/builder/spi-builder-workspace/Sources/Epoxy/CollectionView/Layout/Model/Layout.swift /Users/admin/builder/spi-builder-workspace/Sources/Epoxy/CollectionView/Layout/Model/NSCollectionLayoutDimension+QLCD.swift /Users/admin/builder/spi-builder-workspace/Sources/Epoxy/CollectionView/Layout/Model/SectionProviderWrapper.swift /Users/admin/builder/spi-builder-workspace/Sources/Epoxy/CollectionView/Layout/Model/SupplementaryItem.swift /Users/admin/builder/spi-builder-workspace/Sources/Epoxy/CollectionView/Layout/WrapperTools/EpoxyModeled+Supplementary.swift /Users/admin/builder/spi-builder-workspace/Sources/Epoxy/CollectionView/Layout/WrapperTools/Layout+SectionModel.swift /Users/admin/builder/spi-builder-workspace/Sources/Epoxy/CollectionView/Spacer/Epoxy+Spacer.swift /Users/admin/builder/spi-builder-workspace/Sources/Epoxy/CollectionView/Spacer/SpacerRow.swift /Users/admin/builder/spi-builder-workspace/Sources/Epoxy/CollectionView/Tools/EpoxyModeled+Padding.swift /Users/admin/builder/spi-builder-workspace/Sources/Epoxy/CollectionView/Tools/ListSpacing.swift /Users/admin/builder/spi-builder-workspace/Sources/Epoxy/CollectionView/Tools/SectionEdgeInsets.swift /Users/admin/builder/spi-builder-workspace/Sources/Epoxy/CollectionView/Tools/Sequence+Epoxy.swift /Users/admin/builder/spi-builder-workspace/Sources/Epoxy/CollectionView/WaterfallLayout/Layout+Waterfall.swift /Users/admin/builder/spi-builder-workspace/Sources/Epoxy/CollectionView/WaterfallLayout/WaterfallCompositionalLayout+Config.swift /Users/admin/builder/spi-builder-workspace/Sources/Epoxy/CollectionView/WaterfallLayout/WaterfallCompositionalLayout+LayoutBuilder.swift /Users/admin/builder/spi-builder-workspace/Sources/Epoxy/CollectionView/WaterfallLayout/WaterfallCompositionalLayout.swift /Users/admin/builder/spi-builder-workspace/Sources/Epoxy/Exports.swift /Users/admin/builder/spi-builder-workspace/Sources/Epoxy/Row/BaseStyledEpoxyView.swift /Users/admin/builder/spi-builder-workspace/Sources/Epoxy/Row/ButtonRow/AnyButtonImageContent.swift /Users/admin/builder/spi-builder-workspace/Sources/Epoxy/Row/ButtonRow/ButtonImageContentProviding.swift /Users/admin/builder/spi-builder-workspace/Sources/Epoxy/Row/ButtonRow/ButtonRow.swift /Users/admin/builder/spi-builder-workspace/Sources/Epoxy/Row/ButtonRow/ButtonRowStateContent.swift /Users/admin/builder/spi-builder-workspace/Sources/Epoxy/Row/EmptyRow.swift /Users/admin/builder/spi-builder-workspace/Sources/Epoxy/Row/ImageRow/AnyImageContent+Accessory.swift /Users/admin/builder/spi-builder-workspace/Sources/Epoxy/Row/ImageRow/AnyImageContent.swift /Users/admin/builder/spi-builder-workspace/Sources/Epoxy/Row/ImageRow/FastImageContentProviding.swift /Users/admin/builder/spi-builder-workspace/Sources/Epoxy/Row/ImageRow/ImageContentProviding.swift /Users/admin/builder/spi-builder-workspace/Sources/Epoxy/Row/ImageRow/ImageRow.swift /Users/admin/builder/spi-builder-workspace/Sources/Epoxy/Row/RowConfigureApplicable.swift /Users/admin/builder/spi-builder-workspace/Sources/Epoxy/Row/SwitchRow.swift /Users/admin/builder/spi-builder-workspace/Sources/Epoxy/Row/TextFieldRow.swift /Users/admin/builder/spi-builder-workspace/Sources/Epoxy/Row/TextRow.swift -supplementary-output-file-map /Users/admin/builder/spi-builder-workspace/.derivedData/Build/Intermediates.noindex/RakuyoKit.build/Debug-watchos/RAKEpoxy.build/Objects-normal/arm64_32/supplementaryOutputs-189 -target arm64_32-apple-watchos6.0 -enable-objc-interop -sdk /Applications/Xcode-16.3.0.app/Contents/Developer/Platforms/WatchOS.platform/Developer/SDKs/WatchOS11.4.sdk -I /Users/admin/builder/spi-builder-workspace/.derivedData/Build/Products/Debug-watchos -I /Applications/Xcode-16.3.0.app/Contents/Developer/Platforms/WatchOS.platform/Developer/usr/lib -F /Users/admin/builder/spi-builder-workspace/.derivedData/Build/Products/Debug-watchos/PackageFrameworks -F /Users/admin/builder/spi-builder-workspace/.derivedData/Build/Products/Debug-watchos/PackageFrameworks -F /Users/admin/builder/spi-builder-workspace/.derivedData/Build/Products/Debug-watchos/PackageFrameworks -F /Users/admin/builder/spi-builder-workspace/.derivedData/Build/Products/Debug-watchos/PackageFrameworks -F /Users/admin/builder/spi-builder-workspace/.derivedData/Build/Products/Debug-watchos/PackageFrameworks -F /Users/admin/builder/spi-builder-workspace/.derivedData/Build/Products/Debug-watchos -F /Applications/Xcode-16.3.0.app/Contents/Developer/Platforms/WatchOS.platform/Developer/Library/Frameworks -F /Applications/Xcode-16.3.0.app/Contents/Developer/Platforms/WatchOS.platform/Developer/SDKs/WatchOS11.4.sdk/Developer/Library/Frameworks -no-color-diagnostics -enable-testing -g -debug-info-format\=dwarf -dwarf-version\=4 -module-cache-path /Users/admin/builder/spi-builder-workspace/.derivedData/ModuleCache.noindex -profile-generate -profile-coverage-mapping -swift-version 5 -enforce-exclusivity\=checked -Onone -D SWIFT_PACKAGE -D DEBUG -D Xcode -serialize-debugging-options -const-gather-protocols-file /Users/admin/builder/spi-builder-workspace/.derivedData/Build/Intermediates.noindex/RakuyoKit.build/Debug-watchos/RAKEpoxy.build/Objects-normal/arm64_32/RAKEpoxy_const_extract_protocols.json -enable-experimental-feature DebugDescriptionMacro -empty-abi-descriptor -plugin-path /Applications/Xcode-16.3.0.app/Contents/Developer/Toolchains/XcodeDefault.xctoolchain/usr/lib/swift/host/plugins/testing -validate-clang-modules-once -clang-build-session-file /Users/admin/builder/spi-builder-workspace/.derivedData/ModuleCache.noindex/Session.modulevalidation -Xcc -working-directory -Xcc /Users/admin/builder/spi-builder-workspace/.swiftpm/xcode -resource-dir /Applications/Xcode-16.3.0.app/Contents/Developer/Toolchains/XcodeDefault.xctoolchain/usr/lib/swift -enable-anonymous-context-mangled-names -file-compilation-dir /Users/admin/builder/spi-builder-workspace/.swiftpm/xcode -Xcc -ivfsstatcache -Xcc /Users/admin/builder/spi-builder-workspace/.derivedData/SDKStatCaches.noindex/watchos11.4-22T246-43efb940ff07ba2497b70ec94253f576.sdkstatcache -Xcc -I/Users/admin/builder/spi-builder-workspace/.derivedData/Build/Intermediates.noindex/RakuyoKit.build/Debug-watchos/RAKEpoxy.build/swift-overrides.hmap -Xcc -I/Users/admin/builder/spi-builder-workspace/.derivedData/Build/Products/Debug-watchos/include -Xcc -I/Users/admin/builder/spi-builder-workspace/.derivedData/Build/Intermediates.noindex/RakuyoKit.build/Debug-watchos/RAKEpoxy.build/DerivedSources-normal/arm64_32 -Xcc -I/Users/admin/builder/spi-builder-workspace/.derivedData/Build/Intermediates.noindex/RakuyoKit.build/Debug-watchos/RAKEpoxy.build/DerivedSources/arm64_32 -Xcc -I/Users/admin/builder/spi-builder-workspace/.derivedData/Build/Intermediates.noindex/RakuyoKit.build/Debug-watchos/RAKEpoxy.build/DerivedSources -Xcc -DSWIFT_PACKAGE -Xcc -DDEBUG\=1 -module-name RAKEpoxy -package-name spi_builder_workspace -frontend-parseable-output -disable-clang-spi -target-sdk-version 11.4 -target-sdk-name watchos11.4 -external-plugin-path /Applications/Xcode-16.3.0.app/Contents/Developer/Platforms/WatchOS.platform/Developer/usr/lib/swift/host/plugins\#/Applications/Xcode-16.3.0.app/Contents/Developer/Platforms/WatchOS.platform/Developer/usr/bin/swift-plugin-server -external-plugin-path /Applications/Xcode-16.3.0.app/Contents/Developer/Platforms/WatchOS.platform/Developer/usr/local/lib/swift/host/plugins\#/Applications/Xcode-16.3.0.app/Contents/Developer/Platforms/WatchOS.platform/Developer/usr/bin/swift-plugin-server -in-process-plugin-server-path /Applications/Xcode-16.3.0.app/Contents/Developer/Toolchains/XcodeDefault.xctoolchain/usr/lib/swift/host/libSwiftInProcPluginServer.dylib -plugin-path /Applications/Xcode-16.3.0.app/Contents/Developer/Toolchains/XcodeDefault.xctoolchain/usr/lib/swift/host/plugins -plugin-path /Applications/Xcode-16.3.0.app/Contents/Developer/Toolchains/XcodeDefault.xctoolchain/usr/local/lib/swift/host/plugins -o /Users/admin/builder/spi-builder-workspace/.derivedData/Build/Intermediates.noindex/RakuyoKit.build/Debug-watchos/RAKEpoxy.build/Objects-normal/arm64_32/Layout+Custom.o -o /Users/admin/builder/spi-builder-workspace/.derivedData/Build/Intermediates.noindex/RakuyoKit.build/Debug-watchos/RAKEpoxy.build/Objects-normal/arm64_32/Layout+Flow.o -o /Users/admin/builder/spi-builder-workspace/.derivedData/Build/Intermediates.noindex/RakuyoKit.build/Debug-watchos/RAKEpoxy.build/Objects-normal/arm64_32/Layout+General.o -o /Users/admin/builder/spi-builder-workspace/.derivedData/Build/Intermediates.noindex/RakuyoKit.build/Debug-watchos/RAKEpoxy.build/Objects-normal/arm64_32/Layout+List.o -o /Users/admin/builder/spi-builder-workspace/.derivedData/Build/Intermediates.noindex/RakuyoKit.build/Debug-watchos/RAKEpoxy.build/Objects-normal/arm64_32/DecorationStyle.o -index-unit-output-path /RakuyoKit.build/Debug-watchos/RAKEpoxy.build/Objects-normal/arm64_32/Layout+Custom.o -index-unit-output-path /RakuyoKit.build/Debug-watchos/RAKEpoxy.build/Objects-normal/arm64_32/Layout+Flow.o -index-unit-output-path /RakuyoKit.build/Debug-watchos/RAKEpoxy.build/Objects-normal/arm64_32/Layout+General.o -index-unit-output-path /RakuyoKit.build/Debug-watchos/RAKEpoxy.build/Objects-normal/arm64_32/Layout+List.o -index-unit-output-path /RakuyoKit.build/Debug-watchos/RAKEpoxy.build/Objects-normal/arm64_32/DecorationStyle.o -index-store-path /Users/admin/builder/spi-builder-workspace/.derivedData/Index.noindex/DataStore -index-system-modules
SwiftCompile normal arm64_32 /Users/admin/builder/spi-builder-workspace/Sources/Epoxy/CollectionView/Layout/LayoutImplement/Layout+Custom.swift (in target 'RAKEpoxy' from project 'RakuyoKit')
    cd /Users/admin/builder/spi-builder-workspace/.swiftpm/xcode

/Users/admin/builder/spi-builder-workspace/Sources/Epoxy/Exports.swift:2:19: error: no such module 'EpoxyCollectionView'
@_exported import EpoxyCollectionView
                  ^
SwiftCompile normal arm64_32 /Users/admin/builder/spi-builder-workspace/Sources/Epoxy/CollectionView/Layout/LayoutImplement/Layout+Flow.swift (in target 'RAKEpoxy' from project 'RakuyoKit')
    cd /Users/admin/builder/spi-builder-workspace/.swiftpm/xcode

/Users/admin/builder/spi-builder-workspace/Sources/Epoxy/Exports.swift:2:19: error: no such module 'EpoxyCollectionView'
@_exported import EpoxyCollectionView
                  ^
SwiftCompile normal arm64_32 /Users/admin/builder/spi-builder-workspace/Sources/Epoxy/CollectionView/Layout/LayoutImplement/Layout+General.swift (in target 'RAKEpoxy' from project 'RakuyoKit')
    cd /Users/admin/builder/spi-builder-workspace/.swiftpm/xcode

/Users/admin/builder/spi-builder-workspace/Sources/Epoxy/Exports.swift:2:19: error: no such module 'EpoxyCollectionView'
@_exported import EpoxyCollectionView
                  ^
SwiftCompile normal arm64_32 /Users/admin/builder/spi-builder-workspace/Sources/Epoxy/CollectionView/Layout/LayoutImplement/Layout+List.swift (in target 'RAKEpoxy' from project 'RakuyoKit')
    cd /Users/admin/builder/spi-builder-workspace/.swiftpm/xcode

/Users/admin/builder/spi-builder-workspace/Sources/Epoxy/Exports.swift:2:19: error: no such module 'EpoxyCollectionView'
@_exported import EpoxyCollectionView
                  ^
SwiftCompile normal arm64_32 /Users/admin/builder/spi-builder-workspace/Sources/Epoxy/CollectionView/Layout/Model/DecorationStyle.swift (in target 'RAKEpoxy' from project 'RakuyoKit')
    cd /Users/admin/builder/spi-builder-workspace/.swiftpm/xcode

/Users/admin/builder/spi-builder-workspace/Sources/Epoxy/Exports.swift:2:19: error: no such module 'EpoxyCollectionView'
@_exported import EpoxyCollectionView
                  ^
SwiftCompile normal arm64_32 Compiling\ RAKInternalItemModeling.swift,\ BaseDecorationView.swift,\ DecorationViewConfig.swift,\ GrayBackgroundDecorationView.swift,\ WhiteBackgroundDecorationView.swift /Users/admin/builder/spi-builder-workspace/Sources/Epoxy/CollectionView/ContextMenu/RAKInternalItemModeling.swift /Users/admin/builder/spi-builder-workspace/Sources/Epoxy/CollectionView/DecorationView/BaseDecorationView.swift /Users/admin/builder/spi-builder-workspace/Sources/Epoxy/CollectionView/DecorationView/DecorationViewConfig.swift /Users/admin/builder/spi-builder-workspace/Sources/Epoxy/CollectionView/DecorationView/GrayBackgroundDecorationView.swift /Users/admin/builder/spi-builder-workspace/Sources/Epoxy/CollectionView/DecorationView/WhiteBackgroundDecorationView.swift (in target 'RAKEpoxy' from project 'RakuyoKit')
SwiftCompile normal arm64_32 /Users/admin/builder/spi-builder-workspace/Sources/Epoxy/CollectionView/ContextMenu/RAKInternalItemModeling.swift (in target 'RAKEpoxy' from project 'RakuyoKit')
    cd /Users/admin/builder/spi-builder-workspace/.swiftpm/xcode

SwiftCompile normal arm64_32 /Users/admin/builder/spi-builder-workspace/Sources/Epoxy/CollectionView/DecorationView/BaseDecorationView.swift (in target 'RAKEpoxy' from project 'RakuyoKit')
    cd /Users/admin/builder/spi-builder-workspace/.swiftpm/xcode

SwiftCompile normal arm64_32 /Users/admin/builder/spi-builder-workspace/Sources/Epoxy/CollectionView/DecorationView/DecorationViewConfig.swift (in target 'RAKEpoxy' from project 'RakuyoKit')
    cd /Users/admin/builder/spi-builder-workspace/.swiftpm/xcode

SwiftCompile normal arm64_32 /Users/admin/builder/spi-builder-workspace/Sources/Epoxy/CollectionView/DecorationView/GrayBackgroundDecorationView.swift (in target 'RAKEpoxy' from project 'RakuyoKit')
    cd /Users/admin/builder/spi-builder-workspace/.swiftpm/xcode

SwiftCompile normal arm64_32 /Users/admin/builder/spi-builder-workspace/Sources/Epoxy/CollectionView/DecorationView/WhiteBackgroundDecorationView.swift (in target 'RAKEpoxy' from project 'RakuyoKit')
    cd /Users/admin/builder/spi-builder-workspace/.swiftpm/xcode

SwiftDriverJobDiscovery normal arm64_32 Compiling RAKBaseTableViewCell.swift (in target 'RAKBase' from project 'RakuyoKit')
SwiftCompile normal arm64_32 Compiling\ ButtonRow.swift,\ ButtonRowStateContent.swift,\ EmptyRow.swift,\ AnyImageContent+Accessory.swift /Users/admin/builder/spi-builder-workspace/Sources/Epoxy/Row/ButtonRow/ButtonRow.swift /Users/admin/builder/spi-builder-workspace/Sources/Epoxy/Row/ButtonRow/ButtonRowStateContent.swift /Users/admin/builder/spi-builder-workspace/Sources/Epoxy/Row/EmptyRow.swift /Users/admin/builder/spi-builder-workspace/Sources/Epoxy/Row/ImageRow/AnyImageContent+Accessory.swift (in target 'RAKEpoxy' from project 'RakuyoKit')
Failed frontend command:
/Applications/Xcode-16.3.0.app/Contents/Developer/Toolchains/XcodeDefault.xctoolchain/usr/bin/swift-frontend -frontend -c /Users/admin/builder/spi-builder-workspace/Sources/Epoxy/CollectionView/CollectionView.swift /Users/admin/builder/spi-builder-workspace/Sources/Epoxy/CollectionView/ContextMenu/AnyItemModel+ContextMenu.swift /Users/admin/builder/spi-builder-workspace/Sources/Epoxy/CollectionView/ContextMenu/CollectionViewContextMenuDelegate.swift /Users/admin/builder/spi-builder-workspace/Sources/Epoxy/CollectionView/ContextMenu/ContextMenuProviding.swift /Users/admin/builder/spi-builder-workspace/Sources/Epoxy/CollectionView/ContextMenu/ItemModel+ContextMenu.swift /Users/admin/builder/spi-builder-workspace/Sources/Epoxy/CollectionView/ContextMenu/RAKInternalItemModeling.swift /Users/admin/builder/spi-builder-workspace/Sources/Epoxy/CollectionView/DecorationView/BaseDecorationView.swift /Users/admin/builder/spi-builder-workspace/Sources/Epoxy/CollectionView/DecorationView/DecorationViewConfig.swift /Users/admin/builder/spi-builder-workspace/Sources/Epoxy/CollectionView/DecorationView/GrayBackgroundDecorationView.swift /Users/admin/builder/spi-builder-workspace/Sources/Epoxy/CollectionView/DecorationView/WhiteBackgroundDecorationView.swift /Users/admin/builder/spi-builder-workspace/Sources/Epoxy/CollectionView/Layout/LayoutImplement/Layout+Custom.swift /Users/admin/builder/spi-builder-workspace/Sources/Epoxy/CollectionView/Layout/LayoutImplement/Layout+Flow.swift /Users/admin/builder/spi-builder-workspace/Sources/Epoxy/CollectionView/Layout/LayoutImplement/Layout+General.swift /Users/admin/builder/spi-builder-workspace/Sources/Epoxy/CollectionView/Layout/LayoutImplement/Layout+List.swift /Users/admin/builder/spi-builder-workspace/Sources/Epoxy/CollectionView/Layout/Model/DecorationStyle.swift /Users/admin/builder/spi-builder-workspace/Sources/Epoxy/CollectionView/Layout/Model/Layout.swift /Users/admin/builder/spi-builder-workspace/Sources/Epoxy/CollectionView/Layout/Model/NSCollectionLayoutDimension+QLCD.swift /Users/admin/builder/spi-builder-workspace/Sources/Epoxy/CollectionView/Layout/Model/SectionProviderWrapper.swift /Users/admin/builder/spi-builder-workspace/Sources/Epoxy/CollectionView/Layout/Model/SupplementaryItem.swift /Users/admin/builder/spi-builder-workspace/Sources/Epoxy/CollectionView/Layout/WrapperTools/EpoxyModeled+Supplementary.swift /Users/admin/builder/spi-builder-workspace/Sources/Epoxy/CollectionView/Layout/WrapperTools/Layout+SectionModel.swift /Users/admin/builder/spi-builder-workspace/Sources/Epoxy/CollectionView/Spacer/Epoxy+Spacer.swift /Users/admin/builder/spi-builder-workspace/Sources/Epoxy/CollectionView/Spacer/SpacerRow.swift /Users/admin/builder/spi-builder-workspace/Sources/Epoxy/CollectionView/Tools/EpoxyModeled+Padding.swift /Users/admin/builder/spi-builder-workspace/Sources/Epoxy/CollectionView/Tools/ListSpacing.swift /Users/admin/builder/spi-builder-workspace/Sources/Epoxy/CollectionView/Tools/SectionEdgeInsets.swift /Users/admin/builder/spi-builder-workspace/Sources/Epoxy/CollectionView/Tools/Sequence+Epoxy.swift /Users/admin/builder/spi-builder-workspace/Sources/Epoxy/CollectionView/WaterfallLayout/Layout+Waterfall.swift /Users/admin/builder/spi-builder-workspace/Sources/Epoxy/CollectionView/WaterfallLayout/WaterfallCompositionalLayout+Config.swift /Users/admin/builder/spi-builder-workspace/Sources/Epoxy/CollectionView/WaterfallLayout/WaterfallCompositionalLayout+LayoutBuilder.swift /Users/admin/builder/spi-builder-workspace/Sources/Epoxy/CollectionView/WaterfallLayout/WaterfallCompositionalLayout.swift /Users/admin/builder/spi-builder-workspace/Sources/Epoxy/Exports.swift /Users/admin/builder/spi-builder-workspace/Sources/Epoxy/Row/BaseStyledEpoxyView.swift /Users/admin/builder/spi-builder-workspace/Sources/Epoxy/Row/ButtonRow/AnyButtonImageContent.swift /Users/admin/builder/spi-builder-workspace/Sources/Epoxy/Row/ButtonRow/ButtonImageContentProviding.swift -primary-file /Users/admin/builder/spi-builder-workspace/Sources/Epoxy/Row/ButtonRow/ButtonRow.swift -primary-file /Users/admin/builder/spi-builder-workspace/Sources/Epoxy/Row/ButtonRow/ButtonRowStateContent.swift -primary-file /Users/admin/builder/spi-builder-workspace/Sources/Epoxy/Row/EmptyRow.swift -primary-file /Users/admin/builder/spi-builder-workspace/Sources/Epoxy/Row/ImageRow/AnyImageContent+Accessory.swift /Users/admin/builder/spi-builder-workspace/Sources/Epoxy/Row/ImageRow/AnyImageContent.swift /Users/admin/builder/spi-builder-workspace/Sources/Epoxy/Row/ImageRow/FastImageContentProviding.swift /Users/admin/builder/spi-builder-workspace/Sources/Epoxy/Row/ImageRow/ImageContentProviding.swift /Users/admin/builder/spi-builder-workspace/Sources/Epoxy/Row/ImageRow/ImageRow.swift /Users/admin/builder/spi-builder-workspace/Sources/Epoxy/Row/RowConfigureApplicable.swift /Users/admin/builder/spi-builder-workspace/Sources/Epoxy/Row/SwitchRow.swift /Users/admin/builder/spi-builder-workspace/Sources/Epoxy/Row/TextFieldRow.swift /Users/admin/builder/spi-builder-workspace/Sources/Epoxy/Row/TextRow.swift -supplementary-output-file-map /Users/admin/builder/spi-builder-workspace/.derivedData/Build/Intermediates.noindex/RakuyoKit.build/Debug-watchos/RAKEpoxy.build/Objects-normal/arm64_32/supplementaryOutputs-194 -target arm64_32-apple-watchos6.0 -enable-objc-interop -sdk /Applications/Xcode-16.3.0.app/Contents/Developer/Platforms/WatchOS.platform/Developer/SDKs/WatchOS11.4.sdk -I /Users/admin/builder/spi-builder-workspace/.derivedData/Build/Products/Debug-watchos -I /Applications/Xcode-16.3.0.app/Contents/Developer/Platforms/WatchOS.platform/Developer/usr/lib -F /Users/admin/builder/spi-builder-workspace/.derivedData/Build/Products/Debug-watchos/PackageFrameworks -F /Users/admin/builder/spi-builder-workspace/.derivedData/Build/Products/Debug-watchos/PackageFrameworks -F /Users/admin/builder/spi-builder-workspace/.derivedData/Build/Products/Debug-watchos/PackageFrameworks -F /Users/admin/builder/spi-builder-workspace/.derivedData/Build/Products/Debug-watchos/PackageFrameworks -F /Users/admin/builder/spi-builder-workspace/.derivedData/Build/Products/Debug-watchos/PackageFrameworks -F /Users/admin/builder/spi-builder-workspace/.derivedData/Build/Products/Debug-watchos -F /Applications/Xcode-16.3.0.app/Contents/Developer/Platforms/WatchOS.platform/Developer/Library/Frameworks -F /Applications/Xcode-16.3.0.app/Contents/Developer/Platforms/WatchOS.platform/Developer/SDKs/WatchOS11.4.sdk/Developer/Library/Frameworks -no-color-diagnostics -enable-testing -g -debug-info-format\=dwarf -dwarf-version\=4 -module-cache-path /Users/admin/builder/spi-builder-workspace/.derivedData/ModuleCache.noindex -profile-generate -profile-coverage-mapping -swift-version 5 -enforce-exclusivity\=checked -Onone -D SWIFT_PACKAGE -D DEBUG -D Xcode -serialize-debugging-options -const-gather-protocols-file /Users/admin/builder/spi-builder-workspace/.derivedData/Build/Intermediates.noindex/RakuyoKit.build/Debug-watchos/RAKEpoxy.build/Objects-normal/arm64_32/RAKEpoxy_const_extract_protocols.json -enable-experimental-feature DebugDescriptionMacro -empty-abi-descriptor -plugin-path /Applications/Xcode-16.3.0.app/Contents/Developer/Toolchains/XcodeDefault.xctoolchain/usr/lib/swift/host/plugins/testing -validate-clang-modules-once -clang-build-session-file /Users/admin/builder/spi-builder-workspace/.derivedData/ModuleCache.noindex/Session.modulevalidation -Xcc -working-directory -Xcc /Users/admin/builder/spi-builder-workspace/.swiftpm/xcode -resource-dir /Applications/Xcode-16.3.0.app/Contents/Developer/Toolchains/XcodeDefault.xctoolchain/usr/lib/swift -enable-anonymous-context-mangled-names -file-compilation-dir /Users/admin/builder/spi-builder-workspace/.swiftpm/xcode -Xcc -ivfsstatcache -Xcc /Users/admin/builder/spi-builder-workspace/.derivedData/SDKStatCaches.noindex/watchos11.4-22T246-43efb940ff07ba2497b70ec94253f576.sdkstatcache -Xcc -I/Users/admin/builder/spi-builder-workspace/.derivedData/Build/Intermediates.noindex/RakuyoKit.build/Debug-watchos/RAKEpoxy.build/swift-overrides.hmap -Xcc -I/Users/admin/builder/spi-builder-workspace/.derivedData/Build/Products/Debug-watchos/include -Xcc -I/Users/admin/builder/spi-builder-workspace/.derivedData/Build/Intermediates.noindex/RakuyoKit.build/Debug-watchos/RAKEpoxy.build/DerivedSources-normal/arm64_32 -Xcc -I/Users/admin/builder/spi-builder-workspace/.derivedData/Build/Intermediates.noindex/RakuyoKit.build/Debug-watchos/RAKEpoxy.build/DerivedSources/arm64_32 -Xcc -I/Users/admin/builder/spi-builder-workspace/.derivedData/Build/Intermediates.noindex/RakuyoKit.build/Debug-watchos/RAKEpoxy.build/DerivedSources -Xcc -DSWIFT_PACKAGE -Xcc -DDEBUG\=1 -module-name RAKEpoxy -package-name spi_builder_workspace -frontend-parseable-output -disable-clang-spi -target-sdk-version 11.4 -target-sdk-name watchos11.4 -external-plugin-path /Applications/Xcode-16.3.0.app/Contents/Developer/Platforms/WatchOS.platform/Developer/usr/lib/swift/host/plugins\#/Applications/Xcode-16.3.0.app/Contents/Developer/Platforms/WatchOS.platform/Developer/usr/bin/swift-plugin-server -external-plugin-path /Applications/Xcode-16.3.0.app/Contents/Developer/Platforms/WatchOS.platform/Developer/usr/local/lib/swift/host/plugins\#/Applications/Xcode-16.3.0.app/Contents/Developer/Platforms/WatchOS.platform/Developer/usr/bin/swift-plugin-server -in-process-plugin-server-path /Applications/Xcode-16.3.0.app/Contents/Developer/Toolchains/XcodeDefault.xctoolchain/usr/lib/swift/host/libSwiftInProcPluginServer.dylib -plugin-path /Applications/Xcode-16.3.0.app/Contents/Developer/Toolchains/XcodeDefault.xctoolchain/usr/lib/swift/host/plugins -plugin-path /Applications/Xcode-16.3.0.app/Contents/Developer/Toolchains/XcodeDefault.xctoolchain/usr/local/lib/swift/host/plugins -o /Users/admin/builder/spi-builder-workspace/.derivedData/Build/Intermediates.noindex/RakuyoKit.build/Debug-watchos/RAKEpoxy.build/Objects-normal/arm64_32/ButtonRow.o -o /Users/admin/builder/spi-builder-workspace/.derivedData/Build/Intermediates.noindex/RakuyoKit.build/Debug-watchos/RAKEpoxy.build/Objects-normal/arm64_32/ButtonRowStateContent.o -o /Users/admin/builder/spi-builder-workspace/.derivedData/Build/Intermediates.noindex/RakuyoKit.build/Debug-watchos/RAKEpoxy.build/Objects-normal/arm64_32/EmptyRow.o -o /Users/admin/builder/spi-builder-workspace/.derivedData/Build/Intermediates.noindex/RakuyoKit.build/Debug-watchos/RAKEpoxy.build/Objects-normal/arm64_32/AnyImageContent+Accessory.o -index-unit-output-path /RakuyoKit.build/Debug-watchos/RAKEpoxy.build/Objects-normal/arm64_32/ButtonRow.o -index-unit-output-path /RakuyoKit.build/Debug-watchos/RAKEpoxy.build/Objects-normal/arm64_32/ButtonRowStateContent.o -index-unit-output-path /RakuyoKit.build/Debug-watchos/RAKEpoxy.build/Objects-normal/arm64_32/EmptyRow.o -index-unit-output-path /RakuyoKit.build/Debug-watchos/RAKEpoxy.build/Objects-normal/arm64_32/AnyImageContent+Accessory.o -index-store-path /Users/admin/builder/spi-builder-workspace/.derivedData/Index.noindex/DataStore -index-system-modules
SwiftCompile normal arm64_32 /Users/admin/builder/spi-builder-workspace/Sources/Epoxy/Row/ButtonRow/ButtonRow.swift (in target 'RAKEpoxy' from project 'RakuyoKit')
    cd /Users/admin/builder/spi-builder-workspace/.swiftpm/xcode

/Users/admin/builder/spi-builder-workspace/Sources/Epoxy/Exports.swift:2:19: error: no such module 'EpoxyCollectionView'
@_exported import EpoxyCollectionView
                  ^
SwiftCompile normal arm64_32 /Users/admin/builder/spi-builder-workspace/Sources/Epoxy/Row/ButtonRow/ButtonRowStateContent.swift (in target 'RAKEpoxy' from project 'RakuyoKit')
    cd /Users/admin/builder/spi-builder-workspace/.swiftpm/xcode

/Users/admin/builder/spi-builder-workspace/Sources/Epoxy/Exports.swift:2:19: error: no such module 'EpoxyCollectionView'
@_exported import EpoxyCollectionView
                  ^
SwiftCompile normal arm64_32 /Users/admin/builder/spi-builder-workspace/Sources/Epoxy/Row/EmptyRow.swift (in target 'RAKEpoxy' from project 'RakuyoKit')
    cd /Users/admin/builder/spi-builder-workspace/.swiftpm/xcode

/Users/admin/builder/spi-builder-workspace/Sources/Epoxy/Exports.swift:2:19: error: no such module 'EpoxyCollectionView'
@_exported import EpoxyCollectionView
                  ^
SwiftCompile normal arm64_32 /Users/admin/builder/spi-builder-workspace/Sources/Epoxy/Row/ImageRow/AnyImageContent+Accessory.swift (in target 'RAKEpoxy' from project 'RakuyoKit')
    cd /Users/admin/builder/spi-builder-workspace/.swiftpm/xcode

/Users/admin/builder/spi-builder-workspace/Sources/Epoxy/Exports.swift:2:19: error: no such module 'EpoxyCollectionView'
@_exported import EpoxyCollectionView
                  ^
SwiftDriverJobDiscovery normal armv7k Compiling NavigationControllerPopDelegateProxy.swift, RAKBaseNavigationController.swift (in target 'RAKBase' from project 'RakuyoKit')
SwiftEmitModule normal armv7k Emitting\ module\ for\ RAKEpoxy (in target 'RAKEpoxy' from project 'RakuyoKit')
EmitSwiftModule normal armv7k (in target 'RAKEpoxy' from project 'RakuyoKit')
    cd /Users/admin/builder/spi-builder-workspace/.swiftpm/xcode

SwiftCompile normal armv7k Compiling\ AnyImageContent.swift,\ FastImageContentProviding.swift,\ ImageContentProviding.swift,\ ImageRow.swift /Users/admin/builder/spi-builder-workspace/Sources/Epoxy/Row/ImageRow/AnyImageContent.swift /Users/admin/builder/spi-builder-workspace/Sources/Epoxy/Row/ImageRow/FastImageContentProviding.swift /Users/admin/builder/spi-builder-workspace/Sources/Epoxy/Row/ImageRow/ImageContentProviding.swift /Users/admin/builder/spi-builder-workspace/Sources/Epoxy/Row/ImageRow/ImageRow.swift (in target 'RAKEpoxy' from project 'RakuyoKit')
SwiftCompile normal armv7k /Users/admin/builder/spi-builder-workspace/Sources/Epoxy/Row/ImageRow/AnyImageContent.swift (in target 'RAKEpoxy' from project 'RakuyoKit')
    cd /Users/admin/builder/spi-builder-workspace/.swiftpm/xcode

SwiftCompile normal armv7k /Users/admin/builder/spi-builder-workspace/Sources/Epoxy/Row/ImageRow/FastImageContentProviding.swift (in target 'RAKEpoxy' from project 'RakuyoKit')
    cd /Users/admin/builder/spi-builder-workspace/.swiftpm/xcode

SwiftCompile normal armv7k /Users/admin/builder/spi-builder-workspace/Sources/Epoxy/Row/ImageRow/ImageContentProviding.swift (in target 'RAKEpoxy' from project 'RakuyoKit')
    cd /Users/admin/builder/spi-builder-workspace/.swiftpm/xcode

SwiftCompile normal armv7k /Users/admin/builder/spi-builder-workspace/Sources/Epoxy/Row/ImageRow/ImageRow.swift (in target 'RAKEpoxy' from project 'RakuyoKit')
    cd /Users/admin/builder/spi-builder-workspace/.swiftpm/xcode

SwiftDriverJobDiscovery normal armv7k Compiling RAKRotatableViewController.swift (in target 'RAKBase' from project 'RakuyoKit')
SwiftEmitModule normal arm64 Emitting\ module\ for\ RAKEpoxy (in target 'RAKEpoxy' from project 'RakuyoKit')
EmitSwiftModule normal arm64 (in target 'RAKEpoxy' from project 'RakuyoKit')
    cd /Users/admin/builder/spi-builder-workspace/.swiftpm/xcode

SwiftDriverJobDiscovery normal armv7k Compiling RAKFinalFastCell.swift (in target 'RAKBase' from project 'RakuyoKit')
SwiftCompile normal arm64 Compiling\ AnyImageContent.swift,\ FastImageContentProviding.swift,\ ImageContentProviding.swift,\ ImageRow.swift /Users/admin/builder/spi-builder-workspace/Sources/Epoxy/Row/ImageRow/AnyImageContent.swift /Users/admin/builder/spi-builder-workspace/Sources/Epoxy/Row/ImageRow/FastImageContentProviding.swift /Users/admin/builder/spi-builder-workspace/Sources/Epoxy/Row/ImageRow/ImageContentProviding.swift /Users/admin/builder/spi-builder-workspace/Sources/Epoxy/Row/ImageRow/ImageRow.swift (in target 'RAKEpoxy' from project 'RakuyoKit')
SwiftCompile normal arm64 /Users/admin/builder/spi-builder-workspace/Sources/Epoxy/Row/ImageRow/AnyImageContent.swift (in target 'RAKEpoxy' from project 'RakuyoKit')
    cd /Users/admin/builder/spi-builder-workspace/.swiftpm/xcode

SwiftCompile normal arm64 /Users/admin/builder/spi-builder-workspace/Sources/Epoxy/Row/ImageRow/FastImageContentProviding.swift (in target 'RAKEpoxy' from project 'RakuyoKit')
    cd /Users/admin/builder/spi-builder-workspace/.swiftpm/xcode

SwiftCompile normal arm64 /Users/admin/builder/spi-builder-workspace/Sources/Epoxy/Row/ImageRow/ImageContentProviding.swift (in target 'RAKEpoxy' from project 'RakuyoKit')
    cd /Users/admin/builder/spi-builder-workspace/.swiftpm/xcode

SwiftCompile normal arm64 /Users/admin/builder/spi-builder-workspace/Sources/Epoxy/Row/ImageRow/ImageRow.swift (in target 'RAKEpoxy' from project 'RakuyoKit')
    cd /Users/admin/builder/spi-builder-workspace/.swiftpm/xcode

SwiftDriverJobDiscovery normal arm64_32 Compiling FastCell.swift (in target 'RAKBase' from project 'RakuyoKit')
SwiftCompile normal arm64 Compiling\ RAKInternalItemModeling.swift,\ BaseDecorationView.swift,\ DecorationViewConfig.swift,\ GrayBackgroundDecorationView.swift,\ WhiteBackgroundDecorationView.swift /Users/admin/builder/spi-builder-workspace/Sources/Epoxy/CollectionView/ContextMenu/RAKInternalItemModeling.swift /Users/admin/builder/spi-builder-workspace/Sources/Epoxy/CollectionView/DecorationView/BaseDecorationView.swift /Users/admin/builder/spi-builder-workspace/Sources/Epoxy/CollectionView/DecorationView/DecorationViewConfig.swift /Users/admin/builder/spi-builder-workspace/Sources/Epoxy/CollectionView/DecorationView/GrayBackgroundDecorationView.swift /Users/admin/builder/spi-builder-workspace/Sources/Epoxy/CollectionView/DecorationView/WhiteBackgroundDecorationView.swift (in target 'RAKEpoxy' from project 'RakuyoKit')
SwiftCompile normal arm64 /Users/admin/builder/spi-builder-workspace/Sources/Epoxy/CollectionView/ContextMenu/RAKInternalItemModeling.swift (in target 'RAKEpoxy' from project 'RakuyoKit')
    cd /Users/admin/builder/spi-builder-workspace/.swiftpm/xcode

SwiftCompile normal arm64 /Users/admin/builder/spi-builder-workspace/Sources/Epoxy/CollectionView/DecorationView/BaseDecorationView.swift (in target 'RAKEpoxy' from project 'RakuyoKit')
    cd /Users/admin/builder/spi-builder-workspace/.swiftpm/xcode

SwiftCompile normal arm64 /Users/admin/builder/spi-builder-workspace/Sources/Epoxy/CollectionView/DecorationView/DecorationViewConfig.swift (in target 'RAKEpoxy' from project 'RakuyoKit')
    cd /Users/admin/builder/spi-builder-workspace/.swiftpm/xcode

SwiftCompile normal arm64 /Users/admin/builder/spi-builder-workspace/Sources/Epoxy/CollectionView/DecorationView/GrayBackgroundDecorationView.swift (in target 'RAKEpoxy' from project 'RakuyoKit')
    cd /Users/admin/builder/spi-builder-workspace/.swiftpm/xcode

SwiftCompile normal arm64 /Users/admin/builder/spi-builder-workspace/Sources/Epoxy/CollectionView/DecorationView/WhiteBackgroundDecorationView.swift (in target 'RAKEpoxy' from project 'RakuyoKit')
    cd /Users/admin/builder/spi-builder-workspace/.swiftpm/xcode

SwiftDriverJobDiscovery normal arm64 Compiling RAKBaseViewController.swift (in target 'RAKBase' from project 'RakuyoKit')
SwiftCompile normal armv7k Compiling\ ButtonRow.swift,\ ButtonRowStateContent.swift,\ EmptyRow.swift,\ AnyImageContent+Accessory.swift /Users/admin/builder/spi-builder-workspace/Sources/Epoxy/Row/ButtonRow/ButtonRow.swift /Users/admin/builder/spi-builder-workspace/Sources/Epoxy/Row/ButtonRow/ButtonRowStateContent.swift /Users/admin/builder/spi-builder-workspace/Sources/Epoxy/Row/EmptyRow.swift /Users/admin/builder/spi-builder-workspace/Sources/Epoxy/Row/ImageRow/AnyImageContent+Accessory.swift (in target 'RAKEpoxy' from project 'RakuyoKit')
SwiftCompile normal armv7k /Users/admin/builder/spi-builder-workspace/Sources/Epoxy/Row/ButtonRow/ButtonRow.swift (in target 'RAKEpoxy' from project 'RakuyoKit')
    cd /Users/admin/builder/spi-builder-workspace/.swiftpm/xcode

SwiftCompile normal armv7k /Users/admin/builder/spi-builder-workspace/Sources/Epoxy/Row/ButtonRow/ButtonRowStateContent.swift (in target 'RAKEpoxy' from project 'RakuyoKit')
    cd /Users/admin/builder/spi-builder-workspace/.swiftpm/xcode

SwiftCompile normal armv7k /Users/admin/builder/spi-builder-workspace/Sources/Epoxy/Row/EmptyRow.swift (in target 'RAKEpoxy' from project 'RakuyoKit')
    cd /Users/admin/builder/spi-builder-workspace/.swiftpm/xcode

SwiftCompile normal armv7k /Users/admin/builder/spi-builder-workspace/Sources/Epoxy/Row/ImageRow/AnyImageContent+Accessory.swift (in target 'RAKEpoxy' from project 'RakuyoKit')
    cd /Users/admin/builder/spi-builder-workspace/.swiftpm/xcode

SwiftDriverJobDiscovery normal arm64_32 Compiling RAKRotatableViewController.swift (in target 'RAKBase' from project 'RakuyoKit')
SwiftCompile normal arm64 Compiling\ ButtonRow.swift,\ ButtonRowStateContent.swift,\ EmptyRow.swift,\ AnyImageContent+Accessory.swift /Users/admin/builder/spi-builder-workspace/Sources/Epoxy/Row/ButtonRow/ButtonRow.swift /Users/admin/builder/spi-builder-workspace/Sources/Epoxy/Row/ButtonRow/ButtonRowStateContent.swift /Users/admin/builder/spi-builder-workspace/Sources/Epoxy/Row/EmptyRow.swift /Users/admin/builder/spi-builder-workspace/Sources/Epoxy/Row/ImageRow/AnyImageContent+Accessory.swift (in target 'RAKEpoxy' from project 'RakuyoKit')
Command SwiftCompile failed with a nonzero exit code
** BUILD FAILED **
The following build commands failed:
	SwiftCompile normal arm64_32 Compiling\ Layout+Custom.swift,\ Layout+Flow.swift,\ Layout+General.swift,\ Layout+List.swift,\ DecorationStyle.swift /Users/admin/builder/spi-builder-workspace/Sources/Epoxy/CollectionView/Layout/LayoutImplement/Layout+Custom.swift /Users/admin/builder/spi-builder-workspace/Sources/Epoxy/CollectionView/Layout/LayoutImplement/Layout+Flow.swift /Users/admin/builder/spi-builder-workspace/Sources/Epoxy/CollectionView/Layout/LayoutImplement/Layout+General.swift /Users/admin/builder/spi-builder-workspace/Sources/Epoxy/CollectionView/Layout/LayoutImplement/Layout+List.swift /Users/admin/builder/spi-builder-workspace/Sources/Epoxy/CollectionView/Layout/Model/DecorationStyle.swift (in target 'RAKEpoxy' from project 'RakuyoKit')
	SwiftCompile normal arm64_32 /Users/admin/builder/spi-builder-workspace/Sources/Epoxy/CollectionView/Layout/LayoutImplement/Layout+Custom.swift (in target 'RAKEpoxy' from project 'RakuyoKit')
	SwiftCompile normal arm64_32 /Users/admin/builder/spi-builder-workspace/Sources/Epoxy/CollectionView/Layout/LayoutImplement/Layout+Flow.swift (in target 'RAKEpoxy' from project 'RakuyoKit')
	SwiftCompile normal arm64_32 /Users/admin/builder/spi-builder-workspace/Sources/Epoxy/CollectionView/Layout/LayoutImplement/Layout+General.swift (in target 'RAKEpoxy' from project 'RakuyoKit')
	SwiftCompile normal arm64_32 /Users/admin/builder/spi-builder-workspace/Sources/Epoxy/CollectionView/Layout/LayoutImplement/Layout+List.swift (in target 'RAKEpoxy' from project 'RakuyoKit')
	SwiftCompile normal arm64_32 /Users/admin/builder/spi-builder-workspace/Sources/Epoxy/CollectionView/Layout/Model/DecorationStyle.swift (in target 'RAKEpoxy' from project 'RakuyoKit')
	SwiftCompile normal arm64_32 Compiling\ ButtonRow.swift,\ ButtonRowStateContent.swift,\ EmptyRow.swift,\ AnyImageContent+Accessory.swift /Users/admin/builder/spi-builder-workspace/Sources/Epoxy/Row/ButtonRow/ButtonRow.swift /Users/admin/builder/spi-builder-workspace/Sources/Epoxy/Row/ButtonRow/ButtonRowStateContent.swift /Users/admin/builder/spi-builder-workspace/Sources/Epoxy/Row/EmptyRow.swift /Users/admin/builder/spi-builder-workspace/Sources/Epoxy/Row/ImageRow/AnyImageContent+Accessory.swift (in target 'RAKEpoxy' from project 'RakuyoKit')
	SwiftCompile normal arm64_32 /Users/admin/builder/spi-builder-workspace/Sources/Epoxy/Row/ButtonRow/ButtonRow.swift (in target 'RAKEpoxy' from project 'RakuyoKit')
	SwiftCompile normal arm64_32 /Users/admin/builder/spi-builder-workspace/Sources/Epoxy/Row/ButtonRow/ButtonRowStateContent.swift (in target 'RAKEpoxy' from project 'RakuyoKit')
	SwiftCompile normal arm64_32 /Users/admin/builder/spi-builder-workspace/Sources/Epoxy/Row/EmptyRow.swift (in target 'RAKEpoxy' from project 'RakuyoKit')
	SwiftCompile normal arm64_32 /Users/admin/builder/spi-builder-workspace/Sources/Epoxy/Row/ImageRow/AnyImageContent+Accessory.swift (in target 'RAKEpoxy' from project 'RakuyoKit')
	SwiftCompile normal arm64 Compiling\ ButtonRow.swift,\ ButtonRowStateContent.swift,\ EmptyRow.swift,\ AnyImageContent+Accessory.swift /Users/admin/builder/spi-builder-workspace/Sources/Epoxy/Row/ButtonRow/ButtonRow.swift /Users/admin/builder/spi-builder-workspace/Sources/Epoxy/Row/ButtonRow/ButtonRowStateContent.swift /Users/admin/builder/spi-builder-workspace/Sources/Epoxy/Row/EmptyRow.swift /Users/admin/builder/spi-builder-workspace/Sources/Epoxy/Row/ImageRow/AnyImageContent+Accessory.swift (in target 'RAKEpoxy' from project 'RakuyoKit')
	Building workspace spi-builder-workspace with scheme RakuyoKit-Package
(13 failures)
BUILD FAILURE 6.1 watchOS