The Swift Package Index logo.Swift Package Index

Track the adoption of Swift 6 strict concurrency checks for data race safety. How many packages are Ready for Swift 6?

Build Information

Failed to build meilisearch-swift, reference 0.17.0 (4b7078), with Swift 5.9 for watchOS using Xcode 15.2 on 9 Jan 2025 17:56:50 UTC.

Build Command

env DEVELOPER_DIR=/Applications/Xcode-15.2.0.app xcrun xcodebuild -IDEClonedSourcePackagesDirPathOverride=$PWD/.dependencies -skipMacroValidation -skipPackagePluginValidation -derivedDataPath $PWD/.derivedData build -scheme meilisearch-swift -destination generic/platform=watchOS

Build Log

SwiftDriver MeiliSearch normal arm64_32 com.apple.xcode.tools.swift.compiler (in target 'MeiliSearch' from project 'meilisearch-swift')
    cd /Users/admin/builder/spi-builder-workspace
    builtin-SwiftDriver -- /Applications/Xcode-15.2.0.app/Contents/Developer/Toolchains/XcodeDefault.xctoolchain/usr/bin/swiftc -module-name MeiliSearch -Onone -enforce-exclusivity\=checked @/Users/admin/builder/spi-builder-workspace/.derivedData/Build/Intermediates.noindex/meilisearch-swift.build/Debug-watchos/MeiliSearch.build/Objects-normal/arm64_32/MeiliSearch.SwiftFileList -DSWIFT_PACKAGE -DDEBUG -DXcode -sdk /Applications/Xcode-15.2.0.app/Contents/Developer/Platforms/WatchOS.platform/Developer/SDKs/WatchOS10.2.sdk -target arm64_32-apple-watchos5.0 -g -module-cache-path /Users/admin/builder/spi-builder-workspace/.derivedData/ModuleCache.noindex -Xfrontend -serialize-debugging-options -profile-coverage-mapping -profile-generate -enable-testing -index-store-path /Users/admin/builder/spi-builder-workspace/.derivedData/Index.noindex/DataStore -swift-version 5 -I /Users/admin/builder/spi-builder-workspace/.derivedData/Build/Products/Debug-watchos -I /Applications/Xcode-15.2.0.app/Contents/Developer/Platforms/WatchOS.platform/Developer/usr/lib -F /Users/admin/builder/spi-builder-workspace/.derivedData/Build/Products/Debug-watchos -F /Applications/Xcode-15.2.0.app/Contents/Developer/Platforms/WatchOS.platform/Developer/Library/Frameworks -F /Applications/Xcode-15.2.0.app/Contents/Developer/Platforms/WatchOS.platform/Developer/SDKs/WatchOS10.2.sdk/Developer/Library/Frameworks -c -j10 -enable-batch-mode -incremental -Xcc -ivfsstatcache -Xcc /Users/admin/builder/spi-builder-workspace/.derivedData/SDKStatCaches.noindex/watchos10.2-21S355-1a03c8d25fc3596eb74c01d649b42752.sdkstatcache -output-file-map /Users/admin/builder/spi-builder-workspace/.derivedData/Build/Intermediates.noindex/meilisearch-swift.build/Debug-watchos/MeiliSearch.build/Objects-normal/arm64_32/MeiliSearch-OutputFileMap.json -use-frontend-parseable-output -save-temps -no-color-diagnostics -serialize-diagnostics -emit-dependencies -emit-module -emit-module-path /Users/admin/builder/spi-builder-workspace/.derivedData/Build/Intermediates.noindex/meilisearch-swift.build/Debug-watchos/MeiliSearch.build/Objects-normal/arm64_32/MeiliSearch.swiftmodule -validate-clang-modules-once -clang-build-session-file /Users/admin/builder/spi-builder-workspace/.derivedData/ModuleCache.noindex/Session.modulevalidation -Xcc -I/Users/admin/builder/spi-builder-workspace/.derivedData/Build/Intermediates.noindex/meilisearch-swift.build/Debug-watchos/MeiliSearch.build/swift-overrides.hmap -emit-const-values -Xfrontend -const-gather-protocols-file -Xfrontend /Users/admin/builder/spi-builder-workspace/.derivedData/Build/Intermediates.noindex/meilisearch-swift.build/Debug-watchos/MeiliSearch.build/Objects-normal/arm64_32/MeiliSearch_const_extract_protocols.json -Xcc -I/Users/admin/builder/spi-builder-workspace/.derivedData/Build/Products/Debug-watchos/include -Xcc -I/Users/admin/builder/spi-builder-workspace/.derivedData/Build/Intermediates.noindex/meilisearch-swift.build/Debug-watchos/MeiliSearch.build/DerivedSources-normal/arm64_32 -Xcc -I/Users/admin/builder/spi-builder-workspace/.derivedData/Build/Intermediates.noindex/meilisearch-swift.build/Debug-watchos/MeiliSearch.build/DerivedSources/arm64_32 -Xcc -I/Users/admin/builder/spi-builder-workspace/.derivedData/Build/Intermediates.noindex/meilisearch-swift.build/Debug-watchos/MeiliSearch.build/DerivedSources -Xcc -DSWIFT_PACKAGE -Xcc -DDEBUG\=1 -emit-objc-header -emit-objc-header-path /Users/admin/builder/spi-builder-workspace/.derivedData/Build/Intermediates.noindex/meilisearch-swift.build/Debug-watchos/MeiliSearch.build/Objects-normal/arm64_32/MeiliSearch-Swift.h -working-directory /Users/admin/builder/spi-builder-workspace -experimental-emit-module-separately -disable-cmo
SwiftDriver MeiliSearch normal arm64 com.apple.xcode.tools.swift.compiler (in target 'MeiliSearch' from project 'meilisearch-swift')
    cd /Users/admin/builder/spi-builder-workspace
    builtin-SwiftDriver -- /Applications/Xcode-15.2.0.app/Contents/Developer/Toolchains/XcodeDefault.xctoolchain/usr/bin/swiftc -module-name MeiliSearch -Onone -enforce-exclusivity\=checked @/Users/admin/builder/spi-builder-workspace/.derivedData/Build/Intermediates.noindex/meilisearch-swift.build/Debug-watchos/MeiliSearch.build/Objects-normal/arm64/MeiliSearch.SwiftFileList -DSWIFT_PACKAGE -DDEBUG -DXcode -sdk /Applications/Xcode-15.2.0.app/Contents/Developer/Platforms/WatchOS.platform/Developer/SDKs/WatchOS10.2.sdk -target arm64-apple-watchos5.0 -g -module-cache-path /Users/admin/builder/spi-builder-workspace/.derivedData/ModuleCache.noindex -Xfrontend -serialize-debugging-options -profile-coverage-mapping -profile-generate -enable-testing -index-store-path /Users/admin/builder/spi-builder-workspace/.derivedData/Index.noindex/DataStore -swift-version 5 -I /Users/admin/builder/spi-builder-workspace/.derivedData/Build/Products/Debug-watchos -I /Applications/Xcode-15.2.0.app/Contents/Developer/Platforms/WatchOS.platform/Developer/usr/lib -F /Users/admin/builder/spi-builder-workspace/.derivedData/Build/Products/Debug-watchos -F /Applications/Xcode-15.2.0.app/Contents/Developer/Platforms/WatchOS.platform/Developer/Library/Frameworks -F /Applications/Xcode-15.2.0.app/Contents/Developer/Platforms/WatchOS.platform/Developer/SDKs/WatchOS10.2.sdk/Developer/Library/Frameworks -c -j10 -enable-batch-mode -incremental -Xcc -ivfsstatcache -Xcc /Users/admin/builder/spi-builder-workspace/.derivedData/SDKStatCaches.noindex/watchos10.2-21S355-1a03c8d25fc3596eb74c01d649b42752.sdkstatcache -output-file-map /Users/admin/builder/spi-builder-workspace/.derivedData/Build/Intermediates.noindex/meilisearch-swift.build/Debug-watchos/MeiliSearch.build/Objects-normal/arm64/MeiliSearch-OutputFileMap.json -use-frontend-parseable-output -save-temps -no-color-diagnostics -serialize-diagnostics -emit-dependencies -emit-module -emit-module-path /Users/admin/builder/spi-builder-workspace/.derivedData/Build/Intermediates.noindex/meilisearch-swift.build/Debug-watchos/MeiliSearch.build/Objects-normal/arm64/MeiliSearch.swiftmodule -validate-clang-modules-once -clang-build-session-file /Users/admin/builder/spi-builder-workspace/.derivedData/ModuleCache.noindex/Session.modulevalidation -Xcc -I/Users/admin/builder/spi-builder-workspace/.derivedData/Build/Intermediates.noindex/meilisearch-swift.build/Debug-watchos/MeiliSearch.build/swift-overrides.hmap -emit-const-values -Xfrontend -const-gather-protocols-file -Xfrontend /Users/admin/builder/spi-builder-workspace/.derivedData/Build/Intermediates.noindex/meilisearch-swift.build/Debug-watchos/MeiliSearch.build/Objects-normal/arm64/MeiliSearch_const_extract_protocols.json -Xcc -I/Users/admin/builder/spi-builder-workspace/.derivedData/Build/Products/Debug-watchos/include -Xcc -I/Users/admin/builder/spi-builder-workspace/.derivedData/Build/Intermediates.noindex/meilisearch-swift.build/Debug-watchos/MeiliSearch.build/DerivedSources-normal/arm64 -Xcc -I/Users/admin/builder/spi-builder-workspace/.derivedData/Build/Intermediates.noindex/meilisearch-swift.build/Debug-watchos/MeiliSearch.build/DerivedSources/arm64 -Xcc -I/Users/admin/builder/spi-builder-workspace/.derivedData/Build/Intermediates.noindex/meilisearch-swift.build/Debug-watchos/MeiliSearch.build/DerivedSources -Xcc -DSWIFT_PACKAGE -Xcc -DDEBUG\=1 -emit-objc-header -emit-objc-header-path /Users/admin/builder/spi-builder-workspace/.derivedData/Build/Intermediates.noindex/meilisearch-swift.build/Debug-watchos/MeiliSearch.build/Objects-normal/arm64/MeiliSearch-Swift.h -working-directory /Users/admin/builder/spi-builder-workspace -experimental-emit-module-separately -disable-cmo
WriteAuxiliaryFile /Users/admin/builder/spi-builder-workspace/.derivedData/Build/Intermediates.noindex/meilisearch-swift.build/Debug-watchos/MeiliSearchIntegrationTests.build/Objects-normal/armv7k/MeiliSearchIntegrationTests-OutputFileMap.json (in target 'MeiliSearchIntegrationTests' from project 'meilisearch-swift')
    cd /Users/admin/builder/spi-builder-workspace
    write-file /Users/admin/builder/spi-builder-workspace/.derivedData/Build/Intermediates.noindex/meilisearch-swift.build/Debug-watchos/MeiliSearchIntegrationTests.build/Objects-normal/armv7k/MeiliSearchIntegrationTests-OutputFileMap.json
WriteAuxiliaryFile /Users/admin/builder/spi-builder-workspace/.derivedData/Build/Intermediates.noindex/meilisearch-swift.build/Debug-watchos/MeiliSearchIntegrationTests.build/Objects-normal/armv7k/MeiliSearchIntegrationTests.SwiftFileList (in target 'MeiliSearchIntegrationTests' from project 'meilisearch-swift')
    cd /Users/admin/builder/spi-builder-workspace
    write-file /Users/admin/builder/spi-builder-workspace/.derivedData/Build/Intermediates.noindex/meilisearch-swift.build/Debug-watchos/MeiliSearchIntegrationTests.build/Objects-normal/armv7k/MeiliSearchIntegrationTests.SwiftFileList
WriteAuxiliaryFile /Users/admin/builder/spi-builder-workspace/.derivedData/Build/Intermediates.noindex/meilisearch-swift.build/Debug-watchos/MeiliSearchIntegrationTests.build/Objects-normal/armv7k/MeiliSearchIntegrationTests_const_extract_protocols.json (in target 'MeiliSearchIntegrationTests' from project 'meilisearch-swift')
    cd /Users/admin/builder/spi-builder-workspace
    write-file /Users/admin/builder/spi-builder-workspace/.derivedData/Build/Intermediates.noindex/meilisearch-swift.build/Debug-watchos/MeiliSearchIntegrationTests.build/Objects-normal/armv7k/MeiliSearchIntegrationTests_const_extract_protocols.json
WriteAuxiliaryFile /Users/admin/builder/spi-builder-workspace/.derivedData/Build/Intermediates.noindex/meilisearch-swift.build/Debug-watchos/MeiliSearchIntegrationTests.build/Objects-normal/arm64_32/MeiliSearchIntegrationTests_const_extract_protocols.json (in target 'MeiliSearchIntegrationTests' from project 'meilisearch-swift')
    cd /Users/admin/builder/spi-builder-workspace
    write-file /Users/admin/builder/spi-builder-workspace/.derivedData/Build/Intermediates.noindex/meilisearch-swift.build/Debug-watchos/MeiliSearchIntegrationTests.build/Objects-normal/arm64_32/MeiliSearchIntegrationTests_const_extract_protocols.json
WriteAuxiliaryFile /Users/admin/builder/spi-builder-workspace/.derivedData/Build/Intermediates.noindex/meilisearch-swift.build/Debug-watchos/MeiliSearchIntegrationTests.build/Objects-normal/arm64_32/MeiliSearchIntegrationTests.SwiftFileList (in target 'MeiliSearchIntegrationTests' from project 'meilisearch-swift')
    cd /Users/admin/builder/spi-builder-workspace
    write-file /Users/admin/builder/spi-builder-workspace/.derivedData/Build/Intermediates.noindex/meilisearch-swift.build/Debug-watchos/MeiliSearchIntegrationTests.build/Objects-normal/arm64_32/MeiliSearchIntegrationTests.SwiftFileList
WriteAuxiliaryFile /Users/admin/builder/spi-builder-workspace/.derivedData/Build/Intermediates.noindex/meilisearch-swift.build/Debug-watchos/MeiliSearchIntegrationTests.build/Objects-normal/arm64_32/MeiliSearchIntegrationTests-OutputFileMap.json (in target 'MeiliSearchIntegrationTests' from project 'meilisearch-swift')
    cd /Users/admin/builder/spi-builder-workspace
    write-file /Users/admin/builder/spi-builder-workspace/.derivedData/Build/Intermediates.noindex/meilisearch-swift.build/Debug-watchos/MeiliSearchIntegrationTests.build/Objects-normal/arm64_32/MeiliSearchIntegrationTests-OutputFileMap.json
WriteAuxiliaryFile /Users/admin/builder/spi-builder-workspace/.derivedData/Build/Intermediates.noindex/meilisearch-swift.build/Debug-watchos/MeiliSearchIntegrationTests.build/Objects-normal/arm64/MeiliSearchIntegrationTests_const_extract_protocols.json (in target 'MeiliSearchIntegrationTests' from project 'meilisearch-swift')
    cd /Users/admin/builder/spi-builder-workspace
    write-file /Users/admin/builder/spi-builder-workspace/.derivedData/Build/Intermediates.noindex/meilisearch-swift.build/Debug-watchos/MeiliSearchIntegrationTests.build/Objects-normal/arm64/MeiliSearchIntegrationTests_const_extract_protocols.json
WriteAuxiliaryFile /Users/admin/builder/spi-builder-workspace/.derivedData/Build/Intermediates.noindex/meilisearch-swift.build/Debug-watchos/MeiliSearchIntegrationTests.build/Objects-normal/arm64/MeiliSearchIntegrationTests.SwiftFileList (in target 'MeiliSearchIntegrationTests' from project 'meilisearch-swift')
    cd /Users/admin/builder/spi-builder-workspace
    write-file /Users/admin/builder/spi-builder-workspace/.derivedData/Build/Intermediates.noindex/meilisearch-swift.build/Debug-watchos/MeiliSearchIntegrationTests.build/Objects-normal/arm64/MeiliSearchIntegrationTests.SwiftFileList
WriteAuxiliaryFile /Users/admin/builder/spi-builder-workspace/.derivedData/Build/Intermediates.noindex/meilisearch-swift.build/Debug-watchos/MeiliSearchIntegrationTests.build/Objects-normal/arm64/MeiliSearchIntegrationTests-OutputFileMap.json (in target 'MeiliSearchIntegrationTests' from project 'meilisearch-swift')
    cd /Users/admin/builder/spi-builder-workspace
    write-file /Users/admin/builder/spi-builder-workspace/.derivedData/Build/Intermediates.noindex/meilisearch-swift.build/Debug-watchos/MeiliSearchIntegrationTests.build/Objects-normal/arm64/MeiliSearchIntegrationTests-OutputFileMap.json
SwiftDriver MeiliSearchIntegrationTests normal armv7k com.apple.xcode.tools.swift.compiler (in target 'MeiliSearchIntegrationTests' from project 'meilisearch-swift')
    cd /Users/admin/builder/spi-builder-workspace
    builtin-SwiftDriver -- /Applications/Xcode-15.2.0.app/Contents/Developer/Toolchains/XcodeDefault.xctoolchain/usr/bin/swiftc -module-name MeiliSearchIntegrationTests -Onone -enforce-exclusivity\=checked @/Users/admin/builder/spi-builder-workspace/.derivedData/Build/Intermediates.noindex/meilisearch-swift.build/Debug-watchos/MeiliSearchIntegrationTests.build/Objects-normal/armv7k/MeiliSearchIntegrationTests.SwiftFileList -DSWIFT_PACKAGE -DDEBUG -DXcode -sdk /Applications/Xcode-15.2.0.app/Contents/Developer/Platforms/WatchOS.platform/Developer/SDKs/WatchOS10.2.sdk -target armv7k-apple-watchos5.0 -g -module-cache-path /Users/admin/builder/spi-builder-workspace/.derivedData/ModuleCache.noindex -Xfrontend -serialize-debugging-options -profile-coverage-mapping -profile-generate -enable-testing -index-store-path /Users/admin/builder/spi-builder-workspace/.derivedData/Index.noindex/DataStore -swift-version 5 -I /Users/admin/builder/spi-builder-workspace/.derivedData/Build/Products/Debug-watchos -I /Applications/Xcode-15.2.0.app/Contents/Developer/Platforms/WatchOS.platform/Developer/usr/lib -F /Users/admin/builder/spi-builder-workspace/.derivedData/Build/Products/Debug-watchos/PackageFrameworks -F /Users/admin/builder/spi-builder-workspace/.derivedData/Build/Products/Debug-watchos -F /Applications/Xcode-15.2.0.app/Contents/Developer/Platforms/WatchOS.platform/Developer/Library/Frameworks -F /Applications/Xcode-15.2.0.app/Contents/Developer/Platforms/WatchOS.platform/Developer/SDKs/WatchOS10.2.sdk/Developer/Library/Frameworks -c -j10 -enable-batch-mode -incremental -Xcc -ivfsstatcache -Xcc /Users/admin/builder/spi-builder-workspace/.derivedData/SDKStatCaches.noindex/watchos10.2-21S355-1a03c8d25fc3596eb74c01d649b42752.sdkstatcache -output-file-map /Users/admin/builder/spi-builder-workspace/.derivedData/Build/Intermediates.noindex/meilisearch-swift.build/Debug-watchos/MeiliSearchIntegrationTests.build/Objects-normal/armv7k/MeiliSearchIntegrationTests-OutputFileMap.json -use-frontend-parseable-output -save-temps -no-color-diagnostics -serialize-diagnostics -emit-dependencies -emit-module -emit-module-path /Users/admin/builder/spi-builder-workspace/.derivedData/Build/Intermediates.noindex/meilisearch-swift.build/Debug-watchos/MeiliSearchIntegrationTests.build/Objects-normal/armv7k/MeiliSearchIntegrationTests.swiftmodule -validate-clang-modules-once -clang-build-session-file /Users/admin/builder/spi-builder-workspace/.derivedData/ModuleCache.noindex/Session.modulevalidation -emit-const-values -Xfrontend -const-gather-protocols-file -Xfrontend /Users/admin/builder/spi-builder-workspace/.derivedData/Build/Intermediates.noindex/meilisearch-swift.build/Debug-watchos/MeiliSearchIntegrationTests.build/Objects-normal/armv7k/MeiliSearchIntegrationTests_const_extract_protocols.json -Xcc -I/Users/admin/builder/spi-builder-workspace/.derivedData/Build/Products/Debug-watchos/include -Xcc -I/Users/admin/builder/spi-builder-workspace/.derivedData/Build/Intermediates.noindex/meilisearch-swift.build/Debug-watchos/MeiliSearchIntegrationTests.build/DerivedSources-normal/armv7k -Xcc -I/Users/admin/builder/spi-builder-workspace/.derivedData/Build/Intermediates.noindex/meilisearch-swift.build/Debug-watchos/MeiliSearchIntegrationTests.build/DerivedSources/armv7k -Xcc -I/Users/admin/builder/spi-builder-workspace/.derivedData/Build/Intermediates.noindex/meilisearch-swift.build/Debug-watchos/MeiliSearchIntegrationTests.build/DerivedSources -Xcc -DSWIFT_PACKAGE -Xcc -DDEBUG\=1 -working-directory /Users/admin/builder/spi-builder-workspace -experimental-emit-module-separately -disable-cmo
SwiftDriver MeiliSearchIntegrationTests normal arm64_32 com.apple.xcode.tools.swift.compiler (in target 'MeiliSearchIntegrationTests' from project 'meilisearch-swift')
    cd /Users/admin/builder/spi-builder-workspace
    builtin-SwiftDriver -- /Applications/Xcode-15.2.0.app/Contents/Developer/Toolchains/XcodeDefault.xctoolchain/usr/bin/swiftc -module-name MeiliSearchIntegrationTests -Onone -enforce-exclusivity\=checked @/Users/admin/builder/spi-builder-workspace/.derivedData/Build/Intermediates.noindex/meilisearch-swift.build/Debug-watchos/MeiliSearchIntegrationTests.build/Objects-normal/arm64_32/MeiliSearchIntegrationTests.SwiftFileList -DSWIFT_PACKAGE -DDEBUG -DXcode -sdk /Applications/Xcode-15.2.0.app/Contents/Developer/Platforms/WatchOS.platform/Developer/SDKs/WatchOS10.2.sdk -target arm64_32-apple-watchos5.0 -g -module-cache-path /Users/admin/builder/spi-builder-workspace/.derivedData/ModuleCache.noindex -Xfrontend -serialize-debugging-options -profile-coverage-mapping -profile-generate -enable-testing -index-store-path /Users/admin/builder/spi-builder-workspace/.derivedData/Index.noindex/DataStore -swift-version 5 -I /Users/admin/builder/spi-builder-workspace/.derivedData/Build/Products/Debug-watchos -I /Applications/Xcode-15.2.0.app/Contents/Developer/Platforms/WatchOS.platform/Developer/usr/lib -F /Users/admin/builder/spi-builder-workspace/.derivedData/Build/Products/Debug-watchos/PackageFrameworks -F /Users/admin/builder/spi-builder-workspace/.derivedData/Build/Products/Debug-watchos -F /Applications/Xcode-15.2.0.app/Contents/Developer/Platforms/WatchOS.platform/Developer/Library/Frameworks -F /Applications/Xcode-15.2.0.app/Contents/Developer/Platforms/WatchOS.platform/Developer/SDKs/WatchOS10.2.sdk/Developer/Library/Frameworks -c -j10 -enable-batch-mode -incremental -Xcc -ivfsstatcache -Xcc /Users/admin/builder/spi-builder-workspace/.derivedData/SDKStatCaches.noindex/watchos10.2-21S355-1a03c8d25fc3596eb74c01d649b42752.sdkstatcache -output-file-map /Users/admin/builder/spi-builder-workspace/.derivedData/Build/Intermediates.noindex/meilisearch-swift.build/Debug-watchos/MeiliSearchIntegrationTests.build/Objects-normal/arm64_32/MeiliSearchIntegrationTests-OutputFileMap.json -use-frontend-parseable-output -save-temps -no-color-diagnostics -serialize-diagnostics -emit-dependencies -emit-module -emit-module-path /Users/admin/builder/spi-builder-workspace/.derivedData/Build/Intermediates.noindex/meilisearch-swift.build/Debug-watchos/MeiliSearchIntegrationTests.build/Objects-normal/arm64_32/MeiliSearchIntegrationTests.swiftmodule -validate-clang-modules-once -clang-build-session-file /Users/admin/builder/spi-builder-workspace/.derivedData/ModuleCache.noindex/Session.modulevalidation -emit-const-values -Xfrontend -const-gather-protocols-file -Xfrontend /Users/admin/builder/spi-builder-workspace/.derivedData/Build/Intermediates.noindex/meilisearch-swift.build/Debug-watchos/MeiliSearchIntegrationTests.build/Objects-normal/arm64_32/MeiliSearchIntegrationTests_const_extract_protocols.json -Xcc -I/Users/admin/builder/spi-builder-workspace/.derivedData/Build/Products/Debug-watchos/include -Xcc -I/Users/admin/builder/spi-builder-workspace/.derivedData/Build/Intermediates.noindex/meilisearch-swift.build/Debug-watchos/MeiliSearchIntegrationTests.build/DerivedSources-normal/arm64_32 -Xcc -I/Users/admin/builder/spi-builder-workspace/.derivedData/Build/Intermediates.noindex/meilisearch-swift.build/Debug-watchos/MeiliSearchIntegrationTests.build/DerivedSources/arm64_32 -Xcc -I/Users/admin/builder/spi-builder-workspace/.derivedData/Build/Intermediates.noindex/meilisearch-swift.build/Debug-watchos/MeiliSearchIntegrationTests.build/DerivedSources -Xcc -DSWIFT_PACKAGE -Xcc -DDEBUG\=1 -working-directory /Users/admin/builder/spi-builder-workspace -experimental-emit-module-separately -disable-cmo
SwiftDriver MeiliSearchIntegrationTests normal arm64 com.apple.xcode.tools.swift.compiler (in target 'MeiliSearchIntegrationTests' from project 'meilisearch-swift')
    cd /Users/admin/builder/spi-builder-workspace
    builtin-SwiftDriver -- /Applications/Xcode-15.2.0.app/Contents/Developer/Toolchains/XcodeDefault.xctoolchain/usr/bin/swiftc -module-name MeiliSearchIntegrationTests -Onone -enforce-exclusivity\=checked @/Users/admin/builder/spi-builder-workspace/.derivedData/Build/Intermediates.noindex/meilisearch-swift.build/Debug-watchos/MeiliSearchIntegrationTests.build/Objects-normal/arm64/MeiliSearchIntegrationTests.SwiftFileList -DSWIFT_PACKAGE -DDEBUG -DXcode -sdk /Applications/Xcode-15.2.0.app/Contents/Developer/Platforms/WatchOS.platform/Developer/SDKs/WatchOS10.2.sdk -target arm64-apple-watchos5.0 -g -module-cache-path /Users/admin/builder/spi-builder-workspace/.derivedData/ModuleCache.noindex -Xfrontend -serialize-debugging-options -profile-coverage-mapping -profile-generate -enable-testing -index-store-path /Users/admin/builder/spi-builder-workspace/.derivedData/Index.noindex/DataStore -swift-version 5 -I /Users/admin/builder/spi-builder-workspace/.derivedData/Build/Products/Debug-watchos -I /Applications/Xcode-15.2.0.app/Contents/Developer/Platforms/WatchOS.platform/Developer/usr/lib -F /Users/admin/builder/spi-builder-workspace/.derivedData/Build/Products/Debug-watchos/PackageFrameworks -F /Users/admin/builder/spi-builder-workspace/.derivedData/Build/Products/Debug-watchos -F /Applications/Xcode-15.2.0.app/Contents/Developer/Platforms/WatchOS.platform/Developer/Library/Frameworks -F /Applications/Xcode-15.2.0.app/Contents/Developer/Platforms/WatchOS.platform/Developer/SDKs/WatchOS10.2.sdk/Developer/Library/Frameworks -c -j10 -enable-batch-mode -incremental -Xcc -ivfsstatcache -Xcc /Users/admin/builder/spi-builder-workspace/.derivedData/SDKStatCaches.noindex/watchos10.2-21S355-1a03c8d25fc3596eb74c01d649b42752.sdkstatcache -output-file-map /Users/admin/builder/spi-builder-workspace/.derivedData/Build/Intermediates.noindex/meilisearch-swift.build/Debug-watchos/MeiliSearchIntegrationTests.build/Objects-normal/arm64/MeiliSearchIntegrationTests-OutputFileMap.json -use-frontend-parseable-output -save-temps -no-color-diagnostics -serialize-diagnostics -emit-dependencies -emit-module -emit-module-path /Users/admin/builder/spi-builder-workspace/.derivedData/Build/Intermediates.noindex/meilisearch-swift.build/Debug-watchos/MeiliSearchIntegrationTests.build/Objects-normal/arm64/MeiliSearchIntegrationTests.swiftmodule -validate-clang-modules-once -clang-build-session-file /Users/admin/builder/spi-builder-workspace/.derivedData/ModuleCache.noindex/Session.modulevalidation -emit-const-values -Xfrontend -const-gather-protocols-file -Xfrontend /Users/admin/builder/spi-builder-workspace/.derivedData/Build/Intermediates.noindex/meilisearch-swift.build/Debug-watchos/MeiliSearchIntegrationTests.build/Objects-normal/arm64/MeiliSearchIntegrationTests_const_extract_protocols.json -Xcc -I/Users/admin/builder/spi-builder-workspace/.derivedData/Build/Products/Debug-watchos/include -Xcc -I/Users/admin/builder/spi-builder-workspace/.derivedData/Build/Intermediates.noindex/meilisearch-swift.build/Debug-watchos/MeiliSearchIntegrationTests.build/DerivedSources-normal/arm64 -Xcc -I/Users/admin/builder/spi-builder-workspace/.derivedData/Build/Intermediates.noindex/meilisearch-swift.build/Debug-watchos/MeiliSearchIntegrationTests.build/DerivedSources/arm64 -Xcc -I/Users/admin/builder/spi-builder-workspace/.derivedData/Build/Intermediates.noindex/meilisearch-swift.build/Debug-watchos/MeiliSearchIntegrationTests.build/DerivedSources -Xcc -DSWIFT_PACKAGE -Xcc -DDEBUG\=1 -working-directory /Users/admin/builder/spi-builder-workspace -experimental-emit-module-separately -disable-cmo
SwiftEmitModule normal arm64 Emitting\ module\ for\ MeiliSearchIntegrationTests (in target 'MeiliSearchIntegrationTests' from project 'meilisearch-swift')
    cd /Users/admin/builder/spi-builder-workspace
    builtin-swiftTaskExecution -- /Applications/Xcode-15.2.0.app/Contents/Developer/Toolchains/XcodeDefault.xctoolchain/usr/bin/swift-frontend -frontend -emit-module -experimental-skip-non-inlinable-function-bodies-without-types /Users/admin/builder/spi-builder-workspace/Tests/MeiliSearchIntegrationTests/DocumentsTests.swift /Users/admin/builder/spi-builder-workspace/Tests/MeiliSearchIntegrationTests/DumpsTests.swift /Users/admin/builder/spi-builder-workspace/Tests/MeiliSearchIntegrationTests/IndexesTests.swift /Users/admin/builder/spi-builder-workspace/Tests/MeiliSearchIntegrationTests/KeysTests.swift /Users/admin/builder/spi-builder-workspace/Tests/MeiliSearchIntegrationTests/SearchTests.swift /Users/admin/builder/spi-builder-workspace/Tests/MeiliSearchIntegrationTests/SettingsTests.swift /Users/admin/builder/spi-builder-workspace/Tests/MeiliSearchIntegrationTests/SnapshotsTests.swift /Users/admin/builder/spi-builder-workspace/Tests/MeiliSearchIntegrationTests/Support/Book.swift /Users/admin/builder/spi-builder-workspace/Tests/MeiliSearchIntegrationTests/Support/Movie.swift /Users/admin/builder/spi-builder-workspace/Tests/MeiliSearchIntegrationTests/Support/NestedBook.swift /Users/admin/builder/spi-builder-workspace/Tests/MeiliSearchIntegrationTests/TaskTests.swift /Users/admin/builder/spi-builder-workspace/Tests/MeiliSearchIntegrationTests/Utils.swift -target arm64-apple-watchos5.0 -Xllvm -aarch64-use-tbi -enable-objc-interop -sdk /Applications/Xcode-15.2.0.app/Contents/Developer/Platforms/WatchOS.platform/Developer/SDKs/WatchOS10.2.sdk -I /Users/admin/builder/spi-builder-workspace/.derivedData/Build/Products/Debug-watchos -I /Applications/Xcode-15.2.0.app/Contents/Developer/Platforms/WatchOS.platform/Developer/usr/lib -F /Users/admin/builder/spi-builder-workspace/.derivedData/Build/Products/Debug-watchos/PackageFrameworks -F /Users/admin/builder/spi-builder-workspace/.derivedData/Build/Products/Debug-watchos -F /Applications/Xcode-15.2.0.app/Contents/Developer/Platforms/WatchOS.platform/Developer/Library/Frameworks -F /Applications/Xcode-15.2.0.app/Contents/Developer/Platforms/WatchOS.platform/Developer/SDKs/WatchOS10.2.sdk/Developer/Library/Frameworks -no-color-diagnostics -enable-testing -g -module-cache-path /Users/admin/builder/spi-builder-workspace/.derivedData/ModuleCache.noindex -profile-generate -profile-coverage-mapping -swift-version 5 -enforce-exclusivity\=checked -Onone -D SWIFT_PACKAGE -D DEBUG -D Xcode -serialize-debugging-options -const-gather-protocols-file /Users/admin/builder/spi-builder-workspace/.derivedData/Build/Intermediates.noindex/meilisearch-swift.build/Debug-watchos/MeiliSearchIntegrationTests.build/Objects-normal/arm64/MeiliSearchIntegrationTests_const_extract_protocols.json -empty-abi-descriptor -validate-clang-modules-once -clang-build-session-file /Users/admin/builder/spi-builder-workspace/.derivedData/ModuleCache.noindex/Session.modulevalidation -Xcc -working-directory -Xcc /Users/admin/builder/spi-builder-workspace -resource-dir /Applications/Xcode-15.2.0.app/Contents/Developer/Toolchains/XcodeDefault.xctoolchain/usr/lib/swift -enable-anonymous-context-mangled-names -Xcc -ivfsstatcache -Xcc /Users/admin/builder/spi-builder-workspace/.derivedData/SDKStatCaches.noindex/watchos10.2-21S355-1a03c8d25fc3596eb74c01d649b42752.sdkstatcache -Xcc -I/Users/admin/builder/spi-builder-workspace/.derivedData/Build/Products/Debug-watchos/include -Xcc -I/Users/admin/builder/spi-builder-workspace/.derivedData/Build/Intermediates.noindex/meilisearch-swift.build/Debug-watchos/MeiliSearchIntegrationTests.build/DerivedSources-normal/arm64 -Xcc -I/Users/admin/builder/spi-builder-workspace/.derivedData/Build/Intermediates.noindex/meilisearch-swift.build/Debug-watchos/MeiliSearchIntegrationTests.build/DerivedSources/arm64 -Xcc -I/Users/admin/builder/spi-builder-workspace/.derivedData/Build/Intermediates.noindex/meilisearch-swift.build/Debug-watchos/MeiliSearchIntegrationTests.build/DerivedSources -Xcc -DSWIFT_PACKAGE -Xcc -DDEBUG\=1 -module-name MeiliSearchIntegrationTests -disable-clang-spi -target-sdk-version 10.2 -target-sdk-name watchos10.2 -external-plugin-path /Applications/Xcode-15.2.0.app/Contents/Developer/Platforms/WatchOS.platform/Developer/SDKs/WatchOS10.2.sdk/usr/lib/swift/host/plugins\#/Applications/Xcode-15.2.0.app/Contents/Developer/Platforms/WatchOS.platform/Developer/SDKs/WatchOS10.2.sdk/usr/bin/swift-plugin-server -external-plugin-path /Applications/Xcode-15.2.0.app/Contents/Developer/Platforms/WatchOS.platform/Developer/SDKs/WatchOS10.2.sdk/usr/local/lib/swift/host/plugins\#/Applications/Xcode-15.2.0.app/Contents/Developer/Platforms/WatchOS.platform/Developer/SDKs/WatchOS10.2.sdk/usr/bin/swift-plugin-server -external-plugin-path /Applications/Xcode-15.2.0.app/Contents/Developer/Platforms/WatchOS.platform/Developer/usr/lib/swift/host/plugins\#/Applications/Xcode-15.2.0.app/Contents/Developer/Platforms/WatchOS.platform/Developer/usr/bin/swift-plugin-server -external-plugin-path /Applications/Xcode-15.2.0.app/Contents/Developer/Platforms/WatchOS.platform/Developer/usr/local/lib/swift/host/plugins\#/Applications/Xcode-15.2.0.app/Contents/Developer/Platforms/WatchOS.platform/Developer/usr/bin/swift-plugin-server -plugin-path /Applications/Xcode-15.2.0.app/Contents/Developer/Toolchains/XcodeDefault.xctoolchain/usr/lib/swift/host/plugins -plugin-path /Applications/Xcode-15.2.0.app/Contents/Developer/Toolchains/XcodeDefault.xctoolchain/usr/local/lib/swift/host/plugins -emit-module-doc-path /Users/admin/builder/spi-builder-workspace/.derivedData/Build/Intermediates.noindex/meilisearch-swift.build/Debug-watchos/MeiliSearchIntegrationTests.build/Objects-normal/arm64/MeiliSearchIntegrationTests.swiftdoc -emit-module-source-info-path /Users/admin/builder/spi-builder-workspace/.derivedData/Build/Intermediates.noindex/meilisearch-swift.build/Debug-watchos/MeiliSearchIntegrationTests.build/Objects-normal/arm64/MeiliSearchIntegrationTests.swiftsourceinfo -serialize-diagnostics-path /Users/admin/builder/spi-builder-workspace/.derivedData/Build/Intermediates.noindex/meilisearch-swift.build/Debug-watchos/MeiliSearchIntegrationTests.build/Objects-normal/arm64/MeiliSearchIntegrationTests-master-emit-module.dia -emit-dependencies-path /Users/admin/builder/spi-builder-workspace/.derivedData/Build/Intermediates.noindex/meilisearch-swift.build/Debug-watchos/MeiliSearchIntegrationTests.build/Objects-normal/arm64/MeiliSearchIntegrationTests-master-emit-module.d -o /Users/admin/builder/spi-builder-workspace/.derivedData/Build/Intermediates.noindex/meilisearch-swift.build/Debug-watchos/MeiliSearchIntegrationTests.build/Objects-normal/arm64/MeiliSearchIntegrationTests.swiftmodule -emit-abi-descriptor-path /Users/admin/builder/spi-builder-workspace/.derivedData/Build/Intermediates.noindex/meilisearch-swift.build/Debug-watchos/MeiliSearchIntegrationTests.build/Objects-normal/arm64/MeiliSearchIntegrationTests.abi.json
SwiftCompile normal arm64 Compiling\ TaskTests.swift /Users/admin/builder/spi-builder-workspace/Tests/MeiliSearchIntegrationTests/TaskTests.swift (in target 'MeiliSearchIntegrationTests' from project 'meilisearch-swift')
    cd /Users/admin/builder/spi-builder-workspace
    builtin-swiftTaskExecution -- /Applications/Xcode-15.2.0.app/Contents/Developer/Toolchains/XcodeDefault.xctoolchain/usr/bin/swift-frontend -frontend -c /Users/admin/builder/spi-builder-workspace/Tests/MeiliSearchIntegrationTests/DocumentsTests.swift /Users/admin/builder/spi-builder-workspace/Tests/MeiliSearchIntegrationTests/DumpsTests.swift /Users/admin/builder/spi-builder-workspace/Tests/MeiliSearchIntegrationTests/IndexesTests.swift /Users/admin/builder/spi-builder-workspace/Tests/MeiliSearchIntegrationTests/KeysTests.swift /Users/admin/builder/spi-builder-workspace/Tests/MeiliSearchIntegrationTests/SearchTests.swift /Users/admin/builder/spi-builder-workspace/Tests/MeiliSearchIntegrationTests/SettingsTests.swift /Users/admin/builder/spi-builder-workspace/Tests/MeiliSearchIntegrationTests/SnapshotsTests.swift /Users/admin/builder/spi-builder-workspace/Tests/MeiliSearchIntegrationTests/Support/Book.swift /Users/admin/builder/spi-builder-workspace/Tests/MeiliSearchIntegrationTests/Support/Movie.swift /Users/admin/builder/spi-builder-workspace/Tests/MeiliSearchIntegrationTests/Support/NestedBook.swift -primary-file /Users/admin/builder/spi-builder-workspace/Tests/MeiliSearchIntegrationTests/TaskTests.swift /Users/admin/builder/spi-builder-workspace/Tests/MeiliSearchIntegrationTests/Utils.swift -emit-dependencies-path /Users/admin/builder/spi-builder-workspace/.derivedData/Build/Intermediates.noindex/meilisearch-swift.build/Debug-watchos/MeiliSearchIntegrationTests.build/Objects-normal/arm64/TaskTests.d -emit-const-values-path /Users/admin/builder/spi-builder-workspace/.derivedData/Build/Intermediates.noindex/meilisearch-swift.build/Debug-watchos/MeiliSearchIntegrationTests.build/Objects-normal/arm64/TaskTests.swiftconstvalues -emit-reference-dependencies-path /Users/admin/builder/spi-builder-workspace/.derivedData/Build/Intermediates.noindex/meilisearch-swift.build/Debug-watchos/MeiliSearchIntegrationTests.build/Objects-normal/arm64/TaskTests.swiftdeps -serialize-diagnostics-path /Users/admin/builder/spi-builder-workspace/.derivedData/Build/Intermediates.noindex/meilisearch-swift.build/Debug-watchos/MeiliSearchIntegrationTests.build/Objects-normal/arm64/TaskTests.dia -target arm64-apple-watchos5.0 -Xllvm -aarch64-use-tbi -enable-objc-interop -sdk /Applications/Xcode-15.2.0.app/Contents/Developer/Platforms/WatchOS.platform/Developer/SDKs/WatchOS10.2.sdk -I /Users/admin/builder/spi-builder-workspace/.derivedData/Build/Products/Debug-watchos -I /Applications/Xcode-15.2.0.app/Contents/Developer/Platforms/WatchOS.platform/Developer/usr/lib -F /Users/admin/builder/spi-builder-workspace/.derivedData/Build/Products/Debug-watchos/PackageFrameworks -F /Users/admin/builder/spi-builder-workspace/.derivedData/Build/Products/Debug-watchos -F /Applications/Xcode-15.2.0.app/Contents/Developer/Platforms/WatchOS.platform/Developer/Library/Frameworks -F /Applications/Xcode-15.2.0.app/Contents/Developer/Platforms/WatchOS.platform/Developer/SDKs/WatchOS10.2.sdk/Developer/Library/Frameworks -no-color-diagnostics -enable-testing -g -module-cache-path /Users/admin/builder/spi-builder-workspace/.derivedData/ModuleCache.noindex -profile-generate -profile-coverage-mapping -swift-version 5 -enforce-exclusivity\=checked -Onone -D SWIFT_PACKAGE -D DEBUG -D Xcode -serialize-debugging-options -const-gather-protocols-file /Users/admin/builder/spi-builder-workspace/.derivedData/Build/Intermediates.noindex/meilisearch-swift.build/Debug-watchos/MeiliSearchIntegrationTests.build/Objects-normal/arm64/MeiliSearchIntegrationTests_const_extract_protocols.json -empty-abi-descriptor -validate-clang-modules-once -clang-build-session-file /Users/admin/builder/spi-builder-workspace/.derivedData/ModuleCache.noindex/Session.modulevalidation -Xcc -working-directory -Xcc /Users/admin/builder/spi-builder-workspace -resource-dir /Applications/Xcode-15.2.0.app/Contents/Developer/Toolchains/XcodeDefault.xctoolchain/usr/lib/swift -enable-anonymous-context-mangled-names -Xcc -ivfsstatcache -Xcc /Users/admin/builder/spi-builder-workspace/.derivedData/SDKStatCaches.noindex/watchos10.2-21S355-1a03c8d25fc3596eb74c01d649b42752.sdkstatcache -Xcc -I/Users/admin/builder/spi-builder-workspace/.derivedData/Build/Products/Debug-watchos/include -Xcc -I/Users/admin/builder/spi-builder-workspace/.derivedData/Build/Intermediates.noindex/meilisearch-swift.build/Debug-watchos/MeiliSearchIntegrationTests.build/DerivedSources-normal/arm64 -Xcc -I/Users/admin/builder/spi-builder-workspace/.derivedData/Build/Intermediates.noindex/meilisearch-swift.build/Debug-watchos/MeiliSearchIntegrationTests.build/DerivedSources/arm64 -Xcc -I/Users/admin/builder/spi-builder-workspace/.derivedData/Build/Intermediates.noindex/meilisearch-swift.build/Debug-watchos/MeiliSearchIntegrationTests.build/DerivedSources -Xcc -DSWIFT_PACKAGE -Xcc -DDEBUG\=1 -module-name MeiliSearchIntegrationTests -frontend-parseable-output -disable-clang-spi -target-sdk-version 10.2 -target-sdk-name watchos10.2 -external-plugin-path /Applications/Xcode-15.2.0.app/Contents/Developer/Platforms/WatchOS.platform/Developer/SDKs/WatchOS10.2.sdk/usr/lib/swift/host/plugins\#/Applications/Xcode-15.2.0.app/Contents/Developer/Platforms/WatchOS.platform/Developer/SDKs/WatchOS10.2.sdk/usr/bin/swift-plugin-server -external-plugin-path /Applications/Xcode-15.2.0.app/Contents/Developer/Platforms/WatchOS.platform/Developer/SDKs/WatchOS10.2.sdk/usr/local/lib/swift/host/plugins\#/Applications/Xcode-15.2.0.app/Contents/Developer/Platforms/WatchOS.platform/Developer/SDKs/WatchOS10.2.sdk/usr/bin/swift-plugin-server -external-plugin-path /Applications/Xcode-15.2.0.app/Contents/Developer/Platforms/WatchOS.platform/Developer/usr/lib/swift/host/plugins\#/Applications/Xcode-15.2.0.app/Contents/Developer/Platforms/WatchOS.platform/Developer/usr/bin/swift-plugin-server -external-plugin-path /Applications/Xcode-15.2.0.app/Contents/Developer/Platforms/WatchOS.platform/Developer/usr/local/lib/swift/host/plugins\#/Applications/Xcode-15.2.0.app/Contents/Developer/Platforms/WatchOS.platform/Developer/usr/bin/swift-plugin-server -plugin-path /Applications/Xcode-15.2.0.app/Contents/Developer/Toolchains/XcodeDefault.xctoolchain/usr/lib/swift/host/plugins -plugin-path /Applications/Xcode-15.2.0.app/Contents/Developer/Toolchains/XcodeDefault.xctoolchain/usr/local/lib/swift/host/plugins -o /Users/admin/builder/spi-builder-workspace/.derivedData/Build/Intermediates.noindex/meilisearch-swift.build/Debug-watchos/MeiliSearchIntegrationTests.build/Objects-normal/arm64/TaskTests.o -index-unit-output-path /meilisearch-swift.build/Debug-watchos/MeiliSearchIntegrationTests.build/Objects-normal/arm64/TaskTests.o -index-store-path /Users/admin/builder/spi-builder-workspace/.derivedData/Index.noindex/DataStore -index-system-modules
SwiftCompile normal arm64 /Users/admin/builder/spi-builder-workspace/Tests/MeiliSearchIntegrationTests/TaskTests.swift (in target 'MeiliSearchIntegrationTests' from project 'meilisearch-swift')
    cd /Users/admin/builder/spi-builder-workspace
    /Applications/Xcode-15.2.0.app/Contents/Developer/Toolchains/XcodeDefault.xctoolchain/usr/bin/swift-frontend -c /Users/admin/builder/spi-builder-workspace/Tests/MeiliSearchIntegrationTests/DocumentsTests.swift /Users/admin/builder/spi-builder-workspace/Tests/MeiliSearchIntegrationTests/DumpsTests.swift /Users/admin/builder/spi-builder-workspace/Tests/MeiliSearchIntegrationTests/IndexesTests.swift /Users/admin/builder/spi-builder-workspace/Tests/MeiliSearchIntegrationTests/KeysTests.swift /Users/admin/builder/spi-builder-workspace/Tests/MeiliSearchIntegrationTests/SearchTests.swift /Users/admin/builder/spi-builder-workspace/Tests/MeiliSearchIntegrationTests/SettingsTests.swift /Users/admin/builder/spi-builder-workspace/Tests/MeiliSearchIntegrationTests/SnapshotsTests.swift /Users/admin/builder/spi-builder-workspace/Tests/MeiliSearchIntegrationTests/Support/Book.swift /Users/admin/builder/spi-builder-workspace/Tests/MeiliSearchIntegrationTests/Support/Movie.swift /Users/admin/builder/spi-builder-workspace/Tests/MeiliSearchIntegrationTests/Support/NestedBook.swift -primary-file /Users/admin/builder/spi-builder-workspace/Tests/MeiliSearchIntegrationTests/TaskTests.swift /Users/admin/builder/spi-builder-workspace/Tests/MeiliSearchIntegrationTests/Utils.swift -emit-dependencies-path /Users/admin/builder/spi-builder-workspace/.derivedData/Build/Intermediates.noindex/meilisearch-swift.build/Debug-watchos/MeiliSearchIntegrationTests.build/Objects-normal/arm64/TaskTests.d -emit-const-values-path /Users/admin/builder/spi-builder-workspace/.derivedData/Build/Intermediates.noindex/meilisearch-swift.build/Debug-watchos/MeiliSearchIntegrationTests.build/Objects-normal/arm64/TaskTests.swiftconstvalues -emit-reference-dependencies-path /Users/admin/builder/spi-builder-workspace/.derivedData/Build/Intermediates.noindex/meilisearch-swift.build/Debug-watchos/MeiliSearchIntegrationTests.build/Objects-normal/arm64/TaskTests.swiftdeps -serialize-diagnostics-path /Users/admin/builder/spi-builder-workspace/.derivedData/Build/Intermediates.noindex/meilisearch-swift.build/Debug-watchos/MeiliSearchIntegrationTests.build/Objects-normal/arm64/TaskTests.dia -target arm64-apple-watchos5.0 -Xllvm -aarch64-use-tbi -enable-objc-interop -sdk /Applications/Xcode-15.2.0.app/Contents/Developer/Platforms/WatchOS.platform/Developer/SDKs/WatchOS10.2.sdk -I /Users/admin/builder/spi-builder-workspace/.derivedData/Build/Products/Debug-watchos -I /Applications/Xcode-15.2.0.app/Contents/Developer/Platforms/WatchOS.platform/Developer/usr/lib -F /Users/admin/builder/spi-builder-workspace/.derivedData/Build/Products/Debug-watchos/PackageFrameworks -F /Users/admin/builder/spi-builder-workspace/.derivedData/Build/Products/Debug-watchos -F /Applications/Xcode-15.2.0.app/Contents/Developer/Platforms/WatchOS.platform/Developer/Library/Frameworks -F /Applications/Xcode-15.2.0.app/Contents/Developer/Platforms/WatchOS.platform/Developer/SDKs/WatchOS10.2.sdk/Developer/Library/Frameworks -no-color-diagnostics -enable-testing -g -module-cache-path /Users/admin/builder/spi-builder-workspace/.derivedData/ModuleCache.noindex -profile-generate -profile-coverage-mapping -swift-version 5 -enforce-exclusivity\=checked -Onone -D SWIFT_PACKAGE -D DEBUG -D Xcode -serialize-debugging-options -const-gather-protocols-file /Users/admin/builder/spi-builder-workspace/.derivedData/Build/Intermediates.noindex/meilisearch-swift.build/Debug-watchos/MeiliSearchIntegrationTests.build/Objects-normal/arm64/MeiliSearchIntegrationTests_const_extract_protocols.json -empty-abi-descriptor -validate-clang-modules-once -clang-build-session-file /Users/admin/builder/spi-builder-workspace/.derivedData/ModuleCache.noindex/Session.modulevalidation -Xcc -working-directory -Xcc /Users/admin/builder/spi-builder-workspace -resource-dir /Applications/Xcode-15.2.0.app/Contents/Developer/Toolchains/XcodeDefault.xctoolchain/usr/lib/swift -enable-anonymous-context-mangled-names -Xcc -ivfsstatcache -Xcc /Users/admin/builder/spi-builder-workspace/.derivedData/SDKStatCaches.noindex/watchos10.2-21S355-1a03c8d25fc3596eb74c01d649b42752.sdkstatcache -Xcc -I/Users/admin/builder/spi-builder-workspace/.derivedData/Build/Products/Debug-watchos/include -Xcc -I/Users/admin/builder/spi-builder-workspace/.derivedData/Build/Intermediates.noindex/meilisearch-swift.build/Debug-watchos/MeiliSearchIntegrationTests.build/DerivedSources-normal/arm64 -Xcc -I/Users/admin/builder/spi-builder-workspace/.derivedData/Build/Intermediates.noindex/meilisearch-swift.build/Debug-watchos/MeiliSearchIntegrationTests.build/DerivedSources/arm64 -Xcc -I/Users/admin/builder/spi-builder-workspace/.derivedData/Build/Intermediates.noindex/meilisearch-swift.build/Debug-watchos/MeiliSearchIntegrationTests.build/DerivedSources -Xcc -DSWIFT_PACKAGE -Xcc -DDEBUG\=1 -module-name MeiliSearchIntegrationTests -frontend-parseable-output -disable-clang-spi -target-sdk-version 10.2 -target-sdk-name watchos10.2 -external-plugin-path /Applications/Xcode-15.2.0.app/Contents/Developer/Platforms/WatchOS.platform/Developer/SDKs/WatchOS10.2.sdk/usr/lib/swift/host/plugins\#/Applications/Xcode-15.2.0.app/Contents/Developer/Platforms/WatchOS.platform/Developer/SDKs/WatchOS10.2.sdk/usr/bin/swift-plugin-server -external-plugin-path /Applications/Xcode-15.2.0.app/Contents/Developer/Platforms/WatchOS.platform/Developer/SDKs/WatchOS10.2.sdk/usr/local/lib/swift/host/plugins\#/Applications/Xcode-15.2.0.app/Contents/Developer/Platforms/WatchOS.platform/Developer/SDKs/WatchOS10.2.sdk/usr/bin/swift-plugin-server -external-plugin-path /Applications/Xcode-15.2.0.app/Contents/Developer/Platforms/WatchOS.platform/Developer/usr/lib/swift/host/plugins\#/Applications/Xcode-15.2.0.app/Contents/Developer/Platforms/WatchOS.platform/Developer/usr/bin/swift-plugin-server -external-plugin-path /Applications/Xcode-15.2.0.app/Contents/Developer/Platforms/WatchOS.platform/Developer/usr/local/lib/swift/host/plugins\#/Applications/Xcode-15.2.0.app/Contents/Developer/Platforms/WatchOS.platform/Developer/usr/bin/swift-plugin-server -plugin-path /Applications/Xcode-15.2.0.app/Contents/Developer/Toolchains/XcodeDefault.xctoolchain/usr/lib/swift/host/plugins -plugin-path /Applications/Xcode-15.2.0.app/Contents/Developer/Toolchains/XcodeDefault.xctoolchain/usr/local/lib/swift/host/plugins -o /Users/admin/builder/spi-builder-workspace/.derivedData/Build/Intermediates.noindex/meilisearch-swift.build/Debug-watchos/MeiliSearchIntegrationTests.build/Objects-normal/arm64/TaskTests.o -index-unit-output-path /meilisearch-swift.build/Debug-watchos/MeiliSearchIntegrationTests.build/Objects-normal/arm64/TaskTests.o -index-store-path /Users/admin/builder/spi-builder-workspace/.derivedData/Index.noindex/DataStore -index-system-modules
SwiftCompile normal arm64 Compiling\ Utils.swift /Users/admin/builder/spi-builder-workspace/Tests/MeiliSearchIntegrationTests/Utils.swift (in target 'MeiliSearchIntegrationTests' from project 'meilisearch-swift')
    cd /Users/admin/builder/spi-builder-workspace
    builtin-swiftTaskExecution -- /Applications/Xcode-15.2.0.app/Contents/Developer/Toolchains/XcodeDefault.xctoolchain/usr/bin/swift-frontend -frontend -c /Users/admin/builder/spi-builder-workspace/Tests/MeiliSearchIntegrationTests/DocumentsTests.swift /Users/admin/builder/spi-builder-workspace/Tests/MeiliSearchIntegrationTests/DumpsTests.swift /Users/admin/builder/spi-builder-workspace/Tests/MeiliSearchIntegrationTests/IndexesTests.swift /Users/admin/builder/spi-builder-workspace/Tests/MeiliSearchIntegrationTests/KeysTests.swift /Users/admin/builder/spi-builder-workspace/Tests/MeiliSearchIntegrationTests/SearchTests.swift /Users/admin/builder/spi-builder-workspace/Tests/MeiliSearchIntegrationTests/SettingsTests.swift /Users/admin/builder/spi-builder-workspace/Tests/MeiliSearchIntegrationTests/SnapshotsTests.swift /Users/admin/builder/spi-builder-workspace/Tests/MeiliSearchIntegrationTests/Support/Book.swift /Users/admin/builder/spi-builder-workspace/Tests/MeiliSearchIntegrationTests/Support/Movie.swift /Users/admin/builder/spi-builder-workspace/Tests/MeiliSearchIntegrationTests/Support/NestedBook.swift /Users/admin/builder/spi-builder-workspace/Tests/MeiliSearchIntegrationTests/TaskTests.swift -primary-file /Users/admin/builder/spi-builder-workspace/Tests/MeiliSearchIntegrationTests/Utils.swift -emit-dependencies-path /Users/admin/builder/spi-builder-workspace/.derivedData/Build/Intermediates.noindex/meilisearch-swift.build/Debug-watchos/MeiliSearchIntegrationTests.build/Objects-normal/arm64/Utils.d -emit-const-values-path /Users/admin/builder/spi-builder-workspace/.derivedData/Build/Intermediates.noindex/meilisearch-swift.build/Debug-watchos/MeiliSearchIntegrationTests.build/Objects-normal/arm64/Utils.swiftconstvalues -emit-reference-dependencies-path /Users/admin/builder/spi-builder-workspace/.derivedData/Build/Intermediates.noindex/meilisearch-swift.build/Debug-watchos/MeiliSearchIntegrationTests.build/Objects-normal/arm64/Utils.swiftdeps -serialize-diagnostics-path /Users/admin/builder/spi-builder-workspace/.derivedData/Build/Intermediates.noindex/meilisearch-swift.build/Debug-watchos/MeiliSearchIntegrationTests.build/Objects-normal/arm64/Utils.dia -target arm64-apple-watchos5.0 -Xllvm -aarch64-use-tbi -enable-objc-interop -sdk /Applications/Xcode-15.2.0.app/Contents/Developer/Platforms/WatchOS.platform/Developer/SDKs/WatchOS10.2.sdk -I /Users/admin/builder/spi-builder-workspace/.derivedData/Build/Products/Debug-watchos -I /Applications/Xcode-15.2.0.app/Contents/Developer/Platforms/WatchOS.platform/Developer/usr/lib -F /Users/admin/builder/spi-builder-workspace/.derivedData/Build/Products/Debug-watchos/PackageFrameworks -F /Users/admin/builder/spi-builder-workspace/.derivedData/Build/Products/Debug-watchos -F /Applications/Xcode-15.2.0.app/Contents/Developer/Platforms/WatchOS.platform/Developer/Library/Frameworks -F /Applications/Xcode-15.2.0.app/Contents/Developer/Platforms/WatchOS.platform/Developer/SDKs/WatchOS10.2.sdk/Developer/Library/Frameworks -no-color-diagnostics -enable-testing -g -module-cache-path /Users/admin/builder/spi-builder-workspace/.derivedData/ModuleCache.noindex -profile-generate -profile-coverage-mapping -swift-version 5 -enforce-exclusivity\=checked -Onone -D SWIFT_PACKAGE -D DEBUG -D Xcode -serialize-debugging-options -const-gather-protocols-file /Users/admin/builder/spi-builder-workspace/.derivedData/Build/Intermediates.noindex/meilisearch-swift.build/Debug-watchos/MeiliSearchIntegrationTests.build/Objects-normal/arm64/MeiliSearchIntegrationTests_const_extract_protocols.json -empty-abi-descriptor -validate-clang-modules-once -clang-build-session-file /Users/admin/builder/spi-builder-workspace/.derivedData/ModuleCache.noindex/Session.modulevalidation -Xcc -working-directory -Xcc /Users/admin/builder/spi-builder-workspace -resource-dir /Applications/Xcode-15.2.0.app/Contents/Developer/Toolchains/XcodeDefault.xctoolchain/usr/lib/swift -enable-anonymous-context-mangled-names -Xcc -ivfsstatcache -Xcc /Users/admin/builder/spi-builder-workspace/.derivedData/SDKStatCaches.noindex/watchos10.2-21S355-1a03c8d25fc3596eb74c01d649b42752.sdkstatcache -Xcc -I/Users/admin/builder/spi-builder-workspace/.derivedData/Build/Products/Debug-watchos/include -Xcc -I/Users/admin/builder/spi-builder-workspace/.derivedData/Build/Intermediates.noindex/meilisearch-swift.build/Debug-watchos/MeiliSearchIntegrationTests.build/DerivedSources-normal/arm64 -Xcc -I/Users/admin/builder/spi-builder-workspace/.derivedData/Build/Intermediates.noindex/meilisearch-swift.build/Debug-watchos/MeiliSearchIntegrationTests.build/DerivedSources/arm64 -Xcc -I/Users/admin/builder/spi-builder-workspace/.derivedData/Build/Intermediates.noindex/meilisearch-swift.build/Debug-watchos/MeiliSearchIntegrationTests.build/DerivedSources -Xcc -DSWIFT_PACKAGE -Xcc -DDEBUG\=1 -module-name MeiliSearchIntegrationTests -frontend-parseable-output -disable-clang-spi -target-sdk-version 10.2 -target-sdk-name watchos10.2 -external-plugin-path /Applications/Xcode-15.2.0.app/Contents/Developer/Platforms/WatchOS.platform/Developer/SDKs/WatchOS10.2.sdk/usr/lib/swift/host/plugins\#/Applications/Xcode-15.2.0.app/Contents/Developer/Platforms/WatchOS.platform/Developer/SDKs/WatchOS10.2.sdk/usr/bin/swift-plugin-server -external-plugin-path /Applications/Xcode-15.2.0.app/Contents/Developer/Platforms/WatchOS.platform/Developer/SDKs/WatchOS10.2.sdk/usr/local/lib/swift/host/plugins\#/Applications/Xcode-15.2.0.app/Contents/Developer/Platforms/WatchOS.platform/Developer/SDKs/WatchOS10.2.sdk/usr/bin/swift-plugin-server -external-plugin-path /Applications/Xcode-15.2.0.app/Contents/Developer/Platforms/WatchOS.platform/Developer/usr/lib/swift/host/plugins\#/Applications/Xcode-15.2.0.app/Contents/Developer/Platforms/WatchOS.platform/Developer/usr/bin/swift-plugin-server -external-plugin-path /Applications/Xcode-15.2.0.app/Contents/Developer/Platforms/WatchOS.platform/Developer/usr/local/lib/swift/host/plugins\#/Applications/Xcode-15.2.0.app/Contents/Developer/Platforms/WatchOS.platform/Developer/usr/bin/swift-plugin-server -plugin-path /Applications/Xcode-15.2.0.app/Contents/Developer/Toolchains/XcodeDefault.xctoolchain/usr/lib/swift/host/plugins -plugin-path /Applications/Xcode-15.2.0.app/Contents/Developer/Toolchains/XcodeDefault.xctoolchain/usr/local/lib/swift/host/plugins -o /Users/admin/builder/spi-builder-workspace/.derivedData/Build/Intermediates.noindex/meilisearch-swift.build/Debug-watchos/MeiliSearchIntegrationTests.build/Objects-normal/arm64/Utils.o -index-unit-output-path /meilisearch-swift.build/Debug-watchos/MeiliSearchIntegrationTests.build/Objects-normal/arm64/Utils.o -index-store-path /Users/admin/builder/spi-builder-workspace/.derivedData/Index.noindex/DataStore -index-system-modules
SwiftCompile normal arm64 /Users/admin/builder/spi-builder-workspace/Tests/MeiliSearchIntegrationTests/Utils.swift (in target 'MeiliSearchIntegrationTests' from project 'meilisearch-swift')
    cd /Users/admin/builder/spi-builder-workspace
    /Applications/Xcode-15.2.0.app/Contents/Developer/Toolchains/XcodeDefault.xctoolchain/usr/bin/swift-frontend -c /Users/admin/builder/spi-builder-workspace/Tests/MeiliSearchIntegrationTests/DocumentsTests.swift /Users/admin/builder/spi-builder-workspace/Tests/MeiliSearchIntegrationTests/DumpsTests.swift /Users/admin/builder/spi-builder-workspace/Tests/MeiliSearchIntegrationTests/IndexesTests.swift /Users/admin/builder/spi-builder-workspace/Tests/MeiliSearchIntegrationTests/KeysTests.swift /Users/admin/builder/spi-builder-workspace/Tests/MeiliSearchIntegrationTests/SearchTests.swift /Users/admin/builder/spi-builder-workspace/Tests/MeiliSearchIntegrationTests/SettingsTests.swift /Users/admin/builder/spi-builder-workspace/Tests/MeiliSearchIntegrationTests/SnapshotsTests.swift /Users/admin/builder/spi-builder-workspace/Tests/MeiliSearchIntegrationTests/Support/Book.swift /Users/admin/builder/spi-builder-workspace/Tests/MeiliSearchIntegrationTests/Support/Movie.swift /Users/admin/builder/spi-builder-workspace/Tests/MeiliSearchIntegrationTests/Support/NestedBook.swift /Users/admin/builder/spi-builder-workspace/Tests/MeiliSearchIntegrationTests/TaskTests.swift -primary-file /Users/admin/builder/spi-builder-workspace/Tests/MeiliSearchIntegrationTests/Utils.swift -emit-dependencies-path /Users/admin/builder/spi-builder-workspace/.derivedData/Build/Intermediates.noindex/meilisearch-swift.build/Debug-watchos/MeiliSearchIntegrationTests.build/Objects-normal/arm64/Utils.d -emit-const-values-path /Users/admin/builder/spi-builder-workspace/.derivedData/Build/Intermediates.noindex/meilisearch-swift.build/Debug-watchos/MeiliSearchIntegrationTests.build/Objects-normal/arm64/Utils.swiftconstvalues -emit-reference-dependencies-path /Users/admin/builder/spi-builder-workspace/.derivedData/Build/Intermediates.noindex/meilisearch-swift.build/Debug-watchos/MeiliSearchIntegrationTests.build/Objects-normal/arm64/Utils.swiftdeps -serialize-diagnostics-path /Users/admin/builder/spi-builder-workspace/.derivedData/Build/Intermediates.noindex/meilisearch-swift.build/Debug-watchos/MeiliSearchIntegrationTests.build/Objects-normal/arm64/Utils.dia -target arm64-apple-watchos5.0 -Xllvm -aarch64-use-tbi -enable-objc-interop -sdk /Applications/Xcode-15.2.0.app/Contents/Developer/Platforms/WatchOS.platform/Developer/SDKs/WatchOS10.2.sdk -I /Users/admin/builder/spi-builder-workspace/.derivedData/Build/Products/Debug-watchos -I /Applications/Xcode-15.2.0.app/Contents/Developer/Platforms/WatchOS.platform/Developer/usr/lib -F /Users/admin/builder/spi-builder-workspace/.derivedData/Build/Products/Debug-watchos/PackageFrameworks -F /Users/admin/builder/spi-builder-workspace/.derivedData/Build/Products/Debug-watchos -F /Applications/Xcode-15.2.0.app/Contents/Developer/Platforms/WatchOS.platform/Developer/Library/Frameworks -F /Applications/Xcode-15.2.0.app/Contents/Developer/Platforms/WatchOS.platform/Developer/SDKs/WatchOS10.2.sdk/Developer/Library/Frameworks -no-color-diagnostics -enable-testing -g -module-cache-path /Users/admin/builder/spi-builder-workspace/.derivedData/ModuleCache.noindex -profile-generate -profile-coverage-mapping -swift-version 5 -enforce-exclusivity\=checked -Onone -D SWIFT_PACKAGE -D DEBUG -D Xcode -serialize-debugging-options -const-gather-protocols-file /Users/admin/builder/spi-builder-workspace/.derivedData/Build/Intermediates.noindex/meilisearch-swift.build/Debug-watchos/MeiliSearchIntegrationTests.build/Objects-normal/arm64/MeiliSearchIntegrationTests_const_extract_protocols.json -empty-abi-descriptor -validate-clang-modules-once -clang-build-session-file /Users/admin/builder/spi-builder-workspace/.derivedData/ModuleCache.noindex/Session.modulevalidation -Xcc -working-directory -Xcc /Users/admin/builder/spi-builder-workspace -resource-dir /Applications/Xcode-15.2.0.app/Contents/Developer/Toolchains/XcodeDefault.xctoolchain/usr/lib/swift -enable-anonymous-context-mangled-names -Xcc -ivfsstatcache -Xcc /Users/admin/builder/spi-builder-workspace/.derivedData/SDKStatCaches.noindex/watchos10.2-21S355-1a03c8d25fc3596eb74c01d649b42752.sdkstatcache -Xcc -I/Users/admin/builder/spi-builder-workspace/.derivedData/Build/Products/Debug-watchos/include -Xcc -I/Users/admin/builder/spi-builder-workspace/.derivedData/Build/Intermediates.noindex/meilisearch-swift.build/Debug-watchos/MeiliSearchIntegrationTests.build/DerivedSources-normal/arm64 -Xcc -I/Users/admin/builder/spi-builder-workspace/.derivedData/Build/Intermediates.noindex/meilisearch-swift.build/Debug-watchos/MeiliSearchIntegrationTests.build/DerivedSources/arm64 -Xcc -I/Users/admin/builder/spi-builder-workspace/.derivedData/Build/Intermediates.noindex/meilisearch-swift.build/Debug-watchos/MeiliSearchIntegrationTests.build/DerivedSources -Xcc -DSWIFT_PACKAGE -Xcc -DDEBUG\=1 -module-name MeiliSearchIntegrationTests -frontend-parseable-output -disable-clang-spi -target-sdk-version 10.2 -target-sdk-name watchos10.2 -external-plugin-path /Applications/Xcode-15.2.0.app/Contents/Developer/Platforms/WatchOS.platform/Developer/SDKs/WatchOS10.2.sdk/usr/lib/swift/host/plugins\#/Applications/Xcode-15.2.0.app/Contents/Developer/Platforms/WatchOS.platform/Developer/SDKs/WatchOS10.2.sdk/usr/bin/swift-plugin-server -external-plugin-path /Applications/Xcode-15.2.0.app/Contents/Developer/Platforms/WatchOS.platform/Developer/SDKs/WatchOS10.2.sdk/usr/local/lib/swift/host/plugins\#/Applications/Xcode-15.2.0.app/Contents/Developer/Platforms/WatchOS.platform/Developer/SDKs/WatchOS10.2.sdk/usr/bin/swift-plugin-server -external-plugin-path /Applications/Xcode-15.2.0.app/Contents/Developer/Platforms/WatchOS.platform/Developer/usr/lib/swift/host/plugins\#/Applications/Xcode-15.2.0.app/Contents/Developer/Platforms/WatchOS.platform/Developer/usr/bin/swift-plugin-server -external-plugin-path /Applications/Xcode-15.2.0.app/Contents/Developer/Platforms/WatchOS.platform/Developer/usr/local/lib/swift/host/plugins\#/Applications/Xcode-15.2.0.app/Contents/Developer/Platforms/WatchOS.platform/Developer/usr/bin/swift-plugin-server -plugin-path /Applications/Xcode-15.2.0.app/Contents/Developer/Toolchains/XcodeDefault.xctoolchain/usr/lib/swift/host/plugins -plugin-path /Applications/Xcode-15.2.0.app/Contents/Developer/Toolchains/XcodeDefault.xctoolchain/usr/local/lib/swift/host/plugins -o /Users/admin/builder/spi-builder-workspace/.derivedData/Build/Intermediates.noindex/meilisearch-swift.build/Debug-watchos/MeiliSearchIntegrationTests.build/Objects-normal/arm64/Utils.o -index-unit-output-path /meilisearch-swift.build/Debug-watchos/MeiliSearchIntegrationTests.build/Objects-normal/arm64/Utils.o -index-store-path /Users/admin/builder/spi-builder-workspace/.derivedData/Index.noindex/DataStore -index-system-modules
SwiftEmitModule normal arm64_32 Emitting\ module\ for\ MeiliSearchIntegrationTests (in target 'MeiliSearchIntegrationTests' from project 'meilisearch-swift')
    cd /Users/admin/builder/spi-builder-workspace
    builtin-swiftTaskExecution -- /Applications/Xcode-15.2.0.app/Contents/Developer/Toolchains/XcodeDefault.xctoolchain/usr/bin/swift-frontend -frontend -emit-module -experimental-skip-non-inlinable-function-bodies-without-types /Users/admin/builder/spi-builder-workspace/Tests/MeiliSearchIntegrationTests/DocumentsTests.swift /Users/admin/builder/spi-builder-workspace/Tests/MeiliSearchIntegrationTests/DumpsTests.swift /Users/admin/builder/spi-builder-workspace/Tests/MeiliSearchIntegrationTests/IndexesTests.swift /Users/admin/builder/spi-builder-workspace/Tests/MeiliSearchIntegrationTests/KeysTests.swift /Users/admin/builder/spi-builder-workspace/Tests/MeiliSearchIntegrationTests/SearchTests.swift /Users/admin/builder/spi-builder-workspace/Tests/MeiliSearchIntegrationTests/SettingsTests.swift /Users/admin/builder/spi-builder-workspace/Tests/MeiliSearchIntegrationTests/SnapshotsTests.swift /Users/admin/builder/spi-builder-workspace/Tests/MeiliSearchIntegrationTests/Support/Book.swift /Users/admin/builder/spi-builder-workspace/Tests/MeiliSearchIntegrationTests/Support/Movie.swift /Users/admin/builder/spi-builder-workspace/Tests/MeiliSearchIntegrationTests/Support/NestedBook.swift /Users/admin/builder/spi-builder-workspace/Tests/MeiliSearchIntegrationTests/TaskTests.swift /Users/admin/builder/spi-builder-workspace/Tests/MeiliSearchIntegrationTests/Utils.swift -target arm64_32-apple-watchos5.0 -enable-objc-interop -sdk /Applications/Xcode-15.2.0.app/Contents/Developer/Platforms/WatchOS.platform/Developer/SDKs/WatchOS10.2.sdk -I /Users/admin/builder/spi-builder-workspace/.derivedData/Build/Products/Debug-watchos -I /Applications/Xcode-15.2.0.app/Contents/Developer/Platforms/WatchOS.platform/Developer/usr/lib -F /Users/admin/builder/spi-builder-workspace/.derivedData/Build/Products/Debug-watchos/PackageFrameworks -F /Users/admin/builder/spi-builder-workspace/.derivedData/Build/Products/Debug-watchos -F /Applications/Xcode-15.2.0.app/Contents/Developer/Platforms/WatchOS.platform/Developer/Library/Frameworks -F /Applications/Xcode-15.2.0.app/Contents/Developer/Platforms/WatchOS.platform/Developer/SDKs/WatchOS10.2.sdk/Developer/Library/Frameworks -no-color-diagnostics -enable-testing -g -module-cache-path /Users/admin/builder/spi-builder-workspace/.derivedData/ModuleCache.noindex -profile-generate -profile-coverage-mapping -swift-version 5 -enforce-exclusivity\=checked -Onone -D SWIFT_PACKAGE -D DEBUG -D Xcode -serialize-debugging-options -const-gather-protocols-file /Users/admin/builder/spi-builder-workspace/.derivedData/Build/Intermediates.noindex/meilisearch-swift.build/Debug-watchos/MeiliSearchIntegrationTests.build/Objects-normal/arm64_32/MeiliSearchIntegrationTests_const_extract_protocols.json -empty-abi-descriptor -validate-clang-modules-once -clang-build-session-file /Users/admin/builder/spi-builder-workspace/.derivedData/ModuleCache.noindex/Session.modulevalidation -Xcc -working-directory -Xcc /Users/admin/builder/spi-builder-workspace -resource-dir /Applications/Xcode-15.2.0.app/Contents/Developer/Toolchains/XcodeDefault.xctoolchain/usr/lib/swift -enable-anonymous-context-mangled-names -Xcc -ivfsstatcache -Xcc /Users/admin/builder/spi-builder-workspace/.derivedData/SDKStatCaches.noindex/watchos10.2-21S355-1a03c8d25fc3596eb74c01d649b42752.sdkstatcache -Xcc -I/Users/admin/builder/spi-builder-workspace/.derivedData/Build/Products/Debug-watchos/include -Xcc -I/Users/admin/builder/spi-builder-workspace/.derivedData/Build/Intermediates.noindex/meilisearch-swift.build/Debug-watchos/MeiliSearchIntegrationTests.build/DerivedSources-normal/arm64_32 -Xcc -I/Users/admin/builder/spi-builder-workspace/.derivedData/Build/Intermediates.noindex/meilisearch-swift.build/Debug-watchos/MeiliSearchIntegrationTests.build/DerivedSources/arm64_32 -Xcc -I/Users/admin/builder/spi-builder-workspace/.derivedData/Build/Intermediates.noindex/meilisearch-swift.build/Debug-watchos/MeiliSearchIntegrationTests.build/DerivedSources -Xcc -DSWIFT_PACKAGE -Xcc -DDEBUG\=1 -module-name MeiliSearchIntegrationTests -disable-clang-spi -target-sdk-version 10.2 -target-sdk-name watchos10.2 -external-plugin-path /Applications/Xcode-15.2.0.app/Contents/Developer/Platforms/WatchOS.platform/Developer/SDKs/WatchOS10.2.sdk/usr/lib/swift/host/plugins\#/Applications/Xcode-15.2.0.app/Contents/Developer/Platforms/WatchOS.platform/Developer/SDKs/WatchOS10.2.sdk/usr/bin/swift-plugin-server -external-plugin-path /Applications/Xcode-15.2.0.app/Contents/Developer/Platforms/WatchOS.platform/Developer/SDKs/WatchOS10.2.sdk/usr/local/lib/swift/host/plugins\#/Applications/Xcode-15.2.0.app/Contents/Developer/Platforms/WatchOS.platform/Developer/SDKs/WatchOS10.2.sdk/usr/bin/swift-plugin-server -external-plugin-path /Applications/Xcode-15.2.0.app/Contents/Developer/Platforms/WatchOS.platform/Developer/usr/lib/swift/host/plugins\#/Applications/Xcode-15.2.0.app/Contents/Developer/Platforms/WatchOS.platform/Developer/usr/bin/swift-plugin-server -external-plugin-path /Applications/Xcode-15.2.0.app/Contents/Developer/Platforms/WatchOS.platform/Developer/usr/local/lib/swift/host/plugins\#/Applications/Xcode-15.2.0.app/Contents/Developer/Platforms/WatchOS.platform/Developer/usr/bin/swift-plugin-server -plugin-path /Applications/Xcode-15.2.0.app/Contents/Developer/Toolchains/XcodeDefault.xctoolchain/usr/lib/swift/host/plugins -plugin-path /Applications/Xcode-15.2.0.app/Contents/Developer/Toolchains/XcodeDefault.xctoolchain/usr/local/lib/swift/host/plugins -emit-module-doc-path /Users/admin/builder/spi-builder-workspace/.derivedData/Build/Intermediates.noindex/meilisearch-swift.build/Debug-watchos/MeiliSearchIntegrationTests.build/Objects-normal/arm64_32/MeiliSearchIntegrationTests.swiftdoc -emit-module-source-info-path /Users/admin/builder/spi-builder-workspace/.derivedData/Build/Intermediates.noindex/meilisearch-swift.build/Debug-watchos/MeiliSearchIntegrationTests.build/Objects-normal/arm64_32/MeiliSearchIntegrationTests.swiftsourceinfo -serialize-diagnostics-path /Users/admin/builder/spi-builder-workspace/.derivedData/Build/Intermediates.noindex/meilisearch-swift.build/Debug-watchos/MeiliSearchIntegrationTests.build/Objects-normal/arm64_32/MeiliSearchIntegrationTests-master-emit-module.dia -emit-dependencies-path /Users/admin/builder/spi-builder-workspace/.derivedData/Build/Intermediates.noindex/meilisearch-swift.build/Debug-watchos/MeiliSearchIntegrationTests.build/Objects-normal/arm64_32/MeiliSearchIntegrationTests-master-emit-module.d -o /Users/admin/builder/spi-builder-workspace/.derivedData/Build/Intermediates.noindex/meilisearch-swift.build/Debug-watchos/MeiliSearchIntegrationTests.build/Objects-normal/arm64_32/MeiliSearchIntegrationTests.swiftmodule -emit-abi-descriptor-path /Users/admin/builder/spi-builder-workspace/.derivedData/Build/Intermediates.noindex/meilisearch-swift.build/Debug-watchos/MeiliSearchIntegrationTests.build/Objects-normal/arm64_32/MeiliSearchIntegrationTests.abi.json
/Users/admin/builder/spi-builder-workspace/Tests/MeiliSearchIntegrationTests/IndexesTests.swift:246:24: error: concurrency is only available in watchOS 6.0.0 or newer
  func testSwapIndex() async throws {
                       ^
/Users/admin/builder/spi-builder-workspace/Tests/MeiliSearchIntegrationTests/IndexesTests.swift:246:8: note: add @available attribute to enclosing instance method
  func testSwapIndex() async throws {
       ^
/Users/admin/builder/spi-builder-workspace/Tests/MeiliSearchIntegrationTests/IndexesTests.swift:8:7: note: add @available attribute to enclosing class
class IndexesTests: XCTestCase {
      ^
/Users/admin/builder/spi-builder-workspace/Tests/MeiliSearchIntegrationTests/SearchTests.swift:107:39: error: concurrency is only available in watchOS 6.0.0 or newer
  func testSearchWithRankingDetails() async throws {
                                      ^
/Users/admin/builder/spi-builder-workspace/Tests/MeiliSearchIntegrationTests/SearchTests.swift:107:8: note: add @available attribute to enclosing instance method
  func testSearchWithRankingDetails() async throws {
       ^
/Users/admin/builder/spi-builder-workspace/Tests/MeiliSearchIntegrationTests/SearchTests.swift:28:7: note: add @available attribute to enclosing class
class SearchTests: XCTestCase {
      ^
/Users/admin/builder/spi-builder-workspace/Tests/MeiliSearchIntegrationTests/SettingsTests.swift:961:33: error: concurrency is only available in watchOS 6.0.0 or newer
  func testProximityPrecision() async throws {
                                ^
/Users/admin/builder/spi-builder-workspace/Tests/MeiliSearchIntegrationTests/SettingsTests.swift:961:8: note: add @available attribute to enclosing instance method
  func testProximityPrecision() async throws {
       ^
/Users/admin/builder/spi-builder-workspace/Tests/MeiliSearchIntegrationTests/SettingsTests.swift:8:7: note: add @available attribute to enclosing class
class SettingsTests: XCTestCase {
      ^
/Users/admin/builder/spi-builder-workspace/Tests/MeiliSearchIntegrationTests/SettingsTests.swift:986:27: error: concurrency is only available in watchOS 6.0.0 or newer
  func testSearchCutOff() async throws {
                          ^
/Users/admin/builder/spi-builder-workspace/Tests/MeiliSearchIntegrationTests/SettingsTests.swift:986:8: note: add @available attribute to enclosing instance method
  func testSearchCutOff() async throws {
       ^
/Users/admin/builder/spi-builder-workspace/Tests/MeiliSearchIntegrationTests/SettingsTests.swift:8:7: note: add @available attribute to enclosing class
class SettingsTests: XCTestCase {
      ^
SwiftEmitModule normal armv7k Emitting\ module\ for\ MeiliSearchIntegrationTests (in target 'MeiliSearchIntegrationTests' from project 'meilisearch-swift')
    cd /Users/admin/builder/spi-builder-workspace
    builtin-swiftTaskExecution -- /Applications/Xcode-15.2.0.app/Contents/Developer/Toolchains/XcodeDefault.xctoolchain/usr/bin/swift-frontend -frontend -emit-module -experimental-skip-non-inlinable-function-bodies-without-types /Users/admin/builder/spi-builder-workspace/Tests/MeiliSearchIntegrationTests/DocumentsTests.swift /Users/admin/builder/spi-builder-workspace/Tests/MeiliSearchIntegrationTests/DumpsTests.swift /Users/admin/builder/spi-builder-workspace/Tests/MeiliSearchIntegrationTests/IndexesTests.swift /Users/admin/builder/spi-builder-workspace/Tests/MeiliSearchIntegrationTests/KeysTests.swift /Users/admin/builder/spi-builder-workspace/Tests/MeiliSearchIntegrationTests/SearchTests.swift /Users/admin/builder/spi-builder-workspace/Tests/MeiliSearchIntegrationTests/SettingsTests.swift /Users/admin/builder/spi-builder-workspace/Tests/MeiliSearchIntegrationTests/SnapshotsTests.swift /Users/admin/builder/spi-builder-workspace/Tests/MeiliSearchIntegrationTests/Support/Book.swift /Users/admin/builder/spi-builder-workspace/Tests/MeiliSearchIntegrationTests/Support/Movie.swift /Users/admin/builder/spi-builder-workspace/Tests/MeiliSearchIntegrationTests/Support/NestedBook.swift /Users/admin/builder/spi-builder-workspace/Tests/MeiliSearchIntegrationTests/TaskTests.swift /Users/admin/builder/spi-builder-workspace/Tests/MeiliSearchIntegrationTests/Utils.swift -target armv7k-apple-watchos5.0 -enable-objc-interop -sdk /Applications/Xcode-15.2.0.app/Contents/Developer/Platforms/WatchOS.platform/Developer/SDKs/WatchOS10.2.sdk -I /Users/admin/builder/spi-builder-workspace/.derivedData/Build/Products/Debug-watchos -I /Applications/Xcode-15.2.0.app/Contents/Developer/Platforms/WatchOS.platform/Developer/usr/lib -F /Users/admin/builder/spi-builder-workspace/.derivedData/Build/Products/Debug-watchos/PackageFrameworks -F /Users/admin/builder/spi-builder-workspace/.derivedData/Build/Products/Debug-watchos -F /Applications/Xcode-15.2.0.app/Contents/Developer/Platforms/WatchOS.platform/Developer/Library/Frameworks -F /Applications/Xcode-15.2.0.app/Contents/Developer/Platforms/WatchOS.platform/Developer/SDKs/WatchOS10.2.sdk/Developer/Library/Frameworks -no-color-diagnostics -enable-testing -g -module-cache-path /Users/admin/builder/spi-builder-workspace/.derivedData/ModuleCache.noindex -profile-generate -profile-coverage-mapping -swift-version 5 -enforce-exclusivity\=checked -Onone -D SWIFT_PACKAGE -D DEBUG -D Xcode -serialize-debugging-options -const-gather-protocols-file /Users/admin/builder/spi-builder-workspace/.derivedData/Build/Intermediates.noindex/meilisearch-swift.build/Debug-watchos/MeiliSearchIntegrationTests.build/Objects-normal/armv7k/MeiliSearchIntegrationTests_const_extract_protocols.json -empty-abi-descriptor -validate-clang-modules-once -clang-build-session-file /Users/admin/builder/spi-builder-workspace/.derivedData/ModuleCache.noindex/Session.modulevalidation -Xcc -working-directory -Xcc /Users/admin/builder/spi-builder-workspace -resource-dir /Applications/Xcode-15.2.0.app/Contents/Developer/Toolchains/XcodeDefault.xctoolchain/usr/lib/swift -enable-anonymous-context-mangled-names -Xcc -ivfsstatcache -Xcc /Users/admin/builder/spi-builder-workspace/.derivedData/SDKStatCaches.noindex/watchos10.2-21S355-1a03c8d25fc3596eb74c01d649b42752.sdkstatcache -Xcc -I/Users/admin/builder/spi-builder-workspace/.derivedData/Build/Products/Debug-watchos/include -Xcc -I/Users/admin/builder/spi-builder-workspace/.derivedData/Build/Intermediates.noindex/meilisearch-swift.build/Debug-watchos/MeiliSearchIntegrationTests.build/DerivedSources-normal/armv7k -Xcc -I/Users/admin/builder/spi-builder-workspace/.derivedData/Build/Intermediates.noindex/meilisearch-swift.build/Debug-watchos/MeiliSearchIntegrationTests.build/DerivedSources/armv7k -Xcc -I/Users/admin/builder/spi-builder-workspace/.derivedData/Build/Intermediates.noindex/meilisearch-swift.build/Debug-watchos/MeiliSearchIntegrationTests.build/DerivedSources -Xcc -DSWIFT_PACKAGE -Xcc -DDEBUG\=1 -module-name MeiliSearchIntegrationTests -disable-clang-spi -target-sdk-version 10.2 -target-sdk-name watchos10.2 -external-plugin-path /Applications/Xcode-15.2.0.app/Contents/Developer/Platforms/WatchOS.platform/Developer/SDKs/WatchOS10.2.sdk/usr/lib/swift/host/plugins\#/Applications/Xcode-15.2.0.app/Contents/Developer/Platforms/WatchOS.platform/Developer/SDKs/WatchOS10.2.sdk/usr/bin/swift-plugin-server -external-plugin-path /Applications/Xcode-15.2.0.app/Contents/Developer/Platforms/WatchOS.platform/Developer/SDKs/WatchOS10.2.sdk/usr/local/lib/swift/host/plugins\#/Applications/Xcode-15.2.0.app/Contents/Developer/Platforms/WatchOS.platform/Developer/SDKs/WatchOS10.2.sdk/usr/bin/swift-plugin-server -external-plugin-path /Applications/Xcode-15.2.0.app/Contents/Developer/Platforms/WatchOS.platform/Developer/usr/lib/swift/host/plugins\#/Applications/Xcode-15.2.0.app/Contents/Developer/Platforms/WatchOS.platform/Developer/usr/bin/swift-plugin-server -external-plugin-path /Applications/Xcode-15.2.0.app/Contents/Developer/Platforms/WatchOS.platform/Developer/usr/local/lib/swift/host/plugins\#/Applications/Xcode-15.2.0.app/Contents/Developer/Platforms/WatchOS.platform/Developer/usr/bin/swift-plugin-server -plugin-path /Applications/Xcode-15.2.0.app/Contents/Developer/Toolchains/XcodeDefault.xctoolchain/usr/lib/swift/host/plugins -plugin-path /Applications/Xcode-15.2.0.app/Contents/Developer/Toolchains/XcodeDefault.xctoolchain/usr/local/lib/swift/host/plugins -emit-module-doc-path /Users/admin/builder/spi-builder-workspace/.derivedData/Build/Intermediates.noindex/meilisearch-swift.build/Debug-watchos/MeiliSearchIntegrationTests.build/Objects-normal/armv7k/MeiliSearchIntegrationTests.swiftdoc -emit-module-source-info-path /Users/admin/builder/spi-builder-workspace/.derivedData/Build/Intermediates.noindex/meilisearch-swift.build/Debug-watchos/MeiliSearchIntegrationTests.build/Objects-normal/armv7k/MeiliSearchIntegrationTests.swiftsourceinfo -serialize-diagnostics-path /Users/admin/builder/spi-builder-workspace/.derivedData/Build/Intermediates.noindex/meilisearch-swift.build/Debug-watchos/MeiliSearchIntegrationTests.build/Objects-normal/armv7k/MeiliSearchIntegrationTests-master-emit-module.dia -emit-dependencies-path /Users/admin/builder/spi-builder-workspace/.derivedData/Build/Intermediates.noindex/meilisearch-swift.build/Debug-watchos/MeiliSearchIntegrationTests.build/Objects-normal/armv7k/MeiliSearchIntegrationTests-master-emit-module.d -o /Users/admin/builder/spi-builder-workspace/.derivedData/Build/Intermediates.noindex/meilisearch-swift.build/Debug-watchos/MeiliSearchIntegrationTests.build/Objects-normal/armv7k/MeiliSearchIntegrationTests.swiftmodule -emit-abi-descriptor-path /Users/admin/builder/spi-builder-workspace/.derivedData/Build/Intermediates.noindex/meilisearch-swift.build/Debug-watchos/MeiliSearchIntegrationTests.build/Objects-normal/armv7k/MeiliSearchIntegrationTests.abi.json
/Users/admin/builder/spi-builder-workspace/Tests/MeiliSearchIntegrationTests/IndexesTests.swift:246:24: error: concurrency is only available in watchOS 6.0.0 or newer
  func testSwapIndex() async throws {
                       ^
/Users/admin/builder/spi-builder-workspace/Tests/MeiliSearchIntegrationTests/IndexesTests.swift:246:8: note: add @available attribute to enclosing instance method
  func testSwapIndex() async throws {
       ^
/Users/admin/builder/spi-builder-workspace/Tests/MeiliSearchIntegrationTests/IndexesTests.swift:8:7: note: add @available attribute to enclosing class
class IndexesTests: XCTestCase {
      ^
/Users/admin/builder/spi-builder-workspace/Tests/MeiliSearchIntegrationTests/SearchTests.swift:107:39: error: concurrency is only available in watchOS 6.0.0 or newer
  func testSearchWithRankingDetails() async throws {
                                      ^
/Users/admin/builder/spi-builder-workspace/Tests/MeiliSearchIntegrationTests/SearchTests.swift:107:8: note: add @available attribute to enclosing instance method
  func testSearchWithRankingDetails() async throws {
       ^
/Users/admin/builder/spi-builder-workspace/Tests/MeiliSearchIntegrationTests/SearchTests.swift:28:7: note: add @available attribute to enclosing class
class SearchTests: XCTestCase {
      ^
/Users/admin/builder/spi-builder-workspace/Tests/MeiliSearchIntegrationTests/SettingsTests.swift:961:33: error: concurrency is only available in watchOS 6.0.0 or newer
  func testProximityPrecision() async throws {
                                ^
/Users/admin/builder/spi-builder-workspace/Tests/MeiliSearchIntegrationTests/SettingsTests.swift:961:8: note: add @available attribute to enclosing instance method
  func testProximityPrecision() async throws {
       ^
/Users/admin/builder/spi-builder-workspace/Tests/MeiliSearchIntegrationTests/SettingsTests.swift:8:7: note: add @available attribute to enclosing class
class SettingsTests: XCTestCase {
      ^
/Users/admin/builder/spi-builder-workspace/Tests/MeiliSearchIntegrationTests/SettingsTests.swift:986:27: error: concurrency is only available in watchOS 6.0.0 or newer
  func testSearchCutOff() async throws {
                          ^
/Users/admin/builder/spi-builder-workspace/Tests/MeiliSearchIntegrationTests/SettingsTests.swift:986:8: note: add @available attribute to enclosing instance method
  func testSearchCutOff() async throws {
       ^
/Users/admin/builder/spi-builder-workspace/Tests/MeiliSearchIntegrationTests/SettingsTests.swift:8:7: note: add @available attribute to enclosing class
class SettingsTests: XCTestCase {
      ^
SwiftCompile normal arm64 Compiling\ SearchTests.swift /Users/admin/builder/spi-builder-workspace/Tests/MeiliSearchIntegrationTests/SearchTests.swift (in target 'MeiliSearchIntegrationTests' from project 'meilisearch-swift')
    cd /Users/admin/builder/spi-builder-workspace
    builtin-swiftTaskExecution -- /Applications/Xcode-15.2.0.app/Contents/Developer/Toolchains/XcodeDefault.xctoolchain/usr/bin/swift-frontend -frontend -c /Users/admin/builder/spi-builder-workspace/Tests/MeiliSearchIntegrationTests/DocumentsTests.swift /Users/admin/builder/spi-builder-workspace/Tests/MeiliSearchIntegrationTests/DumpsTests.swift /Users/admin/builder/spi-builder-workspace/Tests/MeiliSearchIntegrationTests/IndexesTests.swift /Users/admin/builder/spi-builder-workspace/Tests/MeiliSearchIntegrationTests/KeysTests.swift -primary-file /Users/admin/builder/spi-builder-workspace/Tests/MeiliSearchIntegrationTests/SearchTests.swift /Users/admin/builder/spi-builder-workspace/Tests/MeiliSearchIntegrationTests/SettingsTests.swift /Users/admin/builder/spi-builder-workspace/Tests/MeiliSearchIntegrationTests/SnapshotsTests.swift /Users/admin/builder/spi-builder-workspace/Tests/MeiliSearchIntegrationTests/Support/Book.swift /Users/admin/builder/spi-builder-workspace/Tests/MeiliSearchIntegrationTests/Support/Movie.swift /Users/admin/builder/spi-builder-workspace/Tests/MeiliSearchIntegrationTests/Support/NestedBook.swift /Users/admin/builder/spi-builder-workspace/Tests/MeiliSearchIntegrationTests/TaskTests.swift /Users/admin/builder/spi-builder-workspace/Tests/MeiliSearchIntegrationTests/Utils.swift -emit-dependencies-path /Users/admin/builder/spi-builder-workspace/.derivedData/Build/Intermediates.noindex/meilisearch-swift.build/Debug-watchos/MeiliSearchIntegrationTests.build/Objects-normal/arm64/SearchTests.d -emit-const-values-path /Users/admin/builder/spi-builder-workspace/.derivedData/Build/Intermediates.noindex/meilisearch-swift.build/Debug-watchos/MeiliSearchIntegrationTests.build/Objects-normal/arm64/SearchTests.swiftconstvalues -emit-reference-dependencies-path /Users/admin/builder/spi-builder-workspace/.derivedData/Build/Intermediates.noindex/meilisearch-swift.build/Debug-watchos/MeiliSearchIntegrationTests.build/Objects-normal/arm64/SearchTests.swiftdeps -serialize-diagnostics-path /Users/admin/builder/spi-builder-workspace/.derivedData/Build/Intermediates.noindex/meilisearch-swift.build/Debug-watchos/MeiliSearchIntegrationTests.build/Objects-normal/arm64/SearchTests.dia -target arm64-apple-watchos5.0 -Xllvm -aarch64-use-tbi -enable-objc-interop -sdk /Applications/Xcode-15.2.0.app/Contents/Developer/Platforms/WatchOS.platform/Developer/SDKs/WatchOS10.2.sdk -I /Users/admin/builder/spi-builder-workspace/.derivedData/Build/Products/Debug-watchos -I /Applications/Xcode-15.2.0.app/Contents/Developer/Platforms/WatchOS.platform/Developer/usr/lib -F /Users/admin/builder/spi-builder-workspace/.derivedData/Build/Products/Debug-watchos/PackageFrameworks -F /Users/admin/builder/spi-builder-workspace/.derivedData/Build/Products/Debug-watchos -F /Applications/Xcode-15.2.0.app/Contents/Developer/Platforms/WatchOS.platform/Developer/Library/Frameworks -F /Applications/Xcode-15.2.0.app/Contents/Developer/Platforms/WatchOS.platform/Developer/SDKs/WatchOS10.2.sdk/Developer/Library/Frameworks -no-color-diagnostics -enable-testing -g -module-cache-path /Users/admin/builder/spi-builder-workspace/.derivedData/ModuleCache.noindex -profile-generate -profile-coverage-mapping -swift-version 5 -enforce-exclusivity\=checked -Onone -D SWIFT_PACKAGE -D DEBUG -D Xcode -serialize-debugging-options -const-gather-protocols-file /Users/admin/builder/spi-builder-workspace/.derivedData/Build/Intermediates.noindex/meilisearch-swift.build/Debug-watchos/MeiliSearchIntegrationTests.build/Objects-normal/arm64/MeiliSearchIntegrationTests_const_extract_protocols.json -empty-abi-descriptor -validate-clang-modules-once -clang-build-session-file /Users/admin/builder/spi-builder-workspace/.derivedData/ModuleCache.noindex/Session.modulevalidation -Xcc -working-directory -Xcc /Users/admin/builder/spi-builder-workspace -resource-dir /Applications/Xcode-15.2.0.app/Contents/Developer/Toolchains/XcodeDefault.xctoolchain/usr/lib/swift -enable-anonymous-context-mangled-names -Xcc -ivfsstatcache -Xcc /Users/admin/builder/spi-builder-workspace/.derivedData/SDKStatCaches.noindex/watchos10.2-21S355-1a03c8d25fc3596eb74c01d649b42752.sdkstatcache -Xcc -I/Users/admin/builder/spi-builder-workspace/.derivedData/Build/Products/Debug-watchos/include -Xcc -I/Users/admin/builder/spi-builder-workspace/.derivedData/Build/Intermediates.noindex/meilisearch-swift.build/Debug-watchos/MeiliSearchIntegrationTests.build/DerivedSources-normal/arm64 -Xcc -I/Users/admin/builder/spi-builder-workspace/.derivedData/Build/Intermediates.noindex/meilisearch-swift.build/Debug-watchos/MeiliSearchIntegrationTests.build/DerivedSources/arm64 -Xcc -I/Users/admin/builder/spi-builder-workspace/.derivedData/Build/Intermediates.noindex/meilisearch-swift.build/Debug-watchos/MeiliSearchIntegrationTests.build/DerivedSources -Xcc -DSWIFT_PACKAGE -Xcc -DDEBUG\=1 -module-name MeiliSearchIntegrationTests -frontend-parseable-output -disable-clang-spi -target-sdk-version 10.2 -target-sdk-name watchos10.2 -external-plugin-path /Applications/Xcode-15.2.0.app/Contents/Developer/Platforms/WatchOS.platform/Developer/SDKs/WatchOS10.2.sdk/usr/lib/swift/host/plugins\#/Applications/Xcode-15.2.0.app/Contents/Developer/Platforms/WatchOS.platform/Developer/SDKs/WatchOS10.2.sdk/usr/bin/swift-plugin-server -external-plugin-path /Applications/Xcode-15.2.0.app/Contents/Developer/Platforms/WatchOS.platform/Developer/SDKs/WatchOS10.2.sdk/usr/local/lib/swift/host/plugins\#/Applications/Xcode-15.2.0.app/Contents/Developer/Platforms/WatchOS.platform/Developer/SDKs/WatchOS10.2.sdk/usr/bin/swift-plugin-server -external-plugin-path /Applications/Xcode-15.2.0.app/Contents/Developer/Platforms/WatchOS.platform/Developer/usr/lib/swift/host/plugins\#/Applications/Xcode-15.2.0.app/Contents/Developer/Platforms/WatchOS.platform/Developer/usr/bin/swift-plugin-server -external-plugin-path /Applications/Xcode-15.2.0.app/Contents/Developer/Platforms/WatchOS.platform/Developer/usr/local/lib/swift/host/plugins\#/Applications/Xcode-15.2.0.app/Contents/Developer/Platforms/WatchOS.platform/Developer/usr/bin/swift-plugin-server -plugin-path /Applications/Xcode-15.2.0.app/Contents/Developer/Toolchains/XcodeDefault.xctoolchain/usr/lib/swift/host/plugins -plugin-path /Applications/Xcode-15.2.0.app/Contents/Developer/Toolchains/XcodeDefault.xctoolchain/usr/local/lib/swift/host/plugins -o /Users/admin/builder/spi-builder-workspace/.derivedData/Build/Intermediates.noindex/meilisearch-swift.build/Debug-watchos/MeiliSearchIntegrationTests.build/Objects-normal/arm64/SearchTests.o -index-unit-output-path /meilisearch-swift.build/Debug-watchos/MeiliSearchIntegrationTests.build/Objects-normal/arm64/SearchTests.o -index-store-path /Users/admin/builder/spi-builder-workspace/.derivedData/Index.noindex/DataStore -index-system-modules
SwiftCompile normal arm64 /Users/admin/builder/spi-builder-workspace/Tests/MeiliSearchIntegrationTests/SearchTests.swift (in target 'MeiliSearchIntegrationTests' from project 'meilisearch-swift')
    cd /Users/admin/builder/spi-builder-workspace
    /Applications/Xcode-15.2.0.app/Contents/Developer/Toolchains/XcodeDefault.xctoolchain/usr/bin/swift-frontend -c /Users/admin/builder/spi-builder-workspace/Tests/MeiliSearchIntegrationTests/DocumentsTests.swift /Users/admin/builder/spi-builder-workspace/Tests/MeiliSearchIntegrationTests/DumpsTests.swift /Users/admin/builder/spi-builder-workspace/Tests/MeiliSearchIntegrationTests/IndexesTests.swift /Users/admin/builder/spi-builder-workspace/Tests/MeiliSearchIntegrationTests/KeysTests.swift -primary-file /Users/admin/builder/spi-builder-workspace/Tests/MeiliSearchIntegrationTests/SearchTests.swift /Users/admin/builder/spi-builder-workspace/Tests/MeiliSearchIntegrationTests/SettingsTests.swift /Users/admin/builder/spi-builder-workspace/Tests/MeiliSearchIntegrationTests/SnapshotsTests.swift /Users/admin/builder/spi-builder-workspace/Tests/MeiliSearchIntegrationTests/Support/Book.swift /Users/admin/builder/spi-builder-workspace/Tests/MeiliSearchIntegrationTests/Support/Movie.swift /Users/admin/builder/spi-builder-workspace/Tests/MeiliSearchIntegrationTests/Support/NestedBook.swift /Users/admin/builder/spi-builder-workspace/Tests/MeiliSearchIntegrationTests/TaskTests.swift /Users/admin/builder/spi-builder-workspace/Tests/MeiliSearchIntegrationTests/Utils.swift -emit-dependencies-path /Users/admin/builder/spi-builder-workspace/.derivedData/Build/Intermediates.noindex/meilisearch-swift.build/Debug-watchos/MeiliSearchIntegrationTests.build/Objects-normal/arm64/SearchTests.d -emit-const-values-path /Users/admin/builder/spi-builder-workspace/.derivedData/Build/Intermediates.noindex/meilisearch-swift.build/Debug-watchos/MeiliSearchIntegrationTests.build/Objects-normal/arm64/SearchTests.swiftconstvalues -emit-reference-dependencies-path /Users/admin/builder/spi-builder-workspace/.derivedData/Build/Intermediates.noindex/meilisearch-swift.build/Debug-watchos/MeiliSearchIntegrationTests.build/Objects-normal/arm64/SearchTests.swiftdeps -serialize-diagnostics-path /Users/admin/builder/spi-builder-workspace/.derivedData/Build/Intermediates.noindex/meilisearch-swift.build/Debug-watchos/MeiliSearchIntegrationTests.build/Objects-normal/arm64/SearchTests.dia -target arm64-apple-watchos5.0 -Xllvm -aarch64-use-tbi -enable-objc-interop -sdk /Applications/Xcode-15.2.0.app/Contents/Developer/Platforms/WatchOS.platform/Developer/SDKs/WatchOS10.2.sdk -I /Users/admin/builder/spi-builder-workspace/.derivedData/Build/Products/Debug-watchos -I /Applications/Xcode-15.2.0.app/Contents/Developer/Platforms/WatchOS.platform/Developer/usr/lib -F /Users/admin/builder/spi-builder-workspace/.derivedData/Build/Products/Debug-watchos/PackageFrameworks -F /Users/admin/builder/spi-builder-workspace/.derivedData/Build/Products/Debug-watchos -F /Applications/Xcode-15.2.0.app/Contents/Developer/Platforms/WatchOS.platform/Developer/Library/Frameworks -F /Applications/Xcode-15.2.0.app/Contents/Developer/Platforms/WatchOS.platform/Developer/SDKs/WatchOS10.2.sdk/Developer/Library/Frameworks -no-color-diagnostics -enable-testing -g -module-cache-path /Users/admin/builder/spi-builder-workspace/.derivedData/ModuleCache.noindex -profile-generate -profile-coverage-mapping -swift-version 5 -enforce-exclusivity\=checked -Onone -D SWIFT_PACKAGE -D DEBUG -D Xcode -serialize-debugging-options -const-gather-protocols-file /Users/admin/builder/spi-builder-workspace/.derivedData/Build/Intermediates.noindex/meilisearch-swift.build/Debug-watchos/MeiliSearchIntegrationTests.build/Objects-normal/arm64/MeiliSearchIntegrationTests_const_extract_protocols.json -empty-abi-descriptor -validate-clang-modules-once -clang-build-session-file /Users/admin/builder/spi-builder-workspace/.derivedData/ModuleCache.noindex/Session.modulevalidation -Xcc -working-directory -Xcc /Users/admin/builder/spi-builder-workspace -resource-dir /Applications/Xcode-15.2.0.app/Contents/Developer/Toolchains/XcodeDefault.xctoolchain/usr/lib/swift -enable-anonymous-context-mangled-names -Xcc -ivfsstatcache -Xcc /Users/admin/builder/spi-builder-workspace/.derivedData/SDKStatCaches.noindex/watchos10.2-21S355-1a03c8d25fc3596eb74c01d649b42752.sdkstatcache -Xcc -I/Users/admin/builder/spi-builder-workspace/.derivedData/Build/Products/Debug-watchos/include -Xcc -I/Users/admin/builder/spi-builder-workspace/.derivedData/Build/Intermediates.noindex/meilisearch-swift.build/Debug-watchos/MeiliSearchIntegrationTests.build/DerivedSources-normal/arm64 -Xcc -I/Users/admin/builder/spi-builder-workspace/.derivedData/Build/Intermediates.noindex/meilisearch-swift.build/Debug-watchos/MeiliSearchIntegrationTests.build/DerivedSources/arm64 -Xcc -I/Users/admin/builder/spi-builder-workspace/.derivedData/Build/Intermediates.noindex/meilisearch-swift.build/Debug-watchos/MeiliSearchIntegrationTests.build/DerivedSources -Xcc -DSWIFT_PACKAGE -Xcc -DDEBUG\=1 -module-name MeiliSearchIntegrationTests -frontend-parseable-output -disable-clang-spi -target-sdk-version 10.2 -target-sdk-name watchos10.2 -external-plugin-path /Applications/Xcode-15.2.0.app/Contents/Developer/Platforms/WatchOS.platform/Developer/SDKs/WatchOS10.2.sdk/usr/lib/swift/host/plugins\#/Applications/Xcode-15.2.0.app/Contents/Developer/Platforms/WatchOS.platform/Developer/SDKs/WatchOS10.2.sdk/usr/bin/swift-plugin-server -external-plugin-path /Applications/Xcode-15.2.0.app/Contents/Developer/Platforms/WatchOS.platform/Developer/SDKs/WatchOS10.2.sdk/usr/local/lib/swift/host/plugins\#/Applications/Xcode-15.2.0.app/Contents/Developer/Platforms/WatchOS.platform/Developer/SDKs/WatchOS10.2.sdk/usr/bin/swift-plugin-server -external-plugin-path /Applications/Xcode-15.2.0.app/Contents/Developer/Platforms/WatchOS.platform/Developer/usr/lib/swift/host/plugins\#/Applications/Xcode-15.2.0.app/Contents/Developer/Platforms/WatchOS.platform/Developer/usr/bin/swift-plugin-server -external-plugin-path /Applications/Xcode-15.2.0.app/Contents/Developer/Platforms/WatchOS.platform/Developer/usr/local/lib/swift/host/plugins\#/Applications/Xcode-15.2.0.app/Contents/Developer/Platforms/WatchOS.platform/Developer/usr/bin/swift-plugin-server -plugin-path /Applications/Xcode-15.2.0.app/Contents/Developer/Toolchains/XcodeDefault.xctoolchain/usr/lib/swift/host/plugins -plugin-path /Applications/Xcode-15.2.0.app/Contents/Developer/Toolchains/XcodeDefault.xctoolchain/usr/local/lib/swift/host/plugins -o /Users/admin/builder/spi-builder-workspace/.derivedData/Build/Intermediates.noindex/meilisearch-swift.build/Debug-watchos/MeiliSearchIntegrationTests.build/Objects-normal/arm64/SearchTests.o -index-unit-output-path /meilisearch-swift.build/Debug-watchos/MeiliSearchIntegrationTests.build/Objects-normal/arm64/SearchTests.o -index-store-path /Users/admin/builder/spi-builder-workspace/.derivedData/Index.noindex/DataStore -index-system-modules
SwiftCompile normal armv7k Compiling\ Book.swift /Users/admin/builder/spi-builder-workspace/Tests/MeiliSearchIntegrationTests/Support/Book.swift (in target 'MeiliSearchIntegrationTests' from project 'meilisearch-swift')
    cd /Users/admin/builder/spi-builder-workspace
    builtin-swiftTaskExecution -- /Applications/Xcode-15.2.0.app/Contents/Developer/Toolchains/XcodeDefault.xctoolchain/usr/bin/swift-frontend -frontend -c /Users/admin/builder/spi-builder-workspace/Tests/MeiliSearchIntegrationTests/DocumentsTests.swift /Users/admin/builder/spi-builder-workspace/Tests/MeiliSearchIntegrationTests/DumpsTests.swift /Users/admin/builder/spi-builder-workspace/Tests/MeiliSearchIntegrationTests/IndexesTests.swift /Users/admin/builder/spi-builder-workspace/Tests/MeiliSearchIntegrationTests/KeysTests.swift /Users/admin/builder/spi-builder-workspace/Tests/MeiliSearchIntegrationTests/SearchTests.swift /Users/admin/builder/spi-builder-workspace/Tests/MeiliSearchIntegrationTests/SettingsTests.swift /Users/admin/builder/spi-builder-workspace/Tests/MeiliSearchIntegrationTests/SnapshotsTests.swift -primary-file /Users/admin/builder/spi-builder-workspace/Tests/MeiliSearchIntegrationTests/Support/Book.swift /Users/admin/builder/spi-builder-workspace/Tests/MeiliSearchIntegrationTests/Support/Movie.swift /Users/admin/builder/spi-builder-workspace/Tests/MeiliSearchIntegrationTests/Support/NestedBook.swift /Users/admin/builder/spi-builder-workspace/Tests/MeiliSearchIntegrationTests/TaskTests.swift /Users/admin/builder/spi-builder-workspace/Tests/MeiliSearchIntegrationTests/Utils.swift -emit-dependencies-path /Users/admin/builder/spi-builder-workspace/.derivedData/Build/Intermediates.noindex/meilisearch-swift.build/Debug-watchos/MeiliSearchIntegrationTests.build/Objects-normal/armv7k/Book.d -emit-const-values-path /Users/admin/builder/spi-builder-workspace/.derivedData/Build/Intermediates.noindex/meilisearch-swift.build/Debug-watchos/MeiliSearchIntegrationTests.build/Objects-normal/armv7k/Book.swiftconstvalues -emit-reference-dependencies-path /Users/admin/builder/spi-builder-workspace/.derivedData/Build/Intermediates.noindex/meilisearch-swift.build/Debug-watchos/MeiliSearchIntegrationTests.build/Objects-normal/armv7k/Book.swiftdeps -serialize-diagnostics-path /Users/admin/builder/spi-builder-workspace/.derivedData/Build/Intermediates.noindex/meilisearch-swift.build/Debug-watchos/MeiliSearchIntegrationTests.build/Objects-normal/armv7k/Book.dia -target armv7k-apple-watchos5.0 -enable-objc-interop -sdk /Applications/Xcode-15.2.0.app/Contents/Developer/Platforms/WatchOS.platform/Developer/SDKs/WatchOS10.2.sdk -I /Users/admin/builder/spi-builder-workspace/.derivedData/Build/Products/Debug-watchos -I /Applications/Xcode-15.2.0.app/Contents/Developer/Platforms/WatchOS.platform/Developer/usr/lib -F /Users/admin/builder/spi-builder-workspace/.derivedData/Build/Products/Debug-watchos/PackageFrameworks -F /Users/admin/builder/spi-builder-workspace/.derivedData/Build/Products/Debug-watchos -F /Applications/Xcode-15.2.0.app/Contents/Developer/Platforms/WatchOS.platform/Developer/Library/Frameworks -F /Applications/Xcode-15.2.0.app/Contents/Developer/Platforms/WatchOS.platform/Developer/SDKs/WatchOS10.2.sdk/Developer/Library/Frameworks -no-color-diagnostics -enable-testing -g -module-cache-path /Users/admin/builder/spi-builder-workspace/.derivedData/ModuleCache.noindex -profile-generate -profile-coverage-mapping -swift-version 5 -enforce-exclusivity\=checked -Onone -D SWIFT_PACKAGE -D DEBUG -D Xcode -serialize-debugging-options -const-gather-protocols-file /Users/admin/builder/spi-builder-workspace/.derivedData/Build/Intermediates.noindex/meilisearch-swift.build/Debug-watchos/MeiliSearchIntegrationTests.build/Objects-normal/armv7k/MeiliSearchIntegrationTests_const_extract_protocols.json -empty-abi-descriptor -validate-clang-modules-once -clang-build-session-file /Users/admin/builder/spi-builder-workspace/.derivedData/ModuleCache.noindex/Session.modulevalidation -Xcc -working-directory -Xcc /Users/admin/builder/spi-builder-workspace -resource-dir /Applications/Xcode-15.2.0.app/Contents/Developer/Toolchains/XcodeDefault.xctoolchain/usr/lib/swift -enable-anonymous-context-mangled-names -Xcc -ivfsstatcache -Xcc /Users/admin/builder/spi-builder-workspace/.derivedData/SDKStatCaches.noindex/watchos10.2-21S355-1a03c8d25fc3596eb74c01d649b42752.sdkstatcache -Xcc -I/Users/admin/builder/spi-builder-workspace/.derivedData/Build/Products/Debug-watchos/include -Xcc -I/Users/admin/builder/spi-builder-workspace/.derivedData/Build/Intermediates.noindex/meilisearch-swift.build/Debug-watchos/MeiliSearchIntegrationTests.build/DerivedSources-normal/armv7k -Xcc -I/Users/admin/builder/spi-builder-workspace/.derivedData/Build/Intermediates.noindex/meilisearch-swift.build/Debug-watchos/MeiliSearchIntegrationTests.build/DerivedSources/armv7k -Xcc -I/Users/admin/builder/spi-builder-workspace/.derivedData/Build/Intermediates.noindex/meilisearch-swift.build/Debug-watchos/MeiliSearchIntegrationTests.build/DerivedSources -Xcc -DSWIFT_PACKAGE -Xcc -DDEBUG\=1 -module-name MeiliSearchIntegrationTests -frontend-parseable-output -disable-clang-spi -target-sdk-version 10.2 -target-sdk-name watchos10.2 -external-plugin-path /Applications/Xcode-15.2.0.app/Contents/Developer/Platforms/WatchOS.platform/Developer/SDKs/WatchOS10.2.sdk/usr/lib/swift/host/plugins\#/Applications/Xcode-15.2.0.app/Contents/Developer/Platforms/WatchOS.platform/Developer/SDKs/WatchOS10.2.sdk/usr/bin/swift-plugin-server -external-plugin-path /Applications/Xcode-15.2.0.app/Contents/Developer/Platforms/WatchOS.platform/Developer/SDKs/WatchOS10.2.sdk/usr/local/lib/swift/host/plugins\#/Applications/Xcode-15.2.0.app/Contents/Developer/Platforms/WatchOS.platform/Developer/SDKs/WatchOS10.2.sdk/usr/bin/swift-plugin-server -external-plugin-path /Applications/Xcode-15.2.0.app/Contents/Developer/Platforms/WatchOS.platform/Developer/usr/lib/swift/host/plugins\#/Applications/Xcode-15.2.0.app/Contents/Developer/Platforms/WatchOS.platform/Developer/usr/bin/swift-plugin-server -external-plugin-path /Applications/Xcode-15.2.0.app/Contents/Developer/Platforms/WatchOS.platform/Developer/usr/local/lib/swift/host/plugins\#/Applications/Xcode-15.2.0.app/Contents/Developer/Platforms/WatchOS.platform/Developer/usr/bin/swift-plugin-server -plugin-path /Applications/Xcode-15.2.0.app/Contents/Developer/Toolchains/XcodeDefault.xctoolchain/usr/lib/swift/host/plugins -plugin-path /Applications/Xcode-15.2.0.app/Contents/Developer/Toolchains/XcodeDefault.xctoolchain/usr/local/lib/swift/host/plugins -o /Users/admin/builder/spi-builder-workspace/.derivedData/Build/Intermediates.noindex/meilisearch-swift.build/Debug-watchos/MeiliSearchIntegrationTests.build/Objects-normal/armv7k/Book.o -index-unit-output-path /meilisearch-swift.build/Debug-watchos/MeiliSearchIntegrationTests.build/Objects-normal/armv7k/Book.o -index-store-path /Users/admin/builder/spi-builder-workspace/.derivedData/Index.noindex/DataStore -index-system-modules
SwiftCompile normal armv7k /Users/admin/builder/spi-builder-workspace/Tests/MeiliSearchIntegrationTests/Support/Book.swift (in target 'MeiliSearchIntegrationTests' from project 'meilisearch-swift')
    cd /Users/admin/builder/spi-builder-workspace
    /Applications/Xcode-15.2.0.app/Contents/Developer/Toolchains/XcodeDefault.xctoolchain/usr/bin/swift-frontend -c /Users/admin/builder/spi-builder-workspace/Tests/MeiliSearchIntegrationTests/DocumentsTests.swift /Users/admin/builder/spi-builder-workspace/Tests/MeiliSearchIntegrationTests/DumpsTests.swift /Users/admin/builder/spi-builder-workspace/Tests/MeiliSearchIntegrationTests/IndexesTests.swift /Users/admin/builder/spi-builder-workspace/Tests/MeiliSearchIntegrationTests/KeysTests.swift /Users/admin/builder/spi-builder-workspace/Tests/MeiliSearchIntegrationTests/SearchTests.swift /Users/admin/builder/spi-builder-workspace/Tests/MeiliSearchIntegrationTests/SettingsTests.swift /Users/admin/builder/spi-builder-workspace/Tests/MeiliSearchIntegrationTests/SnapshotsTests.swift -primary-file /Users/admin/builder/spi-builder-workspace/Tests/MeiliSearchIntegrationTests/Support/Book.swift /Users/admin/builder/spi-builder-workspace/Tests/MeiliSearchIntegrationTests/Support/Movie.swift /Users/admin/builder/spi-builder-workspace/Tests/MeiliSearchIntegrationTests/Support/NestedBook.swift /Users/admin/builder/spi-builder-workspace/Tests/MeiliSearchIntegrationTests/TaskTests.swift /Users/admin/builder/spi-builder-workspace/Tests/MeiliSearchIntegrationTests/Utils.swift -emit-dependencies-path /Users/admin/builder/spi-builder-workspace/.derivedData/Build/Intermediates.noindex/meilisearch-swift.build/Debug-watchos/MeiliSearchIntegrationTests.build/Objects-normal/armv7k/Book.d -emit-const-values-path /Users/admin/builder/spi-builder-workspace/.derivedData/Build/Intermediates.noindex/meilisearch-swift.build/Debug-watchos/MeiliSearchIntegrationTests.build/Objects-normal/armv7k/Book.swiftconstvalues -emit-reference-dependencies-path /Users/admin/builder/spi-builder-workspace/.derivedData/Build/Intermediates.noindex/meilisearch-swift.build/Debug-watchos/MeiliSearchIntegrationTests.build/Objects-normal/armv7k/Book.swiftdeps -serialize-diagnostics-path /Users/admin/builder/spi-builder-workspace/.derivedData/Build/Intermediates.noindex/meilisearch-swift.build/Debug-watchos/MeiliSearchIntegrationTests.build/Objects-normal/armv7k/Book.dia -target armv7k-apple-watchos5.0 -enable-objc-interop -sdk /Applications/Xcode-15.2.0.app/Contents/Developer/Platforms/WatchOS.platform/Developer/SDKs/WatchOS10.2.sdk -I /Users/admin/builder/spi-builder-workspace/.derivedData/Build/Products/Debug-watchos -I /Applications/Xcode-15.2.0.app/Contents/Developer/Platforms/WatchOS.platform/Developer/usr/lib -F /Users/admin/builder/spi-builder-workspace/.derivedData/Build/Products/Debug-watchos/PackageFrameworks -F /Users/admin/builder/spi-builder-workspace/.derivedData/Build/Products/Debug-watchos -F /Applications/Xcode-15.2.0.app/Contents/Developer/Platforms/WatchOS.platform/Developer/Library/Frameworks -F /Applications/Xcode-15.2.0.app/Contents/Developer/Platforms/WatchOS.platform/Developer/SDKs/WatchOS10.2.sdk/Developer/Library/Frameworks -no-color-diagnostics -enable-testing -g -module-cache-path /Users/admin/builder/spi-builder-workspace/.derivedData/ModuleCache.noindex -profile-generate -profile-coverage-mapping -swift-version 5 -enforce-exclusivity\=checked -Onone -D SWIFT_PACKAGE -D DEBUG -D Xcode -serialize-debugging-options -const-gather-protocols-file /Users/admin/builder/spi-builder-workspace/.derivedData/Build/Intermediates.noindex/meilisearch-swift.build/Debug-watchos/MeiliSearchIntegrationTests.build/Objects-normal/armv7k/MeiliSearchIntegrationTests_const_extract_protocols.json -empty-abi-descriptor -validate-clang-modules-once -clang-build-session-file /Users/admin/builder/spi-builder-workspace/.derivedData/ModuleCache.noindex/Session.modulevalidation -Xcc -working-directory -Xcc /Users/admin/builder/spi-builder-workspace -resource-dir /Applications/Xcode-15.2.0.app/Contents/Developer/Toolchains/XcodeDefault.xctoolchain/usr/lib/swift -enable-anonymous-context-mangled-names -Xcc -ivfsstatcache -Xcc /Users/admin/builder/spi-builder-workspace/.derivedData/SDKStatCaches.noindex/watchos10.2-21S355-1a03c8d25fc3596eb74c01d649b42752.sdkstatcache -Xcc -I/Users/admin/builder/spi-builder-workspace/.derivedData/Build/Products/Debug-watchos/include -Xcc -I/Users/admin/builder/spi-builder-workspace/.derivedData/Build/Intermediates.noindex/meilisearch-swift.build/Debug-watchos/MeiliSearchIntegrationTests.build/DerivedSources-normal/armv7k -Xcc -I/Users/admin/builder/spi-builder-workspace/.derivedData/Build/Intermediates.noindex/meilisearch-swift.build/Debug-watchos/MeiliSearchIntegrationTests.build/DerivedSources/armv7k -Xcc -I/Users/admin/builder/spi-builder-workspace/.derivedData/Build/Intermediates.noindex/meilisearch-swift.build/Debug-watchos/MeiliSearchIntegrationTests.build/DerivedSources -Xcc -DSWIFT_PACKAGE -Xcc -DDEBUG\=1 -module-name MeiliSearchIntegrationTests -frontend-parseable-output -disable-clang-spi -target-sdk-version 10.2 -target-sdk-name watchos10.2 -external-plugin-path /Applications/Xcode-15.2.0.app/Contents/Developer/Platforms/WatchOS.platform/Developer/SDKs/WatchOS10.2.sdk/usr/lib/swift/host/plugins\#/Applications/Xcode-15.2.0.app/Contents/Developer/Platforms/WatchOS.platform/Developer/SDKs/WatchOS10.2.sdk/usr/bin/swift-plugin-server -external-plugin-path /Applications/Xcode-15.2.0.app/Contents/Developer/Platforms/WatchOS.platform/Developer/SDKs/WatchOS10.2.sdk/usr/local/lib/swift/host/plugins\#/Applications/Xcode-15.2.0.app/Contents/Developer/Platforms/WatchOS.platform/Developer/SDKs/WatchOS10.2.sdk/usr/bin/swift-plugin-server -external-plugin-path /Applications/Xcode-15.2.0.app/Contents/Developer/Platforms/WatchOS.platform/Developer/usr/lib/swift/host/plugins\#/Applications/Xcode-15.2.0.app/Contents/Developer/Platforms/WatchOS.platform/Developer/usr/bin/swift-plugin-server -external-plugin-path /Applications/Xcode-15.2.0.app/Contents/Developer/Platforms/WatchOS.platform/Developer/usr/local/lib/swift/host/plugins\#/Applications/Xcode-15.2.0.app/Contents/Developer/Platforms/WatchOS.platform/Developer/usr/bin/swift-plugin-server -plugin-path /Applications/Xcode-15.2.0.app/Contents/Developer/Toolchains/XcodeDefault.xctoolchain/usr/lib/swift/host/plugins -plugin-path /Applications/Xcode-15.2.0.app/Contents/Developer/Toolchains/XcodeDefault.xctoolchain/usr/local/lib/swift/host/plugins -o /Users/admin/builder/spi-builder-workspace/.derivedData/Build/Intermediates.noindex/meilisearch-swift.build/Debug-watchos/MeiliSearchIntegrationTests.build/Objects-normal/armv7k/Book.o -index-unit-output-path /meilisearch-swift.build/Debug-watchos/MeiliSearchIntegrationTests.build/Objects-normal/armv7k/Book.o -index-store-path /Users/admin/builder/spi-builder-workspace/.derivedData/Index.noindex/DataStore -index-system-modules
SwiftEmitModule normal arm64 Emitting\ module\ for\ MeiliSearchUnitTests (in target 'MeiliSearchUnitTests' from project 'meilisearch-swift')
    cd /Users/admin/builder/spi-builder-workspace
    builtin-swiftTaskExecution -- /Applications/Xcode-15.2.0.app/Contents/Developer/Toolchains/XcodeDefault.xctoolchain/usr/bin/swift-frontend -frontend -emit-module -experimental-skip-non-inlinable-function-bodies-without-types /Users/admin/builder/spi-builder-workspace/Tests/MeiliSearchUnitTests/ClientTests.swift /Users/admin/builder/spi-builder-workspace/Tests/MeiliSearchUnitTests/DocumentsTests.swift /Users/admin/builder/spi-builder-workspace/Tests/MeiliSearchUnitTests/DumpsTests.swift /Users/admin/builder/spi-builder-workspace/Tests/MeiliSearchUnitTests/FormatterTests.swift /Users/admin/builder/spi-builder-workspace/Tests/MeiliSearchUnitTests/IndexesTests.swift /Users/admin/builder/spi-builder-workspace/Tests/MeiliSearchUnitTests/KeyParamsTests.swift /Users/admin/builder/spi-builder-workspace/Tests/MeiliSearchUnitTests/KeysTests.swift /Users/admin/builder/spi-builder-workspace/Tests/MeiliSearchUnitTests/MockURLSession.swift /Users/admin/builder/spi-builder-workspace/Tests/MeiliSearchUnitTests/PackageVersionTests.swift /Users/admin/builder/spi-builder-workspace/Tests/MeiliSearchUnitTests/QueryParameters/DocumentsQueryTests.swift /Users/admin/builder/spi-builder-workspace/Tests/MeiliSearchUnitTests/QueryParameters/IndexesQueryTests.swift /Users/admin/builder/spi-builder-workspace/Tests/MeiliSearchUnitTests/QueryParameters/KeysQueryTests.swift /Users/admin/builder/spi-builder-workspace/Tests/MeiliSearchUnitTests/QueryParameters/TasksQueryTests.swift /Users/admin/builder/spi-builder-workspace/Tests/MeiliSearchUnitTests/SearchTests.swift /Users/admin/builder/spi-builder-workspace/Tests/MeiliSearchUnitTests/SettingsTests.swift /Users/admin/builder/spi-builder-workspace/Tests/MeiliSearchUnitTests/SnapshotsTests.swift /Users/admin/builder/spi-builder-workspace/Tests/MeiliSearchUnitTests/StatsTests.swift /Users/admin/builder/spi-builder-workspace/Tests/MeiliSearchUnitTests/SystemTests.swift /Users/admin/builder/spi-builder-workspace/Tests/MeiliSearchUnitTests/TasksTests.swift /Users/admin/builder/spi-builder-workspace/Tests/MeiliSearchUnitTests/Utils.swift -target arm64-apple-watchos5.0 -Xllvm -aarch64-use-tbi -enable-objc-interop -sdk /Applications/Xcode-15.2.0.app/Contents/Developer/Platforms/WatchOS.platform/Developer/SDKs/WatchOS10.2.sdk -I /Users/admin/builder/spi-builder-workspace/.derivedData/Build/Products/Debug-watchos -I /Applications/Xcode-15.2.0.app/Contents/Developer/Platforms/WatchOS.platform/Developer/usr/lib -F /Users/admin/builder/spi-builder-workspace/.derivedData/Build/Products/Debug-watchos/PackageFrameworks -F /Users/admin/builder/spi-builder-workspace/.derivedData/Build/Products/Debug-watchos -F /Applications/Xcode-15.2.0.app/Contents/Developer/Platforms/WatchOS.platform/Developer/Library/Frameworks -F /Applications/Xcode-15.2.0.app/Contents/Developer/Platforms/WatchOS.platform/Developer/SDKs/WatchOS10.2.sdk/Developer/Library/Frameworks -no-color-diagnostics -enable-testing -g -module-cache-path /Users/admin/builder/spi-builder-workspace/.derivedData/ModuleCache.noindex -profile-generate -profile-coverage-mapping -swift-version 5 -enforce-exclusivity\=checked -Onone -D SWIFT_PACKAGE -D DEBUG -D Xcode -serialize-debugging-options -const-gather-protocols-file /Users/admin/builder/spi-builder-workspace/.derivedData/Build/Intermediates.noindex/meilisearch-swift.build/Debug-watchos/MeiliSearchUnitTests.build/Objects-normal/arm64/MeiliSearchUnitTests_const_extract_protocols.json -empty-abi-descriptor -validate-clang-modules-once -clang-build-session-file /Users/admin/builder/spi-builder-workspace/.derivedData/ModuleCache.noindex/Session.modulevalidation -Xcc -working-directory -Xcc /Users/admin/builder/spi-builder-workspace -resource-dir /Applications/Xcode-15.2.0.app/Contents/Developer/Toolchains/XcodeDefault.xctoolchain/usr/lib/swift -enable-anonymous-context-mangled-names -Xcc -ivfsstatcache -Xcc /Users/admin/builder/spi-builder-workspace/.derivedData/SDKStatCaches.noindex/watchos10.2-21S355-1a03c8d25fc3596eb74c01d649b42752.sdkstatcache -Xcc -I/Users/admin/builder/spi-builder-workspace/.derivedData/Build/Products/Debug-watchos/include -Xcc -I/Users/admin/builder/spi-builder-workspace/.derivedData/Build/Intermediates.noindex/meilisearch-swift.build/Debug-watchos/MeiliSearchUnitTests.build/DerivedSources-normal/arm64 -Xcc -I/Users/admin/builder/spi-builder-workspace/.derivedData/Build/Intermediates.noindex/meilisearch-swift.build/Debug-watchos/MeiliSearchUnitTests.build/DerivedSources/arm64 -Xcc -I/Users/admin/builder/spi-builder-workspace/.derivedData/Build/Intermediates.noindex/meilisearch-swift.build/Debug-watchos/MeiliSearchUnitTests.build/DerivedSources -Xcc -DSWIFT_PACKAGE -Xcc -DDEBUG\=1 -module-name MeiliSearchUnitTests -disable-clang-spi -target-sdk-version 10.2 -target-sdk-name watchos10.2 -external-plugin-path /Applications/Xcode-15.2.0.app/Contents/Developer/Platforms/WatchOS.platform/Developer/SDKs/WatchOS10.2.sdk/usr/lib/swift/host/plugins\#/Applications/Xcode-15.2.0.app/Contents/Developer/Platforms/WatchOS.platform/Developer/SDKs/WatchOS10.2.sdk/usr/bin/swift-plugin-server -external-plugin-path /Applications/Xcode-15.2.0.app/Contents/Developer/Platforms/WatchOS.platform/Developer/SDKs/WatchOS10.2.sdk/usr/local/lib/swift/host/plugins\#/Applications/Xcode-15.2.0.app/Contents/Developer/Platforms/WatchOS.platform/Developer/SDKs/WatchOS10.2.sdk/usr/bin/swift-plugin-server -external-plugin-path /Applications/Xcode-15.2.0.app/Contents/Developer/Platforms/WatchOS.platform/Developer/usr/lib/swift/host/plugins\#/Applications/Xcode-15.2.0.app/Contents/Developer/Platforms/WatchOS.platform/Developer/usr/bin/swift-plugin-server -external-plugin-path /Applications/Xcode-15.2.0.app/Contents/Developer/Platforms/WatchOS.platform/Developer/usr/local/lib/swift/host/plugins\#/Applications/Xcode-15.2.0.app/Contents/Developer/Platforms/WatchOS.platform/Developer/usr/bin/swift-plugin-server -plugin-path /Applications/Xcode-15.2.0.app/Contents/Developer/Toolchains/XcodeDefault.xctoolchain/usr/lib/swift/host/plugins -plugin-path /Applications/Xcode-15.2.0.app/Contents/Developer/Toolchains/XcodeDefault.xctoolchain/usr/local/lib/swift/host/plugins -emit-module-doc-path /Users/admin/builder/spi-builder-workspace/.derivedData/Build/Intermediates.noindex/meilisearch-swift.build/Debug-watchos/MeiliSearchUnitTests.build/Objects-normal/arm64/MeiliSearchUnitTests.swiftdoc -emit-module-source-info-path /Users/admin/builder/spi-builder-workspace/.derivedData/Build/Intermediates.noindex/meilisearch-swift.build/Debug-watchos/MeiliSearchUnitTests.build/Objects-normal/arm64/MeiliSearchUnitTests.swiftsourceinfo -serialize-diagnostics-path /Users/admin/builder/spi-builder-workspace/.derivedData/Build/Intermediates.noindex/meilisearch-swift.build/Debug-watchos/MeiliSearchUnitTests.build/Objects-normal/arm64/MeiliSearchUnitTests-master-emit-module.dia -emit-dependencies-path /Users/admin/builder/spi-builder-workspace/.derivedData/Build/Intermediates.noindex/meilisearch-swift.build/Debug-watchos/MeiliSearchUnitTests.build/Objects-normal/arm64/MeiliSearchUnitTests-master-emit-module.d -o /Users/admin/builder/spi-builder-workspace/.derivedData/Build/Intermediates.noindex/meilisearch-swift.build/Debug-watchos/MeiliSearchUnitTests.build/Objects-normal/arm64/MeiliSearchUnitTests.swiftmodule -emit-abi-descriptor-path /Users/admin/builder/spi-builder-workspace/.derivedData/Build/Intermediates.noindex/meilisearch-swift.build/Debug-watchos/MeiliSearchUnitTests.build/Objects-normal/arm64/MeiliSearchUnitTests.abi.json
SwiftEmitModule normal arm64_32 Emitting\ module\ for\ MeiliSearchUnitTests (in target 'MeiliSearchUnitTests' from project 'meilisearch-swift')
    cd /Users/admin/builder/spi-builder-workspace
    builtin-swiftTaskExecution -- /Applications/Xcode-15.2.0.app/Contents/Developer/Toolchains/XcodeDefault.xctoolchain/usr/bin/swift-frontend -frontend -emit-module -experimental-skip-non-inlinable-function-bodies-without-types /Users/admin/builder/spi-builder-workspace/Tests/MeiliSearchUnitTests/ClientTests.swift /Users/admin/builder/spi-builder-workspace/Tests/MeiliSearchUnitTests/DocumentsTests.swift /Users/admin/builder/spi-builder-workspace/Tests/MeiliSearchUnitTests/DumpsTests.swift /Users/admin/builder/spi-builder-workspace/Tests/MeiliSearchUnitTests/FormatterTests.swift /Users/admin/builder/spi-builder-workspace/Tests/MeiliSearchUnitTests/IndexesTests.swift /Users/admin/builder/spi-builder-workspace/Tests/MeiliSearchUnitTests/KeyParamsTests.swift /Users/admin/builder/spi-builder-workspace/Tests/MeiliSearchUnitTests/KeysTests.swift /Users/admin/builder/spi-builder-workspace/Tests/MeiliSearchUnitTests/MockURLSession.swift /Users/admin/builder/spi-builder-workspace/Tests/MeiliSearchUnitTests/PackageVersionTests.swift /Users/admin/builder/spi-builder-workspace/Tests/MeiliSearchUnitTests/QueryParameters/DocumentsQueryTests.swift /Users/admin/builder/spi-builder-workspace/Tests/MeiliSearchUnitTests/QueryParameters/IndexesQueryTests.swift /Users/admin/builder/spi-builder-workspace/Tests/MeiliSearchUnitTests/QueryParameters/KeysQueryTests.swift /Users/admin/builder/spi-builder-workspace/Tests/MeiliSearchUnitTests/QueryParameters/TasksQueryTests.swift /Users/admin/builder/spi-builder-workspace/Tests/MeiliSearchUnitTests/SearchTests.swift /Users/admin/builder/spi-builder-workspace/Tests/MeiliSearchUnitTests/SettingsTests.swift /Users/admin/builder/spi-builder-workspace/Tests/MeiliSearchUnitTests/SnapshotsTests.swift /Users/admin/builder/spi-builder-workspace/Tests/MeiliSearchUnitTests/StatsTests.swift /Users/admin/builder/spi-builder-workspace/Tests/MeiliSearchUnitTests/SystemTests.swift /Users/admin/builder/spi-builder-workspace/Tests/MeiliSearchUnitTests/TasksTests.swift /Users/admin/builder/spi-builder-workspace/Tests/MeiliSearchUnitTests/Utils.swift -target arm64_32-apple-watchos5.0 -enable-objc-interop -sdk /Applications/Xcode-15.2.0.app/Contents/Developer/Platforms/WatchOS.platform/Developer/SDKs/WatchOS10.2.sdk -I /Users/admin/builder/spi-builder-workspace/.derivedData/Build/Products/Debug-watchos -I /Applications/Xcode-15.2.0.app/Contents/Developer/Platforms/WatchOS.platform/Developer/usr/lib -F /Users/admin/builder/spi-builder-workspace/.derivedData/Build/Products/Debug-watchos/PackageFrameworks -F /Users/admin/builder/spi-builder-workspace/.derivedData/Build/Products/Debug-watchos -F /Applications/Xcode-15.2.0.app/Contents/Developer/Platforms/WatchOS.platform/Developer/Library/Frameworks -F /Applications/Xcode-15.2.0.app/Contents/Developer/Platforms/WatchOS.platform/Developer/SDKs/WatchOS10.2.sdk/Developer/Library/Frameworks -no-color-diagnostics -enable-testing -g -module-cache-path /Users/admin/builder/spi-builder-workspace/.derivedData/ModuleCache.noindex -profile-generate -profile-coverage-mapping -swift-version 5 -enforce-exclusivity\=checked -Onone -D SWIFT_PACKAGE -D DEBUG -D Xcode -serialize-debugging-options -const-gather-protocols-file /Users/admin/builder/spi-builder-workspace/.derivedData/Build/Intermediates.noindex/meilisearch-swift.build/Debug-watchos/MeiliSearchUnitTests.build/Objects-normal/arm64_32/MeiliSearchUnitTests_const_extract_protocols.json -empty-abi-descriptor -validate-clang-modules-once -clang-build-session-file /Users/admin/builder/spi-builder-workspace/.derivedData/ModuleCache.noindex/Session.modulevalidation -Xcc -working-directory -Xcc /Users/admin/builder/spi-builder-workspace -resource-dir /Applications/Xcode-15.2.0.app/Contents/Developer/Toolchains/XcodeDefault.xctoolchain/usr/lib/swift -enable-anonymous-context-mangled-names -Xcc -ivfsstatcache -Xcc /Users/admin/builder/spi-builder-workspace/.derivedData/SDKStatCaches.noindex/watchos10.2-21S355-1a03c8d25fc3596eb74c01d649b42752.sdkstatcache -Xcc -I/Users/admin/builder/spi-builder-workspace/.derivedData/Build/Products/Debug-watchos/include -Xcc -I/Users/admin/builder/spi-builder-workspace/.derivedData/Build/Intermediates.noindex/meilisearch-swift.build/Debug-watchos/MeiliSearchUnitTests.build/DerivedSources-normal/arm64_32 -Xcc -I/Users/admin/builder/spi-builder-workspace/.derivedData/Build/Intermediates.noindex/meilisearch-swift.build/Debug-watchos/MeiliSearchUnitTests.build/DerivedSources/arm64_32 -Xcc -I/Users/admin/builder/spi-builder-workspace/.derivedData/Build/Intermediates.noindex/meilisearch-swift.build/Debug-watchos/MeiliSearchUnitTests.build/DerivedSources -Xcc -DSWIFT_PACKAGE -Xcc -DDEBUG\=1 -module-name MeiliSearchUnitTests -disable-clang-spi -target-sdk-version 10.2 -target-sdk-name watchos10.2 -external-plugin-path /Applications/Xcode-15.2.0.app/Contents/Developer/Platforms/WatchOS.platform/Developer/SDKs/WatchOS10.2.sdk/usr/lib/swift/host/plugins\#/Applications/Xcode-15.2.0.app/Contents/Developer/Platforms/WatchOS.platform/Developer/SDKs/WatchOS10.2.sdk/usr/bin/swift-plugin-server -external-plugin-path /Applications/Xcode-15.2.0.app/Contents/Developer/Platforms/WatchOS.platform/Developer/SDKs/WatchOS10.2.sdk/usr/local/lib/swift/host/plugins\#/Applications/Xcode-15.2.0.app/Contents/Developer/Platforms/WatchOS.platform/Developer/SDKs/WatchOS10.2.sdk/usr/bin/swift-plugin-server -external-plugin-path /Applications/Xcode-15.2.0.app/Contents/Developer/Platforms/WatchOS.platform/Developer/usr/lib/swift/host/plugins\#/Applications/Xcode-15.2.0.app/Contents/Developer/Platforms/WatchOS.platform/Developer/usr/bin/swift-plugin-server -external-plugin-path /Applications/Xcode-15.2.0.app/Contents/Developer/Platforms/WatchOS.platform/Developer/usr/local/lib/swift/host/plugins\#/Applications/Xcode-15.2.0.app/Contents/Developer/Platforms/WatchOS.platform/Developer/usr/bin/swift-plugin-server -plugin-path /Applications/Xcode-15.2.0.app/Contents/Developer/Toolchains/XcodeDefault.xctoolchain/usr/lib/swift/host/plugins -plugin-path /Applications/Xcode-15.2.0.app/Contents/Developer/Toolchains/XcodeDefault.xctoolchain/usr/local/lib/swift/host/plugins -emit-module-doc-path /Users/admin/builder/spi-builder-workspace/.derivedData/Build/Intermediates.noindex/meilisearch-swift.build/Debug-watchos/MeiliSearchUnitTests.build/Objects-normal/arm64_32/MeiliSearchUnitTests.swiftdoc -emit-module-source-info-path /Users/admin/builder/spi-builder-workspace/.derivedData/Build/Intermediates.noindex/meilisearch-swift.build/Debug-watchos/MeiliSearchUnitTests.build/Objects-normal/arm64_32/MeiliSearchUnitTests.swiftsourceinfo -serialize-diagnostics-path /Users/admin/builder/spi-builder-workspace/.derivedData/Build/Intermediates.noindex/meilisearch-swift.build/Debug-watchos/MeiliSearchUnitTests.build/Objects-normal/arm64_32/MeiliSearchUnitTests-master-emit-module.dia -emit-dependencies-path /Users/admin/builder/spi-builder-workspace/.derivedData/Build/Intermediates.noindex/meilisearch-swift.build/Debug-watchos/MeiliSearchUnitTests.build/Objects-normal/arm64_32/MeiliSearchUnitTests-master-emit-module.d -o /Users/admin/builder/spi-builder-workspace/.derivedData/Build/Intermediates.noindex/meilisearch-swift.build/Debug-watchos/MeiliSearchUnitTests.build/Objects-normal/arm64_32/MeiliSearchUnitTests.swiftmodule -emit-abi-descriptor-path /Users/admin/builder/spi-builder-workspace/.derivedData/Build/Intermediates.noindex/meilisearch-swift.build/Debug-watchos/MeiliSearchUnitTests.build/Objects-normal/arm64_32/MeiliSearchUnitTests.abi.json
/Users/admin/builder/spi-builder-workspace/Tests/MeiliSearchUnitTests/DocumentsTests.swift:34:27: error: concurrency is only available in watchOS 6.0.0 or newer
  func testAddDocuments() async throws {
                          ^
/Users/admin/builder/spi-builder-workspace/Tests/MeiliSearchUnitTests/DocumentsTests.swift:34:8: note: add @available attribute to enclosing instance method
  func testAddDocuments() async throws {
       ^
/Users/admin/builder/spi-builder-workspace/Tests/MeiliSearchUnitTests/DocumentsTests.swift:22:7: note: add @available attribute to enclosing class
class DocumentsTests: XCTestCase {
      ^
/Users/admin/builder/spi-builder-workspace/Tests/MeiliSearchUnitTests/DocumentsTests.swift:55:31: error: concurrency is only available in watchOS 6.0.0 or newer
  func testAddDataDocuments() async throws {
                              ^
/Users/admin/builder/spi-builder-workspace/Tests/MeiliSearchUnitTests/DocumentsTests.swift:55:8: note: add @available attribute to enclosing instance method
  func testAddDataDocuments() async throws {
       ^
/Users/admin/builder/spi-builder-workspace/Tests/MeiliSearchUnitTests/DocumentsTests.swift:22:7: note: add @available attribute to enclosing class
class DocumentsTests: XCTestCase {
      ^
/Users/admin/builder/spi-builder-workspace/Tests/MeiliSearchUnitTests/DocumentsTests.swift:82:34: error: concurrency is only available in watchOS 6.0.0 or newer
  func testUpdateDataDocuments() async throws {
                                 ^
/Users/admin/builder/spi-builder-workspace/Tests/MeiliSearchUnitTests/DocumentsTests.swift:82:8: note: add @available attribute to enclosing instance method
  func testUpdateDataDocuments() async throws {
       ^
/Users/admin/builder/spi-builder-workspace/Tests/MeiliSearchUnitTests/DocumentsTests.swift:22:7: note: add @available attribute to enclosing class
class DocumentsTests: XCTestCase {
      ^
/Users/admin/builder/spi-builder-workspace/Tests/MeiliSearchUnitTests/DocumentsTests.swift:105:30: error: concurrency is only available in watchOS 6.0.0 or newer
  func testUpdateDocuments() async throws {
                             ^
/Users/admin/builder/spi-builder-workspace/Tests/MeiliSearchUnitTests/DocumentsTests.swift:105:8: note: add @available attribute to enclosing instance method
  func testUpdateDocuments() async throws {
       ^
/Users/admin/builder/spi-builder-workspace/Tests/MeiliSearchUnitTests/DocumentsTests.swift:22:7: note: add @available attribute to enclosing class
class DocumentsTests: XCTestCase {
      ^
/Users/admin/builder/spi-builder-workspace/Tests/MeiliSearchUnitTests/DocumentsTests.swift:126:26: error: concurrency is only available in watchOS 6.0.0 or newer
  func testGetDocument() async throws {
                         ^
/Users/admin/builder/spi-builder-workspace/Tests/MeiliSearchUnitTests/DocumentsTests.swift:126:8: note: add @available attribute to enclosing instance method
  func testGetDocument() async throws {
       ^
/Users/admin/builder/spi-builder-workspace/Tests/MeiliSearchUnitTests/DocumentsTests.swift:22:7: note: add @available attribute to enclosing class
class DocumentsTests: XCTestCase {
      ^
/Users/admin/builder/spi-builder-workspace/Tests/MeiliSearchUnitTests/DocumentsTests.swift:147:45: error: concurrency is only available in watchOS 6.0.0 or newer
  func testGetDocumentWithSparseFieldsets() async throws {
                                            ^
/Users/admin/builder/spi-builder-workspace/Tests/MeiliSearchUnitTests/DocumentsTests.swift:147:8: note: add @available attribute to enclosing instance method
  func testGetDocumentWithSparseFieldsets() async throws {
       ^
/Users/admin/builder/spi-builder-workspace/Tests/MeiliSearchUnitTests/DocumentsTests.swift:22:7: note: add @available attribute to enclosing class
class DocumentsTests: XCTestCase {
      ^
/Users/admin/builder/spi-builder-workspace/Tests/MeiliSearchUnitTests/DocumentsTests.swift:168:41: error: concurrency is only available in watchOS 6.0.0 or newer
  func testGetDocumentsWithParameters() async throws {
                                        ^
/Users/admin/builder/spi-builder-workspace/Tests/MeiliSearchUnitTests/DocumentsTests.swift:168:8: note: add @available attribute to enclosing instance method
  func testGetDocumentsWithParameters() async throws {
       ^
/Users/admin/builder/spi-builder-workspace/Tests/MeiliSearchUnitTests/DocumentsTests.swift:22:7: note: add @available attribute to enclosing class
class DocumentsTests: XCTestCase {
      ^
/Users/admin/builder/spi-builder-workspace/Tests/MeiliSearchUnitTests/DocumentsTests.swift:186:27: error: concurrency is only available in watchOS 6.0.0 or newer
  func testGetDocuments() async throws {
                          ^
/Users/admin/builder/spi-builder-workspace/Tests/MeiliSearchUnitTests/DocumentsTests.swift:186:8: note: add @available attribute to enclosing instance method
  func testGetDocuments() async throws {
       ^
/Users/admin/builder/spi-builder-workspace/Tests/MeiliSearchUnitTests/DocumentsTests.swift:22:7: note: add @available attribute to enclosing class
class DocumentsTests: XCTestCase {
      ^
/Users/admin/builder/spi-builder-workspace/Tests/MeiliSearchUnitTests/DocumentsTests.swift:220:29: error: concurrency is only available in watchOS 6.0.0 or newer
  func testDeleteDocument() async throws {
                            ^
/Users/admin/builder/spi-builder-workspace/Tests/MeiliSearchUnitTests/DocumentsTests.swift:220:8: note: add @available attribute to enclosing instance method
  func testDeleteDocument() async throws {
       ^
/Users/admin/builder/spi-builder-workspace/Tests/MeiliSearchUnitTests/DocumentsTests.swift:22:7: note: add @available attribute to enclosing class
class DocumentsTests: XCTestCase {
      ^
/Users/admin/builder/spi-builder-workspace/Tests/MeiliSearchUnitTests/DocumentsTests.swift:235:33: error: concurrency is only available in watchOS 6.0.0 or newer
  func testDeleteAllDocuments() async throws {
                                ^
/Users/admin/builder/spi-builder-workspace/Tests/MeiliSearchUnitTests/DocumentsTests.swift:235:8: note: add @available attribute to enclosing instance method
  func testDeleteAllDocuments() async throws {
       ^
/Users/admin/builder/spi-builder-workspace/Tests/MeiliSearchUnitTests/DocumentsTests.swift:22:7: note: add @available attribute to enclosing class
class DocumentsTests: XCTestCase {
      ^
/Users/admin/builder/spi-builder-workspace/Tests/MeiliSearchUnitTests/DocumentsTests.swift:249:35: error: concurrency is only available in watchOS 6.0.0 or newer
  func testDeleteBatchDocuments() async throws {
                                  ^
/Users/admin/builder/spi-builder-workspace/Tests/MeiliSearchUnitTests/DocumentsTests.swift:249:8: note: add @available attribute to enclosing instance method
  func testDeleteBatchDocuments() async throws {
       ^
/Users/admin/builder/spi-builder-workspace/Tests/MeiliSearchUnitTests/DocumentsTests.swift:22:7: note: add @available attribute to enclosing class
class DocumentsTests: XCTestCase {
      ^
/Users/admin/builder/spi-builder-workspace/Tests/MeiliSearchUnitTests/DumpsTests.swift:13:25: error: concurrency is only available in watchOS 6.0.0 or newer
  func testCreateDump() async throws {
                        ^
/Users/admin/builder/spi-builder-workspace/Tests/MeiliSearchUnitTests/DumpsTests.swift:13:8: note: add @available attribute to enclosing instance method
  func testCreateDump() async throws {
       ^
/Users/admin/builder/spi-builder-workspace/Tests/MeiliSearchUnitTests/DumpsTests.swift:4:7: note: add @available attribute to enclosing class
class DumpsTests: XCTestCase {
      ^
/Users/admin/builder/spi-builder-workspace/Tests/MeiliSearchUnitTests/IndexesTests.swift:16:26: error: concurrency is only available in watchOS 6.0.0 or newer
  func testCreateIndex() async throws {
                         ^
/Users/admin/builder/spi-builder-workspace/Tests/MeiliSearchUnitTests/IndexesTests.swift:16:8: note: add @available attribute to enclosing instance method
  func testCreateIndex() async throws {
       ^
/Users/admin/builder/spi-builder-workspace/Tests/MeiliSearchUnitTests/IndexesTests.swift:4:7: note: add @available attribute to enclosing class
class IndexesTests: XCTestCase {
      ^
/Users/admin/builder/spi-builder-workspace/Tests/MeiliSearchUnitTests/IndexesTests.swift:35:33: error: concurrency is only available in watchOS 6.0.0 or newer
  func testGetIndexWithClient() async throws {
                                ^
/Users/admin/builder/spi-builder-workspace/Tests/MeiliSearchUnitTests/IndexesTests.swift:35:8: note: add @available attribute to enclosing instance method
  func testGetIndexWithClient() async throws {
       ^
/Users/admin/builder/spi-builder-workspace/Tests/MeiliSearchUnitTests/IndexesTests.swift:4:7: note: add @available attribute to enclosing class
class IndexesTests: XCTestCase {
      ^
/Users/admin/builder/spi-builder-workspace/Tests/MeiliSearchUnitTests/IndexesTests.swift:54:23: error: concurrency is only available in watchOS 6.0.0 or newer
  func testGetIndex() async throws {
                      ^
/Users/admin/builder/spi-builder-workspace/Tests/MeiliSearchUnitTests/IndexesTests.swift:54:8: note: add @available attribute to enclosing instance method
  func testGetIndex() async throws {
       ^
/Users/admin/builder/spi-builder-workspace/Tests/MeiliSearchUnitTests/IndexesTests.swift:4:7: note: add @available attribute to enclosing class
class IndexesTests: XCTestCase {
      ^
/Users/admin/builder/spi-builder-workspace/Tests/MeiliSearchUnitTests/IndexesTests.swift:73:25: error: concurrency is only available in watchOS 6.0.0 or newer
  func testGetIndexes() async throws {
                        ^
/Users/admin/builder/spi-builder-workspace/Tests/MeiliSearchUnitTests/IndexesTests.swift:73:8: note: add @available attribute to enclosing instance method
  func testGetIndexes() async throws {
       ^
/Users/admin/builder/spi-builder-workspace/Tests/MeiliSearchUnitTests/IndexesTests.swift:4:7: note: add @available attribute to enclosing class
class IndexesTests: XCTestCase {
      ^
/Users/admin/builder/spi-builder-workspace/Tests/MeiliSearchUnitTests/IndexesTests.swift:98:36: error: concurrency is only available in watchOS 6.0.0 or newer
  func testUpdateIndexWithClient() async throws {
                                   ^
/Users/admin/builder/spi-builder-workspace/Tests/MeiliSearchUnitTests/IndexesTests.swift:98:8: note: add @available attribute to enclosing instance method
  func testUpdateIndexWithClient() async throws {
       ^
/Users/admin/builder/spi-builder-workspace/Tests/MeiliSearchUnitTests/IndexesTests.swift:4:7: note: add @available attribute to enclosing class
class IndexesTests: XCTestCase {
      ^
/Users/admin/builder/spi-builder-workspace/Tests/MeiliSearchUnitTests/IndexesTests.swift:112:26: error: concurrency is only available in watchOS 6.0.0 or newer
  func testUpdateIndex() async throws {
                         ^
/Users/admin/builder/spi-builder-workspace/Tests/MeiliSearchUnitTests/IndexesTests.swift:112:8: note: add @available attribute to enclosing instance method
  func testUpdateIndex() async throws {
       ^
/Users/admin/builder/spi-builder-workspace/Tests/MeiliSearchUnitTests/IndexesTests.swift:4:7: note: add @available attribute to enclosing class
class IndexesTests: XCTestCase {
      ^
/Users/admin/builder/spi-builder-workspace/Tests/MeiliSearchUnitTests/IndexesTests.swift:126:39: error: concurrency is only available in watchOS 6.0.0 or newer
  func testGetIndexesWithParameters() async throws {
                                      ^
/Users/admin/builder/spi-builder-workspace/Tests/MeiliSearchUnitTests/IndexesTests.swift:126:8: note: add @available attribute to enclosing instance method
  func testGetIndexesWithParameters() async throws {
       ^
/Users/admin/builder/spi-builder-workspace/Tests/MeiliSearchUnitTests/IndexesTests.swift:4:7: note: add @available attribute to enclosing class
class IndexesTests: XCTestCase {
      ^
/Users/admin/builder/spi-builder-workspace/Tests/MeiliSearchUnitTests/IndexesTests.swift:144:46: error: concurrency is only available in watchOS 6.0.0 or newer
  func testGetTasksWithParametersFromIndex() async throws {
                                             ^
/Users/admin/builder/spi-builder-workspace/Tests/MeiliSearchUnitTests/IndexesTests.swift:144:8: note: add @available attribute to enclosing instance method
  func testGetTasksWithParametersFromIndex() async throws {
       ^
/Users/admin/builder/spi-builder-workspace/Tests/MeiliSearchUnitTests/IndexesTests.swift:4:7: note: add @available attribute to enclosing class
class IndexesTests: XCTestCase {
      ^
/Users/admin/builder/spi-builder-workspace/Tests/MeiliSearchUnitTests/IndexesTests.swift:164:36: error: concurrency is only available in watchOS 6.0.0 or newer
  func testDeleteIndexWithClient() async throws {
                                   ^
/Users/admin/builder/spi-builder-workspace/Tests/MeiliSearchUnitTests/IndexesTests.swift:164:8: note: add @available attribute to enclosing instance method
  func testDeleteIndexWithClient() async throws {
       ^
/Users/admin/builder/spi-builder-workspace/Tests/MeiliSearchUnitTests/IndexesTests.swift:4:7: note: add @available attribute to enclosing class
class IndexesTests: XCTestCase {
      ^
/Users/admin/builder/spi-builder-workspace/Tests/MeiliSearchUnitTests/IndexesTests.swift:177:26: error: concurrency is only available in watchOS 6.0.0 or newer
  func testDeleteIndex() async throws {
                         ^
/Users/admin/builder/spi-builder-workspace/Tests/MeiliSearchUnitTests/IndexesTests.swift:177:8: note: add @available attribute to enclosing instance method
  func testDeleteIndex() async throws {
       ^
/Users/admin/builder/spi-builder-workspace/Tests/MeiliSearchUnitTests/IndexesTests.swift:4:7: note: add @available attribute to enclosing class
class IndexesTests: XCTestCase {
      ^
/Users/admin/builder/spi-builder-workspace/Tests/MeiliSearchUnitTests/KeysTests.swift:16:36: error: concurrency is only available in watchOS 6.0.0 or newer
  func testGetKeysWithParameters() async throws {
                                   ^
/Users/admin/builder/spi-builder-workspace/Tests/MeiliSearchUnitTests/KeysTests.swift:16:8: note: add @available attribute to enclosing instance method
  func testGetKeysWithParameters() async throws {
       ^
/Users/admin/builder/spi-builder-workspace/Tests/MeiliSearchUnitTests/KeysTests.swift:4:7: note: add @available attribute to enclosing class
class KeysTests: XCTestCase {
      ^
/Users/admin/builder/spi-builder-workspace/Tests/MeiliSearchUnitTests/SearchTests.swift:31:35: error: concurrency is only available in watchOS 6.0.0 or newer
  func testSearchForBotmanMovie() async throws {
                                  ^
/Users/admin/builder/spi-builder-workspace/Tests/MeiliSearchUnitTests/SearchTests.swift:31:8: note: add @available attribute to enclosing instance method
  func testSearchForBotmanMovie() async throws {
       ^
/Users/admin/builder/spi-builder-workspace/Tests/MeiliSearchUnitTests/SearchTests.swift:20:7: note: add @available attribute to enclosing class
class SearchTests: XCTestCase {
      ^
/Users/admin/builder/spi-builder-workspace/Tests/MeiliSearchUnitTests/SearchTests.swift:68:41: error: concurrency is only available in watchOS 6.0.0 or newer
  func testSearchForBotmanMovieFacets() async throws {
                                        ^
/Users/admin/builder/spi-builder-workspace/Tests/MeiliSearchUnitTests/SearchTests.swift:68:8: note: add @available attribute to enclosing instance method
  func testSearchForBotmanMovieFacets() async throws {
       ^
/Users/admin/builder/spi-builder-workspace/Tests/MeiliSearchUnitTests/SearchTests.swift:20:7: note: add @available attribute to enclosing class
class SearchTests: XCTestCase {
      ^
/Users/admin/builder/spi-builder-workspace/Tests/MeiliSearchUnitTests/SearchTests.swift:110:43: error: concurrency is only available in watchOS 6.0.0 or newer
  func testShouldFilterValuesWithSpaces() async throws {
                                          ^
/Users/admin/builder/spi-builder-workspace/Tests/MeiliSearchUnitTests/SearchTests.swift:110:8: note: add @available attribute to enclosing instance method
  func testShouldFilterValuesWithSpaces() async throws {
       ^
/Users/admin/builder/spi-builder-workspace/Tests/MeiliSearchUnitTests/SearchTests.swift:20:7: note: add @available attribute to enclosing class
class SearchTests: XCTestCase {
      ^
/Users/admin/builder/spi-builder-workspace/Tests/MeiliSearchUnitTests/SearchTests.swift:205:41: error: concurrency is only available in watchOS 6.0.0 or newer
  func testSearchWithFinitePagination() async throws {
                                        ^
/Users/admin/builder/spi-builder-workspace/Tests/MeiliSearchUnitTests/SearchTests.swift:205:8: note: add @available attribute to enclosing instance method
  func testSearchWithFinitePagination() async throws {
       ^
/Users/admin/builder/spi-builder-workspace/Tests/MeiliSearchUnitTests/SearchTests.swift:20:7: note: add @available attribute to enclosing class
class SearchTests: XCTestCase {
      ^
/Users/admin/builder/spi-builder-workspace/Tests/MeiliSearchUnitTests/SettingsTests.swift:64:26: error: concurrency is only available in watchOS 6.0.0 or newer
  func testGetSettings() async throws {
                         ^
/Users/admin/builder/spi-builder-workspace/Tests/MeiliSearchUnitTests/SettingsTests.swift:64:8: note: add @available attribute to enclosing instance method
  func testGetSettings() async throws {
       ^
/Users/admin/builder/spi-builder-workspace/Tests/MeiliSearchUnitTests/SettingsTests.swift:4:7: note: add @available attribute to enclosing class
class SettingsTests: XCTestCase {
      ^
/Users/admin/builder/spi-builder-workspace/Tests/MeiliSearchUnitTests/SettingsTests.swift:74:29: error: concurrency is only available in watchOS 6.0.0 or newer
  func testUpdateSettings() async throws {
                            ^
/Users/admin/builder/spi-builder-workspace/Tests/MeiliSearchUnitTests/SettingsTests.swift:74:8: note: add @available attribute to enclosing instance method
  func testUpdateSettings() async throws {
       ^
/Users/admin/builder/spi-builder-workspace/Tests/MeiliSearchUnitTests/SettingsTests.swift:4:7: note: add @available attribute to enclosing class
class SettingsTests: XCTestCase {
      ^
/Users/admin/builder/spi-builder-workspace/Tests/MeiliSearchUnitTests/SettingsTests.swift:92:28: error: concurrency is only available in watchOS 6.0.0 or newer
  func testResetSettings() async throws {
                           ^
/Users/admin/builder/spi-builder-workspace/Tests/MeiliSearchUnitTests/SettingsTests.swift:92:8: note: add @available attribute to enclosing instance method
  func testResetSettings() async throws {
       ^
/Users/admin/builder/spi-builder-workspace/Tests/MeiliSearchUnitTests/SettingsTests.swift:4:7: note: add @available attribute to enclosing class
class SettingsTests: XCTestCase {
      ^
/Users/admin/builder/spi-builder-workspace/Tests/MeiliSearchUnitTests/SettingsTests.swift:110:26: error: concurrency is only available in watchOS 6.0.0 or newer
  func testGetSynonyms() async throws {
                         ^
/Users/admin/builder/spi-builder-workspace/Tests/MeiliSearchUnitTests/SettingsTests.swift:110:8: note: add @available attribute to enclosing instance method
  func testGetSynonyms() async throws {
       ^
/Users/admin/builder/spi-builder-workspace/Tests/MeiliSearchUnitTests/SettingsTests.swift:4:7: note: add @available attribute to enclosing class
class SettingsTests: XCTestCase {
      ^
/Users/admin/builder/spi-builder-workspace/Tests/MeiliSearchUnitTests/SettingsTests.swift:131:29: error: concurrency is only available in watchOS 6.0.0 or newer
  func testUpdateSynonyms() async throws {
                            ^
/Users/admin/builder/spi-builder-workspace/Tests/MeiliSearchUnitTests/SettingsTests.swift:131:8: note: add @available attribute to enclosing instance method
  func testUpdateSynonyms() async throws {
       ^
/Users/admin/builder/spi-builder-workspace/Tests/MeiliSearchUnitTests/SettingsTests.swift:4:7: note: add @available attribute to enclosing class
class SettingsTests: XCTestCase {
      ^
/Users/admin/builder/spi-builder-workspace/Tests/MeiliSearchUnitTests/SettingsTests.swift:159:28: error: concurrency is only available in watchOS 6.0.0 or newer
  func testResetSynonyms() async throws {
                           ^
/Users/admin/builder/spi-builder-workspace/Tests/MeiliSearchUnitTests/SettingsTests.swift:159:8: note: add @available attribute to enclosing instance method
  func testResetSynonyms() async throws {
       ^
/Users/admin/builder/spi-builder-workspace/Tests/MeiliSearchUnitTests/SettingsTests.swift:4:7: note: add @available attribute to enclosing class
class SettingsTests: XCTestCase {
      ^
/Users/admin/builder/spi-builder-workspace/Tests/MeiliSearchUnitTests/SettingsTests.swift:178:27: error: concurrency is only available in watchOS 6.0.0 or newer
  func testGetStopWords() async throws {
                          ^
/Users/admin/builder/spi-builder-workspace/Tests/MeiliSearchUnitTests/SettingsTests.swift:178:8: note: add @available attribute to enclosing instance method
  func testGetStopWords() async throws {
       ^
/Users/admin/builder/spi-builder-workspace/Tests/MeiliSearchUnitTests/SettingsTests.swift:4:7: note: add @available attribute to enclosing class
class SettingsTests: XCTestCase {
      ^
/Users/admin/builder/spi-builder-workspace/Tests/MeiliSearchUnitTests/SettingsTests.swift:194:30: error: concurrency is only available in watchOS 6.0.0 or newer
  func testUpdateStopWords() async throws {
                             ^
/Users/admin/builder/spi-builder-workspace/Tests/MeiliSearchUnitTests/SettingsTests.swift:194:8: note: add @available attribute to enclosing instance method
  func testUpdateStopWords() async throws {
       ^
/Users/admin/builder/spi-builder-workspace/Tests/MeiliSearchUnitTests/SettingsTests.swift:4:7: note: add @available attribute to enclosing class
class SettingsTests: XCTestCase {
      ^
/Users/admin/builder/spi-builder-workspace/Tests/MeiliSearchUnitTests/SettingsTests.swift:217:29: error: concurrency is only available in watchOS 6.0.0 or newer
  func testResetStopWords() async throws {
                            ^
/Users/admin/builder/spi-builder-workspace/Tests/MeiliSearchUnitTests/SettingsTests.swift:217:8: note: add @available attribute to enclosing instance method
  func testResetStopWords() async throws {
       ^
/Users/admin/builder/spi-builder-workspace/Tests/MeiliSearchUnitTests/SettingsTests.swift:4:7: note: add @available attribute to enclosing class
class SettingsTests: XCTestCase {
      ^
/Users/admin/builder/spi-builder-workspace/Tests/MeiliSearchUnitTests/SettingsTests.swift:237:30: error: concurrency is only available in watchOS 6.0.0 or newer
  func testGetRankingRules() async throws {
                             ^
/Users/admin/builder/spi-builder-workspace/Tests/MeiliSearchUnitTests/SettingsTests.swift:237:8: note: add @available attribute to enclosing instance method
  func testGetRankingRules() async throws {
       ^
/Users/admin/builder/spi-builder-workspace/Tests/MeiliSearchUnitTests/SettingsTests.swift:4:7: note: add @available attribute to enclosing class
class SettingsTests: XCTestCase {
      ^
/Users/admin/builder/spi-builder-workspace/Tests/MeiliSearchUnitTests/SettingsTests.swift:261:33: error: concurrency is only available in watchOS 6.0.0 or newer
  func testUpdateRankingRules() async throws {
                                ^
/Users/admin/builder/spi-builder-workspace/Tests/MeiliSearchUnitTests/SettingsTests.swift:261:8: note: add @available attribute to enclosing instance method
  func testUpdateRankingRules() async throws {
       ^
/Users/admin/builder/spi-builder-workspace/Tests/MeiliSearchUnitTests/SettingsTests.swift:4:7: note: add @available attribute to enclosing class
class SettingsTests: XCTestCase {
      ^
/Users/admin/builder/spi-builder-workspace/Tests/MeiliSearchUnitTests/SettingsTests.swift:283:32: error: concurrency is only available in watchOS 6.0.0 or newer
  func testResetRankingRules() async throws {
                               ^
/Users/admin/builder/spi-builder-workspace/Tests/MeiliSearchUnitTests/SettingsTests.swift:283:8: note: add @available attribute to enclosing instance method
  func testResetRankingRules() async throws {
       ^
/Users/admin/builder/spi-builder-workspace/Tests/MeiliSearchUnitTests/SettingsTests.swift:4:7: note: add @available attribute to enclosing class
class SettingsTests: XCTestCase {
      ^
/Users/admin/builder/spi-builder-workspace/Tests/MeiliSearchUnitTests/SettingsTests.swift:303:35: error: concurrency is only available in watchOS 6.0.0 or newer
  func testGetDistinctAttribute() async throws {
                                  ^
/Users/admin/builder/spi-builder-workspace/Tests/MeiliSearchUnitTests/SettingsTests.swift:303:8: note: add @available attribute to enclosing instance method
  func testGetDistinctAttribute() async throws {
       ^
/Users/admin/builder/spi-builder-workspace/Tests/MeiliSearchUnitTests/SettingsTests.swift:4:7: note: add @available attribute to enclosing class
class SettingsTests: XCTestCase {
      ^
/Users/admin/builder/spi-builder-workspace/Tests/MeiliSearchUnitTests/SettingsTests.swift:316:38: error: concurrency is only available in watchOS 6.0.0 or newer
  func testUpdateDistinctAttribute() async throws {
                                     ^
/Users/admin/builder/spi-builder-workspace/Tests/MeiliSearchUnitTests/SettingsTests.swift:316:8: note: add @available attribute to enclosing instance method
  func testUpdateDistinctAttribute() async throws {
       ^
/Users/admin/builder/spi-builder-workspace/Tests/MeiliSearchUnitTests/SettingsTests.swift:4:7: note: add @available attribute to enclosing class
class SettingsTests: XCTestCase {
      ^
/Users/admin/builder/spi-builder-workspace/Tests/MeiliSearchUnitTests/SettingsTests.swift:334:37: error: concurrency is only available in watchOS 6.0.0 or newer
  func testResetDistinctAttribute() async throws {
                                    ^
/Users/admin/builder/spi-builder-workspace/Tests/MeiliSearchUnitTests/SettingsTests.swift:334:8: note: add @available attribute to enclosing instance method
  func testResetDistinctAttribute() async throws {
       ^
/Users/admin/builder/spi-builder-workspace/Tests/MeiliSearchUnitTests/SettingsTests.swift:4:7: note: add @available attribute to enclosing class
class SettingsTests: XCTestCase {
      ^
/Users/admin/builder/spi-builder-workspace/Tests/MeiliSearchUnitTests/SettingsTests.swift:353:38: error: concurrency is only available in watchOS 6.0.0 or newer
  func testGetSearchableAttributes() async throws {
                                     ^
/Users/admin/builder/spi-builder-workspace/Tests/MeiliSearchUnitTests/SettingsTests.swift:353:8: note: add @available attribute to enclosing instance method
  func testGetSearchableAttributes() async throws {
       ^
/Users/admin/builder/spi-builder-workspace/Tests/MeiliSearchUnitTests/SettingsTests.swift:4:7: note: add @available attribute to enclosing class
class SettingsTests: XCTestCase {
      ^
/Users/admin/builder/spi-builder-workspace/Tests/MeiliSearchUnitTests/SettingsTests.swift:369:41: error: concurrency is only available in watchOS 6.0.0 or newer
  func testUpdateSearchableAttributes() async throws {
                                        ^
/Users/admin/builder/spi-builder-workspace/Tests/MeiliSearchUnitTests/SettingsTests.swift:369:8: note: add @available attribute to enclosing instance method
  func testUpdateSearchableAttributes() async throws {
       ^
/Users/admin/builder/spi-builder-workspace/Tests/MeiliSearchUnitTests/SettingsTests.swift:4:7: note: add @available attribute to enclosing class
class SettingsTests: XCTestCase {
      ^
/Users/admin/builder/spi-builder-workspace/Tests/MeiliSearchUnitTests/SettingsTests.swift:393:40: error: concurrency is only available in watchOS 6.0.0 or newer
  func testResetSearchableAttributes() async throws {
                                       ^
/Users/admin/builder/spi-builder-workspace/Tests/MeiliSearchUnitTests/SettingsTests.swift:393:8: note: add @available attribute to enclosing instance method
  func testResetSearchableAttributes() async throws {
       ^
/Users/admin/builder/spi-builder-workspace/Tests/MeiliSearchUnitTests/SettingsTests.swift:4:7: note: add @available attribute to enclosing class
class SettingsTests: XCTestCase {
      ^
/Users/admin/builder/spi-builder-workspace/Tests/MeiliSearchUnitTests/SettingsTests.swift:412:37: error: concurrency is only available in watchOS 6.0.0 or newer
  func testGetDisplayedAttributes() async throws {
                                    ^
/Users/admin/builder/spi-builder-workspace/Tests/MeiliSearchUnitTests/SettingsTests.swift:412:8: note: add @available attribute to enclosing instance method
  func testGetDisplayedAttributes() async throws {
       ^
/Users/admin/builder/spi-builder-workspace/Tests/MeiliSearchUnitTests/SettingsTests.swift:4:7: note: add @available attribute to enclosing class
class SettingsTests: XCTestCase {
      ^
/Users/admin/builder/spi-builder-workspace/Tests/MeiliSearchUnitTests/SettingsTests.swift:428:40: error: concurrency is only available in watchOS 6.0.0 or newer
  func testUpdateDisplayedAttributes() async throws {
                                       ^
/Users/admin/builder/spi-builder-workspace/Tests/MeiliSearchUnitTests/SettingsTests.swift:428:8: note: add @available attribute to enclosing instance method
  func testUpdateDisplayedAttributes() async throws {
       ^
/Users/admin/builder/spi-builder-workspace/Tests/MeiliSearchUnitTests/SettingsTests.swift:4:7: note: add @available attribute to enclosing class
class SettingsTests: XCTestCase {
      ^
/Users/admin/builder/spi-builder-workspace/Tests/MeiliSearchUnitTests/SettingsTests.swift:454:39: error: concurrency is only available in watchOS 6.0.0 or newer
  func testResetDisplayedAttributes() async throws {
                                      ^
/Users/admin/builder/spi-builder-workspace/Tests/MeiliSearchUnitTests/SettingsTests.swift:454:8: note: add @available attribute to enclosing instance method
  func testResetDisplayedAttributes() async throws {
       ^
/Users/admin/builder/spi-builder-workspace/Tests/MeiliSearchUnitTests/SettingsTests.swift:4:7: note: add @available attribute to enclosing class
class SettingsTests: XCTestCase {
      ^
/Users/admin/builder/spi-builder-workspace/Tests/MeiliSearchUnitTests/SettingsTests.swift:473:38: error: concurrency is only available in watchOS 6.0.0 or newer
  func testGetFilterableAttributes() async throws {
                                     ^
/Users/admin/builder/spi-builder-workspace/Tests/MeiliSearchUnitTests/SettingsTests.swift:473:8: note: add @available attribute to enclosing instance method
  func testGetFilterableAttributes() async throws {
       ^
/Users/admin/builder/spi-builder-workspace/Tests/MeiliSearchUnitTests/SettingsTests.swift:4:7: note: add @available attribute to enclosing class
class SettingsTests: XCTestCase {
      ^
/Users/admin/builder/spi-builder-workspace/Tests/MeiliSearchUnitTests/SettingsTests.swift:486:41: error: concurrency is only available in watchOS 6.0.0 or newer
  func testUpdateFilterableAttributes() async throws {
                                        ^
/Users/admin/builder/spi-builder-workspace/Tests/MeiliSearchUnitTests/SettingsTests.swift:486:8: note: add @available attribute to enclosing instance method
  func testUpdateFilterableAttributes() async throws {
       ^
/Users/admin/builder/spi-builder-workspace/Tests/MeiliSearchUnitTests/SettingsTests.swift:4:7: note: add @available attribute to enclosing class
class SettingsTests: XCTestCase {
      ^
/Users/admin/builder/spi-builder-workspace/Tests/MeiliSearchUnitTests/SettingsTests.swift:505:40: error: concurrency is only available in watchOS 6.0.0 or newer
  func testResetFilterableAttributes() async throws {
                                       ^
/Users/admin/builder/spi-builder-workspace/Tests/MeiliSearchUnitTests/SettingsTests.swift:505:8: note: add @available attribute to enclosing instance method
  func testResetFilterableAttributes() async throws {
       ^
/Users/admin/builder/spi-builder-workspace/Tests/MeiliSearchUnitTests/SettingsTests.swift:4:7: note: add @available attribute to enclosing class
class SettingsTests: XCTestCase {
      ^
/Users/admin/builder/spi-builder-workspace/Tests/MeiliSearchUnitTests/SettingsTests.swift:525:36: error: concurrency is only available in watchOS 6.0.0 or newer
  func testGetSortableAttributes() async throws {
                                   ^
/Users/admin/builder/spi-builder-workspace/Tests/MeiliSearchUnitTests/SettingsTests.swift:525:8: note: add @available attribute to enclosing instance method
  func testGetSortableAttributes() async throws {
       ^
/Users/admin/builder/spi-builder-workspace/Tests/MeiliSearchUnitTests/SettingsTests.swift:4:7: note: add @available attribute to enclosing class
class SettingsTests: XCTestCase {
      ^
/Users/admin/builder/spi-builder-workspace/Tests/MeiliSearchUnitTests/SettingsTests.swift:538:39: error: concurrency is only available in watchOS 6.0.0 or newer
  func testUpdateSortableAttributes() async throws {
                                      ^
/Users/admin/builder/spi-builder-workspace/Tests/MeiliSearchUnitTests/SettingsTests.swift:538:8: note: add @available attribute to enclosing instance method
  func testUpdateSortableAttributes() async throws {
       ^
/Users/admin/builder/spi-builder-workspace/Tests/MeiliSearchUnitTests/SettingsTests.swift:4:7: note: add @available attribute to enclosing class
class SettingsTests: XCTestCase {
      ^
/Users/admin/builder/spi-builder-workspace/Tests/MeiliSearchUnitTests/SettingsTests.swift:557:38: error: concurrency is only available in watchOS 6.0.0 or newer
  func testResetSortableAttributes() async throws {
                                     ^
/Users/admin/builder/spi-builder-workspace/Tests/MeiliSearchUnitTests/SettingsTests.swift:557:8: note: add @available attribute to enclosing instance method
  func testResetSortableAttributes() async throws {
       ^
/Users/admin/builder/spi-builder-workspace/Tests/MeiliSearchUnitTests/SettingsTests.swift:4:7: note: add @available attribute to enclosing class
class SettingsTests: XCTestCase {
      ^
/Users/admin/builder/spi-builder-workspace/Tests/MeiliSearchUnitTests/SettingsTests.swift:576:31: error: concurrency is only available in watchOS 6.0.0 or newer
  func testGetTypoTolerance() async throws {
                              ^
/Users/admin/builder/spi-builder-workspace/Tests/MeiliSearchUnitTests/SettingsTests.swift:576:8: note: add @available attribute to enclosing instance method
  func testGetTypoTolerance() async throws {
       ^
/Users/admin/builder/spi-builder-workspace/Tests/MeiliSearchUnitTests/SettingsTests.swift:4:7: note: add @available attribute to enclosing class
class SettingsTests: XCTestCase {
      ^
/Users/admin/builder/spi-builder-workspace/Tests/MeiliSearchUnitTests/SettingsTests.swift:593:34: error: concurrency is only available in watchOS 6.0.0 or newer
  func testUpdateTypoTolerance() async throws {
                                 ^
/Users/admin/builder/spi-builder-workspace/Tests/MeiliSearchUnitTests/SettingsTests.swift:593:8: note: add @available attribute to enclosing instance method
  func testUpdateTypoTolerance() async throws {
       ^
/Users/admin/builder/spi-builder-workspace/Tests/MeiliSearchUnitTests/SettingsTests.swift:4:7: note: add @available attribute to enclosing class
class SettingsTests: XCTestCase {
      ^
/Users/admin/builder/spi-builder-workspace/Tests/MeiliSearchUnitTests/SettingsTests.swift:610:33: error: concurrency is only available in watchOS 6.0.0 or newer
  func testResetTypoTolerance() async throws {
                                ^
/Users/admin/builder/spi-builder-workspace/Tests/MeiliSearchUnitTests/SettingsTests.swift:610:8: note: add @available attribute to enclosing instance method
  func testResetTypoTolerance() async throws {
       ^
/Users/admin/builder/spi-builder-workspace/Tests/MeiliSearchUnitTests/SettingsTests.swift:4:7: note: add @available attribute to enclosing class
class SettingsTests: XCTestCase {
      ^
/Users/admin/builder/spi-builder-workspace/Tests/MeiliSearchUnitTests/SnapshotsTests.swift:13:29: error: concurrency is only available in watchOS 6.0.0 or newer
  func testCreateSnapshot() async throws {
                            ^
/Users/admin/builder/spi-builder-workspace/Tests/MeiliSearchUnitTests/SnapshotsTests.swift:13:8: note: add @available attribute to enclosing instance method
  func testCreateSnapshot() async throws {
       ^
/Users/admin/builder/spi-builder-workspace/Tests/MeiliSearchUnitTests/SnapshotsTests.swift:4:7: note: add @available attribute to enclosing class
class SnapshotsTests: XCTestCase {
      ^
/Users/admin/builder/spi-builder-workspace/Tests/MeiliSearchUnitTests/StatsTests.swift:16:20: error: concurrency is only available in watchOS 6.0.0 or newer
  func testStats() async throws {
                   ^
/Users/admin/builder/spi-builder-workspace/Tests/MeiliSearchUnitTests/StatsTests.swift:16:8: note: add @available attribute to enclosing instance method
  func testStats() async throws {
       ^
/Users/admin/builder/spi-builder-workspace/Tests/MeiliSearchUnitTests/StatsTests.swift:4:7: note: add @available attribute to enclosing class
class StatsTests: XCTestCase {
      ^
/Users/admin/builder/spi-builder-workspace/Tests/MeiliSearchUnitTests/StatsTests.swift:41:23: error: concurrency is only available in watchOS 6.0.0 or newer
  func testAllStats() async throws {
                      ^
/Users/admin/builder/spi-builder-workspace/Tests/MeiliSearchUnitTests/StatsTests.swift:41:8: note: add @available attribute to enclosing instance method
  func testAllStats() async throws {
       ^
/Users/admin/builder/spi-builder-workspace/Tests/MeiliSearchUnitTests/StatsTests.swift:4:7: note: add @available attribute to enclosing class
class StatsTests: XCTestCase {
      ^
/Users/admin/builder/spi-builder-workspace/Tests/MeiliSearchUnitTests/SystemTests.swift:14:36: error: concurrency is only available in watchOS 6.0.0 or newer
  func testHealthStatusAvailable() async throws {
                                   ^
/Users/admin/builder/spi-builder-workspace/Tests/MeiliSearchUnitTests/SystemTests.swift:14:8: note: add @available attribute to enclosing instance method
  func testHealthStatusAvailable() async throws {
       ^
/Users/admin/builder/spi-builder-workspace/Tests/MeiliSearchUnitTests/SystemTests.swift:4:7: note: add @available attribute to enclosing class
class SystemTests: XCTestCase {
      ^
/Users/admin/builder/spi-builder-workspace/Tests/MeiliSearchUnitTests/SystemTests.swift:30:28: error: concurrency is only available in watchOS 6.0.0 or newer
  func testIsHealthyTrue() async throws {
                           ^
/Users/admin/builder/spi-builder-workspace/Tests/MeiliSearchUnitTests/SystemTests.swift:30:8: note: add @available attribute to enclosing instance method
  func testIsHealthyTrue() async throws {
       ^
/Users/admin/builder/spi-builder-workspace/Tests/MeiliSearchUnitTests/SystemTests.swift:4:7: note: add @available attribute to enclosing class
class SystemTests: XCTestCase {
      ^
/Users/admin/builder/spi-builder-workspace/Tests/MeiliSearchUnitTests/SystemTests.swift:45:29: error: concurrency is only available in watchOS 6.0.0 or newer
  func testIsHealthyFalse() async throws {
                            ^
/Users/admin/builder/spi-builder-workspace/Tests/MeiliSearchUnitTests/SystemTests.swift:45:8: note: add @available attribute to enclosing instance method
  func testIsHealthyFalse() async throws {
       ^
/Users/admin/builder/spi-builder-workspace/Tests/MeiliSearchUnitTests/SystemTests.swift:4:7: note: add @available attribute to enclosing class
class SystemTests: XCTestCase {
      ^
/Users/admin/builder/spi-builder-workspace/Tests/MeiliSearchUnitTests/SystemTests.swift:54:22: error: concurrency is only available in watchOS 6.0.0 or newer
  func testVersion() async throws {
                     ^
/Users/admin/builder/spi-builder-workspace/Tests/MeiliSearchUnitTests/SystemTests.swift:54:8: note: add @available attribute to enclosing instance method
  func testVersion() async throws {
       ^
/Users/admin/builder/spi-builder-workspace/Tests/MeiliSearchUnitTests/SystemTests.swift:4:7: note: add @available attribute to enclosing class
class SystemTests: XCTestCase {
      ^
/Users/admin/builder/spi-builder-workspace/Tests/MeiliSearchUnitTests/TasksTests.swift:16:47: error: concurrency is only available in watchOS 6.0.0 or newer
  func testGetTasksWithParametersFromClient() async throws {
                                              ^
/Users/admin/builder/spi-builder-workspace/Tests/MeiliSearchUnitTests/TasksTests.swift:16:8: note: add @available attribute to enclosing instance method
  func testGetTasksWithParametersFromClient() async throws {
       ^
/Users/admin/builder/spi-builder-workspace/Tests/MeiliSearchUnitTests/TasksTests.swift:4:7: note: add @available attribute to enclosing class
class TasksTests: XCTestCase {
      ^
SwiftEmitModule normal armv7k Emitting\ module\ for\ MeiliSearchUnitTests (in target 'MeiliSearchUnitTests' from project 'meilisearch-swift')
    cd /Users/admin/builder/spi-builder-workspace
    builtin-swiftTaskExecution -- /Applications/Xcode-15.2.0.app/Contents/Developer/Toolchains/XcodeDefault.xctoolchain/usr/bin/swift-frontend -frontend -emit-module -experimental-skip-non-inlinable-function-bodies-without-types /Users/admin/builder/spi-builder-workspace/Tests/MeiliSearchUnitTests/ClientTests.swift /Users/admin/builder/spi-builder-workspace/Tests/MeiliSearchUnitTests/DocumentsTests.swift /Users/admin/builder/spi-builder-workspace/Tests/MeiliSearchUnitTests/DumpsTests.swift /Users/admin/builder/spi-builder-workspace/Tests/MeiliSearchUnitTests/FormatterTests.swift /Users/admin/builder/spi-builder-workspace/Tests/MeiliSearchUnitTests/IndexesTests.swift /Users/admin/builder/spi-builder-workspace/Tests/MeiliSearchUnitTests/KeyParamsTests.swift /Users/admin/builder/spi-builder-workspace/Tests/MeiliSearchUnitTests/KeysTests.swift /Users/admin/builder/spi-builder-workspace/Tests/MeiliSearchUnitTests/MockURLSession.swift /Users/admin/builder/spi-builder-workspace/Tests/MeiliSearchUnitTests/PackageVersionTests.swift /Users/admin/builder/spi-builder-workspace/Tests/MeiliSearchUnitTests/QueryParameters/DocumentsQueryTests.swift /Users/admin/builder/spi-builder-workspace/Tests/MeiliSearchUnitTests/QueryParameters/IndexesQueryTests.swift /Users/admin/builder/spi-builder-workspace/Tests/MeiliSearchUnitTests/QueryParameters/KeysQueryTests.swift /Users/admin/builder/spi-builder-workspace/Tests/MeiliSearchUnitTests/QueryParameters/TasksQueryTests.swift /Users/admin/builder/spi-builder-workspace/Tests/MeiliSearchUnitTests/SearchTests.swift /Users/admin/builder/spi-builder-workspace/Tests/MeiliSearchUnitTests/SettingsTests.swift /Users/admin/builder/spi-builder-workspace/Tests/MeiliSearchUnitTests/SnapshotsTests.swift /Users/admin/builder/spi-builder-workspace/Tests/MeiliSearchUnitTests/StatsTests.swift /Users/admin/builder/spi-builder-workspace/Tests/MeiliSearchUnitTests/SystemTests.swift /Users/admin/builder/spi-builder-workspace/Tests/MeiliSearchUnitTests/TasksTests.swift /Users/admin/builder/spi-builder-workspace/Tests/MeiliSearchUnitTests/Utils.swift -target armv7k-apple-watchos5.0 -enable-objc-interop -sdk /Applications/Xcode-15.2.0.app/Contents/Developer/Platforms/WatchOS.platform/Developer/SDKs/WatchOS10.2.sdk -I /Users/admin/builder/spi-builder-workspace/.derivedData/Build/Products/Debug-watchos -I /Applications/Xcode-15.2.0.app/Contents/Developer/Platforms/WatchOS.platform/Developer/usr/lib -F /Users/admin/builder/spi-builder-workspace/.derivedData/Build/Products/Debug-watchos/PackageFrameworks -F /Users/admin/builder/spi-builder-workspace/.derivedData/Build/Products/Debug-watchos -F /Applications/Xcode-15.2.0.app/Contents/Developer/Platforms/WatchOS.platform/Developer/Library/Frameworks -F /Applications/Xcode-15.2.0.app/Contents/Developer/Platforms/WatchOS.platform/Developer/SDKs/WatchOS10.2.sdk/Developer/Library/Frameworks -no-color-diagnostics -enable-testing -g -module-cache-path /Users/admin/builder/spi-builder-workspace/.derivedData/ModuleCache.noindex -profile-generate -profile-coverage-mapping -swift-version 5 -enforce-exclusivity\=checked -Onone -D SWIFT_PACKAGE -D DEBUG -D Xcode -serialize-debugging-options -const-gather-protocols-file /Users/admin/builder/spi-builder-workspace/.derivedData/Build/Intermediates.noindex/meilisearch-swift.build/Debug-watchos/MeiliSearchUnitTests.build/Objects-normal/armv7k/MeiliSearchUnitTests_const_extract_protocols.json -empty-abi-descriptor -validate-clang-modules-once -clang-build-session-file /Users/admin/builder/spi-builder-workspace/.derivedData/ModuleCache.noindex/Session.modulevalidation -Xcc -working-directory -Xcc /Users/admin/builder/spi-builder-workspace -resource-dir /Applications/Xcode-15.2.0.app/Contents/Developer/Toolchains/XcodeDefault.xctoolchain/usr/lib/swift -enable-anonymous-context-mangled-names -Xcc -ivfsstatcache -Xcc /Users/admin/builder/spi-builder-workspace/.derivedData/SDKStatCaches.noindex/watchos10.2-21S355-1a03c8d25fc3596eb74c01d649b42752.sdkstatcache -Xcc -I/Users/admin/builder/spi-builder-workspace/.derivedData/Build/Products/Debug-watchos/include -Xcc -I/Users/admin/builder/spi-builder-workspace/.derivedData/Build/Intermediates.noindex/meilisearch-swift.build/Debug-watchos/MeiliSearchUnitTests.build/DerivedSources-normal/armv7k -Xcc -I/Users/admin/builder/spi-builder-workspace/.derivedData/Build/Intermediates.noindex/meilisearch-swift.build/Debug-watchos/MeiliSearchUnitTests.build/DerivedSources/armv7k -Xcc -I/Users/admin/builder/spi-builder-workspace/.derivedData/Build/Intermediates.noindex/meilisearch-swift.build/Debug-watchos/MeiliSearchUnitTests.build/DerivedSources -Xcc -DSWIFT_PACKAGE -Xcc -DDEBUG\=1 -module-name MeiliSearchUnitTests -disable-clang-spi -target-sdk-version 10.2 -target-sdk-name watchos10.2 -external-plugin-path /Applications/Xcode-15.2.0.app/Contents/Developer/Platforms/WatchOS.platform/Developer/SDKs/WatchOS10.2.sdk/usr/lib/swift/host/plugins\#/Applications/Xcode-15.2.0.app/Contents/Developer/Platforms/WatchOS.platform/Developer/SDKs/WatchOS10.2.sdk/usr/bin/swift-plugin-server -external-plugin-path /Applications/Xcode-15.2.0.app/Contents/Developer/Platforms/WatchOS.platform/Developer/SDKs/WatchOS10.2.sdk/usr/local/lib/swift/host/plugins\#/Applications/Xcode-15.2.0.app/Contents/Developer/Platforms/WatchOS.platform/Developer/SDKs/WatchOS10.2.sdk/usr/bin/swift-plugin-server -external-plugin-path /Applications/Xcode-15.2.0.app/Contents/Developer/Platforms/WatchOS.platform/Developer/usr/lib/swift/host/plugins\#/Applications/Xcode-15.2.0.app/Contents/Developer/Platforms/WatchOS.platform/Developer/usr/bin/swift-plugin-server -external-plugin-path /Applications/Xcode-15.2.0.app/Contents/Developer/Platforms/WatchOS.platform/Developer/usr/local/lib/swift/host/plugins\#/Applications/Xcode-15.2.0.app/Contents/Developer/Platforms/WatchOS.platform/Developer/usr/bin/swift-plugin-server -plugin-path /Applications/Xcode-15.2.0.app/Contents/Developer/Toolchains/XcodeDefault.xctoolchain/usr/lib/swift/host/plugins -plugin-path /Applications/Xcode-15.2.0.app/Contents/Developer/Toolchains/XcodeDefault.xctoolchain/usr/local/lib/swift/host/plugins -emit-module-doc-path /Users/admin/builder/spi-builder-workspace/.derivedData/Build/Intermediates.noindex/meilisearch-swift.build/Debug-watchos/MeiliSearchUnitTests.build/Objects-normal/armv7k/MeiliSearchUnitTests.swiftdoc -emit-module-source-info-path /Users/admin/builder/spi-builder-workspace/.derivedData/Build/Intermediates.noindex/meilisearch-swift.build/Debug-watchos/MeiliSearchUnitTests.build/Objects-normal/armv7k/MeiliSearchUnitTests.swiftsourceinfo -serialize-diagnostics-path /Users/admin/builder/spi-builder-workspace/.derivedData/Build/Intermediates.noindex/meilisearch-swift.build/Debug-watchos/MeiliSearchUnitTests.build/Objects-normal/armv7k/MeiliSearchUnitTests-master-emit-module.dia -emit-dependencies-path /Users/admin/builder/spi-builder-workspace/.derivedData/Build/Intermediates.noindex/meilisearch-swift.build/Debug-watchos/MeiliSearchUnitTests.build/Objects-normal/armv7k/MeiliSearchUnitTests-master-emit-module.d -o /Users/admin/builder/spi-builder-workspace/.derivedData/Build/Intermediates.noindex/meilisearch-swift.build/Debug-watchos/MeiliSearchUnitTests.build/Objects-normal/armv7k/MeiliSearchUnitTests.swiftmodule -emit-abi-descriptor-path /Users/admin/builder/spi-builder-workspace/.derivedData/Build/Intermediates.noindex/meilisearch-swift.build/Debug-watchos/MeiliSearchUnitTests.build/Objects-normal/armv7k/MeiliSearchUnitTests.abi.json
/Users/admin/builder/spi-builder-workspace/Tests/MeiliSearchUnitTests/DocumentsTests.swift:34:27: error: concurrency is only available in watchOS 6.0.0 or newer
  func testAddDocuments() async throws {
                          ^
/Users/admin/builder/spi-builder-workspace/Tests/MeiliSearchUnitTests/DocumentsTests.swift:34:8: note: add @available attribute to enclosing instance method
  func testAddDocuments() async throws {
       ^
/Users/admin/builder/spi-builder-workspace/Tests/MeiliSearchUnitTests/DocumentsTests.swift:22:7: note: add @available attribute to enclosing class
class DocumentsTests: XCTestCase {
      ^
/Users/admin/builder/spi-builder-workspace/Tests/MeiliSearchUnitTests/DocumentsTests.swift:55:31: error: concurrency is only available in watchOS 6.0.0 or newer
  func testAddDataDocuments() async throws {
                              ^
/Users/admin/builder/spi-builder-workspace/Tests/MeiliSearchUnitTests/DocumentsTests.swift:55:8: note: add @available attribute to enclosing instance method
  func testAddDataDocuments() async throws {
       ^
/Users/admin/builder/spi-builder-workspace/Tests/MeiliSearchUnitTests/DocumentsTests.swift:22:7: note: add @available attribute to enclosing class
class DocumentsTests: XCTestCase {
      ^
/Users/admin/builder/spi-builder-workspace/Tests/MeiliSearchUnitTests/DocumentsTests.swift:82:34: error: concurrency is only available in watchOS 6.0.0 or newer
  func testUpdateDataDocuments() async throws {
                                 ^
/Users/admin/builder/spi-builder-workspace/Tests/MeiliSearchUnitTests/DocumentsTests.swift:82:8: note: add @available attribute to enclosing instance method
  func testUpdateDataDocuments() async throws {
       ^
/Users/admin/builder/spi-builder-workspace/Tests/MeiliSearchUnitTests/DocumentsTests.swift:22:7: note: add @available attribute to enclosing class
class DocumentsTests: XCTestCase {
      ^
/Users/admin/builder/spi-builder-workspace/Tests/MeiliSearchUnitTests/DocumentsTests.swift:105:30: error: concurrency is only available in watchOS 6.0.0 or newer
  func testUpdateDocuments() async throws {
                             ^
/Users/admin/builder/spi-builder-workspace/Tests/MeiliSearchUnitTests/DocumentsTests.swift:105:8: note: add @available attribute to enclosing instance method
  func testUpdateDocuments() async throws {
       ^
/Users/admin/builder/spi-builder-workspace/Tests/MeiliSearchUnitTests/DocumentsTests.swift:22:7: note: add @available attribute to enclosing class
class DocumentsTests: XCTestCase {
      ^
/Users/admin/builder/spi-builder-workspace/Tests/MeiliSearchUnitTests/DocumentsTests.swift:126:26: error: concurrency is only available in watchOS 6.0.0 or newer
  func testGetDocument() async throws {
                         ^
/Users/admin/builder/spi-builder-workspace/Tests/MeiliSearchUnitTests/DocumentsTests.swift:126:8: note: add @available attribute to enclosing instance method
  func testGetDocument() async throws {
       ^
/Users/admin/builder/spi-builder-workspace/Tests/MeiliSearchUnitTests/DocumentsTests.swift:22:7: note: add @available attribute to enclosing class
class DocumentsTests: XCTestCase {
      ^
/Users/admin/builder/spi-builder-workspace/Tests/MeiliSearchUnitTests/DocumentsTests.swift:147:45: error: concurrency is only available in watchOS 6.0.0 or newer
  func testGetDocumentWithSparseFieldsets() async throws {
                                            ^
/Users/admin/builder/spi-builder-workspace/Tests/MeiliSearchUnitTests/DocumentsTests.swift:147:8: note: add @available attribute to enclosing instance method
  func testGetDocumentWithSparseFieldsets() async throws {
       ^
/Users/admin/builder/spi-builder-workspace/Tests/MeiliSearchUnitTests/DocumentsTests.swift:22:7: note: add @available attribute to enclosing class
class DocumentsTests: XCTestCase {
      ^
/Users/admin/builder/spi-builder-workspace/Tests/MeiliSearchUnitTests/DocumentsTests.swift:168:41: error: concurrency is only available in watchOS 6.0.0 or newer
  func testGetDocumentsWithParameters() async throws {
                                        ^
/Users/admin/builder/spi-builder-workspace/Tests/MeiliSearchUnitTests/DocumentsTests.swift:168:8: note: add @available attribute to enclosing instance method
  func testGetDocumentsWithParameters() async throws {
       ^
/Users/admin/builder/spi-builder-workspace/Tests/MeiliSearchUnitTests/DocumentsTests.swift:22:7: note: add @available attribute to enclosing class
class DocumentsTests: XCTestCase {
      ^
/Users/admin/builder/spi-builder-workspace/Tests/MeiliSearchUnitTests/DocumentsTests.swift:186:27: error: concurrency is only available in watchOS 6.0.0 or newer
  func testGetDocuments() async throws {
                          ^
/Users/admin/builder/spi-builder-workspace/Tests/MeiliSearchUnitTests/DocumentsTests.swift:186:8: note: add @available attribute to enclosing instance method
  func testGetDocuments() async throws {
       ^
/Users/admin/builder/spi-builder-workspace/Tests/MeiliSearchUnitTests/DocumentsTests.swift:22:7: note: add @available attribute to enclosing class
class DocumentsTests: XCTestCase {
      ^
/Users/admin/builder/spi-builder-workspace/Tests/MeiliSearchUnitTests/DocumentsTests.swift:220:29: error: concurrency is only available in watchOS 6.0.0 or newer
  func testDeleteDocument() async throws {
                            ^
/Users/admin/builder/spi-builder-workspace/Tests/MeiliSearchUnitTests/DocumentsTests.swift:220:8: note: add @available attribute to enclosing instance method
  func testDeleteDocument() async throws {
       ^
/Users/admin/builder/spi-builder-workspace/Tests/MeiliSearchUnitTests/DocumentsTests.swift:22:7: note: add @available attribute to enclosing class
class DocumentsTests: XCTestCase {
      ^
/Users/admin/builder/spi-builder-workspace/Tests/MeiliSearchUnitTests/DocumentsTests.swift:235:33: error: concurrency is only available in watchOS 6.0.0 or newer
  func testDeleteAllDocuments() async throws {
                                ^
/Users/admin/builder/spi-builder-workspace/Tests/MeiliSearchUnitTests/DocumentsTests.swift:235:8: note: add @available attribute to enclosing instance method
  func testDeleteAllDocuments() async throws {
       ^
/Users/admin/builder/spi-builder-workspace/Tests/MeiliSearchUnitTests/DocumentsTests.swift:22:7: note: add @available attribute to enclosing class
class DocumentsTests: XCTestCase {
      ^
/Users/admin/builder/spi-builder-workspace/Tests/MeiliSearchUnitTests/DocumentsTests.swift:249:35: error: concurrency is only available in watchOS 6.0.0 or newer
  func testDeleteBatchDocuments() async throws {
                                  ^
/Users/admin/builder/spi-builder-workspace/Tests/MeiliSearchUnitTests/DocumentsTests.swift:249:8: note: add @available attribute to enclosing instance method
  func testDeleteBatchDocuments() async throws {
       ^
/Users/admin/builder/spi-builder-workspace/Tests/MeiliSearchUnitTests/DocumentsTests.swift:22:7: note: add @available attribute to enclosing class
class DocumentsTests: XCTestCase {
      ^
/Users/admin/builder/spi-builder-workspace/Tests/MeiliSearchUnitTests/DumpsTests.swift:13:25: error: concurrency is only available in watchOS 6.0.0 or newer
  func testCreateDump() async throws {
                        ^
/Users/admin/builder/spi-builder-workspace/Tests/MeiliSearchUnitTests/DumpsTests.swift:13:8: note: add @available attribute to enclosing instance method
  func testCreateDump() async throws {
       ^
/Users/admin/builder/spi-builder-workspace/Tests/MeiliSearchUnitTests/DumpsTests.swift:4:7: note: add @available attribute to enclosing class
class DumpsTests: XCTestCase {
      ^
/Users/admin/builder/spi-builder-workspace/Tests/MeiliSearchUnitTests/IndexesTests.swift:16:26: error: concurrency is only available in watchOS 6.0.0 or newer
  func testCreateIndex() async throws {
                         ^
/Users/admin/builder/spi-builder-workspace/Tests/MeiliSearchUnitTests/IndexesTests.swift:16:8: note: add @available attribute to enclosing instance method
  func testCreateIndex() async throws {
       ^
/Users/admin/builder/spi-builder-workspace/Tests/MeiliSearchUnitTests/IndexesTests.swift:4:7: note: add @available attribute to enclosing class
class IndexesTests: XCTestCase {
      ^
/Users/admin/builder/spi-builder-workspace/Tests/MeiliSearchUnitTests/IndexesTests.swift:35:33: error: concurrency is only available in watchOS 6.0.0 or newer
  func testGetIndexWithClient() async throws {
                                ^
/Users/admin/builder/spi-builder-workspace/Tests/MeiliSearchUnitTests/IndexesTests.swift:35:8: note: add @available attribute to enclosing instance method
  func testGetIndexWithClient() async throws {
       ^
/Users/admin/builder/spi-builder-workspace/Tests/MeiliSearchUnitTests/IndexesTests.swift:4:7: note: add @available attribute to enclosing class
class IndexesTests: XCTestCase {
      ^
/Users/admin/builder/spi-builder-workspace/Tests/MeiliSearchUnitTests/IndexesTests.swift:54:23: error: concurrency is only available in watchOS 6.0.0 or newer
  func testGetIndex() async throws {
                      ^
/Users/admin/builder/spi-builder-workspace/Tests/MeiliSearchUnitTests/IndexesTests.swift:54:8: note: add @available attribute to enclosing instance method
  func testGetIndex() async throws {
       ^
/Users/admin/builder/spi-builder-workspace/Tests/MeiliSearchUnitTests/IndexesTests.swift:4:7: note: add @available attribute to enclosing class
class IndexesTests: XCTestCase {
      ^
/Users/admin/builder/spi-builder-workspace/Tests/MeiliSearchUnitTests/IndexesTests.swift:73:25: error: concurrency is only available in watchOS 6.0.0 or newer
  func testGetIndexes() async throws {
                        ^
/Users/admin/builder/spi-builder-workspace/Tests/MeiliSearchUnitTests/IndexesTests.swift:73:8: note: add @available attribute to enclosing instance method
  func testGetIndexes() async throws {
       ^
/Users/admin/builder/spi-builder-workspace/Tests/MeiliSearchUnitTests/IndexesTests.swift:4:7: note: add @available attribute to enclosing class
class IndexesTests: XCTestCase {
      ^
/Users/admin/builder/spi-builder-workspace/Tests/MeiliSearchUnitTests/IndexesTests.swift:98:36: error: concurrency is only available in watchOS 6.0.0 or newer
  func testUpdateIndexWithClient() async throws {
                                   ^
/Users/admin/builder/spi-builder-workspace/Tests/MeiliSearchUnitTests/IndexesTests.swift:98:8: note: add @available attribute to enclosing instance method
  func testUpdateIndexWithClient() async throws {
       ^
/Users/admin/builder/spi-builder-workspace/Tests/MeiliSearchUnitTests/IndexesTests.swift:4:7: note: add @available attribute to enclosing class
class IndexesTests: XCTestCase {
      ^
/Users/admin/builder/spi-builder-workspace/Tests/MeiliSearchUnitTests/IndexesTests.swift:112:26: error: concurrency is only available in watchOS 6.0.0 or newer
  func testUpdateIndex() async throws {
                         ^
/Users/admin/builder/spi-builder-workspace/Tests/MeiliSearchUnitTests/IndexesTests.swift:112:8: note: add @available attribute to enclosing instance method
  func testUpdateIndex() async throws {
       ^
/Users/admin/builder/spi-builder-workspace/Tests/MeiliSearchUnitTests/IndexesTests.swift:4:7: note: add @available attribute to enclosing class
class IndexesTests: XCTestCase {
      ^
/Users/admin/builder/spi-builder-workspace/Tests/MeiliSearchUnitTests/IndexesTests.swift:126:39: error: concurrency is only available in watchOS 6.0.0 or newer
  func testGetIndexesWithParameters() async throws {
                                      ^
/Users/admin/builder/spi-builder-workspace/Tests/MeiliSearchUnitTests/IndexesTests.swift:126:8: note: add @available attribute to enclosing instance method
  func testGetIndexesWithParameters() async throws {
       ^
/Users/admin/builder/spi-builder-workspace/Tests/MeiliSearchUnitTests/IndexesTests.swift:4:7: note: add @available attribute to enclosing class
class IndexesTests: XCTestCase {
      ^
/Users/admin/builder/spi-builder-workspace/Tests/MeiliSearchUnitTests/IndexesTests.swift:144:46: error: concurrency is only available in watchOS 6.0.0 or newer
  func testGetTasksWithParametersFromIndex() async throws {
                                             ^
/Users/admin/builder/spi-builder-workspace/Tests/MeiliSearchUnitTests/IndexesTests.swift:144:8: note: add @available attribute to enclosing instance method
  func testGetTasksWithParametersFromIndex() async throws {
       ^
/Users/admin/builder/spi-builder-workspace/Tests/MeiliSearchUnitTests/IndexesTests.swift:4:7: note: add @available attribute to enclosing class
class IndexesTests: XCTestCase {
      ^
/Users/admin/builder/spi-builder-workspace/Tests/MeiliSearchUnitTests/IndexesTests.swift:164:36: error: concurrency is only available in watchOS 6.0.0 or newer
  func testDeleteIndexWithClient() async throws {
                                   ^
/Users/admin/builder/spi-builder-workspace/Tests/MeiliSearchUnitTests/IndexesTests.swift:164:8: note: add @available attribute to enclosing instance method
  func testDeleteIndexWithClient() async throws {
       ^
/Users/admin/builder/spi-builder-workspace/Tests/MeiliSearchUnitTests/IndexesTests.swift:4:7: note: add @available attribute to enclosing class
class IndexesTests: XCTestCase {
      ^
/Users/admin/builder/spi-builder-workspace/Tests/MeiliSearchUnitTests/IndexesTests.swift:177:26: error: concurrency is only available in watchOS 6.0.0 or newer
  func testDeleteIndex() async throws {
                         ^
/Users/admin/builder/spi-builder-workspace/Tests/MeiliSearchUnitTests/IndexesTests.swift:177:8: note: add @available attribute to enclosing instance method
  func testDeleteIndex() async throws {
       ^
/Users/admin/builder/spi-builder-workspace/Tests/MeiliSearchUnitTests/IndexesTests.swift:4:7: note: add @available attribute to enclosing class
class IndexesTests: XCTestCase {
      ^
/Users/admin/builder/spi-builder-workspace/Tests/MeiliSearchUnitTests/KeysTests.swift:16:36: error: concurrency is only available in watchOS 6.0.0 or newer
  func testGetKeysWithParameters() async throws {
                                   ^
/Users/admin/builder/spi-builder-workspace/Tests/MeiliSearchUnitTests/KeysTests.swift:16:8: note: add @available attribute to enclosing instance method
  func testGetKeysWithParameters() async throws {
       ^
/Users/admin/builder/spi-builder-workspace/Tests/MeiliSearchUnitTests/KeysTests.swift:4:7: note: add @available attribute to enclosing class
class KeysTests: XCTestCase {
      ^
SwiftCompile normal arm64_32 Compiling\ IndexesTests.swift,\ KeyParamsTests.swift /Users/admin/builder/spi-builder-workspace/Tests/MeiliSearchUnitTests/IndexesTests.swift /Users/admin/builder/spi-builder-workspace/Tests/MeiliSearchUnitTests/KeyParamsTests.swift (in target 'MeiliSearchUnitTests' from project 'meilisearch-swift')
    cd /Users/admin/builder/spi-builder-workspace
    builtin-swiftTaskExecution -- /Applications/Xcode-15.2.0.app/Contents/Developer/Toolchains/XcodeDefault.xctoolchain/usr/bin/swift-frontend -frontend -c /Users/admin/builder/spi-builder-workspace/Tests/MeiliSearchUnitTests/ClientTests.swift /Users/admin/builder/spi-builder-workspace/Tests/MeiliSearchUnitTests/DocumentsTests.swift /Users/admin/builder/spi-builder-workspace/Tests/MeiliSearchUnitTests/DumpsTests.swift /Users/admin/builder/spi-builder-workspace/Tests/MeiliSearchUnitTests/FormatterTests.swift -primary-file /Users/admin/builder/spi-builder-workspace/Tests/MeiliSearchUnitTests/IndexesTests.swift -primary-file /Users/admin/builder/spi-builder-workspace/Tests/MeiliSearchUnitTests/KeyParamsTests.swift /Users/admin/builder/spi-builder-workspace/Tests/MeiliSearchUnitTests/KeysTests.swift /Users/admin/builder/spi-builder-workspace/Tests/MeiliSearchUnitTests/MockURLSession.swift /Users/admin/builder/spi-builder-workspace/Tests/MeiliSearchUnitTests/PackageVersionTests.swift /Users/admin/builder/spi-builder-workspace/Tests/MeiliSearchUnitTests/QueryParameters/DocumentsQueryTests.swift /Users/admin/builder/spi-builder-workspace/Tests/MeiliSearchUnitTests/QueryParameters/IndexesQueryTests.swift /Users/admin/builder/spi-builder-workspace/Tests/MeiliSearchUnitTests/QueryParameters/KeysQueryTests.swift /Users/admin/builder/spi-builder-workspace/Tests/MeiliSearchUnitTests/QueryParameters/TasksQueryTests.swift /Users/admin/builder/spi-builder-workspace/Tests/MeiliSearchUnitTests/SearchTests.swift /Users/admin/builder/spi-builder-workspace/Tests/MeiliSearchUnitTests/SettingsTests.swift /Users/admin/builder/spi-builder-workspace/Tests/MeiliSearchUnitTests/SnapshotsTests.swift /Users/admin/builder/spi-builder-workspace/Tests/MeiliSearchUnitTests/StatsTests.swift /Users/admin/builder/spi-builder-workspace/Tests/MeiliSearchUnitTests/SystemTests.swift /Users/admin/builder/spi-builder-workspace/Tests/MeiliSearchUnitTests/TasksTests.swift /Users/admin/builder/spi-builder-workspace/Tests/MeiliSearchUnitTests/Utils.swift -emit-dependencies-path /Users/admin/builder/spi-builder-workspace/.derivedData/Build/Intermediates.noindex/meilisearch-swift.build/Debug-watchos/MeiliSearchUnitTests.build/Objects-normal/arm64_32/IndexesTests.d -emit-const-values-path /Users/admin/builder/spi-builder-workspace/.derivedData/Build/Intermediates.noindex/meilisearch-swift.build/Debug-watchos/MeiliSearchUnitTests.build/Objects-normal/arm64_32/IndexesTests.swiftconstvalues -emit-reference-dependencies-path /Users/admin/builder/spi-builder-workspace/.derivedData/Build/Intermediates.noindex/meilisearch-swift.build/Debug-watchos/MeiliSearchUnitTests.build/Objects-normal/arm64_32/IndexesTests.swiftdeps -serialize-diagnostics-path /Users/admin/builder/spi-builder-workspace/.derivedData/Build/Intermediates.noindex/meilisearch-swift.build/Debug-watchos/MeiliSearchUnitTests.build/Objects-normal/arm64_32/IndexesTests.dia -emit-dependencies-path /Users/admin/builder/spi-builder-workspace/.derivedData/Build/Intermediates.noindex/meilisearch-swift.build/Debug-watchos/MeiliSearchUnitTests.build/Objects-normal/arm64_32/KeyParamsTests.d -emit-const-values-path /Users/admin/builder/spi-builder-workspace/.derivedData/Build/Intermediates.noindex/meilisearch-swift.build/Debug-watchos/MeiliSearchUnitTests.build/Objects-normal/arm64_32/KeyParamsTests.swiftconstvalues -emit-reference-dependencies-path /Users/admin/builder/spi-builder-workspace/.derivedData/Build/Intermediates.noindex/meilisearch-swift.build/Debug-watchos/MeiliSearchUnitTests.build/Objects-normal/arm64_32/KeyParamsTests.swiftdeps -serialize-diagnostics-path /Users/admin/builder/spi-builder-workspace/.derivedData/Build/Intermediates.noindex/meilisearch-swift.build/Debug-watchos/MeiliSearchUnitTests.build/Objects-normal/arm64_32/KeyParamsTests.dia -target arm64_32-apple-watchos5.0 -enable-objc-interop -sdk /Applications/Xcode-15.2.0.app/Contents/Developer/Platforms/WatchOS.platform/Developer/SDKs/WatchOS10.2.sdk -I /Users/admin/builder/spi-builder-workspace/.derivedData/Build/Products/Debug-watchos -I /Applications/Xcode-15.2.0.app/Contents/Developer/Platforms/WatchOS.platform/Developer/usr/lib -F /Users/admin/builder/spi-builder-workspace/.derivedData/Build/Products/Debug-watchos/PackageFrameworks -F /Users/admin/builder/spi-builder-workspace/.derivedData/Build/Products/Debug-watchos -F /Applications/Xcode-15.2.0.app/Contents/Developer/Platforms/WatchOS.platform/Developer/Library/Frameworks -F /Applications/Xcode-15.2.0.app/Contents/Developer/Platforms/WatchOS.platform/Developer/SDKs/WatchOS10.2.sdk/Developer/Library/Frameworks -no-color-diagnostics -enable-testing -g -module-cache-path /Users/admin/builder/spi-builder-workspace/.derivedData/ModuleCache.noindex -profile-generate -profile-coverage-mapping -swift-version 5 -enforce-exclusivity\=checked -Onone -D SWIFT_PACKAGE -D DEBUG -D Xcode -serialize-debugging-options -const-gather-protocols-file /Users/admin/builder/spi-builder-workspace/.derivedData/Build/Intermediates.noindex/meilisearch-swift.build/Debug-watchos/MeiliSearchUnitTests.build/Objects-normal/arm64_32/MeiliSearchUnitTests_const_extract_protocols.json -empty-abi-descriptor -validate-clang-modules-once -clang-build-session-file /Users/admin/builder/spi-builder-workspace/.derivedData/ModuleCache.noindex/Session.modulevalidation -Xcc -working-directory -Xcc /Users/admin/builder/spi-builder-workspace -resource-dir /Applications/Xcode-15.2.0.app/Contents/Developer/Toolchains/XcodeDefault.xctoolchain/usr/lib/swift -enable-anonymous-context-mangled-names -Xcc -ivfsstatcache -Xcc /Users/admin/builder/spi-builder-workspace/.derivedData/SDKStatCaches.noindex/watchos10.2-21S355-1a03c8d25fc3596eb74c01d649b42752.sdkstatcache -Xcc -I/Users/admin/builder/spi-builder-workspace/.derivedData/Build/Products/Debug-watchos/include -Xcc -I/Users/admin/builder/spi-builder-workspace/.derivedData/Build/Intermediates.noindex/meilisearch-swift.build/Debug-watchos/MeiliSearchUnitTests.build/DerivedSources-normal/arm64_32 -Xcc -I/Users/admin/builder/spi-builder-workspace/.derivedData/Build/Intermediates.noindex/meilisearch-swift.build/Debug-watchos/MeiliSearchUnitTests.build/DerivedSources/arm64_32 -Xcc -I/Users/admin/builder/spi-builder-workspace/.derivedData/Build/Intermediates.noindex/meilisearch-swift.build/Debug-watchos/MeiliSearchUnitTests.build/DerivedSources -Xcc -DSWIFT_PACKAGE -Xcc -DDEBUG\=1 -module-name MeiliSearchUnitTests -frontend-parseable-output -disable-clang-spi -target-sdk-version 10.2 -target-sdk-name watchos10.2 -external-plugin-path /Applications/Xcode-15.2.0.app/Contents/Developer/Platforms/WatchOS.platform/Developer/SDKs/WatchOS10.2.sdk/usr/lib/swift/host/plugins\#/Applications/Xcode-15.2.0.app/Contents/Developer/Platforms/WatchOS.platform/Developer/SDKs/WatchOS10.2.sdk/usr/bin/swift-plugin-server -external-plugin-path /Applications/Xcode-15.2.0.app/Contents/Developer/Platforms/WatchOS.platform/Developer/SDKs/WatchOS10.2.sdk/usr/local/lib/swift/host/plugins\#/Applications/Xcode-15.2.0.app/Contents/Developer/Platforms/WatchOS.platform/Developer/SDKs/WatchOS10.2.sdk/usr/bin/swift-plugin-server -external-plugin-path /Applications/Xcode-15.2.0.app/Contents/Developer/Platforms/WatchOS.platform/Developer/usr/lib/swift/host/plugins\#/Applications/Xcode-15.2.0.app/Contents/Developer/Platforms/WatchOS.platform/Developer/usr/bin/swift-plugin-server -external-plugin-path /Applications/Xcode-15.2.0.app/Contents/Developer/Platforms/WatchOS.platform/Developer/usr/local/lib/swift/host/plugins\#/Applications/Xcode-15.2.0.app/Contents/Developer/Platforms/WatchOS.platform/Developer/usr/bin/swift-plugin-server -plugin-path /Applications/Xcode-15.2.0.app/Contents/Developer/Toolchains/XcodeDefault.xctoolchain/usr/lib/swift/host/plugins -plugin-path /Applications/Xcode-15.2.0.app/Contents/Developer/Toolchains/XcodeDefault.xctoolchain/usr/local/lib/swift/host/plugins -o /Users/admin/builder/spi-builder-workspace/.derivedData/Build/Intermediates.noindex/meilisearch-swift.build/Debug-watchos/MeiliSearchUnitTests.build/Objects-normal/arm64_32/IndexesTests.o -o /Users/admin/builder/spi-builder-workspace/.derivedData/Build/Intermediates.noindex/meilisearch-swift.build/Debug-watchos/MeiliSearchUnitTests.build/Objects-normal/arm64_32/KeyParamsTests.o -index-unit-output-path /meilisearch-swift.build/Debug-watchos/MeiliSearchUnitTests.build/Objects-normal/arm64_32/IndexesTests.o -index-unit-output-path /meilisearch-swift.build/Debug-watchos/MeiliSearchUnitTests.build/Objects-normal/arm64_32/KeyParamsTests.o -index-store-path /Users/admin/builder/spi-builder-workspace/.derivedData/Index.noindex/DataStore -index-system-modules
** BUILD FAILED **
The following build commands failed:
	SwiftEmitModule normal arm64_32 Emitting\ module\ for\ MeiliSearchIntegrationTests (in target 'MeiliSearchIntegrationTests' from project 'meilisearch-swift')
	SwiftEmitModule normal armv7k Emitting\ module\ for\ MeiliSearchIntegrationTests (in target 'MeiliSearchIntegrationTests' from project 'meilisearch-swift')
	SwiftEmitModule normal arm64_32 Emitting\ module\ for\ MeiliSearchUnitTests (in target 'MeiliSearchUnitTests' from project 'meilisearch-swift')
(3 failures)
BUILD FAILURE 5.9 watchOS