The Swift Package Index logo.Swift Package Index

Track the adoption of Swift 6 strict concurrency checks for data race safety. How many packages are Ready for Swift 6?

Build Information

Failed to build GrowingUtils, reference master (195b27), with Swift 6.1 for Linux on 25 Apr 2025 17:21:50 UTC.

Build Command

bash -c docker run --pull=always --rm -v "checkouts-4609320-0":/host -w "$PWD" registry.gitlab.com/finestructure/spi-images:basic-6.1-latest swift build --triple x86_64-unknown-linux-gnu 2>&1

Build Log

========================================
RunAll
========================================
Builder version: 4.61.0
Interrupt handler set up.
========================================
Checkout
========================================
Clone URL: https://github.com/growingio/growingio-sdk-ios-utilities.git
Reference: master
Initialized empty Git repository in /host/spi-builder-workspace/.git/
hint: Using 'master' as the name for the initial branch. This default branch name
hint: is subject to change. To configure the initial branch name to use in all
hint: of your new repositories, which will suppress this warning, call:
hint:
hint: 	git config --global init.defaultBranch <name>
hint:
hint: Names commonly chosen instead of 'master' are 'main', 'trunk' and
hint: 'development'. The just-created branch can be renamed via this command:
hint:
hint: 	git branch -m <name>
From https://github.com/growingio/growingio-sdk-ios-utilities
 * branch            master     -> FETCH_HEAD
 * [new branch]      master     -> origin/master
HEAD is now at 195b276 fix: ANLSPI-26449 move to Xcode 16 (#6)
Cloned https://github.com/growingio/growingio-sdk-ios-utilities.git
Revision (git rev-parse @):
195b276b217d533bd2a6ccc64b3f59af1ad40f30
SUCCESS checkout https://github.com/growingio/growingio-sdk-ios-utilities.git at master
========================================
Build
========================================
Selected platform:         linux
Swift version:             6.1
Building package at path:  $PWD
https://github.com/growingio/growingio-sdk-ios-utilities.git
https://github.com/growingio/growingio-sdk-ios-utilities.git
WARNING: environment variable SUPPRESS_SWIFT_6_FLAGS is not set
{
  "dependencies" : [
  ],
  "manifest_display_name" : "GrowingUtils",
  "name" : "GrowingUtils",
  "path" : "/host/spi-builder-workspace",
  "platforms" : [
    {
      "name" : "ios",
      "version" : "12.0"
    },
    {
      "name" : "maccatalyst",
      "version" : "13.0"
    },
    {
      "name" : "macos",
      "version" : "10.14"
    },
    {
      "name" : "tvos",
      "version" : "12.0"
    },
    {
      "name" : "watchos",
      "version" : "7.0"
    },
    {
      "name" : "visionos",
      "version" : "1.0"
    }
  ],
  "products" : [
    {
      "name" : "GrowingUtilsTrackerCore",
      "targets" : [
        "GrowingUtilsTrackerCore_Wrapper"
      ],
      "type" : {
        "library" : [
          "automatic"
        ]
      }
    },
    {
      "name" : "GrowingUtilsAutotrackerCore",
      "targets" : [
        "GrowingUtilsAutotrackerCore_Wrapper"
      ],
      "type" : {
        "library" : [
          "automatic"
        ]
      }
    }
  ],
  "targets" : [
    {
      "c99name" : "GrowingUtilsTrackerCore_Wrapper",
      "module_type" : "ClangTarget",
      "name" : "GrowingUtilsTrackerCore_Wrapper",
      "path" : "SwiftPM-Wrap/TrackerCore-Wrapper",
      "product_memberships" : [
        "GrowingUtilsTrackerCore"
      ],
      "sources" : [
        "dummy.m"
      ],
      "target_dependencies" : [
        "GrowingUtilsTrackerCore"
      ],
      "type" : "library"
    },
    {
      "c99name" : "GrowingUtilsTrackerCore",
      "module_type" : "ClangTarget",
      "name" : "GrowingUtilsTrackerCore",
      "path" : "Sources/TrackerCore",
      "product_memberships" : [
        "GrowingUtilsTrackerCore",
        "GrowingUtilsAutotrackerCore"
      ],
      "resources" : [
        {
          "path" : "/host/spi-builder-workspace/Sources/TrackerCore/Resources/PrivacyInfo.xcprivacy",
          "rule" : {
            "copy" : {
            }
          }
        }
      ],
      "sources" : [
        "Category/UIApplication+GrowingUtilsTrackerCore.m",
        "Category/UIViewController+GrowingUtilsTrackerCore.m",
        "Extension/GrowingULApplication.m",
        "Lifecycle/GrowingULAppLifecycle.m",
        "Swizzle/GrowingULSwizzle.m",
        "Swizzle/GrowingULSwizzler.m",
        "TimeUtil/GrowingULTimeUtil.m"
      ],
      "type" : "library"
    },
    {
      "c99name" : "GrowingUtilsAutotrackerCore_Wrapper",
      "module_type" : "ClangTarget",
      "name" : "GrowingUtilsAutotrackerCore_Wrapper",
      "path" : "SwiftPM-Wrap/AutotrackerCore-Wrapper",
      "product_memberships" : [
        "GrowingUtilsAutotrackerCore"
      ],
      "sources" : [
        "dummy.m"
      ],
      "target_dependencies" : [
        "GrowingUtilsAutotrackerCore"
      ],
      "type" : "library"
    },
    {
      "c99name" : "GrowingUtilsAutotrackerCore",
      "module_type" : "ClangTarget",
      "name" : "GrowingUtilsAutotrackerCore",
      "path" : "Sources/AutotrackerCore",
      "product_memberships" : [
        "GrowingUtilsAutotrackerCore"
      ],
      "sources" : [
        "Lifecycle/GrowingULViewControllerLifecycle.m"
      ],
      "target_dependencies" : [
        "GrowingUtilsTrackerCore"
      ],
      "type" : "library"
    }
  ],
  "tools_version" : "5.9"
}
Running build ...
bash -c docker run --pull=always --rm -v "checkouts-4609320-0":/host -w "$PWD" registry.gitlab.com/finestructure/spi-images:basic-6.1-latest swift build --triple x86_64-unknown-linux-gnu -Xswiftc -Xfrontend -Xswiftc -stats-output-dir -Xswiftc -Xfrontend -Xswiftc .stats -Xswiftc -strict-concurrency=complete -Xswiftc -enable-upcoming-feature -Xswiftc StrictConcurrency -Xswiftc -enable-upcoming-feature -Xswiftc DisableOutwardActorInference -Xswiftc -enable-upcoming-feature -Xswiftc GlobalActorIsolatedTypesUsability -Xswiftc -enable-upcoming-feature -Xswiftc InferSendableFromCaptures 2>&1
basic-6.1-latest: Pulling from finestructure/spi-images
Digest: sha256:3bdcac04179f4ed3e5b8e9dbd6e74bbf5ebc0f4fde48bbaad7d1e5c757e65bcb
Status: Image is up to date for registry.gitlab.com/finestructure/spi-images:basic-6.1-latest
Building for debugging...
[0/11] Copying PrivacyInfo.xcprivacy
[1/11] Compiling GrowingUtilsTrackerCore_Wrapper dummy.m
In file included from <built-in>:1:
/host/spi-builder-workspace/.build/x86_64-unknown-linux-gnu/debug/GrowingUtilsTrackerCore.build/DerivedSources/resource_bundle_accessor.h:2:9: fatal error: 'Foundation/Foundation.h' file not found
    2 | #import <Foundation/Foundation.h>
      |         ^~~~~~~~~~~~~~~~~~~~~~~~~
1 error generated.
[2/11] Compiling GrowingUtilsTrackerCore resource_bundle_accessor.m
In file included from <built-in>:1:
/host/spi-builder-workspace/.build/x86_64-unknown-linux-gnu/debug/GrowingUtilsTrackerCore.build/DerivedSources/resource_bundle_accessor.h:2:9: fatal error: 'Foundation/Foundation.h' file not found
    2 | #import <Foundation/Foundation.h>
      |         ^~~~~~~~~~~~~~~~~~~~~~~~~
1 error generated.
[2/11] Compiling GrowingULTimeUtil.m
In file included from <built-in>:1:
/host/spi-builder-workspace/.build/x86_64-unknown-linux-gnu/debug/GrowingUtilsTrackerCore.build/DerivedSources/resource_bundle_accessor.h:2:9: fatal error: 'Foundation/Foundation.h' file not found
    2 | #import <Foundation/Foundation.h>
      |         ^~~~~~~~~~~~~~~~~~~~~~~~~
1 error generated.
[2/11] Compiling GrowingULSwizzle.m
[2/11] Compiling GrowingUtilsAutotrackerCore_Wrapper dummy.m
[2/11] Compiling UIViewController+GrowingUtilsTrackerCore.m
In file included from <built-in>:1:
/host/spi-builder-workspace/.build/x86_64-unknown-linux-gnu/debug/GrowingUtilsTrackerCore.build/DerivedSources/resource_bundle_accessor.h:2:9: fatal error: 'Foundation/Foundation.h' file not found
    2 | #import <Foundation/Foundation.h>
      |         ^~~~~~~~~~~~~~~~~~~~~~~~~
1 error generated.
[2/11] Compiling GrowingULApplication.m
In file included from <built-in>:1:
/host/spi-builder-workspace/.build/x86_64-unknown-linux-gnu/debug/GrowingUtilsTrackerCore.build/DerivedSources/resource_bundle_accessor.h:2:9: fatal error: 'Foundation/Foundation.h' file not found
    2 | #import <Foundation/Foundation.h>
      |         ^~~~~~~~~~~~~~~~~~~~~~~~~
1 error generated.
[2/11] Compiling GrowingULAppLifecycle.m
In file included from <built-in>:1:
/host/spi-builder-workspace/.build/x86_64-unknown-linux-gnu/debug/GrowingUtilsTrackerCore.build/DerivedSources/resource_bundle_accessor.h:2:9: fatal error: 'Foundation/Foundation.h' file not found
    2 | #import <Foundation/Foundation.h>
      |         ^~~~~~~~~~~~~~~~~~~~~~~~~
1 error generated.
[2/11] Compiling GrowingULSwizzler.m
Running build ...
bash -c docker run --pull=always --rm -v "checkouts-4609320-0":/host -w "$PWD" registry.gitlab.com/finestructure/spi-images:basic-6.1-latest swift build --triple x86_64-unknown-linux-gnu 2>&1
basic-6.1-latest: Pulling from finestructure/spi-images
Digest: sha256:3bdcac04179f4ed3e5b8e9dbd6e74bbf5ebc0f4fde48bbaad7d1e5c757e65bcb
Status: Image is up to date for registry.gitlab.com/finestructure/spi-images:basic-6.1-latest
[0/1] Planning build
Building for debugging...
[0/9] Compiling GrowingUtilsAutotrackerCore_Wrapper dummy.m
In file included from <built-in>:1:
/host/spi-builder-workspace/.build/x86_64-unknown-linux-gnu/debug/GrowingUtilsTrackerCore.build/DerivedSources/resource_bundle_accessor.h:2:9: fatal error: 'Foundation/Foundation.h' file not found
    2 | #import <Foundation/Foundation.h>
      |         ^~~~~~~~~~~~~~~~~~~~~~~~~
1 error generated.
[1/9] Compiling GrowingULAppLifecycle.m
[1/9] Compiling GrowingULApplication.m
[1/9] Compiling UIApplication+GrowingUtilsTrackerCore.m
In file included from <built-in>:1:
/host/spi-builder-workspace/.build/x86_64-unknown-linux-gnu/debug/GrowingUtilsTrackerCore.build/DerivedSources/resource_bundle_accessor.h:2:9: fatal error: 'Foundation/Foundation.h' file not found
    2 | #import <Foundation/Foundation.h>
      |         ^~~~~~~~~~~~~~~~~~~~~~~~~
1 error generated.
[1/9] Compiling GrowingUtilsTrackerCore resource_bundle_accessor.m
[1/9] Compiling UIViewController+GrowingUtilsTrackerCore.m
[1/9] Compiling GrowingULSwizzler.m
In file included from <built-in>:1:
/host/spi-builder-workspace/.build/x86_64-unknown-linux-gnu/debug/GrowingUtilsTrackerCore.build/DerivedSources/resource_bundle_accessor.h:2:9: fatal error: 'Foundation/Foundation.h' file not found
    2 | #import <Foundation/Foundation.h>
      |         ^~~~~~~~~~~~~~~~~~~~~~~~~
1 error generated.
[1/9] Compiling GrowingULTimeUtil.m
In file included from <built-in>:1:
/host/spi-builder-workspace/.build/x86_64-unknown-linux-gnu/debug/GrowingUtilsTrackerCore.build/DerivedSources/resource_bundle_accessor.h:2:9: fatal error: 'Foundation/Foundation.h' file not found
    2 | #import <Foundation/Foundation.h>
      |         ^~~~~~~~~~~~~~~~~~~~~~~~~
[1/9] Compiling GrowingULSwizzle.m
BUILD FAILURE 6.1 linux