The Swift Package Index logo.Swift Package Index

Track the adoption of Swift 6 strict concurrency checks for data race safety. How many packages are Ready for Swift 6?

Build Information

Failed to build DCSettings, reference main (7d9ad3), with Swift 6.0 for watchOS using Xcode 16.2 on 30 Nov 2024 20:03:28 UTC.

Build Command

env DEVELOPER_DIR=/Applications/Xcode-16.1.0.app xcrun xcodebuild -IDEClonedSourcePackagesDirPathOverride=$PWD/.dependencies -skipMacroValidation -skipPackagePluginValidation -derivedDataPath $PWD/.derivedData build -scheme DCSettings -destination generic/platform=watchOS OTHER_SWIFT_FLAGS=-stats-output-dir .stats -strict-concurrency=complete -enable-upcoming-feature StrictConcurrency -enable-upcoming-feature DisableOutwardActorInference -enable-upcoming-feature GlobalActorIsolatedTypesUsability -enable-upcoming-feature InferSendableFromCaptures

Build Log

SwiftCompile normal arm64_32 Compiling\ DCKeyRepresentable.swift,\ DCSetting.swift /Users/admin/builder/spi-builder-workspace/Sources/DCSettings/Settings/DCKeyRepresentable.swift /Users/admin/builder/spi-builder-workspace/Sources/DCSettings/Settings/DCSetting.swift (in target 'DCSettings' from project 'DCSettings')
    cd /Users/admin/builder/spi-builder-workspace/.swiftpm/xcode
    builtin-swiftTaskExecution -- /Applications/Xcode-16.1.0.app/Contents/Developer/Toolchains/XcodeDefault.xctoolchain/usr/bin/swift-frontend -frontend -c /Users/admin/builder/spi-builder-workspace/Sources/DCSettings/Extensions/Collection+Extended.swift /Users/admin/builder/spi-builder-workspace/Sources/DCSettings/Extensions/Color+Codable.swift /Users/admin/builder/spi-builder-workspace/Sources/DCSettings/Extensions/DCKeyRepresentableConformances.swift /Users/admin/builder/spi-builder-workspace/Sources/DCSettings/Extensions/NSUbiquitousKeyValueStore+DCKeyValueStore.swift /Users/admin/builder/spi-builder-workspace/Sources/DCSettings/Extensions/String+Extended.swift /Users/admin/builder/spi-builder-workspace/Sources/DCSettings/Extensions/Text+MonospacedDigit.swift /Users/admin/builder/spi-builder-workspace/Sources/DCSettings/Extensions/UserDefaults+DCKeyValueStore.swift -primary-file /Users/admin/builder/spi-builder-workspace/Sources/DCSettings/Settings/DCKeyRepresentable.swift -primary-file /Users/admin/builder/spi-builder-workspace/Sources/DCSettings/Settings/DCSetting.swift /Users/admin/builder/spi-builder-workspace/Sources/DCSettings/Settings/DCSettingConfiguration.swift /Users/admin/builder/spi-builder-workspace/Sources/DCSettings/Settings/DCSettingGroup.swift /Users/admin/builder/spi-builder-workspace/Sources/DCSettings/Settings/DCSettingOption.swift /Users/admin/builder/spi-builder-workspace/Sources/DCSettings/Settings/DCSettingsManager.swift /Users/admin/builder/spi-builder-workspace/Sources/DCSettings/Settings/DCStoredRepresentedValue.swift /Users/admin/builder/spi-builder-workspace/Sources/DCSettings/Settings/DCStoredValue.swift /Users/admin/builder/spi-builder-workspace/Sources/DCSettings/Settings/DCValueBounds.swift /Users/admin/builder/spi-builder-workspace/Sources/DCSettings/Store/DCKeyValueStore.swift /Users/admin/builder/spi-builder-workspace/Sources/DCSettings/Store/DCSettingStore.swift /Users/admin/builder/spi-builder-workspace/Sources/DCSettings/Views/DCSettingView.swift /Users/admin/builder/spi-builder-workspace/Sources/DCSettings/Views/DCSettingViewProviding.swift /Users/admin/builder/spi-builder-workspace/Sources/DCSettings/Views/DCSettingsView.swift -emit-dependencies-path /Users/admin/builder/spi-builder-workspace/.derivedData/Build/Intermediates.noindex/DCSettings.build/Debug-watchos/DCSettings.build/Objects-normal/arm64_32/DCKeyRepresentable.d -emit-const-values-path /Users/admin/builder/spi-builder-workspace/.derivedData/Build/Intermediates.noindex/DCSettings.build/Debug-watchos/DCSettings.build/Objects-normal/arm64_32/DCKeyRepresentable.swiftconstvalues -emit-reference-dependencies-path /Users/admin/builder/spi-builder-workspace/.derivedData/Build/Intermediates.noindex/DCSettings.build/Debug-watchos/DCSettings.build/Objects-normal/arm64_32/DCKeyRepresentable.swiftdeps -serialize-diagnostics-path /Users/admin/builder/spi-builder-workspace/.derivedData/Build/Intermediates.noindex/DCSettings.build/Debug-watchos/DCSettings.build/Objects-normal/arm64_32/DCKeyRepresentable.dia -emit-dependencies-path /Users/admin/builder/spi-builder-workspace/.derivedData/Build/Intermediates.noindex/DCSettings.build/Debug-watchos/DCSettings.build/Objects-normal/arm64_32/DCSetting.d -emit-const-values-path /Users/admin/builder/spi-builder-workspace/.derivedData/Build/Intermediates.noindex/DCSettings.build/Debug-watchos/DCSettings.build/Objects-normal/arm64_32/DCSetting.swiftconstvalues -emit-reference-dependencies-path /Users/admin/builder/spi-builder-workspace/.derivedData/Build/Intermediates.noindex/DCSettings.build/Debug-watchos/DCSettings.build/Objects-normal/arm64_32/DCSetting.swiftdeps -serialize-diagnostics-path /Users/admin/builder/spi-builder-workspace/.derivedData/Build/Intermediates.noindex/DCSettings.build/Debug-watchos/DCSettings.build/Objects-normal/arm64_32/DCSetting.dia -target arm64_32-apple-watchos6.0 -enable-objc-interop -sdk /Applications/Xcode-16.1.0.app/Contents/Developer/Platforms/WatchOS.platform/Developer/SDKs/WatchOS11.1.sdk -I /Users/admin/builder/spi-builder-workspace/.derivedData/Build/Products/Debug-watchos -I /Applications/Xcode-16.1.0.app/Contents/Developer/Platforms/WatchOS.platform/Developer/usr/lib -F /Users/admin/builder/spi-builder-workspace/.derivedData/Build/Products/Debug-watchos -F /Applications/Xcode-16.1.0.app/Contents/Developer/Platforms/WatchOS.platform/Developer/Library/Frameworks -F /Applications/Xcode-16.1.0.app/Contents/Developer/Platforms/WatchOS.platform/Developer/SDKs/WatchOS11.1.sdk/Developer/Library/Frameworks -no-color-diagnostics -enable-testing -g -debug-info-format\=dwarf -dwarf-version\=4 -module-cache-path /Users/admin/builder/spi-builder-workspace/.derivedData/ModuleCache.noindex -profile-generate -profile-coverage-mapping -swift-version 5 -enforce-exclusivity\=checked -stats-output-dir /Users/admin/builder/spi-builder-workspace/.swiftpm/xcode/.stats -Onone -D SWIFT_PACKAGE -D DEBUG -serialize-debugging-options -const-gather-protocols-file /Users/admin/builder/spi-builder-workspace/.derivedData/Build/Intermediates.noindex/DCSettings.build/Debug-watchos/DCSettings.build/Objects-normal/arm64_32/DCSettings_const_extract_protocols.json -enable-experimental-feature DebugDescriptionMacro -enable-experimental-feature OpaqueTypeErasure -enable-upcoming-feature StrictConcurrency -enable-upcoming-feature DisableOutwardActorInference -enable-upcoming-feature GlobalActorIsolatedTypesUsability -enable-upcoming-feature InferSendableFromCaptures -strict-concurrency\=complete -empty-abi-descriptor -plugin-path /Applications/Xcode-16.1.0.app/Contents/Developer/Toolchains/XcodeDefault.xctoolchain/usr/lib/swift/host/plugins/testing -validate-clang-modules-once -clang-build-session-file /Users/admin/builder/spi-builder-workspace/.derivedData/ModuleCache.noindex/Session.modulevalidation -Xcc -working-directory -Xcc /Users/admin/builder/spi-builder-workspace/.swiftpm/xcode -resource-dir /Applications/Xcode-16.1.0.app/Contents/Developer/Toolchains/XcodeDefault.xctoolchain/usr/lib/swift -enable-anonymous-context-mangled-names -file-compilation-dir /Users/admin/builder/spi-builder-workspace/.swiftpm/xcode -Xcc -D_LIBCPP_HARDENING_MODE\=_LIBCPP_HARDENING_MODE_DEBUG -Xcc -ivfsstatcache -Xcc /Users/admin/builder/spi-builder-workspace/.derivedData/SDKStatCaches.noindex/watchos11.1-22R574-7b9df0bda16bb4641b33636c68f04660.sdkstatcache -Xcc -I/Users/admin/builder/spi-builder-workspace/.derivedData/Build/Intermediates.noindex/DCSettings.build/Debug-watchos/DCSettings.build/swift-overrides.hmap -Xcc -I/Users/admin/builder/spi-builder-workspace/.derivedData/Build/Products/Debug-watchos/include -Xcc -I/Users/admin/builder/spi-builder-workspace/.derivedData/Build/Intermediates.noindex/DCSettings.build/Debug-watchos/DCSettings.build/DerivedSources-normal/arm64_32 -Xcc -I/Users/admin/builder/spi-builder-workspace/.derivedData/Build/Intermediates.noindex/DCSettings.build/Debug-watchos/DCSettings.build/DerivedSources/arm64_32 -Xcc -I/Users/admin/builder/spi-builder-workspace/.derivedData/Build/Intermediates.noindex/DCSettings.build/Debug-watchos/DCSettings.build/DerivedSources -Xcc -DSWIFT_PACKAGE -Xcc -DDEBUG\=1 -module-name DCSettings -package-name spi_builder_workspace -frontend-parseable-output -disable-clang-spi -target-sdk-version 11.1 -target-sdk-name watchos11.1 -external-plugin-path /Applications/Xcode-16.1.0.app/Contents/Developer/Platforms/WatchOS.platform/Developer/usr/lib/swift/host/plugins\#/Applications/Xcode-16.1.0.app/Contents/Developer/Platforms/WatchOS.platform/Developer/usr/bin/swift-plugin-server -external-plugin-path /Applications/Xcode-16.1.0.app/Contents/Developer/Platforms/WatchOS.platform/Developer/usr/local/lib/swift/host/plugins\#/Applications/Xcode-16.1.0.app/Contents/Developer/Platforms/WatchOS.platform/Developer/usr/bin/swift-plugin-server -plugin-path /Applications/Xcode-16.1.0.app/Contents/Developer/Toolchains/XcodeDefault.xctoolchain/usr/lib/swift/host/plugins -plugin-path /Applications/Xcode-16.1.0.app/Contents/Developer/Toolchains/XcodeDefault.xctoolchain/usr/local/lib/swift/host/plugins -o /Users/admin/builder/spi-builder-workspace/.derivedData/Build/Intermediates.noindex/DCSettings.build/Debug-watchos/DCSettings.build/Objects-normal/arm64_32/DCKeyRepresentable.o -o /Users/admin/builder/spi-builder-workspace/.derivedData/Build/Intermediates.noindex/DCSettings.build/Debug-watchos/DCSettings.build/Objects-normal/arm64_32/DCSetting.o -index-unit-output-path /DCSettings.build/Debug-watchos/DCSettings.build/Objects-normal/arm64_32/DCKeyRepresentable.o -index-unit-output-path /DCSettings.build/Debug-watchos/DCSettings.build/Objects-normal/arm64_32/DCSetting.o -index-store-path /Users/admin/builder/spi-builder-workspace/.derivedData/Index.noindex/DataStore -index-system-modules
SwiftCompile normal arm64_32 /Users/admin/builder/spi-builder-workspace/Sources/DCSettings/Settings/DCKeyRepresentable.swift (in target 'DCSettings' from project 'DCSettings')
    cd /Users/admin/builder/spi-builder-workspace/.swiftpm/xcode
    /Applications/Xcode-16.1.0.app/Contents/Developer/Toolchains/XcodeDefault.xctoolchain/usr/bin/swift-frontend -c /Users/admin/builder/spi-builder-workspace/Sources/DCSettings/Extensions/Collection+Extended.swift /Users/admin/builder/spi-builder-workspace/Sources/DCSettings/Extensions/Color+Codable.swift /Users/admin/builder/spi-builder-workspace/Sources/DCSettings/Extensions/DCKeyRepresentableConformances.swift /Users/admin/builder/spi-builder-workspace/Sources/DCSettings/Extensions/NSUbiquitousKeyValueStore+DCKeyValueStore.swift /Users/admin/builder/spi-builder-workspace/Sources/DCSettings/Extensions/String+Extended.swift /Users/admin/builder/spi-builder-workspace/Sources/DCSettings/Extensions/Text+MonospacedDigit.swift /Users/admin/builder/spi-builder-workspace/Sources/DCSettings/Extensions/UserDefaults+DCKeyValueStore.swift -primary-file /Users/admin/builder/spi-builder-workspace/Sources/DCSettings/Settings/DCKeyRepresentable.swift -primary-file /Users/admin/builder/spi-builder-workspace/Sources/DCSettings/Settings/DCSetting.swift /Users/admin/builder/spi-builder-workspace/Sources/DCSettings/Settings/DCSettingConfiguration.swift /Users/admin/builder/spi-builder-workspace/Sources/DCSettings/Settings/DCSettingGroup.swift /Users/admin/builder/spi-builder-workspace/Sources/DCSettings/Settings/DCSettingOption.swift /Users/admin/builder/spi-builder-workspace/Sources/DCSettings/Settings/DCSettingsManager.swift /Users/admin/builder/spi-builder-workspace/Sources/DCSettings/Settings/DCStoredRepresentedValue.swift /Users/admin/builder/spi-builder-workspace/Sources/DCSettings/Settings/DCStoredValue.swift /Users/admin/builder/spi-builder-workspace/Sources/DCSettings/Settings/DCValueBounds.swift /Users/admin/builder/spi-builder-workspace/Sources/DCSettings/Store/DCKeyValueStore.swift /Users/admin/builder/spi-builder-workspace/Sources/DCSettings/Store/DCSettingStore.swift /Users/admin/builder/spi-builder-workspace/Sources/DCSettings/Views/DCSettingView.swift /Users/admin/builder/spi-builder-workspace/Sources/DCSettings/Views/DCSettingViewProviding.swift /Users/admin/builder/spi-builder-workspace/Sources/DCSettings/Views/DCSettingsView.swift -emit-dependencies-path /Users/admin/builder/spi-builder-workspace/.derivedData/Build/Intermediates.noindex/DCSettings.build/Debug-watchos/DCSettings.build/Objects-normal/arm64_32/DCKeyRepresentable.d -emit-const-values-path /Users/admin/builder/spi-builder-workspace/.derivedData/Build/Intermediates.noindex/DCSettings.build/Debug-watchos/DCSettings.build/Objects-normal/arm64_32/DCKeyRepresentable.swiftconstvalues -emit-reference-dependencies-path /Users/admin/builder/spi-builder-workspace/.derivedData/Build/Intermediates.noindex/DCSettings.build/Debug-watchos/DCSettings.build/Objects-normal/arm64_32/DCKeyRepresentable.swiftdeps -serialize-diagnostics-path /Users/admin/builder/spi-builder-workspace/.derivedData/Build/Intermediates.noindex/DCSettings.build/Debug-watchos/DCSettings.build/Objects-normal/arm64_32/DCKeyRepresentable.dia -emit-dependencies-path /Users/admin/builder/spi-builder-workspace/.derivedData/Build/Intermediates.noindex/DCSettings.build/Debug-watchos/DCSettings.build/Objects-normal/arm64_32/DCSetting.d -emit-const-values-path /Users/admin/builder/spi-builder-workspace/.derivedData/Build/Intermediates.noindex/DCSettings.build/Debug-watchos/DCSettings.build/Objects-normal/arm64_32/DCSetting.swiftconstvalues -emit-reference-dependencies-path /Users/admin/builder/spi-builder-workspace/.derivedData/Build/Intermediates.noindex/DCSettings.build/Debug-watchos/DCSettings.build/Objects-normal/arm64_32/DCSetting.swiftdeps -serialize-diagnostics-path /Users/admin/builder/spi-builder-workspace/.derivedData/Build/Intermediates.noindex/DCSettings.build/Debug-watchos/DCSettings.build/Objects-normal/arm64_32/DCSetting.dia -target arm64_32-apple-watchos6.0 -enable-objc-interop -sdk /Applications/Xcode-16.1.0.app/Contents/Developer/Platforms/WatchOS.platform/Developer/SDKs/WatchOS11.1.sdk -I /Users/admin/builder/spi-builder-workspace/.derivedData/Build/Products/Debug-watchos -I /Applications/Xcode-16.1.0.app/Contents/Developer/Platforms/WatchOS.platform/Developer/usr/lib -F /Users/admin/builder/spi-builder-workspace/.derivedData/Build/Products/Debug-watchos -F /Applications/Xcode-16.1.0.app/Contents/Developer/Platforms/WatchOS.platform/Developer/Library/Frameworks -F /Applications/Xcode-16.1.0.app/Contents/Developer/Platforms/WatchOS.platform/Developer/SDKs/WatchOS11.1.sdk/Developer/Library/Frameworks -no-color-diagnostics -enable-testing -g -debug-info-format\=dwarf -dwarf-version\=4 -module-cache-path /Users/admin/builder/spi-builder-workspace/.derivedData/ModuleCache.noindex -profile-generate -profile-coverage-mapping -swift-version 5 -enforce-exclusivity\=checked -stats-output-dir /Users/admin/builder/spi-builder-workspace/.swiftpm/xcode/.stats -Onone -D SWIFT_PACKAGE -D DEBUG -serialize-debugging-options -const-gather-protocols-file /Users/admin/builder/spi-builder-workspace/.derivedData/Build/Intermediates.noindex/DCSettings.build/Debug-watchos/DCSettings.build/Objects-normal/arm64_32/DCSettings_const_extract_protocols.json -enable-experimental-feature DebugDescriptionMacro -enable-experimental-feature OpaqueTypeErasure -enable-upcoming-feature StrictConcurrency -enable-upcoming-feature DisableOutwardActorInference -enable-upcoming-feature GlobalActorIsolatedTypesUsability -enable-upcoming-feature InferSendableFromCaptures -strict-concurrency\=complete -empty-abi-descriptor -plugin-path /Applications/Xcode-16.1.0.app/Contents/Developer/Toolchains/XcodeDefault.xctoolchain/usr/lib/swift/host/plugins/testing -validate-clang-modules-once -clang-build-session-file /Users/admin/builder/spi-builder-workspace/.derivedData/ModuleCache.noindex/Session.modulevalidation -Xcc -working-directory -Xcc /Users/admin/builder/spi-builder-workspace/.swiftpm/xcode -resource-dir /Applications/Xcode-16.1.0.app/Contents/Developer/Toolchains/XcodeDefault.xctoolchain/usr/lib/swift -enable-anonymous-context-mangled-names -file-compilation-dir /Users/admin/builder/spi-builder-workspace/.swiftpm/xcode -Xcc -D_LIBCPP_HARDENING_MODE\=_LIBCPP_HARDENING_MODE_DEBUG -Xcc -ivfsstatcache -Xcc /Users/admin/builder/spi-builder-workspace/.derivedData/SDKStatCaches.noindex/watchos11.1-22R574-7b9df0bda16bb4641b33636c68f04660.sdkstatcache -Xcc -I/Users/admin/builder/spi-builder-workspace/.derivedData/Build/Intermediates.noindex/DCSettings.build/Debug-watchos/DCSettings.build/swift-overrides.hmap -Xcc -I/Users/admin/builder/spi-builder-workspace/.derivedData/Build/Products/Debug-watchos/include -Xcc -I/Users/admin/builder/spi-builder-workspace/.derivedData/Build/Intermediates.noindex/DCSettings.build/Debug-watchos/DCSettings.build/DerivedSources-normal/arm64_32 -Xcc -I/Users/admin/builder/spi-builder-workspace/.derivedData/Build/Intermediates.noindex/DCSettings.build/Debug-watchos/DCSettings.build/DerivedSources/arm64_32 -Xcc -I/Users/admin/builder/spi-builder-workspace/.derivedData/Build/Intermediates.noindex/DCSettings.build/Debug-watchos/DCSettings.build/DerivedSources -Xcc -DSWIFT_PACKAGE -Xcc -DDEBUG\=1 -module-name DCSettings -package-name spi_builder_workspace -frontend-parseable-output -disable-clang-spi -target-sdk-version 11.1 -target-sdk-name watchos11.1 -external-plugin-path /Applications/Xcode-16.1.0.app/Contents/Developer/Platforms/WatchOS.platform/Developer/usr/lib/swift/host/plugins\#/Applications/Xcode-16.1.0.app/Contents/Developer/Platforms/WatchOS.platform/Developer/usr/bin/swift-plugin-server -external-plugin-path /Applications/Xcode-16.1.0.app/Contents/Developer/Platforms/WatchOS.platform/Developer/usr/local/lib/swift/host/plugins\#/Applications/Xcode-16.1.0.app/Contents/Developer/Platforms/WatchOS.platform/Developer/usr/bin/swift-plugin-server -plugin-path /Applications/Xcode-16.1.0.app/Contents/Developer/Toolchains/XcodeDefault.xctoolchain/usr/lib/swift/host/plugins -plugin-path /Applications/Xcode-16.1.0.app/Contents/Developer/Toolchains/XcodeDefault.xctoolchain/usr/local/lib/swift/host/plugins -o /Users/admin/builder/spi-builder-workspace/.derivedData/Build/Intermediates.noindex/DCSettings.build/Debug-watchos/DCSettings.build/Objects-normal/arm64_32/DCKeyRepresentable.o -o /Users/admin/builder/spi-builder-workspace/.derivedData/Build/Intermediates.noindex/DCSettings.build/Debug-watchos/DCSettings.build/Objects-normal/arm64_32/DCSetting.o -index-unit-output-path /DCSettings.build/Debug-watchos/DCSettings.build/Objects-normal/arm64_32/DCKeyRepresentable.o -index-unit-output-path /DCSettings.build/Debug-watchos/DCSettings.build/Objects-normal/arm64_32/DCSetting.o -index-store-path /Users/admin/builder/spi-builder-workspace/.derivedData/Index.noindex/DataStore -index-system-modules
SwiftCompile normal arm64_32 /Users/admin/builder/spi-builder-workspace/Sources/DCSettings/Settings/DCSetting.swift (in target 'DCSettings' from project 'DCSettings')
    cd /Users/admin/builder/spi-builder-workspace/.swiftpm/xcode
    /Applications/Xcode-16.1.0.app/Contents/Developer/Toolchains/XcodeDefault.xctoolchain/usr/bin/swift-frontend -c /Users/admin/builder/spi-builder-workspace/Sources/DCSettings/Extensions/Collection+Extended.swift /Users/admin/builder/spi-builder-workspace/Sources/DCSettings/Extensions/Color+Codable.swift /Users/admin/builder/spi-builder-workspace/Sources/DCSettings/Extensions/DCKeyRepresentableConformances.swift /Users/admin/builder/spi-builder-workspace/Sources/DCSettings/Extensions/NSUbiquitousKeyValueStore+DCKeyValueStore.swift /Users/admin/builder/spi-builder-workspace/Sources/DCSettings/Extensions/String+Extended.swift /Users/admin/builder/spi-builder-workspace/Sources/DCSettings/Extensions/Text+MonospacedDigit.swift /Users/admin/builder/spi-builder-workspace/Sources/DCSettings/Extensions/UserDefaults+DCKeyValueStore.swift -primary-file /Users/admin/builder/spi-builder-workspace/Sources/DCSettings/Settings/DCKeyRepresentable.swift -primary-file /Users/admin/builder/spi-builder-workspace/Sources/DCSettings/Settings/DCSetting.swift /Users/admin/builder/spi-builder-workspace/Sources/DCSettings/Settings/DCSettingConfiguration.swift /Users/admin/builder/spi-builder-workspace/Sources/DCSettings/Settings/DCSettingGroup.swift /Users/admin/builder/spi-builder-workspace/Sources/DCSettings/Settings/DCSettingOption.swift /Users/admin/builder/spi-builder-workspace/Sources/DCSettings/Settings/DCSettingsManager.swift /Users/admin/builder/spi-builder-workspace/Sources/DCSettings/Settings/DCStoredRepresentedValue.swift /Users/admin/builder/spi-builder-workspace/Sources/DCSettings/Settings/DCStoredValue.swift /Users/admin/builder/spi-builder-workspace/Sources/DCSettings/Settings/DCValueBounds.swift /Users/admin/builder/spi-builder-workspace/Sources/DCSettings/Store/DCKeyValueStore.swift /Users/admin/builder/spi-builder-workspace/Sources/DCSettings/Store/DCSettingStore.swift /Users/admin/builder/spi-builder-workspace/Sources/DCSettings/Views/DCSettingView.swift /Users/admin/builder/spi-builder-workspace/Sources/DCSettings/Views/DCSettingViewProviding.swift /Users/admin/builder/spi-builder-workspace/Sources/DCSettings/Views/DCSettingsView.swift -emit-dependencies-path /Users/admin/builder/spi-builder-workspace/.derivedData/Build/Intermediates.noindex/DCSettings.build/Debug-watchos/DCSettings.build/Objects-normal/arm64_32/DCKeyRepresentable.d -emit-const-values-path /Users/admin/builder/spi-builder-workspace/.derivedData/Build/Intermediates.noindex/DCSettings.build/Debug-watchos/DCSettings.build/Objects-normal/arm64_32/DCKeyRepresentable.swiftconstvalues -emit-reference-dependencies-path /Users/admin/builder/spi-builder-workspace/.derivedData/Build/Intermediates.noindex/DCSettings.build/Debug-watchos/DCSettings.build/Objects-normal/arm64_32/DCKeyRepresentable.swiftdeps -serialize-diagnostics-path /Users/admin/builder/spi-builder-workspace/.derivedData/Build/Intermediates.noindex/DCSettings.build/Debug-watchos/DCSettings.build/Objects-normal/arm64_32/DCKeyRepresentable.dia -emit-dependencies-path /Users/admin/builder/spi-builder-workspace/.derivedData/Build/Intermediates.noindex/DCSettings.build/Debug-watchos/DCSettings.build/Objects-normal/arm64_32/DCSetting.d -emit-const-values-path /Users/admin/builder/spi-builder-workspace/.derivedData/Build/Intermediates.noindex/DCSettings.build/Debug-watchos/DCSettings.build/Objects-normal/arm64_32/DCSetting.swiftconstvalues -emit-reference-dependencies-path /Users/admin/builder/spi-builder-workspace/.derivedData/Build/Intermediates.noindex/DCSettings.build/Debug-watchos/DCSettings.build/Objects-normal/arm64_32/DCSetting.swiftdeps -serialize-diagnostics-path /Users/admin/builder/spi-builder-workspace/.derivedData/Build/Intermediates.noindex/DCSettings.build/Debug-watchos/DCSettings.build/Objects-normal/arm64_32/DCSetting.dia -target arm64_32-apple-watchos6.0 -enable-objc-interop -sdk /Applications/Xcode-16.1.0.app/Contents/Developer/Platforms/WatchOS.platform/Developer/SDKs/WatchOS11.1.sdk -I /Users/admin/builder/spi-builder-workspace/.derivedData/Build/Products/Debug-watchos -I /Applications/Xcode-16.1.0.app/Contents/Developer/Platforms/WatchOS.platform/Developer/usr/lib -F /Users/admin/builder/spi-builder-workspace/.derivedData/Build/Products/Debug-watchos -F /Applications/Xcode-16.1.0.app/Contents/Developer/Platforms/WatchOS.platform/Developer/Library/Frameworks -F /Applications/Xcode-16.1.0.app/Contents/Developer/Platforms/WatchOS.platform/Developer/SDKs/WatchOS11.1.sdk/Developer/Library/Frameworks -no-color-diagnostics -enable-testing -g -debug-info-format\=dwarf -dwarf-version\=4 -module-cache-path /Users/admin/builder/spi-builder-workspace/.derivedData/ModuleCache.noindex -profile-generate -profile-coverage-mapping -swift-version 5 -enforce-exclusivity\=checked -stats-output-dir /Users/admin/builder/spi-builder-workspace/.swiftpm/xcode/.stats -Onone -D SWIFT_PACKAGE -D DEBUG -serialize-debugging-options -const-gather-protocols-file /Users/admin/builder/spi-builder-workspace/.derivedData/Build/Intermediates.noindex/DCSettings.build/Debug-watchos/DCSettings.build/Objects-normal/arm64_32/DCSettings_const_extract_protocols.json -enable-experimental-feature DebugDescriptionMacro -enable-experimental-feature OpaqueTypeErasure -enable-upcoming-feature StrictConcurrency -enable-upcoming-feature DisableOutwardActorInference -enable-upcoming-feature GlobalActorIsolatedTypesUsability -enable-upcoming-feature InferSendableFromCaptures -strict-concurrency\=complete -empty-abi-descriptor -plugin-path /Applications/Xcode-16.1.0.app/Contents/Developer/Toolchains/XcodeDefault.xctoolchain/usr/lib/swift/host/plugins/testing -validate-clang-modules-once -clang-build-session-file /Users/admin/builder/spi-builder-workspace/.derivedData/ModuleCache.noindex/Session.modulevalidation -Xcc -working-directory -Xcc /Users/admin/builder/spi-builder-workspace/.swiftpm/xcode -resource-dir /Applications/Xcode-16.1.0.app/Contents/Developer/Toolchains/XcodeDefault.xctoolchain/usr/lib/swift -enable-anonymous-context-mangled-names -file-compilation-dir /Users/admin/builder/spi-builder-workspace/.swiftpm/xcode -Xcc -D_LIBCPP_HARDENING_MODE\=_LIBCPP_HARDENING_MODE_DEBUG -Xcc -ivfsstatcache -Xcc /Users/admin/builder/spi-builder-workspace/.derivedData/SDKStatCaches.noindex/watchos11.1-22R574-7b9df0bda16bb4641b33636c68f04660.sdkstatcache -Xcc -I/Users/admin/builder/spi-builder-workspace/.derivedData/Build/Intermediates.noindex/DCSettings.build/Debug-watchos/DCSettings.build/swift-overrides.hmap -Xcc -I/Users/admin/builder/spi-builder-workspace/.derivedData/Build/Products/Debug-watchos/include -Xcc -I/Users/admin/builder/spi-builder-workspace/.derivedData/Build/Intermediates.noindex/DCSettings.build/Debug-watchos/DCSettings.build/DerivedSources-normal/arm64_32 -Xcc -I/Users/admin/builder/spi-builder-workspace/.derivedData/Build/Intermediates.noindex/DCSettings.build/Debug-watchos/DCSettings.build/DerivedSources/arm64_32 -Xcc -I/Users/admin/builder/spi-builder-workspace/.derivedData/Build/Intermediates.noindex/DCSettings.build/Debug-watchos/DCSettings.build/DerivedSources -Xcc -DSWIFT_PACKAGE -Xcc -DDEBUG\=1 -module-name DCSettings -package-name spi_builder_workspace -frontend-parseable-output -disable-clang-spi -target-sdk-version 11.1 -target-sdk-name watchos11.1 -external-plugin-path /Applications/Xcode-16.1.0.app/Contents/Developer/Platforms/WatchOS.platform/Developer/usr/lib/swift/host/plugins\#/Applications/Xcode-16.1.0.app/Contents/Developer/Platforms/WatchOS.platform/Developer/usr/bin/swift-plugin-server -external-plugin-path /Applications/Xcode-16.1.0.app/Contents/Developer/Platforms/WatchOS.platform/Developer/usr/local/lib/swift/host/plugins\#/Applications/Xcode-16.1.0.app/Contents/Developer/Platforms/WatchOS.platform/Developer/usr/bin/swift-plugin-server -plugin-path /Applications/Xcode-16.1.0.app/Contents/Developer/Toolchains/XcodeDefault.xctoolchain/usr/lib/swift/host/plugins -plugin-path /Applications/Xcode-16.1.0.app/Contents/Developer/Toolchains/XcodeDefault.xctoolchain/usr/local/lib/swift/host/plugins -o /Users/admin/builder/spi-builder-workspace/.derivedData/Build/Intermediates.noindex/DCSettings.build/Debug-watchos/DCSettings.build/Objects-normal/arm64_32/DCKeyRepresentable.o -o /Users/admin/builder/spi-builder-workspace/.derivedData/Build/Intermediates.noindex/DCSettings.build/Debug-watchos/DCSettings.build/Objects-normal/arm64_32/DCSetting.o -index-unit-output-path /DCSettings.build/Debug-watchos/DCSettings.build/Objects-normal/arm64_32/DCKeyRepresentable.o -index-unit-output-path /DCSettings.build/Debug-watchos/DCSettings.build/Objects-normal/arm64_32/DCSetting.o -index-store-path /Users/admin/builder/spi-builder-workspace/.derivedData/Index.noindex/DataStore -index-system-modules
SwiftCompile normal arm64_32 Compiling\ Collection+Extended.swift,\ Color+Codable.swift,\ DCKeyRepresentableConformances.swift /Users/admin/builder/spi-builder-workspace/Sources/DCSettings/Extensions/Collection+Extended.swift /Users/admin/builder/spi-builder-workspace/Sources/DCSettings/Extensions/Color+Codable.swift /Users/admin/builder/spi-builder-workspace/Sources/DCSettings/Extensions/DCKeyRepresentableConformances.swift (in target 'DCSettings' from project 'DCSettings')
    cd /Users/admin/builder/spi-builder-workspace/.swiftpm/xcode
    builtin-swiftTaskExecution -- /Applications/Xcode-16.1.0.app/Contents/Developer/Toolchains/XcodeDefault.xctoolchain/usr/bin/swift-frontend -frontend -c -primary-file /Users/admin/builder/spi-builder-workspace/Sources/DCSettings/Extensions/Collection+Extended.swift -primary-file /Users/admin/builder/spi-builder-workspace/Sources/DCSettings/Extensions/Color+Codable.swift -primary-file /Users/admin/builder/spi-builder-workspace/Sources/DCSettings/Extensions/DCKeyRepresentableConformances.swift /Users/admin/builder/spi-builder-workspace/Sources/DCSettings/Extensions/NSUbiquitousKeyValueStore+DCKeyValueStore.swift /Users/admin/builder/spi-builder-workspace/Sources/DCSettings/Extensions/String+Extended.swift /Users/admin/builder/spi-builder-workspace/Sources/DCSettings/Extensions/Text+MonospacedDigit.swift /Users/admin/builder/spi-builder-workspace/Sources/DCSettings/Extensions/UserDefaults+DCKeyValueStore.swift /Users/admin/builder/spi-builder-workspace/Sources/DCSettings/Settings/DCKeyRepresentable.swift /Users/admin/builder/spi-builder-workspace/Sources/DCSettings/Settings/DCSetting.swift /Users/admin/builder/spi-builder-workspace/Sources/DCSettings/Settings/DCSettingConfiguration.swift /Users/admin/builder/spi-builder-workspace/Sources/DCSettings/Settings/DCSettingGroup.swift /Users/admin/builder/spi-builder-workspace/Sources/DCSettings/Settings/DCSettingOption.swift /Users/admin/builder/spi-builder-workspace/Sources/DCSettings/Settings/DCSettingsManager.swift /Users/admin/builder/spi-builder-workspace/Sources/DCSettings/Settings/DCStoredRepresentedValue.swift /Users/admin/builder/spi-builder-workspace/Sources/DCSettings/Settings/DCStoredValue.swift /Users/admin/builder/spi-builder-workspace/Sources/DCSettings/Settings/DCValueBounds.swift /Users/admin/builder/spi-builder-workspace/Sources/DCSettings/Store/DCKeyValueStore.swift /Users/admin/builder/spi-builder-workspace/Sources/DCSettings/Store/DCSettingStore.swift /Users/admin/builder/spi-builder-workspace/Sources/DCSettings/Views/DCSettingView.swift /Users/admin/builder/spi-builder-workspace/Sources/DCSettings/Views/DCSettingViewProviding.swift /Users/admin/builder/spi-builder-workspace/Sources/DCSettings/Views/DCSettingsView.swift -supplementary-output-file-map /Users/admin/builder/spi-builder-workspace/.derivedData/Build/Intermediates.noindex/DCSettings.build/Debug-watchos/DCSettings.build/Objects-normal/arm64_32/supplementaryOutputs-3 -target arm64_32-apple-watchos6.0 -enable-objc-interop -sdk /Applications/Xcode-16.1.0.app/Contents/Developer/Platforms/WatchOS.platform/Developer/SDKs/WatchOS11.1.sdk -I /Users/admin/builder/spi-builder-workspace/.derivedData/Build/Products/Debug-watchos -I /Applications/Xcode-16.1.0.app/Contents/Developer/Platforms/WatchOS.platform/Developer/usr/lib -F /Users/admin/builder/spi-builder-workspace/.derivedData/Build/Products/Debug-watchos -F /Applications/Xcode-16.1.0.app/Contents/Developer/Platforms/WatchOS.platform/Developer/Library/Frameworks -F /Applications/Xcode-16.1.0.app/Contents/Developer/Platforms/WatchOS.platform/Developer/SDKs/WatchOS11.1.sdk/Developer/Library/Frameworks -no-color-diagnostics -enable-testing -g -debug-info-format\=dwarf -dwarf-version\=4 -module-cache-path /Users/admin/builder/spi-builder-workspace/.derivedData/ModuleCache.noindex -profile-generate -profile-coverage-mapping -swift-version 5 -enforce-exclusivity\=checked -stats-output-dir /Users/admin/builder/spi-builder-workspace/.swiftpm/xcode/.stats -Onone -D SWIFT_PACKAGE -D DEBUG -serialize-debugging-options -const-gather-protocols-file /Users/admin/builder/spi-builder-workspace/.derivedData/Build/Intermediates.noindex/DCSettings.build/Debug-watchos/DCSettings.build/Objects-normal/arm64_32/DCSettings_const_extract_protocols.json -enable-experimental-feature DebugDescriptionMacro -enable-experimental-feature OpaqueTypeErasure -enable-upcoming-feature StrictConcurrency -enable-upcoming-feature DisableOutwardActorInference -enable-upcoming-feature GlobalActorIsolatedTypesUsability -enable-upcoming-feature InferSendableFromCaptures -strict-concurrency\=complete -empty-abi-descriptor -plugin-path /Applications/Xcode-16.1.0.app/Contents/Developer/Toolchains/XcodeDefault.xctoolchain/usr/lib/swift/host/plugins/testing -validate-clang-modules-once -clang-build-session-file /Users/admin/builder/spi-builder-workspace/.derivedData/ModuleCache.noindex/Session.modulevalidation -Xcc -working-directory -Xcc /Users/admin/builder/spi-builder-workspace/.swiftpm/xcode -resource-dir /Applications/Xcode-16.1.0.app/Contents/Developer/Toolchains/XcodeDefault.xctoolchain/usr/lib/swift -enable-anonymous-context-mangled-names -file-compilation-dir /Users/admin/builder/spi-builder-workspace/.swiftpm/xcode -Xcc -D_LIBCPP_HARDENING_MODE\=_LIBCPP_HARDENING_MODE_DEBUG -Xcc -ivfsstatcache -Xcc /Users/admin/builder/spi-builder-workspace/.derivedData/SDKStatCaches.noindex/watchos11.1-22R574-7b9df0bda16bb4641b33636c68f04660.sdkstatcache -Xcc -I/Users/admin/builder/spi-builder-workspace/.derivedData/Build/Intermediates.noindex/DCSettings.build/Debug-watchos/DCSettings.build/swift-overrides.hmap -Xcc -I/Users/admin/builder/spi-builder-workspace/.derivedData/Build/Products/Debug-watchos/include -Xcc -I/Users/admin/builder/spi-builder-workspace/.derivedData/Build/Intermediates.noindex/DCSettings.build/Debug-watchos/DCSettings.build/DerivedSources-normal/arm64_32 -Xcc -I/Users/admin/builder/spi-builder-workspace/.derivedData/Build/Intermediates.noindex/DCSettings.build/Debug-watchos/DCSettings.build/DerivedSources/arm64_32 -Xcc -I/Users/admin/builder/spi-builder-workspace/.derivedData/Build/Intermediates.noindex/DCSettings.build/Debug-watchos/DCSettings.build/DerivedSources -Xcc -DSWIFT_PACKAGE -Xcc -DDEBUG\=1 -module-name DCSettings -package-name spi_builder_workspace -frontend-parseable-output -disable-clang-spi -target-sdk-version 11.1 -target-sdk-name watchos11.1 -external-plugin-path /Applications/Xcode-16.1.0.app/Contents/Developer/Platforms/WatchOS.platform/Developer/usr/lib/swift/host/plugins\#/Applications/Xcode-16.1.0.app/Contents/Developer/Platforms/WatchOS.platform/Developer/usr/bin/swift-plugin-server -external-plugin-path /Applications/Xcode-16.1.0.app/Contents/Developer/Platforms/WatchOS.platform/Developer/usr/local/lib/swift/host/plugins\#/Applications/Xcode-16.1.0.app/Contents/Developer/Platforms/WatchOS.platform/Developer/usr/bin/swift-plugin-server -plugin-path /Applications/Xcode-16.1.0.app/Contents/Developer/Toolchains/XcodeDefault.xctoolchain/usr/lib/swift/host/plugins -plugin-path /Applications/Xcode-16.1.0.app/Contents/Developer/Toolchains/XcodeDefault.xctoolchain/usr/local/lib/swift/host/plugins -o /Users/admin/builder/spi-builder-workspace/.derivedData/Build/Intermediates.noindex/DCSettings.build/Debug-watchos/DCSettings.build/Objects-normal/arm64_32/Collection+Extended.o -o /Users/admin/builder/spi-builder-workspace/.derivedData/Build/Intermediates.noindex/DCSettings.build/Debug-watchos/DCSettings.build/Objects-normal/arm64_32/Color+Codable.o -o /Users/admin/builder/spi-builder-workspace/.derivedData/Build/Intermediates.noindex/DCSettings.build/Debug-watchos/DCSettings.build/Objects-normal/arm64_32/DCKeyRepresentableConformances.o -index-unit-output-path /DCSettings.build/Debug-watchos/DCSettings.build/Objects-normal/arm64_32/Collection+Extended.o -index-unit-output-path /DCSettings.build/Debug-watchos/DCSettings.build/Objects-normal/arm64_32/Color+Codable.o -index-unit-output-path /DCSettings.build/Debug-watchos/DCSettings.build/Objects-normal/arm64_32/DCKeyRepresentableConformances.o -index-store-path /Users/admin/builder/spi-builder-workspace/.derivedData/Index.noindex/DataStore -index-system-modules
SwiftCompile normal arm64_32 /Users/admin/builder/spi-builder-workspace/Sources/DCSettings/Extensions/Collection+Extended.swift (in target 'DCSettings' from project 'DCSettings')
    cd /Users/admin/builder/spi-builder-workspace/.swiftpm/xcode
    /Applications/Xcode-16.1.0.app/Contents/Developer/Toolchains/XcodeDefault.xctoolchain/usr/bin/swift-frontend -c -primary-file /Users/admin/builder/spi-builder-workspace/Sources/DCSettings/Extensions/Collection+Extended.swift -primary-file /Users/admin/builder/spi-builder-workspace/Sources/DCSettings/Extensions/Color+Codable.swift -primary-file /Users/admin/builder/spi-builder-workspace/Sources/DCSettings/Extensions/DCKeyRepresentableConformances.swift /Users/admin/builder/spi-builder-workspace/Sources/DCSettings/Extensions/NSUbiquitousKeyValueStore+DCKeyValueStore.swift /Users/admin/builder/spi-builder-workspace/Sources/DCSettings/Extensions/String+Extended.swift /Users/admin/builder/spi-builder-workspace/Sources/DCSettings/Extensions/Text+MonospacedDigit.swift /Users/admin/builder/spi-builder-workspace/Sources/DCSettings/Extensions/UserDefaults+DCKeyValueStore.swift /Users/admin/builder/spi-builder-workspace/Sources/DCSettings/Settings/DCKeyRepresentable.swift /Users/admin/builder/spi-builder-workspace/Sources/DCSettings/Settings/DCSetting.swift /Users/admin/builder/spi-builder-workspace/Sources/DCSettings/Settings/DCSettingConfiguration.swift /Users/admin/builder/spi-builder-workspace/Sources/DCSettings/Settings/DCSettingGroup.swift /Users/admin/builder/spi-builder-workspace/Sources/DCSettings/Settings/DCSettingOption.swift /Users/admin/builder/spi-builder-workspace/Sources/DCSettings/Settings/DCSettingsManager.swift /Users/admin/builder/spi-builder-workspace/Sources/DCSettings/Settings/DCStoredRepresentedValue.swift /Users/admin/builder/spi-builder-workspace/Sources/DCSettings/Settings/DCStoredValue.swift /Users/admin/builder/spi-builder-workspace/Sources/DCSettings/Settings/DCValueBounds.swift /Users/admin/builder/spi-builder-workspace/Sources/DCSettings/Store/DCKeyValueStore.swift /Users/admin/builder/spi-builder-workspace/Sources/DCSettings/Store/DCSettingStore.swift /Users/admin/builder/spi-builder-workspace/Sources/DCSettings/Views/DCSettingView.swift /Users/admin/builder/spi-builder-workspace/Sources/DCSettings/Views/DCSettingViewProviding.swift /Users/admin/builder/spi-builder-workspace/Sources/DCSettings/Views/DCSettingsView.swift -supplementary-output-file-map /Users/admin/builder/spi-builder-workspace/.derivedData/Build/Intermediates.noindex/DCSettings.build/Debug-watchos/DCSettings.build/Objects-normal/arm64_32/supplementaryOutputs-3 -target arm64_32-apple-watchos6.0 -enable-objc-interop -sdk /Applications/Xcode-16.1.0.app/Contents/Developer/Platforms/WatchOS.platform/Developer/SDKs/WatchOS11.1.sdk -I /Users/admin/builder/spi-builder-workspace/.derivedData/Build/Products/Debug-watchos -I /Applications/Xcode-16.1.0.app/Contents/Developer/Platforms/WatchOS.platform/Developer/usr/lib -F /Users/admin/builder/spi-builder-workspace/.derivedData/Build/Products/Debug-watchos -F /Applications/Xcode-16.1.0.app/Contents/Developer/Platforms/WatchOS.platform/Developer/Library/Frameworks -F /Applications/Xcode-16.1.0.app/Contents/Developer/Platforms/WatchOS.platform/Developer/SDKs/WatchOS11.1.sdk/Developer/Library/Frameworks -no-color-diagnostics -enable-testing -g -debug-info-format\=dwarf -dwarf-version\=4 -module-cache-path /Users/admin/builder/spi-builder-workspace/.derivedData/ModuleCache.noindex -profile-generate -profile-coverage-mapping -swift-version 5 -enforce-exclusivity\=checked -stats-output-dir /Users/admin/builder/spi-builder-workspace/.swiftpm/xcode/.stats -Onone -D SWIFT_PACKAGE -D DEBUG -serialize-debugging-options -const-gather-protocols-file /Users/admin/builder/spi-builder-workspace/.derivedData/Build/Intermediates.noindex/DCSettings.build/Debug-watchos/DCSettings.build/Objects-normal/arm64_32/DCSettings_const_extract_protocols.json -enable-experimental-feature DebugDescriptionMacro -enable-experimental-feature OpaqueTypeErasure -enable-upcoming-feature StrictConcurrency -enable-upcoming-feature DisableOutwardActorInference -enable-upcoming-feature GlobalActorIsolatedTypesUsability -enable-upcoming-feature InferSendableFromCaptures -strict-concurrency\=complete -empty-abi-descriptor -plugin-path /Applications/Xcode-16.1.0.app/Contents/Developer/Toolchains/XcodeDefault.xctoolchain/usr/lib/swift/host/plugins/testing -validate-clang-modules-once -clang-build-session-file /Users/admin/builder/spi-builder-workspace/.derivedData/ModuleCache.noindex/Session.modulevalidation -Xcc -working-directory -Xcc /Users/admin/builder/spi-builder-workspace/.swiftpm/xcode -resource-dir /Applications/Xcode-16.1.0.app/Contents/Developer/Toolchains/XcodeDefault.xctoolchain/usr/lib/swift -enable-anonymous-context-mangled-names -file-compilation-dir /Users/admin/builder/spi-builder-workspace/.swiftpm/xcode -Xcc -D_LIBCPP_HARDENING_MODE\=_LIBCPP_HARDENING_MODE_DEBUG -Xcc -ivfsstatcache -Xcc /Users/admin/builder/spi-builder-workspace/.derivedData/SDKStatCaches.noindex/watchos11.1-22R574-7b9df0bda16bb4641b33636c68f04660.sdkstatcache -Xcc -I/Users/admin/builder/spi-builder-workspace/.derivedData/Build/Intermediates.noindex/DCSettings.build/Debug-watchos/DCSettings.build/swift-overrides.hmap -Xcc -I/Users/admin/builder/spi-builder-workspace/.derivedData/Build/Products/Debug-watchos/include -Xcc -I/Users/admin/builder/spi-builder-workspace/.derivedData/Build/Intermediates.noindex/DCSettings.build/Debug-watchos/DCSettings.build/DerivedSources-normal/arm64_32 -Xcc -I/Users/admin/builder/spi-builder-workspace/.derivedData/Build/Intermediates.noindex/DCSettings.build/Debug-watchos/DCSettings.build/DerivedSources/arm64_32 -Xcc -I/Users/admin/builder/spi-builder-workspace/.derivedData/Build/Intermediates.noindex/DCSettings.build/Debug-watchos/DCSettings.build/DerivedSources -Xcc -DSWIFT_PACKAGE -Xcc -DDEBUG\=1 -module-name DCSettings -package-name spi_builder_workspace -frontend-parseable-output -disable-clang-spi -target-sdk-version 11.1 -target-sdk-name watchos11.1 -external-plugin-path /Applications/Xcode-16.1.0.app/Contents/Developer/Platforms/WatchOS.platform/Developer/usr/lib/swift/host/plugins\#/Applications/Xcode-16.1.0.app/Contents/Developer/Platforms/WatchOS.platform/Developer/usr/bin/swift-plugin-server -external-plugin-path /Applications/Xcode-16.1.0.app/Contents/Developer/Platforms/WatchOS.platform/Developer/usr/local/lib/swift/host/plugins\#/Applications/Xcode-16.1.0.app/Contents/Developer/Platforms/WatchOS.platform/Developer/usr/bin/swift-plugin-server -plugin-path /Applications/Xcode-16.1.0.app/Contents/Developer/Toolchains/XcodeDefault.xctoolchain/usr/lib/swift/host/plugins -plugin-path /Applications/Xcode-16.1.0.app/Contents/Developer/Toolchains/XcodeDefault.xctoolchain/usr/local/lib/swift/host/plugins -o /Users/admin/builder/spi-builder-workspace/.derivedData/Build/Intermediates.noindex/DCSettings.build/Debug-watchos/DCSettings.build/Objects-normal/arm64_32/Collection+Extended.o -o /Users/admin/builder/spi-builder-workspace/.derivedData/Build/Intermediates.noindex/DCSettings.build/Debug-watchos/DCSettings.build/Objects-normal/arm64_32/Color+Codable.o -o /Users/admin/builder/spi-builder-workspace/.derivedData/Build/Intermediates.noindex/DCSettings.build/Debug-watchos/DCSettings.build/Objects-normal/arm64_32/DCKeyRepresentableConformances.o -index-unit-output-path /DCSettings.build/Debug-watchos/DCSettings.build/Objects-normal/arm64_32/Collection+Extended.o -index-unit-output-path /DCSettings.build/Debug-watchos/DCSettings.build/Objects-normal/arm64_32/Color+Codable.o -index-unit-output-path /DCSettings.build/Debug-watchos/DCSettings.build/Objects-normal/arm64_32/DCKeyRepresentableConformances.o -index-store-path /Users/admin/builder/spi-builder-workspace/.derivedData/Index.noindex/DataStore -index-system-modules
SwiftCompile normal arm64_32 /Users/admin/builder/spi-builder-workspace/Sources/DCSettings/Extensions/Color+Codable.swift (in target 'DCSettings' from project 'DCSettings')
    cd /Users/admin/builder/spi-builder-workspace/.swiftpm/xcode
    /Applications/Xcode-16.1.0.app/Contents/Developer/Toolchains/XcodeDefault.xctoolchain/usr/bin/swift-frontend -c -primary-file /Users/admin/builder/spi-builder-workspace/Sources/DCSettings/Extensions/Collection+Extended.swift -primary-file /Users/admin/builder/spi-builder-workspace/Sources/DCSettings/Extensions/Color+Codable.swift -primary-file /Users/admin/builder/spi-builder-workspace/Sources/DCSettings/Extensions/DCKeyRepresentableConformances.swift /Users/admin/builder/spi-builder-workspace/Sources/DCSettings/Extensions/NSUbiquitousKeyValueStore+DCKeyValueStore.swift /Users/admin/builder/spi-builder-workspace/Sources/DCSettings/Extensions/String+Extended.swift /Users/admin/builder/spi-builder-workspace/Sources/DCSettings/Extensions/Text+MonospacedDigit.swift /Users/admin/builder/spi-builder-workspace/Sources/DCSettings/Extensions/UserDefaults+DCKeyValueStore.swift /Users/admin/builder/spi-builder-workspace/Sources/DCSettings/Settings/DCKeyRepresentable.swift /Users/admin/builder/spi-builder-workspace/Sources/DCSettings/Settings/DCSetting.swift /Users/admin/builder/spi-builder-workspace/Sources/DCSettings/Settings/DCSettingConfiguration.swift /Users/admin/builder/spi-builder-workspace/Sources/DCSettings/Settings/DCSettingGroup.swift /Users/admin/builder/spi-builder-workspace/Sources/DCSettings/Settings/DCSettingOption.swift /Users/admin/builder/spi-builder-workspace/Sources/DCSettings/Settings/DCSettingsManager.swift /Users/admin/builder/spi-builder-workspace/Sources/DCSettings/Settings/DCStoredRepresentedValue.swift /Users/admin/builder/spi-builder-workspace/Sources/DCSettings/Settings/DCStoredValue.swift /Users/admin/builder/spi-builder-workspace/Sources/DCSettings/Settings/DCValueBounds.swift /Users/admin/builder/spi-builder-workspace/Sources/DCSettings/Store/DCKeyValueStore.swift /Users/admin/builder/spi-builder-workspace/Sources/DCSettings/Store/DCSettingStore.swift /Users/admin/builder/spi-builder-workspace/Sources/DCSettings/Views/DCSettingView.swift /Users/admin/builder/spi-builder-workspace/Sources/DCSettings/Views/DCSettingViewProviding.swift /Users/admin/builder/spi-builder-workspace/Sources/DCSettings/Views/DCSettingsView.swift -supplementary-output-file-map /Users/admin/builder/spi-builder-workspace/.derivedData/Build/Intermediates.noindex/DCSettings.build/Debug-watchos/DCSettings.build/Objects-normal/arm64_32/supplementaryOutputs-3 -target arm64_32-apple-watchos6.0 -enable-objc-interop -sdk /Applications/Xcode-16.1.0.app/Contents/Developer/Platforms/WatchOS.platform/Developer/SDKs/WatchOS11.1.sdk -I /Users/admin/builder/spi-builder-workspace/.derivedData/Build/Products/Debug-watchos -I /Applications/Xcode-16.1.0.app/Contents/Developer/Platforms/WatchOS.platform/Developer/usr/lib -F /Users/admin/builder/spi-builder-workspace/.derivedData/Build/Products/Debug-watchos -F /Applications/Xcode-16.1.0.app/Contents/Developer/Platforms/WatchOS.platform/Developer/Library/Frameworks -F /Applications/Xcode-16.1.0.app/Contents/Developer/Platforms/WatchOS.platform/Developer/SDKs/WatchOS11.1.sdk/Developer/Library/Frameworks -no-color-diagnostics -enable-testing -g -debug-info-format\=dwarf -dwarf-version\=4 -module-cache-path /Users/admin/builder/spi-builder-workspace/.derivedData/ModuleCache.noindex -profile-generate -profile-coverage-mapping -swift-version 5 -enforce-exclusivity\=checked -stats-output-dir /Users/admin/builder/spi-builder-workspace/.swiftpm/xcode/.stats -Onone -D SWIFT_PACKAGE -D DEBUG -serialize-debugging-options -const-gather-protocols-file /Users/admin/builder/spi-builder-workspace/.derivedData/Build/Intermediates.noindex/DCSettings.build/Debug-watchos/DCSettings.build/Objects-normal/arm64_32/DCSettings_const_extract_protocols.json -enable-experimental-feature DebugDescriptionMacro -enable-experimental-feature OpaqueTypeErasure -enable-upcoming-feature StrictConcurrency -enable-upcoming-feature DisableOutwardActorInference -enable-upcoming-feature GlobalActorIsolatedTypesUsability -enable-upcoming-feature InferSendableFromCaptures -strict-concurrency\=complete -empty-abi-descriptor -plugin-path /Applications/Xcode-16.1.0.app/Contents/Developer/Toolchains/XcodeDefault.xctoolchain/usr/lib/swift/host/plugins/testing -validate-clang-modules-once -clang-build-session-file /Users/admin/builder/spi-builder-workspace/.derivedData/ModuleCache.noindex/Session.modulevalidation -Xcc -working-directory -Xcc /Users/admin/builder/spi-builder-workspace/.swiftpm/xcode -resource-dir /Applications/Xcode-16.1.0.app/Contents/Developer/Toolchains/XcodeDefault.xctoolchain/usr/lib/swift -enable-anonymous-context-mangled-names -file-compilation-dir /Users/admin/builder/spi-builder-workspace/.swiftpm/xcode -Xcc -D_LIBCPP_HARDENING_MODE\=_LIBCPP_HARDENING_MODE_DEBUG -Xcc -ivfsstatcache -Xcc /Users/admin/builder/spi-builder-workspace/.derivedData/SDKStatCaches.noindex/watchos11.1-22R574-7b9df0bda16bb4641b33636c68f04660.sdkstatcache -Xcc -I/Users/admin/builder/spi-builder-workspace/.derivedData/Build/Intermediates.noindex/DCSettings.build/Debug-watchos/DCSettings.build/swift-overrides.hmap -Xcc -I/Users/admin/builder/spi-builder-workspace/.derivedData/Build/Products/Debug-watchos/include -Xcc -I/Users/admin/builder/spi-builder-workspace/.derivedData/Build/Intermediates.noindex/DCSettings.build/Debug-watchos/DCSettings.build/DerivedSources-normal/arm64_32 -Xcc -I/Users/admin/builder/spi-builder-workspace/.derivedData/Build/Intermediates.noindex/DCSettings.build/Debug-watchos/DCSettings.build/DerivedSources/arm64_32 -Xcc -I/Users/admin/builder/spi-builder-workspace/.derivedData/Build/Intermediates.noindex/DCSettings.build/Debug-watchos/DCSettings.build/DerivedSources -Xcc -DSWIFT_PACKAGE -Xcc -DDEBUG\=1 -module-name DCSettings -package-name spi_builder_workspace -frontend-parseable-output -disable-clang-spi -target-sdk-version 11.1 -target-sdk-name watchos11.1 -external-plugin-path /Applications/Xcode-16.1.0.app/Contents/Developer/Platforms/WatchOS.platform/Developer/usr/lib/swift/host/plugins\#/Applications/Xcode-16.1.0.app/Contents/Developer/Platforms/WatchOS.platform/Developer/usr/bin/swift-plugin-server -external-plugin-path /Applications/Xcode-16.1.0.app/Contents/Developer/Platforms/WatchOS.platform/Developer/usr/local/lib/swift/host/plugins\#/Applications/Xcode-16.1.0.app/Contents/Developer/Platforms/WatchOS.platform/Developer/usr/bin/swift-plugin-server -plugin-path /Applications/Xcode-16.1.0.app/Contents/Developer/Toolchains/XcodeDefault.xctoolchain/usr/lib/swift/host/plugins -plugin-path /Applications/Xcode-16.1.0.app/Contents/Developer/Toolchains/XcodeDefault.xctoolchain/usr/local/lib/swift/host/plugins -o /Users/admin/builder/spi-builder-workspace/.derivedData/Build/Intermediates.noindex/DCSettings.build/Debug-watchos/DCSettings.build/Objects-normal/arm64_32/Collection+Extended.o -o /Users/admin/builder/spi-builder-workspace/.derivedData/Build/Intermediates.noindex/DCSettings.build/Debug-watchos/DCSettings.build/Objects-normal/arm64_32/Color+Codable.o -o /Users/admin/builder/spi-builder-workspace/.derivedData/Build/Intermediates.noindex/DCSettings.build/Debug-watchos/DCSettings.build/Objects-normal/arm64_32/DCKeyRepresentableConformances.o -index-unit-output-path /DCSettings.build/Debug-watchos/DCSettings.build/Objects-normal/arm64_32/Collection+Extended.o -index-unit-output-path /DCSettings.build/Debug-watchos/DCSettings.build/Objects-normal/arm64_32/Color+Codable.o -index-unit-output-path /DCSettings.build/Debug-watchos/DCSettings.build/Objects-normal/arm64_32/DCKeyRepresentableConformances.o -index-store-path /Users/admin/builder/spi-builder-workspace/.derivedData/Index.noindex/DataStore -index-system-modules
SwiftCompile normal arm64_32 /Users/admin/builder/spi-builder-workspace/Sources/DCSettings/Extensions/DCKeyRepresentableConformances.swift (in target 'DCSettings' from project 'DCSettings')
    cd /Users/admin/builder/spi-builder-workspace/.swiftpm/xcode
    /Applications/Xcode-16.1.0.app/Contents/Developer/Toolchains/XcodeDefault.xctoolchain/usr/bin/swift-frontend -c -primary-file /Users/admin/builder/spi-builder-workspace/Sources/DCSettings/Extensions/Collection+Extended.swift -primary-file /Users/admin/builder/spi-builder-workspace/Sources/DCSettings/Extensions/Color+Codable.swift -primary-file /Users/admin/builder/spi-builder-workspace/Sources/DCSettings/Extensions/DCKeyRepresentableConformances.swift /Users/admin/builder/spi-builder-workspace/Sources/DCSettings/Extensions/NSUbiquitousKeyValueStore+DCKeyValueStore.swift /Users/admin/builder/spi-builder-workspace/Sources/DCSettings/Extensions/String+Extended.swift /Users/admin/builder/spi-builder-workspace/Sources/DCSettings/Extensions/Text+MonospacedDigit.swift /Users/admin/builder/spi-builder-workspace/Sources/DCSettings/Extensions/UserDefaults+DCKeyValueStore.swift /Users/admin/builder/spi-builder-workspace/Sources/DCSettings/Settings/DCKeyRepresentable.swift /Users/admin/builder/spi-builder-workspace/Sources/DCSettings/Settings/DCSetting.swift /Users/admin/builder/spi-builder-workspace/Sources/DCSettings/Settings/DCSettingConfiguration.swift /Users/admin/builder/spi-builder-workspace/Sources/DCSettings/Settings/DCSettingGroup.swift /Users/admin/builder/spi-builder-workspace/Sources/DCSettings/Settings/DCSettingOption.swift /Users/admin/builder/spi-builder-workspace/Sources/DCSettings/Settings/DCSettingsManager.swift /Users/admin/builder/spi-builder-workspace/Sources/DCSettings/Settings/DCStoredRepresentedValue.swift /Users/admin/builder/spi-builder-workspace/Sources/DCSettings/Settings/DCStoredValue.swift /Users/admin/builder/spi-builder-workspace/Sources/DCSettings/Settings/DCValueBounds.swift /Users/admin/builder/spi-builder-workspace/Sources/DCSettings/Store/DCKeyValueStore.swift /Users/admin/builder/spi-builder-workspace/Sources/DCSettings/Store/DCSettingStore.swift /Users/admin/builder/spi-builder-workspace/Sources/DCSettings/Views/DCSettingView.swift /Users/admin/builder/spi-builder-workspace/Sources/DCSettings/Views/DCSettingViewProviding.swift /Users/admin/builder/spi-builder-workspace/Sources/DCSettings/Views/DCSettingsView.swift -supplementary-output-file-map /Users/admin/builder/spi-builder-workspace/.derivedData/Build/Intermediates.noindex/DCSettings.build/Debug-watchos/DCSettings.build/Objects-normal/arm64_32/supplementaryOutputs-3 -target arm64_32-apple-watchos6.0 -enable-objc-interop -sdk /Applications/Xcode-16.1.0.app/Contents/Developer/Platforms/WatchOS.platform/Developer/SDKs/WatchOS11.1.sdk -I /Users/admin/builder/spi-builder-workspace/.derivedData/Build/Products/Debug-watchos -I /Applications/Xcode-16.1.0.app/Contents/Developer/Platforms/WatchOS.platform/Developer/usr/lib -F /Users/admin/builder/spi-builder-workspace/.derivedData/Build/Products/Debug-watchos -F /Applications/Xcode-16.1.0.app/Contents/Developer/Platforms/WatchOS.platform/Developer/Library/Frameworks -F /Applications/Xcode-16.1.0.app/Contents/Developer/Platforms/WatchOS.platform/Developer/SDKs/WatchOS11.1.sdk/Developer/Library/Frameworks -no-color-diagnostics -enable-testing -g -debug-info-format\=dwarf -dwarf-version\=4 -module-cache-path /Users/admin/builder/spi-builder-workspace/.derivedData/ModuleCache.noindex -profile-generate -profile-coverage-mapping -swift-version 5 -enforce-exclusivity\=checked -stats-output-dir /Users/admin/builder/spi-builder-workspace/.swiftpm/xcode/.stats -Onone -D SWIFT_PACKAGE -D DEBUG -serialize-debugging-options -const-gather-protocols-file /Users/admin/builder/spi-builder-workspace/.derivedData/Build/Intermediates.noindex/DCSettings.build/Debug-watchos/DCSettings.build/Objects-normal/arm64_32/DCSettings_const_extract_protocols.json -enable-experimental-feature DebugDescriptionMacro -enable-experimental-feature OpaqueTypeErasure -enable-upcoming-feature StrictConcurrency -enable-upcoming-feature DisableOutwardActorInference -enable-upcoming-feature GlobalActorIsolatedTypesUsability -enable-upcoming-feature InferSendableFromCaptures -strict-concurrency\=complete -empty-abi-descriptor -plugin-path /Applications/Xcode-16.1.0.app/Contents/Developer/Toolchains/XcodeDefault.xctoolchain/usr/lib/swift/host/plugins/testing -validate-clang-modules-once -clang-build-session-file /Users/admin/builder/spi-builder-workspace/.derivedData/ModuleCache.noindex/Session.modulevalidation -Xcc -working-directory -Xcc /Users/admin/builder/spi-builder-workspace/.swiftpm/xcode -resource-dir /Applications/Xcode-16.1.0.app/Contents/Developer/Toolchains/XcodeDefault.xctoolchain/usr/lib/swift -enable-anonymous-context-mangled-names -file-compilation-dir /Users/admin/builder/spi-builder-workspace/.swiftpm/xcode -Xcc -D_LIBCPP_HARDENING_MODE\=_LIBCPP_HARDENING_MODE_DEBUG -Xcc -ivfsstatcache -Xcc /Users/admin/builder/spi-builder-workspace/.derivedData/SDKStatCaches.noindex/watchos11.1-22R574-7b9df0bda16bb4641b33636c68f04660.sdkstatcache -Xcc -I/Users/admin/builder/spi-builder-workspace/.derivedData/Build/Intermediates.noindex/DCSettings.build/Debug-watchos/DCSettings.build/swift-overrides.hmap -Xcc -I/Users/admin/builder/spi-builder-workspace/.derivedData/Build/Products/Debug-watchos/include -Xcc -I/Users/admin/builder/spi-builder-workspace/.derivedData/Build/Intermediates.noindex/DCSettings.build/Debug-watchos/DCSettings.build/DerivedSources-normal/arm64_32 -Xcc -I/Users/admin/builder/spi-builder-workspace/.derivedData/Build/Intermediates.noindex/DCSettings.build/Debug-watchos/DCSettings.build/DerivedSources/arm64_32 -Xcc -I/Users/admin/builder/spi-builder-workspace/.derivedData/Build/Intermediates.noindex/DCSettings.build/Debug-watchos/DCSettings.build/DerivedSources -Xcc -DSWIFT_PACKAGE -Xcc -DDEBUG\=1 -module-name DCSettings -package-name spi_builder_workspace -frontend-parseable-output -disable-clang-spi -target-sdk-version 11.1 -target-sdk-name watchos11.1 -external-plugin-path /Applications/Xcode-16.1.0.app/Contents/Developer/Platforms/WatchOS.platform/Developer/usr/lib/swift/host/plugins\#/Applications/Xcode-16.1.0.app/Contents/Developer/Platforms/WatchOS.platform/Developer/usr/bin/swift-plugin-server -external-plugin-path /Applications/Xcode-16.1.0.app/Contents/Developer/Platforms/WatchOS.platform/Developer/usr/local/lib/swift/host/plugins\#/Applications/Xcode-16.1.0.app/Contents/Developer/Platforms/WatchOS.platform/Developer/usr/bin/swift-plugin-server -plugin-path /Applications/Xcode-16.1.0.app/Contents/Developer/Toolchains/XcodeDefault.xctoolchain/usr/lib/swift/host/plugins -plugin-path /Applications/Xcode-16.1.0.app/Contents/Developer/Toolchains/XcodeDefault.xctoolchain/usr/local/lib/swift/host/plugins -o /Users/admin/builder/spi-builder-workspace/.derivedData/Build/Intermediates.noindex/DCSettings.build/Debug-watchos/DCSettings.build/Objects-normal/arm64_32/Collection+Extended.o -o /Users/admin/builder/spi-builder-workspace/.derivedData/Build/Intermediates.noindex/DCSettings.build/Debug-watchos/DCSettings.build/Objects-normal/arm64_32/Color+Codable.o -o /Users/admin/builder/spi-builder-workspace/.derivedData/Build/Intermediates.noindex/DCSettings.build/Debug-watchos/DCSettings.build/Objects-normal/arm64_32/DCKeyRepresentableConformances.o -index-unit-output-path /DCSettings.build/Debug-watchos/DCSettings.build/Objects-normal/arm64_32/Collection+Extended.o -index-unit-output-path /DCSettings.build/Debug-watchos/DCSettings.build/Objects-normal/arm64_32/Color+Codable.o -index-unit-output-path /DCSettings.build/Debug-watchos/DCSettings.build/Objects-normal/arm64_32/DCKeyRepresentableConformances.o -index-store-path /Users/admin/builder/spi-builder-workspace/.derivedData/Index.noindex/DataStore -index-system-modules
SwiftCompile normal arm64_32 Compiling\ DCStoredRepresentedValue.swift,\ DCStoredValue.swift /Users/admin/builder/spi-builder-workspace/Sources/DCSettings/Settings/DCStoredRepresentedValue.swift /Users/admin/builder/spi-builder-workspace/Sources/DCSettings/Settings/DCStoredValue.swift (in target 'DCSettings' from project 'DCSettings')
    cd /Users/admin/builder/spi-builder-workspace/.swiftpm/xcode
    builtin-swiftTaskExecution -- /Applications/Xcode-16.1.0.app/Contents/Developer/Toolchains/XcodeDefault.xctoolchain/usr/bin/swift-frontend -frontend -c /Users/admin/builder/spi-builder-workspace/Sources/DCSettings/Extensions/Collection+Extended.swift /Users/admin/builder/spi-builder-workspace/Sources/DCSettings/Extensions/Color+Codable.swift /Users/admin/builder/spi-builder-workspace/Sources/DCSettings/Extensions/DCKeyRepresentableConformances.swift /Users/admin/builder/spi-builder-workspace/Sources/DCSettings/Extensions/NSUbiquitousKeyValueStore+DCKeyValueStore.swift /Users/admin/builder/spi-builder-workspace/Sources/DCSettings/Extensions/String+Extended.swift /Users/admin/builder/spi-builder-workspace/Sources/DCSettings/Extensions/Text+MonospacedDigit.swift /Users/admin/builder/spi-builder-workspace/Sources/DCSettings/Extensions/UserDefaults+DCKeyValueStore.swift /Users/admin/builder/spi-builder-workspace/Sources/DCSettings/Settings/DCKeyRepresentable.swift /Users/admin/builder/spi-builder-workspace/Sources/DCSettings/Settings/DCSetting.swift /Users/admin/builder/spi-builder-workspace/Sources/DCSettings/Settings/DCSettingConfiguration.swift /Users/admin/builder/spi-builder-workspace/Sources/DCSettings/Settings/DCSettingGroup.swift /Users/admin/builder/spi-builder-workspace/Sources/DCSettings/Settings/DCSettingOption.swift /Users/admin/builder/spi-builder-workspace/Sources/DCSettings/Settings/DCSettingsManager.swift -primary-file /Users/admin/builder/spi-builder-workspace/Sources/DCSettings/Settings/DCStoredRepresentedValue.swift -primary-file /Users/admin/builder/spi-builder-workspace/Sources/DCSettings/Settings/DCStoredValue.swift /Users/admin/builder/spi-builder-workspace/Sources/DCSettings/Settings/DCValueBounds.swift /Users/admin/builder/spi-builder-workspace/Sources/DCSettings/Store/DCKeyValueStore.swift /Users/admin/builder/spi-builder-workspace/Sources/DCSettings/Store/DCSettingStore.swift /Users/admin/builder/spi-builder-workspace/Sources/DCSettings/Views/DCSettingView.swift /Users/admin/builder/spi-builder-workspace/Sources/DCSettings/Views/DCSettingViewProviding.swift /Users/admin/builder/spi-builder-workspace/Sources/DCSettings/Views/DCSettingsView.swift -emit-dependencies-path /Users/admin/builder/spi-builder-workspace/.derivedData/Build/Intermediates.noindex/DCSettings.build/Debug-watchos/DCSettings.build/Objects-normal/arm64_32/DCStoredRepresentedValue.d -emit-const-values-path /Users/admin/builder/spi-builder-workspace/.derivedData/Build/Intermediates.noindex/DCSettings.build/Debug-watchos/DCSettings.build/Objects-normal/arm64_32/DCStoredRepresentedValue.swiftconstvalues -emit-reference-dependencies-path /Users/admin/builder/spi-builder-workspace/.derivedData/Build/Intermediates.noindex/DCSettings.build/Debug-watchos/DCSettings.build/Objects-normal/arm64_32/DCStoredRepresentedValue.swiftdeps -serialize-diagnostics-path /Users/admin/builder/spi-builder-workspace/.derivedData/Build/Intermediates.noindex/DCSettings.build/Debug-watchos/DCSettings.build/Objects-normal/arm64_32/DCStoredRepresentedValue.dia -emit-dependencies-path /Users/admin/builder/spi-builder-workspace/.derivedData/Build/Intermediates.noindex/DCSettings.build/Debug-watchos/DCSettings.build/Objects-normal/arm64_32/DCStoredValue.d -emit-const-values-path /Users/admin/builder/spi-builder-workspace/.derivedData/Build/Intermediates.noindex/DCSettings.build/Debug-watchos/DCSettings.build/Objects-normal/arm64_32/DCStoredValue.swiftconstvalues -emit-reference-dependencies-path /Users/admin/builder/spi-builder-workspace/.derivedData/Build/Intermediates.noindex/DCSettings.build/Debug-watchos/DCSettings.build/Objects-normal/arm64_32/DCStoredValue.swiftdeps -serialize-diagnostics-path /Users/admin/builder/spi-builder-workspace/.derivedData/Build/Intermediates.noindex/DCSettings.build/Debug-watchos/DCSettings.build/Objects-normal/arm64_32/DCStoredValue.dia -target arm64_32-apple-watchos6.0 -enable-objc-interop -sdk /Applications/Xcode-16.1.0.app/Contents/Developer/Platforms/WatchOS.platform/Developer/SDKs/WatchOS11.1.sdk -I /Users/admin/builder/spi-builder-workspace/.derivedData/Build/Products/Debug-watchos -I /Applications/Xcode-16.1.0.app/Contents/Developer/Platforms/WatchOS.platform/Developer/usr/lib -F /Users/admin/builder/spi-builder-workspace/.derivedData/Build/Products/Debug-watchos -F /Applications/Xcode-16.1.0.app/Contents/Developer/Platforms/WatchOS.platform/Developer/Library/Frameworks -F /Applications/Xcode-16.1.0.app/Contents/Developer/Platforms/WatchOS.platform/Developer/SDKs/WatchOS11.1.sdk/Developer/Library/Frameworks -no-color-diagnostics -enable-testing -g -debug-info-format\=dwarf -dwarf-version\=4 -module-cache-path /Users/admin/builder/spi-builder-workspace/.derivedData/ModuleCache.noindex -profile-generate -profile-coverage-mapping -swift-version 5 -enforce-exclusivity\=checked -stats-output-dir /Users/admin/builder/spi-builder-workspace/.swiftpm/xcode/.stats -Onone -D SWIFT_PACKAGE -D DEBUG -serialize-debugging-options -const-gather-protocols-file /Users/admin/builder/spi-builder-workspace/.derivedData/Build/Intermediates.noindex/DCSettings.build/Debug-watchos/DCSettings.build/Objects-normal/arm64_32/DCSettings_const_extract_protocols.json -enable-experimental-feature DebugDescriptionMacro -enable-experimental-feature OpaqueTypeErasure -enable-upcoming-feature StrictConcurrency -enable-upcoming-feature DisableOutwardActorInference -enable-upcoming-feature GlobalActorIsolatedTypesUsability -enable-upcoming-feature InferSendableFromCaptures -strict-concurrency\=complete -empty-abi-descriptor -plugin-path /Applications/Xcode-16.1.0.app/Contents/Developer/Toolchains/XcodeDefault.xctoolchain/usr/lib/swift/host/plugins/testing -validate-clang-modules-once -clang-build-session-file /Users/admin/builder/spi-builder-workspace/.derivedData/ModuleCache.noindex/Session.modulevalidation -Xcc -working-directory -Xcc /Users/admin/builder/spi-builder-workspace/.swiftpm/xcode -resource-dir /Applications/Xcode-16.1.0.app/Contents/Developer/Toolchains/XcodeDefault.xctoolchain/usr/lib/swift -enable-anonymous-context-mangled-names -file-compilation-dir /Users/admin/builder/spi-builder-workspace/.swiftpm/xcode -Xcc -D_LIBCPP_HARDENING_MODE\=_LIBCPP_HARDENING_MODE_DEBUG -Xcc -ivfsstatcache -Xcc /Users/admin/builder/spi-builder-workspace/.derivedData/SDKStatCaches.noindex/watchos11.1-22R574-7b9df0bda16bb4641b33636c68f04660.sdkstatcache -Xcc -I/Users/admin/builder/spi-builder-workspace/.derivedData/Build/Intermediates.noindex/DCSettings.build/Debug-watchos/DCSettings.build/swift-overrides.hmap -Xcc -I/Users/admin/builder/spi-builder-workspace/.derivedData/Build/Products/Debug-watchos/include -Xcc -I/Users/admin/builder/spi-builder-workspace/.derivedData/Build/Intermediates.noindex/DCSettings.build/Debug-watchos/DCSettings.build/DerivedSources-normal/arm64_32 -Xcc -I/Users/admin/builder/spi-builder-workspace/.derivedData/Build/Intermediates.noindex/DCSettings.build/Debug-watchos/DCSettings.build/DerivedSources/arm64_32 -Xcc -I/Users/admin/builder/spi-builder-workspace/.derivedData/Build/Intermediates.noindex/DCSettings.build/Debug-watchos/DCSettings.build/DerivedSources -Xcc -DSWIFT_PACKAGE -Xcc -DDEBUG\=1 -module-name DCSettings -package-name spi_builder_workspace -frontend-parseable-output -disable-clang-spi -target-sdk-version 11.1 -target-sdk-name watchos11.1 -external-plugin-path /Applications/Xcode-16.1.0.app/Contents/Developer/Platforms/WatchOS.platform/Developer/usr/lib/swift/host/plugins\#/Applications/Xcode-16.1.0.app/Contents/Developer/Platforms/WatchOS.platform/Developer/usr/bin/swift-plugin-server -external-plugin-path /Applications/Xcode-16.1.0.app/Contents/Developer/Platforms/WatchOS.platform/Developer/usr/local/lib/swift/host/plugins\#/Applications/Xcode-16.1.0.app/Contents/Developer/Platforms/WatchOS.platform/Developer/usr/bin/swift-plugin-server -plugin-path /Applications/Xcode-16.1.0.app/Contents/Developer/Toolchains/XcodeDefault.xctoolchain/usr/lib/swift/host/plugins -plugin-path /Applications/Xcode-16.1.0.app/Contents/Developer/Toolchains/XcodeDefault.xctoolchain/usr/local/lib/swift/host/plugins -o /Users/admin/builder/spi-builder-workspace/.derivedData/Build/Intermediates.noindex/DCSettings.build/Debug-watchos/DCSettings.build/Objects-normal/arm64_32/DCStoredRepresentedValue.o -o /Users/admin/builder/spi-builder-workspace/.derivedData/Build/Intermediates.noindex/DCSettings.build/Debug-watchos/DCSettings.build/Objects-normal/arm64_32/DCStoredValue.o -index-unit-output-path /DCSettings.build/Debug-watchos/DCSettings.build/Objects-normal/arm64_32/DCStoredRepresentedValue.o -index-unit-output-path /DCSettings.build/Debug-watchos/DCSettings.build/Objects-normal/arm64_32/DCStoredValue.o -index-store-path /Users/admin/builder/spi-builder-workspace/.derivedData/Index.noindex/DataStore -index-system-modules
SwiftCompile normal arm64_32 /Users/admin/builder/spi-builder-workspace/Sources/DCSettings/Settings/DCStoredRepresentedValue.swift (in target 'DCSettings' from project 'DCSettings')
    cd /Users/admin/builder/spi-builder-workspace/.swiftpm/xcode
    /Applications/Xcode-16.1.0.app/Contents/Developer/Toolchains/XcodeDefault.xctoolchain/usr/bin/swift-frontend -c /Users/admin/builder/spi-builder-workspace/Sources/DCSettings/Extensions/Collection+Extended.swift /Users/admin/builder/spi-builder-workspace/Sources/DCSettings/Extensions/Color+Codable.swift /Users/admin/builder/spi-builder-workspace/Sources/DCSettings/Extensions/DCKeyRepresentableConformances.swift /Users/admin/builder/spi-builder-workspace/Sources/DCSettings/Extensions/NSUbiquitousKeyValueStore+DCKeyValueStore.swift /Users/admin/builder/spi-builder-workspace/Sources/DCSettings/Extensions/String+Extended.swift /Users/admin/builder/spi-builder-workspace/Sources/DCSettings/Extensions/Text+MonospacedDigit.swift /Users/admin/builder/spi-builder-workspace/Sources/DCSettings/Extensions/UserDefaults+DCKeyValueStore.swift /Users/admin/builder/spi-builder-workspace/Sources/DCSettings/Settings/DCKeyRepresentable.swift /Users/admin/builder/spi-builder-workspace/Sources/DCSettings/Settings/DCSetting.swift /Users/admin/builder/spi-builder-workspace/Sources/DCSettings/Settings/DCSettingConfiguration.swift /Users/admin/builder/spi-builder-workspace/Sources/DCSettings/Settings/DCSettingGroup.swift /Users/admin/builder/spi-builder-workspace/Sources/DCSettings/Settings/DCSettingOption.swift /Users/admin/builder/spi-builder-workspace/Sources/DCSettings/Settings/DCSettingsManager.swift -primary-file /Users/admin/builder/spi-builder-workspace/Sources/DCSettings/Settings/DCStoredRepresentedValue.swift -primary-file /Users/admin/builder/spi-builder-workspace/Sources/DCSettings/Settings/DCStoredValue.swift /Users/admin/builder/spi-builder-workspace/Sources/DCSettings/Settings/DCValueBounds.swift /Users/admin/builder/spi-builder-workspace/Sources/DCSettings/Store/DCKeyValueStore.swift /Users/admin/builder/spi-builder-workspace/Sources/DCSettings/Store/DCSettingStore.swift /Users/admin/builder/spi-builder-workspace/Sources/DCSettings/Views/DCSettingView.swift /Users/admin/builder/spi-builder-workspace/Sources/DCSettings/Views/DCSettingViewProviding.swift /Users/admin/builder/spi-builder-workspace/Sources/DCSettings/Views/DCSettingsView.swift -emit-dependencies-path /Users/admin/builder/spi-builder-workspace/.derivedData/Build/Intermediates.noindex/DCSettings.build/Debug-watchos/DCSettings.build/Objects-normal/arm64_32/DCStoredRepresentedValue.d -emit-const-values-path /Users/admin/builder/spi-builder-workspace/.derivedData/Build/Intermediates.noindex/DCSettings.build/Debug-watchos/DCSettings.build/Objects-normal/arm64_32/DCStoredRepresentedValue.swiftconstvalues -emit-reference-dependencies-path /Users/admin/builder/spi-builder-workspace/.derivedData/Build/Intermediates.noindex/DCSettings.build/Debug-watchos/DCSettings.build/Objects-normal/arm64_32/DCStoredRepresentedValue.swiftdeps -serialize-diagnostics-path /Users/admin/builder/spi-builder-workspace/.derivedData/Build/Intermediates.noindex/DCSettings.build/Debug-watchos/DCSettings.build/Objects-normal/arm64_32/DCStoredRepresentedValue.dia -emit-dependencies-path /Users/admin/builder/spi-builder-workspace/.derivedData/Build/Intermediates.noindex/DCSettings.build/Debug-watchos/DCSettings.build/Objects-normal/arm64_32/DCStoredValue.d -emit-const-values-path /Users/admin/builder/spi-builder-workspace/.derivedData/Build/Intermediates.noindex/DCSettings.build/Debug-watchos/DCSettings.build/Objects-normal/arm64_32/DCStoredValue.swiftconstvalues -emit-reference-dependencies-path /Users/admin/builder/spi-builder-workspace/.derivedData/Build/Intermediates.noindex/DCSettings.build/Debug-watchos/DCSettings.build/Objects-normal/arm64_32/DCStoredValue.swiftdeps -serialize-diagnostics-path /Users/admin/builder/spi-builder-workspace/.derivedData/Build/Intermediates.noindex/DCSettings.build/Debug-watchos/DCSettings.build/Objects-normal/arm64_32/DCStoredValue.dia -target arm64_32-apple-watchos6.0 -enable-objc-interop -sdk /Applications/Xcode-16.1.0.app/Contents/Developer/Platforms/WatchOS.platform/Developer/SDKs/WatchOS11.1.sdk -I /Users/admin/builder/spi-builder-workspace/.derivedData/Build/Products/Debug-watchos -I /Applications/Xcode-16.1.0.app/Contents/Developer/Platforms/WatchOS.platform/Developer/usr/lib -F /Users/admin/builder/spi-builder-workspace/.derivedData/Build/Products/Debug-watchos -F /Applications/Xcode-16.1.0.app/Contents/Developer/Platforms/WatchOS.platform/Developer/Library/Frameworks -F /Applications/Xcode-16.1.0.app/Contents/Developer/Platforms/WatchOS.platform/Developer/SDKs/WatchOS11.1.sdk/Developer/Library/Frameworks -no-color-diagnostics -enable-testing -g -debug-info-format\=dwarf -dwarf-version\=4 -module-cache-path /Users/admin/builder/spi-builder-workspace/.derivedData/ModuleCache.noindex -profile-generate -profile-coverage-mapping -swift-version 5 -enforce-exclusivity\=checked -stats-output-dir /Users/admin/builder/spi-builder-workspace/.swiftpm/xcode/.stats -Onone -D SWIFT_PACKAGE -D DEBUG -serialize-debugging-options -const-gather-protocols-file /Users/admin/builder/spi-builder-workspace/.derivedData/Build/Intermediates.noindex/DCSettings.build/Debug-watchos/DCSettings.build/Objects-normal/arm64_32/DCSettings_const_extract_protocols.json -enable-experimental-feature DebugDescriptionMacro -enable-experimental-feature OpaqueTypeErasure -enable-upcoming-feature StrictConcurrency -enable-upcoming-feature DisableOutwardActorInference -enable-upcoming-feature GlobalActorIsolatedTypesUsability -enable-upcoming-feature InferSendableFromCaptures -strict-concurrency\=complete -empty-abi-descriptor -plugin-path /Applications/Xcode-16.1.0.app/Contents/Developer/Toolchains/XcodeDefault.xctoolchain/usr/lib/swift/host/plugins/testing -validate-clang-modules-once -clang-build-session-file /Users/admin/builder/spi-builder-workspace/.derivedData/ModuleCache.noindex/Session.modulevalidation -Xcc -working-directory -Xcc /Users/admin/builder/spi-builder-workspace/.swiftpm/xcode -resource-dir /Applications/Xcode-16.1.0.app/Contents/Developer/Toolchains/XcodeDefault.xctoolchain/usr/lib/swift -enable-anonymous-context-mangled-names -file-compilation-dir /Users/admin/builder/spi-builder-workspace/.swiftpm/xcode -Xcc -D_LIBCPP_HARDENING_MODE\=_LIBCPP_HARDENING_MODE_DEBUG -Xcc -ivfsstatcache -Xcc /Users/admin/builder/spi-builder-workspace/.derivedData/SDKStatCaches.noindex/watchos11.1-22R574-7b9df0bda16bb4641b33636c68f04660.sdkstatcache -Xcc -I/Users/admin/builder/spi-builder-workspace/.derivedData/Build/Intermediates.noindex/DCSettings.build/Debug-watchos/DCSettings.build/swift-overrides.hmap -Xcc -I/Users/admin/builder/spi-builder-workspace/.derivedData/Build/Products/Debug-watchos/include -Xcc -I/Users/admin/builder/spi-builder-workspace/.derivedData/Build/Intermediates.noindex/DCSettings.build/Debug-watchos/DCSettings.build/DerivedSources-normal/arm64_32 -Xcc -I/Users/admin/builder/spi-builder-workspace/.derivedData/Build/Intermediates.noindex/DCSettings.build/Debug-watchos/DCSettings.build/DerivedSources/arm64_32 -Xcc -I/Users/admin/builder/spi-builder-workspace/.derivedData/Build/Intermediates.noindex/DCSettings.build/Debug-watchos/DCSettings.build/DerivedSources -Xcc -DSWIFT_PACKAGE -Xcc -DDEBUG\=1 -module-name DCSettings -package-name spi_builder_workspace -frontend-parseable-output -disable-clang-spi -target-sdk-version 11.1 -target-sdk-name watchos11.1 -external-plugin-path /Applications/Xcode-16.1.0.app/Contents/Developer/Platforms/WatchOS.platform/Developer/usr/lib/swift/host/plugins\#/Applications/Xcode-16.1.0.app/Contents/Developer/Platforms/WatchOS.platform/Developer/usr/bin/swift-plugin-server -external-plugin-path /Applications/Xcode-16.1.0.app/Contents/Developer/Platforms/WatchOS.platform/Developer/usr/local/lib/swift/host/plugins\#/Applications/Xcode-16.1.0.app/Contents/Developer/Platforms/WatchOS.platform/Developer/usr/bin/swift-plugin-server -plugin-path /Applications/Xcode-16.1.0.app/Contents/Developer/Toolchains/XcodeDefault.xctoolchain/usr/lib/swift/host/plugins -plugin-path /Applications/Xcode-16.1.0.app/Contents/Developer/Toolchains/XcodeDefault.xctoolchain/usr/local/lib/swift/host/plugins -o /Users/admin/builder/spi-builder-workspace/.derivedData/Build/Intermediates.noindex/DCSettings.build/Debug-watchos/DCSettings.build/Objects-normal/arm64_32/DCStoredRepresentedValue.o -o /Users/admin/builder/spi-builder-workspace/.derivedData/Build/Intermediates.noindex/DCSettings.build/Debug-watchos/DCSettings.build/Objects-normal/arm64_32/DCStoredValue.o -index-unit-output-path /DCSettings.build/Debug-watchos/DCSettings.build/Objects-normal/arm64_32/DCStoredRepresentedValue.o -index-unit-output-path /DCSettings.build/Debug-watchos/DCSettings.build/Objects-normal/arm64_32/DCStoredValue.o -index-store-path /Users/admin/builder/spi-builder-workspace/.derivedData/Index.noindex/DataStore -index-system-modules
SwiftCompile normal arm64_32 /Users/admin/builder/spi-builder-workspace/Sources/DCSettings/Settings/DCStoredValue.swift (in target 'DCSettings' from project 'DCSettings')
    cd /Users/admin/builder/spi-builder-workspace/.swiftpm/xcode
    /Applications/Xcode-16.1.0.app/Contents/Developer/Toolchains/XcodeDefault.xctoolchain/usr/bin/swift-frontend -c /Users/admin/builder/spi-builder-workspace/Sources/DCSettings/Extensions/Collection+Extended.swift /Users/admin/builder/spi-builder-workspace/Sources/DCSettings/Extensions/Color+Codable.swift /Users/admin/builder/spi-builder-workspace/Sources/DCSettings/Extensions/DCKeyRepresentableConformances.swift /Users/admin/builder/spi-builder-workspace/Sources/DCSettings/Extensions/NSUbiquitousKeyValueStore+DCKeyValueStore.swift /Users/admin/builder/spi-builder-workspace/Sources/DCSettings/Extensions/String+Extended.swift /Users/admin/builder/spi-builder-workspace/Sources/DCSettings/Extensions/Text+MonospacedDigit.swift /Users/admin/builder/spi-builder-workspace/Sources/DCSettings/Extensions/UserDefaults+DCKeyValueStore.swift /Users/admin/builder/spi-builder-workspace/Sources/DCSettings/Settings/DCKeyRepresentable.swift /Users/admin/builder/spi-builder-workspace/Sources/DCSettings/Settings/DCSetting.swift /Users/admin/builder/spi-builder-workspace/Sources/DCSettings/Settings/DCSettingConfiguration.swift /Users/admin/builder/spi-builder-workspace/Sources/DCSettings/Settings/DCSettingGroup.swift /Users/admin/builder/spi-builder-workspace/Sources/DCSettings/Settings/DCSettingOption.swift /Users/admin/builder/spi-builder-workspace/Sources/DCSettings/Settings/DCSettingsManager.swift -primary-file /Users/admin/builder/spi-builder-workspace/Sources/DCSettings/Settings/DCStoredRepresentedValue.swift -primary-file /Users/admin/builder/spi-builder-workspace/Sources/DCSettings/Settings/DCStoredValue.swift /Users/admin/builder/spi-builder-workspace/Sources/DCSettings/Settings/DCValueBounds.swift /Users/admin/builder/spi-builder-workspace/Sources/DCSettings/Store/DCKeyValueStore.swift /Users/admin/builder/spi-builder-workspace/Sources/DCSettings/Store/DCSettingStore.swift /Users/admin/builder/spi-builder-workspace/Sources/DCSettings/Views/DCSettingView.swift /Users/admin/builder/spi-builder-workspace/Sources/DCSettings/Views/DCSettingViewProviding.swift /Users/admin/builder/spi-builder-workspace/Sources/DCSettings/Views/DCSettingsView.swift -emit-dependencies-path /Users/admin/builder/spi-builder-workspace/.derivedData/Build/Intermediates.noindex/DCSettings.build/Debug-watchos/DCSettings.build/Objects-normal/arm64_32/DCStoredRepresentedValue.d -emit-const-values-path /Users/admin/builder/spi-builder-workspace/.derivedData/Build/Intermediates.noindex/DCSettings.build/Debug-watchos/DCSettings.build/Objects-normal/arm64_32/DCStoredRepresentedValue.swiftconstvalues -emit-reference-dependencies-path /Users/admin/builder/spi-builder-workspace/.derivedData/Build/Intermediates.noindex/DCSettings.build/Debug-watchos/DCSettings.build/Objects-normal/arm64_32/DCStoredRepresentedValue.swiftdeps -serialize-diagnostics-path /Users/admin/builder/spi-builder-workspace/.derivedData/Build/Intermediates.noindex/DCSettings.build/Debug-watchos/DCSettings.build/Objects-normal/arm64_32/DCStoredRepresentedValue.dia -emit-dependencies-path /Users/admin/builder/spi-builder-workspace/.derivedData/Build/Intermediates.noindex/DCSettings.build/Debug-watchos/DCSettings.build/Objects-normal/arm64_32/DCStoredValue.d -emit-const-values-path /Users/admin/builder/spi-builder-workspace/.derivedData/Build/Intermediates.noindex/DCSettings.build/Debug-watchos/DCSettings.build/Objects-normal/arm64_32/DCStoredValue.swiftconstvalues -emit-reference-dependencies-path /Users/admin/builder/spi-builder-workspace/.derivedData/Build/Intermediates.noindex/DCSettings.build/Debug-watchos/DCSettings.build/Objects-normal/arm64_32/DCStoredValue.swiftdeps -serialize-diagnostics-path /Users/admin/builder/spi-builder-workspace/.derivedData/Build/Intermediates.noindex/DCSettings.build/Debug-watchos/DCSettings.build/Objects-normal/arm64_32/DCStoredValue.dia -target arm64_32-apple-watchos6.0 -enable-objc-interop -sdk /Applications/Xcode-16.1.0.app/Contents/Developer/Platforms/WatchOS.platform/Developer/SDKs/WatchOS11.1.sdk -I /Users/admin/builder/spi-builder-workspace/.derivedData/Build/Products/Debug-watchos -I /Applications/Xcode-16.1.0.app/Contents/Developer/Platforms/WatchOS.platform/Developer/usr/lib -F /Users/admin/builder/spi-builder-workspace/.derivedData/Build/Products/Debug-watchos -F /Applications/Xcode-16.1.0.app/Contents/Developer/Platforms/WatchOS.platform/Developer/Library/Frameworks -F /Applications/Xcode-16.1.0.app/Contents/Developer/Platforms/WatchOS.platform/Developer/SDKs/WatchOS11.1.sdk/Developer/Library/Frameworks -no-color-diagnostics -enable-testing -g -debug-info-format\=dwarf -dwarf-version\=4 -module-cache-path /Users/admin/builder/spi-builder-workspace/.derivedData/ModuleCache.noindex -profile-generate -profile-coverage-mapping -swift-version 5 -enforce-exclusivity\=checked -stats-output-dir /Users/admin/builder/spi-builder-workspace/.swiftpm/xcode/.stats -Onone -D SWIFT_PACKAGE -D DEBUG -serialize-debugging-options -const-gather-protocols-file /Users/admin/builder/spi-builder-workspace/.derivedData/Build/Intermediates.noindex/DCSettings.build/Debug-watchos/DCSettings.build/Objects-normal/arm64_32/DCSettings_const_extract_protocols.json -enable-experimental-feature DebugDescriptionMacro -enable-experimental-feature OpaqueTypeErasure -enable-upcoming-feature StrictConcurrency -enable-upcoming-feature DisableOutwardActorInference -enable-upcoming-feature GlobalActorIsolatedTypesUsability -enable-upcoming-feature InferSendableFromCaptures -strict-concurrency\=complete -empty-abi-descriptor -plugin-path /Applications/Xcode-16.1.0.app/Contents/Developer/Toolchains/XcodeDefault.xctoolchain/usr/lib/swift/host/plugins/testing -validate-clang-modules-once -clang-build-session-file /Users/admin/builder/spi-builder-workspace/.derivedData/ModuleCache.noindex/Session.modulevalidation -Xcc -working-directory -Xcc /Users/admin/builder/spi-builder-workspace/.swiftpm/xcode -resource-dir /Applications/Xcode-16.1.0.app/Contents/Developer/Toolchains/XcodeDefault.xctoolchain/usr/lib/swift -enable-anonymous-context-mangled-names -file-compilation-dir /Users/admin/builder/spi-builder-workspace/.swiftpm/xcode -Xcc -D_LIBCPP_HARDENING_MODE\=_LIBCPP_HARDENING_MODE_DEBUG -Xcc -ivfsstatcache -Xcc /Users/admin/builder/spi-builder-workspace/.derivedData/SDKStatCaches.noindex/watchos11.1-22R574-7b9df0bda16bb4641b33636c68f04660.sdkstatcache -Xcc -I/Users/admin/builder/spi-builder-workspace/.derivedData/Build/Intermediates.noindex/DCSettings.build/Debug-watchos/DCSettings.build/swift-overrides.hmap -Xcc -I/Users/admin/builder/spi-builder-workspace/.derivedData/Build/Products/Debug-watchos/include -Xcc -I/Users/admin/builder/spi-builder-workspace/.derivedData/Build/Intermediates.noindex/DCSettings.build/Debug-watchos/DCSettings.build/DerivedSources-normal/arm64_32 -Xcc -I/Users/admin/builder/spi-builder-workspace/.derivedData/Build/Intermediates.noindex/DCSettings.build/Debug-watchos/DCSettings.build/DerivedSources/arm64_32 -Xcc -I/Users/admin/builder/spi-builder-workspace/.derivedData/Build/Intermediates.noindex/DCSettings.build/Debug-watchos/DCSettings.build/DerivedSources -Xcc -DSWIFT_PACKAGE -Xcc -DDEBUG\=1 -module-name DCSettings -package-name spi_builder_workspace -frontend-parseable-output -disable-clang-spi -target-sdk-version 11.1 -target-sdk-name watchos11.1 -external-plugin-path /Applications/Xcode-16.1.0.app/Contents/Developer/Platforms/WatchOS.platform/Developer/usr/lib/swift/host/plugins\#/Applications/Xcode-16.1.0.app/Contents/Developer/Platforms/WatchOS.platform/Developer/usr/bin/swift-plugin-server -external-plugin-path /Applications/Xcode-16.1.0.app/Contents/Developer/Platforms/WatchOS.platform/Developer/usr/local/lib/swift/host/plugins\#/Applications/Xcode-16.1.0.app/Contents/Developer/Platforms/WatchOS.platform/Developer/usr/bin/swift-plugin-server -plugin-path /Applications/Xcode-16.1.0.app/Contents/Developer/Toolchains/XcodeDefault.xctoolchain/usr/lib/swift/host/plugins -plugin-path /Applications/Xcode-16.1.0.app/Contents/Developer/Toolchains/XcodeDefault.xctoolchain/usr/local/lib/swift/host/plugins -o /Users/admin/builder/spi-builder-workspace/.derivedData/Build/Intermediates.noindex/DCSettings.build/Debug-watchos/DCSettings.build/Objects-normal/arm64_32/DCStoredRepresentedValue.o -o /Users/admin/builder/spi-builder-workspace/.derivedData/Build/Intermediates.noindex/DCSettings.build/Debug-watchos/DCSettings.build/Objects-normal/arm64_32/DCStoredValue.o -index-unit-output-path /DCSettings.build/Debug-watchos/DCSettings.build/Objects-normal/arm64_32/DCStoredRepresentedValue.o -index-unit-output-path /DCSettings.build/Debug-watchos/DCSettings.build/Objects-normal/arm64_32/DCStoredValue.o -index-store-path /Users/admin/builder/spi-builder-workspace/.derivedData/Index.noindex/DataStore -index-system-modules
SwiftCompile normal arm64_32 Compiling\ DCSettingStore.swift,\ DCSettingView.swift /Users/admin/builder/spi-builder-workspace/Sources/DCSettings/Store/DCSettingStore.swift /Users/admin/builder/spi-builder-workspace/Sources/DCSettings/Views/DCSettingView.swift (in target 'DCSettings' from project 'DCSettings')
    cd /Users/admin/builder/spi-builder-workspace/.swiftpm/xcode
    builtin-swiftTaskExecution -- /Applications/Xcode-16.1.0.app/Contents/Developer/Toolchains/XcodeDefault.xctoolchain/usr/bin/swift-frontend -frontend -c /Users/admin/builder/spi-builder-workspace/Sources/DCSettings/Extensions/Collection+Extended.swift /Users/admin/builder/spi-builder-workspace/Sources/DCSettings/Extensions/Color+Codable.swift /Users/admin/builder/spi-builder-workspace/Sources/DCSettings/Extensions/DCKeyRepresentableConformances.swift /Users/admin/builder/spi-builder-workspace/Sources/DCSettings/Extensions/NSUbiquitousKeyValueStore+DCKeyValueStore.swift /Users/admin/builder/spi-builder-workspace/Sources/DCSettings/Extensions/String+Extended.swift /Users/admin/builder/spi-builder-workspace/Sources/DCSettings/Extensions/Text+MonospacedDigit.swift /Users/admin/builder/spi-builder-workspace/Sources/DCSettings/Extensions/UserDefaults+DCKeyValueStore.swift /Users/admin/builder/spi-builder-workspace/Sources/DCSettings/Settings/DCKeyRepresentable.swift /Users/admin/builder/spi-builder-workspace/Sources/DCSettings/Settings/DCSetting.swift /Users/admin/builder/spi-builder-workspace/Sources/DCSettings/Settings/DCSettingConfiguration.swift /Users/admin/builder/spi-builder-workspace/Sources/DCSettings/Settings/DCSettingGroup.swift /Users/admin/builder/spi-builder-workspace/Sources/DCSettings/Settings/DCSettingOption.swift /Users/admin/builder/spi-builder-workspace/Sources/DCSettings/Settings/DCSettingsManager.swift /Users/admin/builder/spi-builder-workspace/Sources/DCSettings/Settings/DCStoredRepresentedValue.swift /Users/admin/builder/spi-builder-workspace/Sources/DCSettings/Settings/DCStoredValue.swift /Users/admin/builder/spi-builder-workspace/Sources/DCSettings/Settings/DCValueBounds.swift /Users/admin/builder/spi-builder-workspace/Sources/DCSettings/Store/DCKeyValueStore.swift -primary-file /Users/admin/builder/spi-builder-workspace/Sources/DCSettings/Store/DCSettingStore.swift -primary-file /Users/admin/builder/spi-builder-workspace/Sources/DCSettings/Views/DCSettingView.swift /Users/admin/builder/spi-builder-workspace/Sources/DCSettings/Views/DCSettingViewProviding.swift /Users/admin/builder/spi-builder-workspace/Sources/DCSettings/Views/DCSettingsView.swift -emit-dependencies-path /Users/admin/builder/spi-builder-workspace/.derivedData/Build/Intermediates.noindex/DCSettings.build/Debug-watchos/DCSettings.build/Objects-normal/arm64_32/DCSettingStore.d -emit-const-values-path /Users/admin/builder/spi-builder-workspace/.derivedData/Build/Intermediates.noindex/DCSettings.build/Debug-watchos/DCSettings.build/Objects-normal/arm64_32/DCSettingStore.swiftconstvalues -emit-reference-dependencies-path /Users/admin/builder/spi-builder-workspace/.derivedData/Build/Intermediates.noindex/DCSettings.build/Debug-watchos/DCSettings.build/Objects-normal/arm64_32/DCSettingStore.swiftdeps -serialize-diagnostics-path /Users/admin/builder/spi-builder-workspace/.derivedData/Build/Intermediates.noindex/DCSettings.build/Debug-watchos/DCSettings.build/Objects-normal/arm64_32/DCSettingStore.dia -emit-dependencies-path /Users/admin/builder/spi-builder-workspace/.derivedData/Build/Intermediates.noindex/DCSettings.build/Debug-watchos/DCSettings.build/Objects-normal/arm64_32/DCSettingView.d -emit-const-values-path /Users/admin/builder/spi-builder-workspace/.derivedData/Build/Intermediates.noindex/DCSettings.build/Debug-watchos/DCSettings.build/Objects-normal/arm64_32/DCSettingView.swiftconstvalues -emit-reference-dependencies-path /Users/admin/builder/spi-builder-workspace/.derivedData/Build/Intermediates.noindex/DCSettings.build/Debug-watchos/DCSettings.build/Objects-normal/arm64_32/DCSettingView.swiftdeps -serialize-diagnostics-path /Users/admin/builder/spi-builder-workspace/.derivedData/Build/Intermediates.noindex/DCSettings.build/Debug-watchos/DCSettings.build/Objects-normal/arm64_32/DCSettingView.dia -target arm64_32-apple-watchos6.0 -enable-objc-interop -sdk /Applications/Xcode-16.1.0.app/Contents/Developer/Platforms/WatchOS.platform/Developer/SDKs/WatchOS11.1.sdk -I /Users/admin/builder/spi-builder-workspace/.derivedData/Build/Products/Debug-watchos -I /Applications/Xcode-16.1.0.app/Contents/Developer/Platforms/WatchOS.platform/Developer/usr/lib -F /Users/admin/builder/spi-builder-workspace/.derivedData/Build/Products/Debug-watchos -F /Applications/Xcode-16.1.0.app/Contents/Developer/Platforms/WatchOS.platform/Developer/Library/Frameworks -F /Applications/Xcode-16.1.0.app/Contents/Developer/Platforms/WatchOS.platform/Developer/SDKs/WatchOS11.1.sdk/Developer/Library/Frameworks -no-color-diagnostics -enable-testing -g -debug-info-format\=dwarf -dwarf-version\=4 -module-cache-path /Users/admin/builder/spi-builder-workspace/.derivedData/ModuleCache.noindex -profile-generate -profile-coverage-mapping -swift-version 5 -enforce-exclusivity\=checked -stats-output-dir /Users/admin/builder/spi-builder-workspace/.swiftpm/xcode/.stats -Onone -D SWIFT_PACKAGE -D DEBUG -serialize-debugging-options -const-gather-protocols-file /Users/admin/builder/spi-builder-workspace/.derivedData/Build/Intermediates.noindex/DCSettings.build/Debug-watchos/DCSettings.build/Objects-normal/arm64_32/DCSettings_const_extract_protocols.json -enable-experimental-feature DebugDescriptionMacro -enable-experimental-feature OpaqueTypeErasure -enable-upcoming-feature StrictConcurrency -enable-upcoming-feature DisableOutwardActorInference -enable-upcoming-feature GlobalActorIsolatedTypesUsability -enable-upcoming-feature InferSendableFromCaptures -strict-concurrency\=complete -empty-abi-descriptor -plugin-path /Applications/Xcode-16.1.0.app/Contents/Developer/Toolchains/XcodeDefault.xctoolchain/usr/lib/swift/host/plugins/testing -validate-clang-modules-once -clang-build-session-file /Users/admin/builder/spi-builder-workspace/.derivedData/ModuleCache.noindex/Session.modulevalidation -Xcc -working-directory -Xcc /Users/admin/builder/spi-builder-workspace/.swiftpm/xcode -resource-dir /Applications/Xcode-16.1.0.app/Contents/Developer/Toolchains/XcodeDefault.xctoolchain/usr/lib/swift -enable-anonymous-context-mangled-names -file-compilation-dir /Users/admin/builder/spi-builder-workspace/.swiftpm/xcode -Xcc -D_LIBCPP_HARDENING_MODE\=_LIBCPP_HARDENING_MODE_DEBUG -Xcc -ivfsstatcache -Xcc /Users/admin/builder/spi-builder-workspace/.derivedData/SDKStatCaches.noindex/watchos11.1-22R574-7b9df0bda16bb4641b33636c68f04660.sdkstatcache -Xcc -I/Users/admin/builder/spi-builder-workspace/.derivedData/Build/Intermediates.noindex/DCSettings.build/Debug-watchos/DCSettings.build/swift-overrides.hmap -Xcc -I/Users/admin/builder/spi-builder-workspace/.derivedData/Build/Products/Debug-watchos/include -Xcc -I/Users/admin/builder/spi-builder-workspace/.derivedData/Build/Intermediates.noindex/DCSettings.build/Debug-watchos/DCSettings.build/DerivedSources-normal/arm64_32 -Xcc -I/Users/admin/builder/spi-builder-workspace/.derivedData/Build/Intermediates.noindex/DCSettings.build/Debug-watchos/DCSettings.build/DerivedSources/arm64_32 -Xcc -I/Users/admin/builder/spi-builder-workspace/.derivedData/Build/Intermediates.noindex/DCSettings.build/Debug-watchos/DCSettings.build/DerivedSources -Xcc -DSWIFT_PACKAGE -Xcc -DDEBUG\=1 -module-name DCSettings -package-name spi_builder_workspace -frontend-parseable-output -disable-clang-spi -target-sdk-version 11.1 -target-sdk-name watchos11.1 -external-plugin-path /Applications/Xcode-16.1.0.app/Contents/Developer/Platforms/WatchOS.platform/Developer/usr/lib/swift/host/plugins\#/Applications/Xcode-16.1.0.app/Contents/Developer/Platforms/WatchOS.platform/Developer/usr/bin/swift-plugin-server -external-plugin-path /Applications/Xcode-16.1.0.app/Contents/Developer/Platforms/WatchOS.platform/Developer/usr/local/lib/swift/host/plugins\#/Applications/Xcode-16.1.0.app/Contents/Developer/Platforms/WatchOS.platform/Developer/usr/bin/swift-plugin-server -plugin-path /Applications/Xcode-16.1.0.app/Contents/Developer/Toolchains/XcodeDefault.xctoolchain/usr/lib/swift/host/plugins -plugin-path /Applications/Xcode-16.1.0.app/Contents/Developer/Toolchains/XcodeDefault.xctoolchain/usr/local/lib/swift/host/plugins -o /Users/admin/builder/spi-builder-workspace/.derivedData/Build/Intermediates.noindex/DCSettings.build/Debug-watchos/DCSettings.build/Objects-normal/arm64_32/DCSettingStore.o -o /Users/admin/builder/spi-builder-workspace/.derivedData/Build/Intermediates.noindex/DCSettings.build/Debug-watchos/DCSettings.build/Objects-normal/arm64_32/DCSettingView.o -index-unit-output-path /DCSettings.build/Debug-watchos/DCSettings.build/Objects-normal/arm64_32/DCSettingStore.o -index-unit-output-path /DCSettings.build/Debug-watchos/DCSettings.build/Objects-normal/arm64_32/DCSettingView.o -index-store-path /Users/admin/builder/spi-builder-workspace/.derivedData/Index.noindex/DataStore -index-system-modules
SwiftCompile normal arm64_32 /Users/admin/builder/spi-builder-workspace/Sources/DCSettings/Store/DCSettingStore.swift (in target 'DCSettings' from project 'DCSettings')
    cd /Users/admin/builder/spi-builder-workspace/.swiftpm/xcode
    /Applications/Xcode-16.1.0.app/Contents/Developer/Toolchains/XcodeDefault.xctoolchain/usr/bin/swift-frontend -c /Users/admin/builder/spi-builder-workspace/Sources/DCSettings/Extensions/Collection+Extended.swift /Users/admin/builder/spi-builder-workspace/Sources/DCSettings/Extensions/Color+Codable.swift /Users/admin/builder/spi-builder-workspace/Sources/DCSettings/Extensions/DCKeyRepresentableConformances.swift /Users/admin/builder/spi-builder-workspace/Sources/DCSettings/Extensions/NSUbiquitousKeyValueStore+DCKeyValueStore.swift /Users/admin/builder/spi-builder-workspace/Sources/DCSettings/Extensions/String+Extended.swift /Users/admin/builder/spi-builder-workspace/Sources/DCSettings/Extensions/Text+MonospacedDigit.swift /Users/admin/builder/spi-builder-workspace/Sources/DCSettings/Extensions/UserDefaults+DCKeyValueStore.swift /Users/admin/builder/spi-builder-workspace/Sources/DCSettings/Settings/DCKeyRepresentable.swift /Users/admin/builder/spi-builder-workspace/Sources/DCSettings/Settings/DCSetting.swift /Users/admin/builder/spi-builder-workspace/Sources/DCSettings/Settings/DCSettingConfiguration.swift /Users/admin/builder/spi-builder-workspace/Sources/DCSettings/Settings/DCSettingGroup.swift /Users/admin/builder/spi-builder-workspace/Sources/DCSettings/Settings/DCSettingOption.swift /Users/admin/builder/spi-builder-workspace/Sources/DCSettings/Settings/DCSettingsManager.swift /Users/admin/builder/spi-builder-workspace/Sources/DCSettings/Settings/DCStoredRepresentedValue.swift /Users/admin/builder/spi-builder-workspace/Sources/DCSettings/Settings/DCStoredValue.swift /Users/admin/builder/spi-builder-workspace/Sources/DCSettings/Settings/DCValueBounds.swift /Users/admin/builder/spi-builder-workspace/Sources/DCSettings/Store/DCKeyValueStore.swift -primary-file /Users/admin/builder/spi-builder-workspace/Sources/DCSettings/Store/DCSettingStore.swift -primary-file /Users/admin/builder/spi-builder-workspace/Sources/DCSettings/Views/DCSettingView.swift /Users/admin/builder/spi-builder-workspace/Sources/DCSettings/Views/DCSettingViewProviding.swift /Users/admin/builder/spi-builder-workspace/Sources/DCSettings/Views/DCSettingsView.swift -emit-dependencies-path /Users/admin/builder/spi-builder-workspace/.derivedData/Build/Intermediates.noindex/DCSettings.build/Debug-watchos/DCSettings.build/Objects-normal/arm64_32/DCSettingStore.d -emit-const-values-path /Users/admin/builder/spi-builder-workspace/.derivedData/Build/Intermediates.noindex/DCSettings.build/Debug-watchos/DCSettings.build/Objects-normal/arm64_32/DCSettingStore.swiftconstvalues -emit-reference-dependencies-path /Users/admin/builder/spi-builder-workspace/.derivedData/Build/Intermediates.noindex/DCSettings.build/Debug-watchos/DCSettings.build/Objects-normal/arm64_32/DCSettingStore.swiftdeps -serialize-diagnostics-path /Users/admin/builder/spi-builder-workspace/.derivedData/Build/Intermediates.noindex/DCSettings.build/Debug-watchos/DCSettings.build/Objects-normal/arm64_32/DCSettingStore.dia -emit-dependencies-path /Users/admin/builder/spi-builder-workspace/.derivedData/Build/Intermediates.noindex/DCSettings.build/Debug-watchos/DCSettings.build/Objects-normal/arm64_32/DCSettingView.d -emit-const-values-path /Users/admin/builder/spi-builder-workspace/.derivedData/Build/Intermediates.noindex/DCSettings.build/Debug-watchos/DCSettings.build/Objects-normal/arm64_32/DCSettingView.swiftconstvalues -emit-reference-dependencies-path /Users/admin/builder/spi-builder-workspace/.derivedData/Build/Intermediates.noindex/DCSettings.build/Debug-watchos/DCSettings.build/Objects-normal/arm64_32/DCSettingView.swiftdeps -serialize-diagnostics-path /Users/admin/builder/spi-builder-workspace/.derivedData/Build/Intermediates.noindex/DCSettings.build/Debug-watchos/DCSettings.build/Objects-normal/arm64_32/DCSettingView.dia -target arm64_32-apple-watchos6.0 -enable-objc-interop -sdk /Applications/Xcode-16.1.0.app/Contents/Developer/Platforms/WatchOS.platform/Developer/SDKs/WatchOS11.1.sdk -I /Users/admin/builder/spi-builder-workspace/.derivedData/Build/Products/Debug-watchos -I /Applications/Xcode-16.1.0.app/Contents/Developer/Platforms/WatchOS.platform/Developer/usr/lib -F /Users/admin/builder/spi-builder-workspace/.derivedData/Build/Products/Debug-watchos -F /Applications/Xcode-16.1.0.app/Contents/Developer/Platforms/WatchOS.platform/Developer/Library/Frameworks -F /Applications/Xcode-16.1.0.app/Contents/Developer/Platforms/WatchOS.platform/Developer/SDKs/WatchOS11.1.sdk/Developer/Library/Frameworks -no-color-diagnostics -enable-testing -g -debug-info-format\=dwarf -dwarf-version\=4 -module-cache-path /Users/admin/builder/spi-builder-workspace/.derivedData/ModuleCache.noindex -profile-generate -profile-coverage-mapping -swift-version 5 -enforce-exclusivity\=checked -stats-output-dir /Users/admin/builder/spi-builder-workspace/.swiftpm/xcode/.stats -Onone -D SWIFT_PACKAGE -D DEBUG -serialize-debugging-options -const-gather-protocols-file /Users/admin/builder/spi-builder-workspace/.derivedData/Build/Intermediates.noindex/DCSettings.build/Debug-watchos/DCSettings.build/Objects-normal/arm64_32/DCSettings_const_extract_protocols.json -enable-experimental-feature DebugDescriptionMacro -enable-experimental-feature OpaqueTypeErasure -enable-upcoming-feature StrictConcurrency -enable-upcoming-feature DisableOutwardActorInference -enable-upcoming-feature GlobalActorIsolatedTypesUsability -enable-upcoming-feature InferSendableFromCaptures -strict-concurrency\=complete -empty-abi-descriptor -plugin-path /Applications/Xcode-16.1.0.app/Contents/Developer/Toolchains/XcodeDefault.xctoolchain/usr/lib/swift/host/plugins/testing -validate-clang-modules-once -clang-build-session-file /Users/admin/builder/spi-builder-workspace/.derivedData/ModuleCache.noindex/Session.modulevalidation -Xcc -working-directory -Xcc /Users/admin/builder/spi-builder-workspace/.swiftpm/xcode -resource-dir /Applications/Xcode-16.1.0.app/Contents/Developer/Toolchains/XcodeDefault.xctoolchain/usr/lib/swift -enable-anonymous-context-mangled-names -file-compilation-dir /Users/admin/builder/spi-builder-workspace/.swiftpm/xcode -Xcc -D_LIBCPP_HARDENING_MODE\=_LIBCPP_HARDENING_MODE_DEBUG -Xcc -ivfsstatcache -Xcc /Users/admin/builder/spi-builder-workspace/.derivedData/SDKStatCaches.noindex/watchos11.1-22R574-7b9df0bda16bb4641b33636c68f04660.sdkstatcache -Xcc -I/Users/admin/builder/spi-builder-workspace/.derivedData/Build/Intermediates.noindex/DCSettings.build/Debug-watchos/DCSettings.build/swift-overrides.hmap -Xcc -I/Users/admin/builder/spi-builder-workspace/.derivedData/Build/Products/Debug-watchos/include -Xcc -I/Users/admin/builder/spi-builder-workspace/.derivedData/Build/Intermediates.noindex/DCSettings.build/Debug-watchos/DCSettings.build/DerivedSources-normal/arm64_32 -Xcc -I/Users/admin/builder/spi-builder-workspace/.derivedData/Build/Intermediates.noindex/DCSettings.build/Debug-watchos/DCSettings.build/DerivedSources/arm64_32 -Xcc -I/Users/admin/builder/spi-builder-workspace/.derivedData/Build/Intermediates.noindex/DCSettings.build/Debug-watchos/DCSettings.build/DerivedSources -Xcc -DSWIFT_PACKAGE -Xcc -DDEBUG\=1 -module-name DCSettings -package-name spi_builder_workspace -frontend-parseable-output -disable-clang-spi -target-sdk-version 11.1 -target-sdk-name watchos11.1 -external-plugin-path /Applications/Xcode-16.1.0.app/Contents/Developer/Platforms/WatchOS.platform/Developer/usr/lib/swift/host/plugins\#/Applications/Xcode-16.1.0.app/Contents/Developer/Platforms/WatchOS.platform/Developer/usr/bin/swift-plugin-server -external-plugin-path /Applications/Xcode-16.1.0.app/Contents/Developer/Platforms/WatchOS.platform/Developer/usr/local/lib/swift/host/plugins\#/Applications/Xcode-16.1.0.app/Contents/Developer/Platforms/WatchOS.platform/Developer/usr/bin/swift-plugin-server -plugin-path /Applications/Xcode-16.1.0.app/Contents/Developer/Toolchains/XcodeDefault.xctoolchain/usr/lib/swift/host/plugins -plugin-path /Applications/Xcode-16.1.0.app/Contents/Developer/Toolchains/XcodeDefault.xctoolchain/usr/local/lib/swift/host/plugins -o /Users/admin/builder/spi-builder-workspace/.derivedData/Build/Intermediates.noindex/DCSettings.build/Debug-watchos/DCSettings.build/Objects-normal/arm64_32/DCSettingStore.o -o /Users/admin/builder/spi-builder-workspace/.derivedData/Build/Intermediates.noindex/DCSettings.build/Debug-watchos/DCSettings.build/Objects-normal/arm64_32/DCSettingView.o -index-unit-output-path /DCSettings.build/Debug-watchos/DCSettings.build/Objects-normal/arm64_32/DCSettingStore.o -index-unit-output-path /DCSettings.build/Debug-watchos/DCSettings.build/Objects-normal/arm64_32/DCSettingView.o -index-store-path /Users/admin/builder/spi-builder-workspace/.derivedData/Index.noindex/DataStore -index-system-modules
SwiftCompile normal arm64_32 /Users/admin/builder/spi-builder-workspace/Sources/DCSettings/Views/DCSettingView.swift (in target 'DCSettings' from project 'DCSettings')
    cd /Users/admin/builder/spi-builder-workspace/.swiftpm/xcode
    /Applications/Xcode-16.1.0.app/Contents/Developer/Toolchains/XcodeDefault.xctoolchain/usr/bin/swift-frontend -c /Users/admin/builder/spi-builder-workspace/Sources/DCSettings/Extensions/Collection+Extended.swift /Users/admin/builder/spi-builder-workspace/Sources/DCSettings/Extensions/Color+Codable.swift /Users/admin/builder/spi-builder-workspace/Sources/DCSettings/Extensions/DCKeyRepresentableConformances.swift /Users/admin/builder/spi-builder-workspace/Sources/DCSettings/Extensions/NSUbiquitousKeyValueStore+DCKeyValueStore.swift /Users/admin/builder/spi-builder-workspace/Sources/DCSettings/Extensions/String+Extended.swift /Users/admin/builder/spi-builder-workspace/Sources/DCSettings/Extensions/Text+MonospacedDigit.swift /Users/admin/builder/spi-builder-workspace/Sources/DCSettings/Extensions/UserDefaults+DCKeyValueStore.swift /Users/admin/builder/spi-builder-workspace/Sources/DCSettings/Settings/DCKeyRepresentable.swift /Users/admin/builder/spi-builder-workspace/Sources/DCSettings/Settings/DCSetting.swift /Users/admin/builder/spi-builder-workspace/Sources/DCSettings/Settings/DCSettingConfiguration.swift /Users/admin/builder/spi-builder-workspace/Sources/DCSettings/Settings/DCSettingGroup.swift /Users/admin/builder/spi-builder-workspace/Sources/DCSettings/Settings/DCSettingOption.swift /Users/admin/builder/spi-builder-workspace/Sources/DCSettings/Settings/DCSettingsManager.swift /Users/admin/builder/spi-builder-workspace/Sources/DCSettings/Settings/DCStoredRepresentedValue.swift /Users/admin/builder/spi-builder-workspace/Sources/DCSettings/Settings/DCStoredValue.swift /Users/admin/builder/spi-builder-workspace/Sources/DCSettings/Settings/DCValueBounds.swift /Users/admin/builder/spi-builder-workspace/Sources/DCSettings/Store/DCKeyValueStore.swift -primary-file /Users/admin/builder/spi-builder-workspace/Sources/DCSettings/Store/DCSettingStore.swift -primary-file /Users/admin/builder/spi-builder-workspace/Sources/DCSettings/Views/DCSettingView.swift /Users/admin/builder/spi-builder-workspace/Sources/DCSettings/Views/DCSettingViewProviding.swift /Users/admin/builder/spi-builder-workspace/Sources/DCSettings/Views/DCSettingsView.swift -emit-dependencies-path /Users/admin/builder/spi-builder-workspace/.derivedData/Build/Intermediates.noindex/DCSettings.build/Debug-watchos/DCSettings.build/Objects-normal/arm64_32/DCSettingStore.d -emit-const-values-path /Users/admin/builder/spi-builder-workspace/.derivedData/Build/Intermediates.noindex/DCSettings.build/Debug-watchos/DCSettings.build/Objects-normal/arm64_32/DCSettingStore.swiftconstvalues -emit-reference-dependencies-path /Users/admin/builder/spi-builder-workspace/.derivedData/Build/Intermediates.noindex/DCSettings.build/Debug-watchos/DCSettings.build/Objects-normal/arm64_32/DCSettingStore.swiftdeps -serialize-diagnostics-path /Users/admin/builder/spi-builder-workspace/.derivedData/Build/Intermediates.noindex/DCSettings.build/Debug-watchos/DCSettings.build/Objects-normal/arm64_32/DCSettingStore.dia -emit-dependencies-path /Users/admin/builder/spi-builder-workspace/.derivedData/Build/Intermediates.noindex/DCSettings.build/Debug-watchos/DCSettings.build/Objects-normal/arm64_32/DCSettingView.d -emit-const-values-path /Users/admin/builder/spi-builder-workspace/.derivedData/Build/Intermediates.noindex/DCSettings.build/Debug-watchos/DCSettings.build/Objects-normal/arm64_32/DCSettingView.swiftconstvalues -emit-reference-dependencies-path /Users/admin/builder/spi-builder-workspace/.derivedData/Build/Intermediates.noindex/DCSettings.build/Debug-watchos/DCSettings.build/Objects-normal/arm64_32/DCSettingView.swiftdeps -serialize-diagnostics-path /Users/admin/builder/spi-builder-workspace/.derivedData/Build/Intermediates.noindex/DCSettings.build/Debug-watchos/DCSettings.build/Objects-normal/arm64_32/DCSettingView.dia -target arm64_32-apple-watchos6.0 -enable-objc-interop -sdk /Applications/Xcode-16.1.0.app/Contents/Developer/Platforms/WatchOS.platform/Developer/SDKs/WatchOS11.1.sdk -I /Users/admin/builder/spi-builder-workspace/.derivedData/Build/Products/Debug-watchos -I /Applications/Xcode-16.1.0.app/Contents/Developer/Platforms/WatchOS.platform/Developer/usr/lib -F /Users/admin/builder/spi-builder-workspace/.derivedData/Build/Products/Debug-watchos -F /Applications/Xcode-16.1.0.app/Contents/Developer/Platforms/WatchOS.platform/Developer/Library/Frameworks -F /Applications/Xcode-16.1.0.app/Contents/Developer/Platforms/WatchOS.platform/Developer/SDKs/WatchOS11.1.sdk/Developer/Library/Frameworks -no-color-diagnostics -enable-testing -g -debug-info-format\=dwarf -dwarf-version\=4 -module-cache-path /Users/admin/builder/spi-builder-workspace/.derivedData/ModuleCache.noindex -profile-generate -profile-coverage-mapping -swift-version 5 -enforce-exclusivity\=checked -stats-output-dir /Users/admin/builder/spi-builder-workspace/.swiftpm/xcode/.stats -Onone -D SWIFT_PACKAGE -D DEBUG -serialize-debugging-options -const-gather-protocols-file /Users/admin/builder/spi-builder-workspace/.derivedData/Build/Intermediates.noindex/DCSettings.build/Debug-watchos/DCSettings.build/Objects-normal/arm64_32/DCSettings_const_extract_protocols.json -enable-experimental-feature DebugDescriptionMacro -enable-experimental-feature OpaqueTypeErasure -enable-upcoming-feature StrictConcurrency -enable-upcoming-feature DisableOutwardActorInference -enable-upcoming-feature GlobalActorIsolatedTypesUsability -enable-upcoming-feature InferSendableFromCaptures -strict-concurrency\=complete -empty-abi-descriptor -plugin-path /Applications/Xcode-16.1.0.app/Contents/Developer/Toolchains/XcodeDefault.xctoolchain/usr/lib/swift/host/plugins/testing -validate-clang-modules-once -clang-build-session-file /Users/admin/builder/spi-builder-workspace/.derivedData/ModuleCache.noindex/Session.modulevalidation -Xcc -working-directory -Xcc /Users/admin/builder/spi-builder-workspace/.swiftpm/xcode -resource-dir /Applications/Xcode-16.1.0.app/Contents/Developer/Toolchains/XcodeDefault.xctoolchain/usr/lib/swift -enable-anonymous-context-mangled-names -file-compilation-dir /Users/admin/builder/spi-builder-workspace/.swiftpm/xcode -Xcc -D_LIBCPP_HARDENING_MODE\=_LIBCPP_HARDENING_MODE_DEBUG -Xcc -ivfsstatcache -Xcc /Users/admin/builder/spi-builder-workspace/.derivedData/SDKStatCaches.noindex/watchos11.1-22R574-7b9df0bda16bb4641b33636c68f04660.sdkstatcache -Xcc -I/Users/admin/builder/spi-builder-workspace/.derivedData/Build/Intermediates.noindex/DCSettings.build/Debug-watchos/DCSettings.build/swift-overrides.hmap -Xcc -I/Users/admin/builder/spi-builder-workspace/.derivedData/Build/Products/Debug-watchos/include -Xcc -I/Users/admin/builder/spi-builder-workspace/.derivedData/Build/Intermediates.noindex/DCSettings.build/Debug-watchos/DCSettings.build/DerivedSources-normal/arm64_32 -Xcc -I/Users/admin/builder/spi-builder-workspace/.derivedData/Build/Intermediates.noindex/DCSettings.build/Debug-watchos/DCSettings.build/DerivedSources/arm64_32 -Xcc -I/Users/admin/builder/spi-builder-workspace/.derivedData/Build/Intermediates.noindex/DCSettings.build/Debug-watchos/DCSettings.build/DerivedSources -Xcc -DSWIFT_PACKAGE -Xcc -DDEBUG\=1 -module-name DCSettings -package-name spi_builder_workspace -frontend-parseable-output -disable-clang-spi -target-sdk-version 11.1 -target-sdk-name watchos11.1 -external-plugin-path /Applications/Xcode-16.1.0.app/Contents/Developer/Platforms/WatchOS.platform/Developer/usr/lib/swift/host/plugins\#/Applications/Xcode-16.1.0.app/Contents/Developer/Platforms/WatchOS.platform/Developer/usr/bin/swift-plugin-server -external-plugin-path /Applications/Xcode-16.1.0.app/Contents/Developer/Platforms/WatchOS.platform/Developer/usr/local/lib/swift/host/plugins\#/Applications/Xcode-16.1.0.app/Contents/Developer/Platforms/WatchOS.platform/Developer/usr/bin/swift-plugin-server -plugin-path /Applications/Xcode-16.1.0.app/Contents/Developer/Toolchains/XcodeDefault.xctoolchain/usr/lib/swift/host/plugins -plugin-path /Applications/Xcode-16.1.0.app/Contents/Developer/Toolchains/XcodeDefault.xctoolchain/usr/local/lib/swift/host/plugins -o /Users/admin/builder/spi-builder-workspace/.derivedData/Build/Intermediates.noindex/DCSettings.build/Debug-watchos/DCSettings.build/Objects-normal/arm64_32/DCSettingStore.o -o /Users/admin/builder/spi-builder-workspace/.derivedData/Build/Intermediates.noindex/DCSettings.build/Debug-watchos/DCSettings.build/Objects-normal/arm64_32/DCSettingView.o -index-unit-output-path /DCSettings.build/Debug-watchos/DCSettings.build/Objects-normal/arm64_32/DCSettingStore.o -index-unit-output-path /DCSettings.build/Debug-watchos/DCSettings.build/Objects-normal/arm64_32/DCSettingView.o -index-store-path /Users/admin/builder/spi-builder-workspace/.derivedData/Index.noindex/DataStore -index-system-modules
SwiftCompile normal arm64_32 Compiling\ DCSettingOption.swift,\ DCSettingsManager.swift /Users/admin/builder/spi-builder-workspace/Sources/DCSettings/Settings/DCSettingOption.swift /Users/admin/builder/spi-builder-workspace/Sources/DCSettings/Settings/DCSettingsManager.swift (in target 'DCSettings' from project 'DCSettings')
    cd /Users/admin/builder/spi-builder-workspace/.swiftpm/xcode
    builtin-swiftTaskExecution -- /Applications/Xcode-16.1.0.app/Contents/Developer/Toolchains/XcodeDefault.xctoolchain/usr/bin/swift-frontend -frontend -c /Users/admin/builder/spi-builder-workspace/Sources/DCSettings/Extensions/Collection+Extended.swift /Users/admin/builder/spi-builder-workspace/Sources/DCSettings/Extensions/Color+Codable.swift /Users/admin/builder/spi-builder-workspace/Sources/DCSettings/Extensions/DCKeyRepresentableConformances.swift /Users/admin/builder/spi-builder-workspace/Sources/DCSettings/Extensions/NSUbiquitousKeyValueStore+DCKeyValueStore.swift /Users/admin/builder/spi-builder-workspace/Sources/DCSettings/Extensions/String+Extended.swift /Users/admin/builder/spi-builder-workspace/Sources/DCSettings/Extensions/Text+MonospacedDigit.swift /Users/admin/builder/spi-builder-workspace/Sources/DCSettings/Extensions/UserDefaults+DCKeyValueStore.swift /Users/admin/builder/spi-builder-workspace/Sources/DCSettings/Settings/DCKeyRepresentable.swift /Users/admin/builder/spi-builder-workspace/Sources/DCSettings/Settings/DCSetting.swift /Users/admin/builder/spi-builder-workspace/Sources/DCSettings/Settings/DCSettingConfiguration.swift /Users/admin/builder/spi-builder-workspace/Sources/DCSettings/Settings/DCSettingGroup.swift -primary-file /Users/admin/builder/spi-builder-workspace/Sources/DCSettings/Settings/DCSettingOption.swift -primary-file /Users/admin/builder/spi-builder-workspace/Sources/DCSettings/Settings/DCSettingsManager.swift /Users/admin/builder/spi-builder-workspace/Sources/DCSettings/Settings/DCStoredRepresentedValue.swift /Users/admin/builder/spi-builder-workspace/Sources/DCSettings/Settings/DCStoredValue.swift /Users/admin/builder/spi-builder-workspace/Sources/DCSettings/Settings/DCValueBounds.swift /Users/admin/builder/spi-builder-workspace/Sources/DCSettings/Store/DCKeyValueStore.swift /Users/admin/builder/spi-builder-workspace/Sources/DCSettings/Store/DCSettingStore.swift /Users/admin/builder/spi-builder-workspace/Sources/DCSettings/Views/DCSettingView.swift /Users/admin/builder/spi-builder-workspace/Sources/DCSettings/Views/DCSettingViewProviding.swift /Users/admin/builder/spi-builder-workspace/Sources/DCSettings/Views/DCSettingsView.swift -emit-dependencies-path /Users/admin/builder/spi-builder-workspace/.derivedData/Build/Intermediates.noindex/DCSettings.build/Debug-watchos/DCSettings.build/Objects-normal/arm64_32/DCSettingOption.d -emit-const-values-path /Users/admin/builder/spi-builder-workspace/.derivedData/Build/Intermediates.noindex/DCSettings.build/Debug-watchos/DCSettings.build/Objects-normal/arm64_32/DCSettingOption.swiftconstvalues -emit-reference-dependencies-path /Users/admin/builder/spi-builder-workspace/.derivedData/Build/Intermediates.noindex/DCSettings.build/Debug-watchos/DCSettings.build/Objects-normal/arm64_32/DCSettingOption.swiftdeps -serialize-diagnostics-path /Users/admin/builder/spi-builder-workspace/.derivedData/Build/Intermediates.noindex/DCSettings.build/Debug-watchos/DCSettings.build/Objects-normal/arm64_32/DCSettingOption.dia -emit-dependencies-path /Users/admin/builder/spi-builder-workspace/.derivedData/Build/Intermediates.noindex/DCSettings.build/Debug-watchos/DCSettings.build/Objects-normal/arm64_32/DCSettingsManager.d -emit-const-values-path /Users/admin/builder/spi-builder-workspace/.derivedData/Build/Intermediates.noindex/DCSettings.build/Debug-watchos/DCSettings.build/Objects-normal/arm64_32/DCSettingsManager.swiftconstvalues -emit-reference-dependencies-path /Users/admin/builder/spi-builder-workspace/.derivedData/Build/Intermediates.noindex/DCSettings.build/Debug-watchos/DCSettings.build/Objects-normal/arm64_32/DCSettingsManager.swiftdeps -serialize-diagnostics-path /Users/admin/builder/spi-builder-workspace/.derivedData/Build/Intermediates.noindex/DCSettings.build/Debug-watchos/DCSettings.build/Objects-normal/arm64_32/DCSettingsManager.dia -target arm64_32-apple-watchos6.0 -enable-objc-interop -sdk /Applications/Xcode-16.1.0.app/Contents/Developer/Platforms/WatchOS.platform/Developer/SDKs/WatchOS11.1.sdk -I /Users/admin/builder/spi-builder-workspace/.derivedData/Build/Products/Debug-watchos -I /Applications/Xcode-16.1.0.app/Contents/Developer/Platforms/WatchOS.platform/Developer/usr/lib -F /Users/admin/builder/spi-builder-workspace/.derivedData/Build/Products/Debug-watchos -F /Applications/Xcode-16.1.0.app/Contents/Developer/Platforms/WatchOS.platform/Developer/Library/Frameworks -F /Applications/Xcode-16.1.0.app/Contents/Developer/Platforms/WatchOS.platform/Developer/SDKs/WatchOS11.1.sdk/Developer/Library/Frameworks -no-color-diagnostics -enable-testing -g -debug-info-format\=dwarf -dwarf-version\=4 -module-cache-path /Users/admin/builder/spi-builder-workspace/.derivedData/ModuleCache.noindex -profile-generate -profile-coverage-mapping -swift-version 5 -enforce-exclusivity\=checked -stats-output-dir /Users/admin/builder/spi-builder-workspace/.swiftpm/xcode/.stats -Onone -D SWIFT_PACKAGE -D DEBUG -serialize-debugging-options -const-gather-protocols-file /Users/admin/builder/spi-builder-workspace/.derivedData/Build/Intermediates.noindex/DCSettings.build/Debug-watchos/DCSettings.build/Objects-normal/arm64_32/DCSettings_const_extract_protocols.json -enable-experimental-feature DebugDescriptionMacro -enable-experimental-feature OpaqueTypeErasure -enable-upcoming-feature StrictConcurrency -enable-upcoming-feature DisableOutwardActorInference -enable-upcoming-feature GlobalActorIsolatedTypesUsability -enable-upcoming-feature InferSendableFromCaptures -strict-concurrency\=complete -empty-abi-descriptor -plugin-path /Applications/Xcode-16.1.0.app/Contents/Developer/Toolchains/XcodeDefault.xctoolchain/usr/lib/swift/host/plugins/testing -validate-clang-modules-once -clang-build-session-file /Users/admin/builder/spi-builder-workspace/.derivedData/ModuleCache.noindex/Session.modulevalidation -Xcc -working-directory -Xcc /Users/admin/builder/spi-builder-workspace/.swiftpm/xcode -resource-dir /Applications/Xcode-16.1.0.app/Contents/Developer/Toolchains/XcodeDefault.xctoolchain/usr/lib/swift -enable-anonymous-context-mangled-names -file-compilation-dir /Users/admin/builder/spi-builder-workspace/.swiftpm/xcode -Xcc -D_LIBCPP_HARDENING_MODE\=_LIBCPP_HARDENING_MODE_DEBUG -Xcc -ivfsstatcache -Xcc /Users/admin/builder/spi-builder-workspace/.derivedData/SDKStatCaches.noindex/watchos11.1-22R574-7b9df0bda16bb4641b33636c68f04660.sdkstatcache -Xcc -I/Users/admin/builder/spi-builder-workspace/.derivedData/Build/Intermediates.noindex/DCSettings.build/Debug-watchos/DCSettings.build/swift-overrides.hmap -Xcc -I/Users/admin/builder/spi-builder-workspace/.derivedData/Build/Products/Debug-watchos/include -Xcc -I/Users/admin/builder/spi-builder-workspace/.derivedData/Build/Intermediates.noindex/DCSettings.build/Debug-watchos/DCSettings.build/DerivedSources-normal/arm64_32 -Xcc -I/Users/admin/builder/spi-builder-workspace/.derivedData/Build/Intermediates.noindex/DCSettings.build/Debug-watchos/DCSettings.build/DerivedSources/arm64_32 -Xcc -I/Users/admin/builder/spi-builder-workspace/.derivedData/Build/Intermediates.noindex/DCSettings.build/Debug-watchos/DCSettings.build/DerivedSources -Xcc -DSWIFT_PACKAGE -Xcc -DDEBUG\=1 -module-name DCSettings -package-name spi_builder_workspace -frontend-parseable-output -disable-clang-spi -target-sdk-version 11.1 -target-sdk-name watchos11.1 -external-plugin-path /Applications/Xcode-16.1.0.app/Contents/Developer/Platforms/WatchOS.platform/Developer/usr/lib/swift/host/plugins\#/Applications/Xcode-16.1.0.app/Contents/Developer/Platforms/WatchOS.platform/Developer/usr/bin/swift-plugin-server -external-plugin-path /Applications/Xcode-16.1.0.app/Contents/Developer/Platforms/WatchOS.platform/Developer/usr/local/lib/swift/host/plugins\#/Applications/Xcode-16.1.0.app/Contents/Developer/Platforms/WatchOS.platform/Developer/usr/bin/swift-plugin-server -plugin-path /Applications/Xcode-16.1.0.app/Contents/Developer/Toolchains/XcodeDefault.xctoolchain/usr/lib/swift/host/plugins -plugin-path /Applications/Xcode-16.1.0.app/Contents/Developer/Toolchains/XcodeDefault.xctoolchain/usr/local/lib/swift/host/plugins -o /Users/admin/builder/spi-builder-workspace/.derivedData/Build/Intermediates.noindex/DCSettings.build/Debug-watchos/DCSettings.build/Objects-normal/arm64_32/DCSettingOption.o -o /Users/admin/builder/spi-builder-workspace/.derivedData/Build/Intermediates.noindex/DCSettings.build/Debug-watchos/DCSettings.build/Objects-normal/arm64_32/DCSettingsManager.o -index-unit-output-path /DCSettings.build/Debug-watchos/DCSettings.build/Objects-normal/arm64_32/DCSettingOption.o -index-unit-output-path /DCSettings.build/Debug-watchos/DCSettings.build/Objects-normal/arm64_32/DCSettingsManager.o -index-store-path /Users/admin/builder/spi-builder-workspace/.derivedData/Index.noindex/DataStore -index-system-modules
SwiftCompile normal arm64_32 /Users/admin/builder/spi-builder-workspace/Sources/DCSettings/Settings/DCSettingOption.swift (in target 'DCSettings' from project 'DCSettings')
    cd /Users/admin/builder/spi-builder-workspace/.swiftpm/xcode
    /Applications/Xcode-16.1.0.app/Contents/Developer/Toolchains/XcodeDefault.xctoolchain/usr/bin/swift-frontend -c /Users/admin/builder/spi-builder-workspace/Sources/DCSettings/Extensions/Collection+Extended.swift /Users/admin/builder/spi-builder-workspace/Sources/DCSettings/Extensions/Color+Codable.swift /Users/admin/builder/spi-builder-workspace/Sources/DCSettings/Extensions/DCKeyRepresentableConformances.swift /Users/admin/builder/spi-builder-workspace/Sources/DCSettings/Extensions/NSUbiquitousKeyValueStore+DCKeyValueStore.swift /Users/admin/builder/spi-builder-workspace/Sources/DCSettings/Extensions/String+Extended.swift /Users/admin/builder/spi-builder-workspace/Sources/DCSettings/Extensions/Text+MonospacedDigit.swift /Users/admin/builder/spi-builder-workspace/Sources/DCSettings/Extensions/UserDefaults+DCKeyValueStore.swift /Users/admin/builder/spi-builder-workspace/Sources/DCSettings/Settings/DCKeyRepresentable.swift /Users/admin/builder/spi-builder-workspace/Sources/DCSettings/Settings/DCSetting.swift /Users/admin/builder/spi-builder-workspace/Sources/DCSettings/Settings/DCSettingConfiguration.swift /Users/admin/builder/spi-builder-workspace/Sources/DCSettings/Settings/DCSettingGroup.swift -primary-file /Users/admin/builder/spi-builder-workspace/Sources/DCSettings/Settings/DCSettingOption.swift -primary-file /Users/admin/builder/spi-builder-workspace/Sources/DCSettings/Settings/DCSettingsManager.swift /Users/admin/builder/spi-builder-workspace/Sources/DCSettings/Settings/DCStoredRepresentedValue.swift /Users/admin/builder/spi-builder-workspace/Sources/DCSettings/Settings/DCStoredValue.swift /Users/admin/builder/spi-builder-workspace/Sources/DCSettings/Settings/DCValueBounds.swift /Users/admin/builder/spi-builder-workspace/Sources/DCSettings/Store/DCKeyValueStore.swift /Users/admin/builder/spi-builder-workspace/Sources/DCSettings/Store/DCSettingStore.swift /Users/admin/builder/spi-builder-workspace/Sources/DCSettings/Views/DCSettingView.swift /Users/admin/builder/spi-builder-workspace/Sources/DCSettings/Views/DCSettingViewProviding.swift /Users/admin/builder/spi-builder-workspace/Sources/DCSettings/Views/DCSettingsView.swift -emit-dependencies-path /Users/admin/builder/spi-builder-workspace/.derivedData/Build/Intermediates.noindex/DCSettings.build/Debug-watchos/DCSettings.build/Objects-normal/arm64_32/DCSettingOption.d -emit-const-values-path /Users/admin/builder/spi-builder-workspace/.derivedData/Build/Intermediates.noindex/DCSettings.build/Debug-watchos/DCSettings.build/Objects-normal/arm64_32/DCSettingOption.swiftconstvalues -emit-reference-dependencies-path /Users/admin/builder/spi-builder-workspace/.derivedData/Build/Intermediates.noindex/DCSettings.build/Debug-watchos/DCSettings.build/Objects-normal/arm64_32/DCSettingOption.swiftdeps -serialize-diagnostics-path /Users/admin/builder/spi-builder-workspace/.derivedData/Build/Intermediates.noindex/DCSettings.build/Debug-watchos/DCSettings.build/Objects-normal/arm64_32/DCSettingOption.dia -emit-dependencies-path /Users/admin/builder/spi-builder-workspace/.derivedData/Build/Intermediates.noindex/DCSettings.build/Debug-watchos/DCSettings.build/Objects-normal/arm64_32/DCSettingsManager.d -emit-const-values-path /Users/admin/builder/spi-builder-workspace/.derivedData/Build/Intermediates.noindex/DCSettings.build/Debug-watchos/DCSettings.build/Objects-normal/arm64_32/DCSettingsManager.swiftconstvalues -emit-reference-dependencies-path /Users/admin/builder/spi-builder-workspace/.derivedData/Build/Intermediates.noindex/DCSettings.build/Debug-watchos/DCSettings.build/Objects-normal/arm64_32/DCSettingsManager.swiftdeps -serialize-diagnostics-path /Users/admin/builder/spi-builder-workspace/.derivedData/Build/Intermediates.noindex/DCSettings.build/Debug-watchos/DCSettings.build/Objects-normal/arm64_32/DCSettingsManager.dia -target arm64_32-apple-watchos6.0 -enable-objc-interop -sdk /Applications/Xcode-16.1.0.app/Contents/Developer/Platforms/WatchOS.platform/Developer/SDKs/WatchOS11.1.sdk -I /Users/admin/builder/spi-builder-workspace/.derivedData/Build/Products/Debug-watchos -I /Applications/Xcode-16.1.0.app/Contents/Developer/Platforms/WatchOS.platform/Developer/usr/lib -F /Users/admin/builder/spi-builder-workspace/.derivedData/Build/Products/Debug-watchos -F /Applications/Xcode-16.1.0.app/Contents/Developer/Platforms/WatchOS.platform/Developer/Library/Frameworks -F /Applications/Xcode-16.1.0.app/Contents/Developer/Platforms/WatchOS.platform/Developer/SDKs/WatchOS11.1.sdk/Developer/Library/Frameworks -no-color-diagnostics -enable-testing -g -debug-info-format\=dwarf -dwarf-version\=4 -module-cache-path /Users/admin/builder/spi-builder-workspace/.derivedData/ModuleCache.noindex -profile-generate -profile-coverage-mapping -swift-version 5 -enforce-exclusivity\=checked -stats-output-dir /Users/admin/builder/spi-builder-workspace/.swiftpm/xcode/.stats -Onone -D SWIFT_PACKAGE -D DEBUG -serialize-debugging-options -const-gather-protocols-file /Users/admin/builder/spi-builder-workspace/.derivedData/Build/Intermediates.noindex/DCSettings.build/Debug-watchos/DCSettings.build/Objects-normal/arm64_32/DCSettings_const_extract_protocols.json -enable-experimental-feature DebugDescriptionMacro -enable-experimental-feature OpaqueTypeErasure -enable-upcoming-feature StrictConcurrency -enable-upcoming-feature DisableOutwardActorInference -enable-upcoming-feature GlobalActorIsolatedTypesUsability -enable-upcoming-feature InferSendableFromCaptures -strict-concurrency\=complete -empty-abi-descriptor -plugin-path /Applications/Xcode-16.1.0.app/Contents/Developer/Toolchains/XcodeDefault.xctoolchain/usr/lib/swift/host/plugins/testing -validate-clang-modules-once -clang-build-session-file /Users/admin/builder/spi-builder-workspace/.derivedData/ModuleCache.noindex/Session.modulevalidation -Xcc -working-directory -Xcc /Users/admin/builder/spi-builder-workspace/.swiftpm/xcode -resource-dir /Applications/Xcode-16.1.0.app/Contents/Developer/Toolchains/XcodeDefault.xctoolchain/usr/lib/swift -enable-anonymous-context-mangled-names -file-compilation-dir /Users/admin/builder/spi-builder-workspace/.swiftpm/xcode -Xcc -D_LIBCPP_HARDENING_MODE\=_LIBCPP_HARDENING_MODE_DEBUG -Xcc -ivfsstatcache -Xcc /Users/admin/builder/spi-builder-workspace/.derivedData/SDKStatCaches.noindex/watchos11.1-22R574-7b9df0bda16bb4641b33636c68f04660.sdkstatcache -Xcc -I/Users/admin/builder/spi-builder-workspace/.derivedData/Build/Intermediates.noindex/DCSettings.build/Debug-watchos/DCSettings.build/swift-overrides.hmap -Xcc -I/Users/admin/builder/spi-builder-workspace/.derivedData/Build/Products/Debug-watchos/include -Xcc -I/Users/admin/builder/spi-builder-workspace/.derivedData/Build/Intermediates.noindex/DCSettings.build/Debug-watchos/DCSettings.build/DerivedSources-normal/arm64_32 -Xcc -I/Users/admin/builder/spi-builder-workspace/.derivedData/Build/Intermediates.noindex/DCSettings.build/Debug-watchos/DCSettings.build/DerivedSources/arm64_32 -Xcc -I/Users/admin/builder/spi-builder-workspace/.derivedData/Build/Intermediates.noindex/DCSettings.build/Debug-watchos/DCSettings.build/DerivedSources -Xcc -DSWIFT_PACKAGE -Xcc -DDEBUG\=1 -module-name DCSettings -package-name spi_builder_workspace -frontend-parseable-output -disable-clang-spi -target-sdk-version 11.1 -target-sdk-name watchos11.1 -external-plugin-path /Applications/Xcode-16.1.0.app/Contents/Developer/Platforms/WatchOS.platform/Developer/usr/lib/swift/host/plugins\#/Applications/Xcode-16.1.0.app/Contents/Developer/Platforms/WatchOS.platform/Developer/usr/bin/swift-plugin-server -external-plugin-path /Applications/Xcode-16.1.0.app/Contents/Developer/Platforms/WatchOS.platform/Developer/usr/local/lib/swift/host/plugins\#/Applications/Xcode-16.1.0.app/Contents/Developer/Platforms/WatchOS.platform/Developer/usr/bin/swift-plugin-server -plugin-path /Applications/Xcode-16.1.0.app/Contents/Developer/Toolchains/XcodeDefault.xctoolchain/usr/lib/swift/host/plugins -plugin-path /Applications/Xcode-16.1.0.app/Contents/Developer/Toolchains/XcodeDefault.xctoolchain/usr/local/lib/swift/host/plugins -o /Users/admin/builder/spi-builder-workspace/.derivedData/Build/Intermediates.noindex/DCSettings.build/Debug-watchos/DCSettings.build/Objects-normal/arm64_32/DCSettingOption.o -o /Users/admin/builder/spi-builder-workspace/.derivedData/Build/Intermediates.noindex/DCSettings.build/Debug-watchos/DCSettings.build/Objects-normal/arm64_32/DCSettingsManager.o -index-unit-output-path /DCSettings.build/Debug-watchos/DCSettings.build/Objects-normal/arm64_32/DCSettingOption.o -index-unit-output-path /DCSettings.build/Debug-watchos/DCSettings.build/Objects-normal/arm64_32/DCSettingsManager.o -index-store-path /Users/admin/builder/spi-builder-workspace/.derivedData/Index.noindex/DataStore -index-system-modules
SwiftCompile normal arm64_32 /Users/admin/builder/spi-builder-workspace/Sources/DCSettings/Settings/DCSettingsManager.swift (in target 'DCSettings' from project 'DCSettings')
    cd /Users/admin/builder/spi-builder-workspace/.swiftpm/xcode
    /Applications/Xcode-16.1.0.app/Contents/Developer/Toolchains/XcodeDefault.xctoolchain/usr/bin/swift-frontend -c /Users/admin/builder/spi-builder-workspace/Sources/DCSettings/Extensions/Collection+Extended.swift /Users/admin/builder/spi-builder-workspace/Sources/DCSettings/Extensions/Color+Codable.swift /Users/admin/builder/spi-builder-workspace/Sources/DCSettings/Extensions/DCKeyRepresentableConformances.swift /Users/admin/builder/spi-builder-workspace/Sources/DCSettings/Extensions/NSUbiquitousKeyValueStore+DCKeyValueStore.swift /Users/admin/builder/spi-builder-workspace/Sources/DCSettings/Extensions/String+Extended.swift /Users/admin/builder/spi-builder-workspace/Sources/DCSettings/Extensions/Text+MonospacedDigit.swift /Users/admin/builder/spi-builder-workspace/Sources/DCSettings/Extensions/UserDefaults+DCKeyValueStore.swift /Users/admin/builder/spi-builder-workspace/Sources/DCSettings/Settings/DCKeyRepresentable.swift /Users/admin/builder/spi-builder-workspace/Sources/DCSettings/Settings/DCSetting.swift /Users/admin/builder/spi-builder-workspace/Sources/DCSettings/Settings/DCSettingConfiguration.swift /Users/admin/builder/spi-builder-workspace/Sources/DCSettings/Settings/DCSettingGroup.swift -primary-file /Users/admin/builder/spi-builder-workspace/Sources/DCSettings/Settings/DCSettingOption.swift -primary-file /Users/admin/builder/spi-builder-workspace/Sources/DCSettings/Settings/DCSettingsManager.swift /Users/admin/builder/spi-builder-workspace/Sources/DCSettings/Settings/DCStoredRepresentedValue.swift /Users/admin/builder/spi-builder-workspace/Sources/DCSettings/Settings/DCStoredValue.swift /Users/admin/builder/spi-builder-workspace/Sources/DCSettings/Settings/DCValueBounds.swift /Users/admin/builder/spi-builder-workspace/Sources/DCSettings/Store/DCKeyValueStore.swift /Users/admin/builder/spi-builder-workspace/Sources/DCSettings/Store/DCSettingStore.swift /Users/admin/builder/spi-builder-workspace/Sources/DCSettings/Views/DCSettingView.swift /Users/admin/builder/spi-builder-workspace/Sources/DCSettings/Views/DCSettingViewProviding.swift /Users/admin/builder/spi-builder-workspace/Sources/DCSettings/Views/DCSettingsView.swift -emit-dependencies-path /Users/admin/builder/spi-builder-workspace/.derivedData/Build/Intermediates.noindex/DCSettings.build/Debug-watchos/DCSettings.build/Objects-normal/arm64_32/DCSettingOption.d -emit-const-values-path /Users/admin/builder/spi-builder-workspace/.derivedData/Build/Intermediates.noindex/DCSettings.build/Debug-watchos/DCSettings.build/Objects-normal/arm64_32/DCSettingOption.swiftconstvalues -emit-reference-dependencies-path /Users/admin/builder/spi-builder-workspace/.derivedData/Build/Intermediates.noindex/DCSettings.build/Debug-watchos/DCSettings.build/Objects-normal/arm64_32/DCSettingOption.swiftdeps -serialize-diagnostics-path /Users/admin/builder/spi-builder-workspace/.derivedData/Build/Intermediates.noindex/DCSettings.build/Debug-watchos/DCSettings.build/Objects-normal/arm64_32/DCSettingOption.dia -emit-dependencies-path /Users/admin/builder/spi-builder-workspace/.derivedData/Build/Intermediates.noindex/DCSettings.build/Debug-watchos/DCSettings.build/Objects-normal/arm64_32/DCSettingsManager.d -emit-const-values-path /Users/admin/builder/spi-builder-workspace/.derivedData/Build/Intermediates.noindex/DCSettings.build/Debug-watchos/DCSettings.build/Objects-normal/arm64_32/DCSettingsManager.swiftconstvalues -emit-reference-dependencies-path /Users/admin/builder/spi-builder-workspace/.derivedData/Build/Intermediates.noindex/DCSettings.build/Debug-watchos/DCSettings.build/Objects-normal/arm64_32/DCSettingsManager.swiftdeps -serialize-diagnostics-path /Users/admin/builder/spi-builder-workspace/.derivedData/Build/Intermediates.noindex/DCSettings.build/Debug-watchos/DCSettings.build/Objects-normal/arm64_32/DCSettingsManager.dia -target arm64_32-apple-watchos6.0 -enable-objc-interop -sdk /Applications/Xcode-16.1.0.app/Contents/Developer/Platforms/WatchOS.platform/Developer/SDKs/WatchOS11.1.sdk -I /Users/admin/builder/spi-builder-workspace/.derivedData/Build/Products/Debug-watchos -I /Applications/Xcode-16.1.0.app/Contents/Developer/Platforms/WatchOS.platform/Developer/usr/lib -F /Users/admin/builder/spi-builder-workspace/.derivedData/Build/Products/Debug-watchos -F /Applications/Xcode-16.1.0.app/Contents/Developer/Platforms/WatchOS.platform/Developer/Library/Frameworks -F /Applications/Xcode-16.1.0.app/Contents/Developer/Platforms/WatchOS.platform/Developer/SDKs/WatchOS11.1.sdk/Developer/Library/Frameworks -no-color-diagnostics -enable-testing -g -debug-info-format\=dwarf -dwarf-version\=4 -module-cache-path /Users/admin/builder/spi-builder-workspace/.derivedData/ModuleCache.noindex -profile-generate -profile-coverage-mapping -swift-version 5 -enforce-exclusivity\=checked -stats-output-dir /Users/admin/builder/spi-builder-workspace/.swiftpm/xcode/.stats -Onone -D SWIFT_PACKAGE -D DEBUG -serialize-debugging-options -const-gather-protocols-file /Users/admin/builder/spi-builder-workspace/.derivedData/Build/Intermediates.noindex/DCSettings.build/Debug-watchos/DCSettings.build/Objects-normal/arm64_32/DCSettings_const_extract_protocols.json -enable-experimental-feature DebugDescriptionMacro -enable-experimental-feature OpaqueTypeErasure -enable-upcoming-feature StrictConcurrency -enable-upcoming-feature DisableOutwardActorInference -enable-upcoming-feature GlobalActorIsolatedTypesUsability -enable-upcoming-feature InferSendableFromCaptures -strict-concurrency\=complete -empty-abi-descriptor -plugin-path /Applications/Xcode-16.1.0.app/Contents/Developer/Toolchains/XcodeDefault.xctoolchain/usr/lib/swift/host/plugins/testing -validate-clang-modules-once -clang-build-session-file /Users/admin/builder/spi-builder-workspace/.derivedData/ModuleCache.noindex/Session.modulevalidation -Xcc -working-directory -Xcc /Users/admin/builder/spi-builder-workspace/.swiftpm/xcode -resource-dir /Applications/Xcode-16.1.0.app/Contents/Developer/Toolchains/XcodeDefault.xctoolchain/usr/lib/swift -enable-anonymous-context-mangled-names -file-compilation-dir /Users/admin/builder/spi-builder-workspace/.swiftpm/xcode -Xcc -D_LIBCPP_HARDENING_MODE\=_LIBCPP_HARDENING_MODE_DEBUG -Xcc -ivfsstatcache -Xcc /Users/admin/builder/spi-builder-workspace/.derivedData/SDKStatCaches.noindex/watchos11.1-22R574-7b9df0bda16bb4641b33636c68f04660.sdkstatcache -Xcc -I/Users/admin/builder/spi-builder-workspace/.derivedData/Build/Intermediates.noindex/DCSettings.build/Debug-watchos/DCSettings.build/swift-overrides.hmap -Xcc -I/Users/admin/builder/spi-builder-workspace/.derivedData/Build/Products/Debug-watchos/include -Xcc -I/Users/admin/builder/spi-builder-workspace/.derivedData/Build/Intermediates.noindex/DCSettings.build/Debug-watchos/DCSettings.build/DerivedSources-normal/arm64_32 -Xcc -I/Users/admin/builder/spi-builder-workspace/.derivedData/Build/Intermediates.noindex/DCSettings.build/Debug-watchos/DCSettings.build/DerivedSources/arm64_32 -Xcc -I/Users/admin/builder/spi-builder-workspace/.derivedData/Build/Intermediates.noindex/DCSettings.build/Debug-watchos/DCSettings.build/DerivedSources -Xcc -DSWIFT_PACKAGE -Xcc -DDEBUG\=1 -module-name DCSettings -package-name spi_builder_workspace -frontend-parseable-output -disable-clang-spi -target-sdk-version 11.1 -target-sdk-name watchos11.1 -external-plugin-path /Applications/Xcode-16.1.0.app/Contents/Developer/Platforms/WatchOS.platform/Developer/usr/lib/swift/host/plugins\#/Applications/Xcode-16.1.0.app/Contents/Developer/Platforms/WatchOS.platform/Developer/usr/bin/swift-plugin-server -external-plugin-path /Applications/Xcode-16.1.0.app/Contents/Developer/Platforms/WatchOS.platform/Developer/usr/local/lib/swift/host/plugins\#/Applications/Xcode-16.1.0.app/Contents/Developer/Platforms/WatchOS.platform/Developer/usr/bin/swift-plugin-server -plugin-path /Applications/Xcode-16.1.0.app/Contents/Developer/Toolchains/XcodeDefault.xctoolchain/usr/lib/swift/host/plugins -plugin-path /Applications/Xcode-16.1.0.app/Contents/Developer/Toolchains/XcodeDefault.xctoolchain/usr/local/lib/swift/host/plugins -o /Users/admin/builder/spi-builder-workspace/.derivedData/Build/Intermediates.noindex/DCSettings.build/Debug-watchos/DCSettings.build/Objects-normal/arm64_32/DCSettingOption.o -o /Users/admin/builder/spi-builder-workspace/.derivedData/Build/Intermediates.noindex/DCSettings.build/Debug-watchos/DCSettings.build/Objects-normal/arm64_32/DCSettingsManager.o -index-unit-output-path /DCSettings.build/Debug-watchos/DCSettings.build/Objects-normal/arm64_32/DCSettingOption.o -index-unit-output-path /DCSettings.build/Debug-watchos/DCSettings.build/Objects-normal/arm64_32/DCSettingsManager.o -index-store-path /Users/admin/builder/spi-builder-workspace/.derivedData/Index.noindex/DataStore -index-system-modules
SwiftCompile normal arm64_32 Compiling\ DCSettingViewProviding.swift,\ DCSettingsView.swift /Users/admin/builder/spi-builder-workspace/Sources/DCSettings/Views/DCSettingViewProviding.swift /Users/admin/builder/spi-builder-workspace/Sources/DCSettings/Views/DCSettingsView.swift (in target 'DCSettings' from project 'DCSettings')
    cd /Users/admin/builder/spi-builder-workspace/.swiftpm/xcode
    builtin-swiftTaskExecution -- /Applications/Xcode-16.1.0.app/Contents/Developer/Toolchains/XcodeDefault.xctoolchain/usr/bin/swift-frontend -frontend -c /Users/admin/builder/spi-builder-workspace/Sources/DCSettings/Extensions/Collection+Extended.swift /Users/admin/builder/spi-builder-workspace/Sources/DCSettings/Extensions/Color+Codable.swift /Users/admin/builder/spi-builder-workspace/Sources/DCSettings/Extensions/DCKeyRepresentableConformances.swift /Users/admin/builder/spi-builder-workspace/Sources/DCSettings/Extensions/NSUbiquitousKeyValueStore+DCKeyValueStore.swift /Users/admin/builder/spi-builder-workspace/Sources/DCSettings/Extensions/String+Extended.swift /Users/admin/builder/spi-builder-workspace/Sources/DCSettings/Extensions/Text+MonospacedDigit.swift /Users/admin/builder/spi-builder-workspace/Sources/DCSettings/Extensions/UserDefaults+DCKeyValueStore.swift /Users/admin/builder/spi-builder-workspace/Sources/DCSettings/Settings/DCKeyRepresentable.swift /Users/admin/builder/spi-builder-workspace/Sources/DCSettings/Settings/DCSetting.swift /Users/admin/builder/spi-builder-workspace/Sources/DCSettings/Settings/DCSettingConfiguration.swift /Users/admin/builder/spi-builder-workspace/Sources/DCSettings/Settings/DCSettingGroup.swift /Users/admin/builder/spi-builder-workspace/Sources/DCSettings/Settings/DCSettingOption.swift /Users/admin/builder/spi-builder-workspace/Sources/DCSettings/Settings/DCSettingsManager.swift /Users/admin/builder/spi-builder-workspace/Sources/DCSettings/Settings/DCStoredRepresentedValue.swift /Users/admin/builder/spi-builder-workspace/Sources/DCSettings/Settings/DCStoredValue.swift /Users/admin/builder/spi-builder-workspace/Sources/DCSettings/Settings/DCValueBounds.swift /Users/admin/builder/spi-builder-workspace/Sources/DCSettings/Store/DCKeyValueStore.swift /Users/admin/builder/spi-builder-workspace/Sources/DCSettings/Store/DCSettingStore.swift /Users/admin/builder/spi-builder-workspace/Sources/DCSettings/Views/DCSettingView.swift -primary-file /Users/admin/builder/spi-builder-workspace/Sources/DCSettings/Views/DCSettingViewProviding.swift -primary-file /Users/admin/builder/spi-builder-workspace/Sources/DCSettings/Views/DCSettingsView.swift -emit-dependencies-path /Users/admin/builder/spi-builder-workspace/.derivedData/Build/Intermediates.noindex/DCSettings.build/Debug-watchos/DCSettings.build/Objects-normal/arm64_32/DCSettingViewProviding.d -emit-const-values-path /Users/admin/builder/spi-builder-workspace/.derivedData/Build/Intermediates.noindex/DCSettings.build/Debug-watchos/DCSettings.build/Objects-normal/arm64_32/DCSettingViewProviding.swiftconstvalues -emit-reference-dependencies-path /Users/admin/builder/spi-builder-workspace/.derivedData/Build/Intermediates.noindex/DCSettings.build/Debug-watchos/DCSettings.build/Objects-normal/arm64_32/DCSettingViewProviding.swiftdeps -serialize-diagnostics-path /Users/admin/builder/spi-builder-workspace/.derivedData/Build/Intermediates.noindex/DCSettings.build/Debug-watchos/DCSettings.build/Objects-normal/arm64_32/DCSettingViewProviding.dia -emit-dependencies-path /Users/admin/builder/spi-builder-workspace/.derivedData/Build/Intermediates.noindex/DCSettings.build/Debug-watchos/DCSettings.build/Objects-normal/arm64_32/DCSettingsView.d -emit-const-values-path /Users/admin/builder/spi-builder-workspace/.derivedData/Build/Intermediates.noindex/DCSettings.build/Debug-watchos/DCSettings.build/Objects-normal/arm64_32/DCSettingsView.swiftconstvalues -emit-reference-dependencies-path /Users/admin/builder/spi-builder-workspace/.derivedData/Build/Intermediates.noindex/DCSettings.build/Debug-watchos/DCSettings.build/Objects-normal/arm64_32/DCSettingsView.swiftdeps -serialize-diagnostics-path /Users/admin/builder/spi-builder-workspace/.derivedData/Build/Intermediates.noindex/DCSettings.build/Debug-watchos/DCSettings.build/Objects-normal/arm64_32/DCSettingsView.dia -target arm64_32-apple-watchos6.0 -enable-objc-interop -sdk /Applications/Xcode-16.1.0.app/Contents/Developer/Platforms/WatchOS.platform/Developer/SDKs/WatchOS11.1.sdk -I /Users/admin/builder/spi-builder-workspace/.derivedData/Build/Products/Debug-watchos -I /Applications/Xcode-16.1.0.app/Contents/Developer/Platforms/WatchOS.platform/Developer/usr/lib -F /Users/admin/builder/spi-builder-workspace/.derivedData/Build/Products/Debug-watchos -F /Applications/Xcode-16.1.0.app/Contents/Developer/Platforms/WatchOS.platform/Developer/Library/Frameworks -F /Applications/Xcode-16.1.0.app/Contents/Developer/Platforms/WatchOS.platform/Developer/SDKs/WatchOS11.1.sdk/Developer/Library/Frameworks -no-color-diagnostics -enable-testing -g -debug-info-format\=dwarf -dwarf-version\=4 -module-cache-path /Users/admin/builder/spi-builder-workspace/.derivedData/ModuleCache.noindex -profile-generate -profile-coverage-mapping -swift-version 5 -enforce-exclusivity\=checked -stats-output-dir /Users/admin/builder/spi-builder-workspace/.swiftpm/xcode/.stats -Onone -D SWIFT_PACKAGE -D DEBUG -serialize-debugging-options -const-gather-protocols-file /Users/admin/builder/spi-builder-workspace/.derivedData/Build/Intermediates.noindex/DCSettings.build/Debug-watchos/DCSettings.build/Objects-normal/arm64_32/DCSettings_const_extract_protocols.json -enable-experimental-feature DebugDescriptionMacro -enable-experimental-feature OpaqueTypeErasure -enable-upcoming-feature StrictConcurrency -enable-upcoming-feature DisableOutwardActorInference -enable-upcoming-feature GlobalActorIsolatedTypesUsability -enable-upcoming-feature InferSendableFromCaptures -strict-concurrency\=complete -empty-abi-descriptor -plugin-path /Applications/Xcode-16.1.0.app/Contents/Developer/Toolchains/XcodeDefault.xctoolchain/usr/lib/swift/host/plugins/testing -validate-clang-modules-once -clang-build-session-file /Users/admin/builder/spi-builder-workspace/.derivedData/ModuleCache.noindex/Session.modulevalidation -Xcc -working-directory -Xcc /Users/admin/builder/spi-builder-workspace/.swiftpm/xcode -resource-dir /Applications/Xcode-16.1.0.app/Contents/Developer/Toolchains/XcodeDefault.xctoolchain/usr/lib/swift -enable-anonymous-context-mangled-names -file-compilation-dir /Users/admin/builder/spi-builder-workspace/.swiftpm/xcode -Xcc -D_LIBCPP_HARDENING_MODE\=_LIBCPP_HARDENING_MODE_DEBUG -Xcc -ivfsstatcache -Xcc /Users/admin/builder/spi-builder-workspace/.derivedData/SDKStatCaches.noindex/watchos11.1-22R574-7b9df0bda16bb4641b33636c68f04660.sdkstatcache -Xcc -I/Users/admin/builder/spi-builder-workspace/.derivedData/Build/Intermediates.noindex/DCSettings.build/Debug-watchos/DCSettings.build/swift-overrides.hmap -Xcc -I/Users/admin/builder/spi-builder-workspace/.derivedData/Build/Products/Debug-watchos/include -Xcc -I/Users/admin/builder/spi-builder-workspace/.derivedData/Build/Intermediates.noindex/DCSettings.build/Debug-watchos/DCSettings.build/DerivedSources-normal/arm64_32 -Xcc -I/Users/admin/builder/spi-builder-workspace/.derivedData/Build/Intermediates.noindex/DCSettings.build/Debug-watchos/DCSettings.build/DerivedSources/arm64_32 -Xcc -I/Users/admin/builder/spi-builder-workspace/.derivedData/Build/Intermediates.noindex/DCSettings.build/Debug-watchos/DCSettings.build/DerivedSources -Xcc -DSWIFT_PACKAGE -Xcc -DDEBUG\=1 -module-name DCSettings -package-name spi_builder_workspace -frontend-parseable-output -disable-clang-spi -target-sdk-version 11.1 -target-sdk-name watchos11.1 -external-plugin-path /Applications/Xcode-16.1.0.app/Contents/Developer/Platforms/WatchOS.platform/Developer/usr/lib/swift/host/plugins\#/Applications/Xcode-16.1.0.app/Contents/Developer/Platforms/WatchOS.platform/Developer/usr/bin/swift-plugin-server -external-plugin-path /Applications/Xcode-16.1.0.app/Contents/Developer/Platforms/WatchOS.platform/Developer/usr/local/lib/swift/host/plugins\#/Applications/Xcode-16.1.0.app/Contents/Developer/Platforms/WatchOS.platform/Developer/usr/bin/swift-plugin-server -plugin-path /Applications/Xcode-16.1.0.app/Contents/Developer/Toolchains/XcodeDefault.xctoolchain/usr/lib/swift/host/plugins -plugin-path /Applications/Xcode-16.1.0.app/Contents/Developer/Toolchains/XcodeDefault.xctoolchain/usr/local/lib/swift/host/plugins -o /Users/admin/builder/spi-builder-workspace/.derivedData/Build/Intermediates.noindex/DCSettings.build/Debug-watchos/DCSettings.build/Objects-normal/arm64_32/DCSettingViewProviding.o -o /Users/admin/builder/spi-builder-workspace/.derivedData/Build/Intermediates.noindex/DCSettings.build/Debug-watchos/DCSettings.build/Objects-normal/arm64_32/DCSettingsView.o -index-unit-output-path /DCSettings.build/Debug-watchos/DCSettings.build/Objects-normal/arm64_32/DCSettingViewProviding.o -index-unit-output-path /DCSettings.build/Debug-watchos/DCSettings.build/Objects-normal/arm64_32/DCSettingsView.o -index-store-path /Users/admin/builder/spi-builder-workspace/.derivedData/Index.noindex/DataStore -index-system-modules
SwiftCompile normal arm64_32 /Users/admin/builder/spi-builder-workspace/Sources/DCSettings/Views/DCSettingViewProviding.swift (in target 'DCSettings' from project 'DCSettings')
    cd /Users/admin/builder/spi-builder-workspace/.swiftpm/xcode
    /Applications/Xcode-16.1.0.app/Contents/Developer/Toolchains/XcodeDefault.xctoolchain/usr/bin/swift-frontend -c /Users/admin/builder/spi-builder-workspace/Sources/DCSettings/Extensions/Collection+Extended.swift /Users/admin/builder/spi-builder-workspace/Sources/DCSettings/Extensions/Color+Codable.swift /Users/admin/builder/spi-builder-workspace/Sources/DCSettings/Extensions/DCKeyRepresentableConformances.swift /Users/admin/builder/spi-builder-workspace/Sources/DCSettings/Extensions/NSUbiquitousKeyValueStore+DCKeyValueStore.swift /Users/admin/builder/spi-builder-workspace/Sources/DCSettings/Extensions/String+Extended.swift /Users/admin/builder/spi-builder-workspace/Sources/DCSettings/Extensions/Text+MonospacedDigit.swift /Users/admin/builder/spi-builder-workspace/Sources/DCSettings/Extensions/UserDefaults+DCKeyValueStore.swift /Users/admin/builder/spi-builder-workspace/Sources/DCSettings/Settings/DCKeyRepresentable.swift /Users/admin/builder/spi-builder-workspace/Sources/DCSettings/Settings/DCSetting.swift /Users/admin/builder/spi-builder-workspace/Sources/DCSettings/Settings/DCSettingConfiguration.swift /Users/admin/builder/spi-builder-workspace/Sources/DCSettings/Settings/DCSettingGroup.swift /Users/admin/builder/spi-builder-workspace/Sources/DCSettings/Settings/DCSettingOption.swift /Users/admin/builder/spi-builder-workspace/Sources/DCSettings/Settings/DCSettingsManager.swift /Users/admin/builder/spi-builder-workspace/Sources/DCSettings/Settings/DCStoredRepresentedValue.swift /Users/admin/builder/spi-builder-workspace/Sources/DCSettings/Settings/DCStoredValue.swift /Users/admin/builder/spi-builder-workspace/Sources/DCSettings/Settings/DCValueBounds.swift /Users/admin/builder/spi-builder-workspace/Sources/DCSettings/Store/DCKeyValueStore.swift /Users/admin/builder/spi-builder-workspace/Sources/DCSettings/Store/DCSettingStore.swift /Users/admin/builder/spi-builder-workspace/Sources/DCSettings/Views/DCSettingView.swift -primary-file /Users/admin/builder/spi-builder-workspace/Sources/DCSettings/Views/DCSettingViewProviding.swift -primary-file /Users/admin/builder/spi-builder-workspace/Sources/DCSettings/Views/DCSettingsView.swift -emit-dependencies-path /Users/admin/builder/spi-builder-workspace/.derivedData/Build/Intermediates.noindex/DCSettings.build/Debug-watchos/DCSettings.build/Objects-normal/arm64_32/DCSettingViewProviding.d -emit-const-values-path /Users/admin/builder/spi-builder-workspace/.derivedData/Build/Intermediates.noindex/DCSettings.build/Debug-watchos/DCSettings.build/Objects-normal/arm64_32/DCSettingViewProviding.swiftconstvalues -emit-reference-dependencies-path /Users/admin/builder/spi-builder-workspace/.derivedData/Build/Intermediates.noindex/DCSettings.build/Debug-watchos/DCSettings.build/Objects-normal/arm64_32/DCSettingViewProviding.swiftdeps -serialize-diagnostics-path /Users/admin/builder/spi-builder-workspace/.derivedData/Build/Intermediates.noindex/DCSettings.build/Debug-watchos/DCSettings.build/Objects-normal/arm64_32/DCSettingViewProviding.dia -emit-dependencies-path /Users/admin/builder/spi-builder-workspace/.derivedData/Build/Intermediates.noindex/DCSettings.build/Debug-watchos/DCSettings.build/Objects-normal/arm64_32/DCSettingsView.d -emit-const-values-path /Users/admin/builder/spi-builder-workspace/.derivedData/Build/Intermediates.noindex/DCSettings.build/Debug-watchos/DCSettings.build/Objects-normal/arm64_32/DCSettingsView.swiftconstvalues -emit-reference-dependencies-path /Users/admin/builder/spi-builder-workspace/.derivedData/Build/Intermediates.noindex/DCSettings.build/Debug-watchos/DCSettings.build/Objects-normal/arm64_32/DCSettingsView.swiftdeps -serialize-diagnostics-path /Users/admin/builder/spi-builder-workspace/.derivedData/Build/Intermediates.noindex/DCSettings.build/Debug-watchos/DCSettings.build/Objects-normal/arm64_32/DCSettingsView.dia -target arm64_32-apple-watchos6.0 -enable-objc-interop -sdk /Applications/Xcode-16.1.0.app/Contents/Developer/Platforms/WatchOS.platform/Developer/SDKs/WatchOS11.1.sdk -I /Users/admin/builder/spi-builder-workspace/.derivedData/Build/Products/Debug-watchos -I /Applications/Xcode-16.1.0.app/Contents/Developer/Platforms/WatchOS.platform/Developer/usr/lib -F /Users/admin/builder/spi-builder-workspace/.derivedData/Build/Products/Debug-watchos -F /Applications/Xcode-16.1.0.app/Contents/Developer/Platforms/WatchOS.platform/Developer/Library/Frameworks -F /Applications/Xcode-16.1.0.app/Contents/Developer/Platforms/WatchOS.platform/Developer/SDKs/WatchOS11.1.sdk/Developer/Library/Frameworks -no-color-diagnostics -enable-testing -g -debug-info-format\=dwarf -dwarf-version\=4 -module-cache-path /Users/admin/builder/spi-builder-workspace/.derivedData/ModuleCache.noindex -profile-generate -profile-coverage-mapping -swift-version 5 -enforce-exclusivity\=checked -stats-output-dir /Users/admin/builder/spi-builder-workspace/.swiftpm/xcode/.stats -Onone -D SWIFT_PACKAGE -D DEBUG -serialize-debugging-options -const-gather-protocols-file /Users/admin/builder/spi-builder-workspace/.derivedData/Build/Intermediates.noindex/DCSettings.build/Debug-watchos/DCSettings.build/Objects-normal/arm64_32/DCSettings_const_extract_protocols.json -enable-experimental-feature DebugDescriptionMacro -enable-experimental-feature OpaqueTypeErasure -enable-upcoming-feature StrictConcurrency -enable-upcoming-feature DisableOutwardActorInference -enable-upcoming-feature GlobalActorIsolatedTypesUsability -enable-upcoming-feature InferSendableFromCaptures -strict-concurrency\=complete -empty-abi-descriptor -plugin-path /Applications/Xcode-16.1.0.app/Contents/Developer/Toolchains/XcodeDefault.xctoolchain/usr/lib/swift/host/plugins/testing -validate-clang-modules-once -clang-build-session-file /Users/admin/builder/spi-builder-workspace/.derivedData/ModuleCache.noindex/Session.modulevalidation -Xcc -working-directory -Xcc /Users/admin/builder/spi-builder-workspace/.swiftpm/xcode -resource-dir /Applications/Xcode-16.1.0.app/Contents/Developer/Toolchains/XcodeDefault.xctoolchain/usr/lib/swift -enable-anonymous-context-mangled-names -file-compilation-dir /Users/admin/builder/spi-builder-workspace/.swiftpm/xcode -Xcc -D_LIBCPP_HARDENING_MODE\=_LIBCPP_HARDENING_MODE_DEBUG -Xcc -ivfsstatcache -Xcc /Users/admin/builder/spi-builder-workspace/.derivedData/SDKStatCaches.noindex/watchos11.1-22R574-7b9df0bda16bb4641b33636c68f04660.sdkstatcache -Xcc -I/Users/admin/builder/spi-builder-workspace/.derivedData/Build/Intermediates.noindex/DCSettings.build/Debug-watchos/DCSettings.build/swift-overrides.hmap -Xcc -I/Users/admin/builder/spi-builder-workspace/.derivedData/Build/Products/Debug-watchos/include -Xcc -I/Users/admin/builder/spi-builder-workspace/.derivedData/Build/Intermediates.noindex/DCSettings.build/Debug-watchos/DCSettings.build/DerivedSources-normal/arm64_32 -Xcc -I/Users/admin/builder/spi-builder-workspace/.derivedData/Build/Intermediates.noindex/DCSettings.build/Debug-watchos/DCSettings.build/DerivedSources/arm64_32 -Xcc -I/Users/admin/builder/spi-builder-workspace/.derivedData/Build/Intermediates.noindex/DCSettings.build/Debug-watchos/DCSettings.build/DerivedSources -Xcc -DSWIFT_PACKAGE -Xcc -DDEBUG\=1 -module-name DCSettings -package-name spi_builder_workspace -frontend-parseable-output -disable-clang-spi -target-sdk-version 11.1 -target-sdk-name watchos11.1 -external-plugin-path /Applications/Xcode-16.1.0.app/Contents/Developer/Platforms/WatchOS.platform/Developer/usr/lib/swift/host/plugins\#/Applications/Xcode-16.1.0.app/Contents/Developer/Platforms/WatchOS.platform/Developer/usr/bin/swift-plugin-server -external-plugin-path /Applications/Xcode-16.1.0.app/Contents/Developer/Platforms/WatchOS.platform/Developer/usr/local/lib/swift/host/plugins\#/Applications/Xcode-16.1.0.app/Contents/Developer/Platforms/WatchOS.platform/Developer/usr/bin/swift-plugin-server -plugin-path /Applications/Xcode-16.1.0.app/Contents/Developer/Toolchains/XcodeDefault.xctoolchain/usr/lib/swift/host/plugins -plugin-path /Applications/Xcode-16.1.0.app/Contents/Developer/Toolchains/XcodeDefault.xctoolchain/usr/local/lib/swift/host/plugins -o /Users/admin/builder/spi-builder-workspace/.derivedData/Build/Intermediates.noindex/DCSettings.build/Debug-watchos/DCSettings.build/Objects-normal/arm64_32/DCSettingViewProviding.o -o /Users/admin/builder/spi-builder-workspace/.derivedData/Build/Intermediates.noindex/DCSettings.build/Debug-watchos/DCSettings.build/Objects-normal/arm64_32/DCSettingsView.o -index-unit-output-path /DCSettings.build/Debug-watchos/DCSettings.build/Objects-normal/arm64_32/DCSettingViewProviding.o -index-unit-output-path /DCSettings.build/Debug-watchos/DCSettings.build/Objects-normal/arm64_32/DCSettingsView.o -index-store-path /Users/admin/builder/spi-builder-workspace/.derivedData/Index.noindex/DataStore -index-system-modules
SwiftCompile normal arm64_32 /Users/admin/builder/spi-builder-workspace/Sources/DCSettings/Views/DCSettingsView.swift (in target 'DCSettings' from project 'DCSettings')
    cd /Users/admin/builder/spi-builder-workspace/.swiftpm/xcode
    /Applications/Xcode-16.1.0.app/Contents/Developer/Toolchains/XcodeDefault.xctoolchain/usr/bin/swift-frontend -c /Users/admin/builder/spi-builder-workspace/Sources/DCSettings/Extensions/Collection+Extended.swift /Users/admin/builder/spi-builder-workspace/Sources/DCSettings/Extensions/Color+Codable.swift /Users/admin/builder/spi-builder-workspace/Sources/DCSettings/Extensions/DCKeyRepresentableConformances.swift /Users/admin/builder/spi-builder-workspace/Sources/DCSettings/Extensions/NSUbiquitousKeyValueStore+DCKeyValueStore.swift /Users/admin/builder/spi-builder-workspace/Sources/DCSettings/Extensions/String+Extended.swift /Users/admin/builder/spi-builder-workspace/Sources/DCSettings/Extensions/Text+MonospacedDigit.swift /Users/admin/builder/spi-builder-workspace/Sources/DCSettings/Extensions/UserDefaults+DCKeyValueStore.swift /Users/admin/builder/spi-builder-workspace/Sources/DCSettings/Settings/DCKeyRepresentable.swift /Users/admin/builder/spi-builder-workspace/Sources/DCSettings/Settings/DCSetting.swift /Users/admin/builder/spi-builder-workspace/Sources/DCSettings/Settings/DCSettingConfiguration.swift /Users/admin/builder/spi-builder-workspace/Sources/DCSettings/Settings/DCSettingGroup.swift /Users/admin/builder/spi-builder-workspace/Sources/DCSettings/Settings/DCSettingOption.swift /Users/admin/builder/spi-builder-workspace/Sources/DCSettings/Settings/DCSettingsManager.swift /Users/admin/builder/spi-builder-workspace/Sources/DCSettings/Settings/DCStoredRepresentedValue.swift /Users/admin/builder/spi-builder-workspace/Sources/DCSettings/Settings/DCStoredValue.swift /Users/admin/builder/spi-builder-workspace/Sources/DCSettings/Settings/DCValueBounds.swift /Users/admin/builder/spi-builder-workspace/Sources/DCSettings/Store/DCKeyValueStore.swift /Users/admin/builder/spi-builder-workspace/Sources/DCSettings/Store/DCSettingStore.swift /Users/admin/builder/spi-builder-workspace/Sources/DCSettings/Views/DCSettingView.swift -primary-file /Users/admin/builder/spi-builder-workspace/Sources/DCSettings/Views/DCSettingViewProviding.swift -primary-file /Users/admin/builder/spi-builder-workspace/Sources/DCSettings/Views/DCSettingsView.swift -emit-dependencies-path /Users/admin/builder/spi-builder-workspace/.derivedData/Build/Intermediates.noindex/DCSettings.build/Debug-watchos/DCSettings.build/Objects-normal/arm64_32/DCSettingViewProviding.d -emit-const-values-path /Users/admin/builder/spi-builder-workspace/.derivedData/Build/Intermediates.noindex/DCSettings.build/Debug-watchos/DCSettings.build/Objects-normal/arm64_32/DCSettingViewProviding.swiftconstvalues -emit-reference-dependencies-path /Users/admin/builder/spi-builder-workspace/.derivedData/Build/Intermediates.noindex/DCSettings.build/Debug-watchos/DCSettings.build/Objects-normal/arm64_32/DCSettingViewProviding.swiftdeps -serialize-diagnostics-path /Users/admin/builder/spi-builder-workspace/.derivedData/Build/Intermediates.noindex/DCSettings.build/Debug-watchos/DCSettings.build/Objects-normal/arm64_32/DCSettingViewProviding.dia -emit-dependencies-path /Users/admin/builder/spi-builder-workspace/.derivedData/Build/Intermediates.noindex/DCSettings.build/Debug-watchos/DCSettings.build/Objects-normal/arm64_32/DCSettingsView.d -emit-const-values-path /Users/admin/builder/spi-builder-workspace/.derivedData/Build/Intermediates.noindex/DCSettings.build/Debug-watchos/DCSettings.build/Objects-normal/arm64_32/DCSettingsView.swiftconstvalues -emit-reference-dependencies-path /Users/admin/builder/spi-builder-workspace/.derivedData/Build/Intermediates.noindex/DCSettings.build/Debug-watchos/DCSettings.build/Objects-normal/arm64_32/DCSettingsView.swiftdeps -serialize-diagnostics-path /Users/admin/builder/spi-builder-workspace/.derivedData/Build/Intermediates.noindex/DCSettings.build/Debug-watchos/DCSettings.build/Objects-normal/arm64_32/DCSettingsView.dia -target arm64_32-apple-watchos6.0 -enable-objc-interop -sdk /Applications/Xcode-16.1.0.app/Contents/Developer/Platforms/WatchOS.platform/Developer/SDKs/WatchOS11.1.sdk -I /Users/admin/builder/spi-builder-workspace/.derivedData/Build/Products/Debug-watchos -I /Applications/Xcode-16.1.0.app/Contents/Developer/Platforms/WatchOS.platform/Developer/usr/lib -F /Users/admin/builder/spi-builder-workspace/.derivedData/Build/Products/Debug-watchos -F /Applications/Xcode-16.1.0.app/Contents/Developer/Platforms/WatchOS.platform/Developer/Library/Frameworks -F /Applications/Xcode-16.1.0.app/Contents/Developer/Platforms/WatchOS.platform/Developer/SDKs/WatchOS11.1.sdk/Developer/Library/Frameworks -no-color-diagnostics -enable-testing -g -debug-info-format\=dwarf -dwarf-version\=4 -module-cache-path /Users/admin/builder/spi-builder-workspace/.derivedData/ModuleCache.noindex -profile-generate -profile-coverage-mapping -swift-version 5 -enforce-exclusivity\=checked -stats-output-dir /Users/admin/builder/spi-builder-workspace/.swiftpm/xcode/.stats -Onone -D SWIFT_PACKAGE -D DEBUG -serialize-debugging-options -const-gather-protocols-file /Users/admin/builder/spi-builder-workspace/.derivedData/Build/Intermediates.noindex/DCSettings.build/Debug-watchos/DCSettings.build/Objects-normal/arm64_32/DCSettings_const_extract_protocols.json -enable-experimental-feature DebugDescriptionMacro -enable-experimental-feature OpaqueTypeErasure -enable-upcoming-feature StrictConcurrency -enable-upcoming-feature DisableOutwardActorInference -enable-upcoming-feature GlobalActorIsolatedTypesUsability -enable-upcoming-feature InferSendableFromCaptures -strict-concurrency\=complete -empty-abi-descriptor -plugin-path /Applications/Xcode-16.1.0.app/Contents/Developer/Toolchains/XcodeDefault.xctoolchain/usr/lib/swift/host/plugins/testing -validate-clang-modules-once -clang-build-session-file /Users/admin/builder/spi-builder-workspace/.derivedData/ModuleCache.noindex/Session.modulevalidation -Xcc -working-directory -Xcc /Users/admin/builder/spi-builder-workspace/.swiftpm/xcode -resource-dir /Applications/Xcode-16.1.0.app/Contents/Developer/Toolchains/XcodeDefault.xctoolchain/usr/lib/swift -enable-anonymous-context-mangled-names -file-compilation-dir /Users/admin/builder/spi-builder-workspace/.swiftpm/xcode -Xcc -D_LIBCPP_HARDENING_MODE\=_LIBCPP_HARDENING_MODE_DEBUG -Xcc -ivfsstatcache -Xcc /Users/admin/builder/spi-builder-workspace/.derivedData/SDKStatCaches.noindex/watchos11.1-22R574-7b9df0bda16bb4641b33636c68f04660.sdkstatcache -Xcc -I/Users/admin/builder/spi-builder-workspace/.derivedData/Build/Intermediates.noindex/DCSettings.build/Debug-watchos/DCSettings.build/swift-overrides.hmap -Xcc -I/Users/admin/builder/spi-builder-workspace/.derivedData/Build/Products/Debug-watchos/include -Xcc -I/Users/admin/builder/spi-builder-workspace/.derivedData/Build/Intermediates.noindex/DCSettings.build/Debug-watchos/DCSettings.build/DerivedSources-normal/arm64_32 -Xcc -I/Users/admin/builder/spi-builder-workspace/.derivedData/Build/Intermediates.noindex/DCSettings.build/Debug-watchos/DCSettings.build/DerivedSources/arm64_32 -Xcc -I/Users/admin/builder/spi-builder-workspace/.derivedData/Build/Intermediates.noindex/DCSettings.build/Debug-watchos/DCSettings.build/DerivedSources -Xcc -DSWIFT_PACKAGE -Xcc -DDEBUG\=1 -module-name DCSettings -package-name spi_builder_workspace -frontend-parseable-output -disable-clang-spi -target-sdk-version 11.1 -target-sdk-name watchos11.1 -external-plugin-path /Applications/Xcode-16.1.0.app/Contents/Developer/Platforms/WatchOS.platform/Developer/usr/lib/swift/host/plugins\#/Applications/Xcode-16.1.0.app/Contents/Developer/Platforms/WatchOS.platform/Developer/usr/bin/swift-plugin-server -external-plugin-path /Applications/Xcode-16.1.0.app/Contents/Developer/Platforms/WatchOS.platform/Developer/usr/local/lib/swift/host/plugins\#/Applications/Xcode-16.1.0.app/Contents/Developer/Platforms/WatchOS.platform/Developer/usr/bin/swift-plugin-server -plugin-path /Applications/Xcode-16.1.0.app/Contents/Developer/Toolchains/XcodeDefault.xctoolchain/usr/lib/swift/host/plugins -plugin-path /Applications/Xcode-16.1.0.app/Contents/Developer/Toolchains/XcodeDefault.xctoolchain/usr/local/lib/swift/host/plugins -o /Users/admin/builder/spi-builder-workspace/.derivedData/Build/Intermediates.noindex/DCSettings.build/Debug-watchos/DCSettings.build/Objects-normal/arm64_32/DCSettingViewProviding.o -o /Users/admin/builder/spi-builder-workspace/.derivedData/Build/Intermediates.noindex/DCSettings.build/Debug-watchos/DCSettings.build/Objects-normal/arm64_32/DCSettingsView.o -index-unit-output-path /DCSettings.build/Debug-watchos/DCSettings.build/Objects-normal/arm64_32/DCSettingViewProviding.o -index-unit-output-path /DCSettings.build/Debug-watchos/DCSettings.build/Objects-normal/arm64_32/DCSettingsView.o -index-store-path /Users/admin/builder/spi-builder-workspace/.derivedData/Index.noindex/DataStore -index-system-modules
SwiftEmitModule normal arm64_32 Emitting\ module\ for\ DCSettings (in target 'DCSettings' from project 'DCSettings')
    cd /Users/admin/builder/spi-builder-workspace/.swiftpm/xcode
    builtin-swiftTaskExecution -- /Applications/Xcode-16.1.0.app/Contents/Developer/Toolchains/XcodeDefault.xctoolchain/usr/bin/swift-frontend -frontend -emit-module -experimental-skip-non-inlinable-function-bodies-without-types /Users/admin/builder/spi-builder-workspace/Sources/DCSettings/Extensions/Collection+Extended.swift /Users/admin/builder/spi-builder-workspace/Sources/DCSettings/Extensions/Color+Codable.swift /Users/admin/builder/spi-builder-workspace/Sources/DCSettings/Extensions/DCKeyRepresentableConformances.swift /Users/admin/builder/spi-builder-workspace/Sources/DCSettings/Extensions/NSUbiquitousKeyValueStore+DCKeyValueStore.swift /Users/admin/builder/spi-builder-workspace/Sources/DCSettings/Extensions/String+Extended.swift /Users/admin/builder/spi-builder-workspace/Sources/DCSettings/Extensions/Text+MonospacedDigit.swift /Users/admin/builder/spi-builder-workspace/Sources/DCSettings/Extensions/UserDefaults+DCKeyValueStore.swift /Users/admin/builder/spi-builder-workspace/Sources/DCSettings/Settings/DCKeyRepresentable.swift /Users/admin/builder/spi-builder-workspace/Sources/DCSettings/Settings/DCSetting.swift /Users/admin/builder/spi-builder-workspace/Sources/DCSettings/Settings/DCSettingConfiguration.swift /Users/admin/builder/spi-builder-workspace/Sources/DCSettings/Settings/DCSettingGroup.swift /Users/admin/builder/spi-builder-workspace/Sources/DCSettings/Settings/DCSettingOption.swift /Users/admin/builder/spi-builder-workspace/Sources/DCSettings/Settings/DCSettingsManager.swift /Users/admin/builder/spi-builder-workspace/Sources/DCSettings/Settings/DCStoredRepresentedValue.swift /Users/admin/builder/spi-builder-workspace/Sources/DCSettings/Settings/DCStoredValue.swift /Users/admin/builder/spi-builder-workspace/Sources/DCSettings/Settings/DCValueBounds.swift /Users/admin/builder/spi-builder-workspace/Sources/DCSettings/Store/DCKeyValueStore.swift /Users/admin/builder/spi-builder-workspace/Sources/DCSettings/Store/DCSettingStore.swift /Users/admin/builder/spi-builder-workspace/Sources/DCSettings/Views/DCSettingView.swift /Users/admin/builder/spi-builder-workspace/Sources/DCSettings/Views/DCSettingViewProviding.swift /Users/admin/builder/spi-builder-workspace/Sources/DCSettings/Views/DCSettingsView.swift -target arm64_32-apple-watchos6.0 -enable-objc-interop -sdk /Applications/Xcode-16.1.0.app/Contents/Developer/Platforms/WatchOS.platform/Developer/SDKs/WatchOS11.1.sdk -I /Users/admin/builder/spi-builder-workspace/.derivedData/Build/Products/Debug-watchos -I /Applications/Xcode-16.1.0.app/Contents/Developer/Platforms/WatchOS.platform/Developer/usr/lib -F /Users/admin/builder/spi-builder-workspace/.derivedData/Build/Products/Debug-watchos -F /Applications/Xcode-16.1.0.app/Contents/Developer/Platforms/WatchOS.platform/Developer/Library/Frameworks -F /Applications/Xcode-16.1.0.app/Contents/Developer/Platforms/WatchOS.platform/Developer/SDKs/WatchOS11.1.sdk/Developer/Library/Frameworks -no-color-diagnostics -enable-testing -g -debug-info-format\=dwarf -dwarf-version\=4 -module-cache-path /Users/admin/builder/spi-builder-workspace/.derivedData/ModuleCache.noindex -profile-generate -profile-coverage-mapping -swift-version 5 -enforce-exclusivity\=checked -stats-output-dir /Users/admin/builder/spi-builder-workspace/.swiftpm/xcode/.stats -Onone -D SWIFT_PACKAGE -D DEBUG -serialize-debugging-options -const-gather-protocols-file /Users/admin/builder/spi-builder-workspace/.derivedData/Build/Intermediates.noindex/DCSettings.build/Debug-watchos/DCSettings.build/Objects-normal/arm64_32/DCSettings_const_extract_protocols.json -enable-experimental-feature DebugDescriptionMacro -enable-experimental-feature OpaqueTypeErasure -enable-upcoming-feature StrictConcurrency -enable-upcoming-feature DisableOutwardActorInference -enable-upcoming-feature GlobalActorIsolatedTypesUsability -enable-upcoming-feature InferSendableFromCaptures -strict-concurrency\=complete -empty-abi-descriptor -plugin-path /Applications/Xcode-16.1.0.app/Contents/Developer/Toolchains/XcodeDefault.xctoolchain/usr/lib/swift/host/plugins/testing -validate-clang-modules-once -clang-build-session-file /Users/admin/builder/spi-builder-workspace/.derivedData/ModuleCache.noindex/Session.modulevalidation -Xcc -working-directory -Xcc /Users/admin/builder/spi-builder-workspace/.swiftpm/xcode -resource-dir /Applications/Xcode-16.1.0.app/Contents/Developer/Toolchains/XcodeDefault.xctoolchain/usr/lib/swift -enable-anonymous-context-mangled-names -file-compilation-dir /Users/admin/builder/spi-builder-workspace/.swiftpm/xcode -Xcc -D_LIBCPP_HARDENING_MODE\=_LIBCPP_HARDENING_MODE_DEBUG -Xcc -ivfsstatcache -Xcc /Users/admin/builder/spi-builder-workspace/.derivedData/SDKStatCaches.noindex/watchos11.1-22R574-7b9df0bda16bb4641b33636c68f04660.sdkstatcache -Xcc -I/Users/admin/builder/spi-builder-workspace/.derivedData/Build/Intermediates.noindex/DCSettings.build/Debug-watchos/DCSettings.build/swift-overrides.hmap -Xcc -I/Users/admin/builder/spi-builder-workspace/.derivedData/Build/Products/Debug-watchos/include -Xcc -I/Users/admin/builder/spi-builder-workspace/.derivedData/Build/Intermediates.noindex/DCSettings.build/Debug-watchos/DCSettings.build/DerivedSources-normal/arm64_32 -Xcc -I/Users/admin/builder/spi-builder-workspace/.derivedData/Build/Intermediates.noindex/DCSettings.build/Debug-watchos/DCSettings.build/DerivedSources/arm64_32 -Xcc -I/Users/admin/builder/spi-builder-workspace/.derivedData/Build/Intermediates.noindex/DCSettings.build/Debug-watchos/DCSettings.build/DerivedSources -Xcc -DSWIFT_PACKAGE -Xcc -DDEBUG\=1 -module-name DCSettings -package-name spi_builder_workspace -frontend-parseable-output -disable-clang-spi -target-sdk-version 11.1 -target-sdk-name watchos11.1 -external-plugin-path /Applications/Xcode-16.1.0.app/Contents/Developer/Platforms/WatchOS.platform/Developer/usr/lib/swift/host/plugins\#/Applications/Xcode-16.1.0.app/Contents/Developer/Platforms/WatchOS.platform/Developer/usr/bin/swift-plugin-server -external-plugin-path /Applications/Xcode-16.1.0.app/Contents/Developer/Platforms/WatchOS.platform/Developer/usr/local/lib/swift/host/plugins\#/Applications/Xcode-16.1.0.app/Contents/Developer/Platforms/WatchOS.platform/Developer/usr/bin/swift-plugin-server -plugin-path /Applications/Xcode-16.1.0.app/Contents/Developer/Toolchains/XcodeDefault.xctoolchain/usr/lib/swift/host/plugins -plugin-path /Applications/Xcode-16.1.0.app/Contents/Developer/Toolchains/XcodeDefault.xctoolchain/usr/local/lib/swift/host/plugins -emit-module-doc-path /Users/admin/builder/spi-builder-workspace/.derivedData/Build/Intermediates.noindex/DCSettings.build/Debug-watchos/DCSettings.build/Objects-normal/arm64_32/DCSettings.swiftdoc -emit-module-source-info-path /Users/admin/builder/spi-builder-workspace/.derivedData/Build/Intermediates.noindex/DCSettings.build/Debug-watchos/DCSettings.build/Objects-normal/arm64_32/DCSettings.swiftsourceinfo -emit-objc-header-path /Users/admin/builder/spi-builder-workspace/.derivedData/Build/Intermediates.noindex/DCSettings.build/Debug-watchos/DCSettings.build/Objects-normal/arm64_32/DCSettings-Swift.h -serialize-diagnostics-path /Users/admin/builder/spi-builder-workspace/.derivedData/Build/Intermediates.noindex/DCSettings.build/Debug-watchos/DCSettings.build/Objects-normal/arm64_32/DCSettings-master-emit-module.dia -emit-dependencies-path /Users/admin/builder/spi-builder-workspace/.derivedData/Build/Intermediates.noindex/DCSettings.build/Debug-watchos/DCSettings.build/Objects-normal/arm64_32/DCSettings-master-emit-module.d -o /Users/admin/builder/spi-builder-workspace/.derivedData/Build/Intermediates.noindex/DCSettings.build/Debug-watchos/DCSettings.build/Objects-normal/arm64_32/DCSettings.swiftmodule -emit-abi-descriptor-path /Users/admin/builder/spi-builder-workspace/.derivedData/Build/Intermediates.noindex/DCSettings.build/Debug-watchos/DCSettings.build/Objects-normal/arm64_32/DCSettings.abi.json
EmitSwiftModule normal arm64_32 (in target 'DCSettings' from project 'DCSettings')
    cd /Users/admin/builder/spi-builder-workspace/.swiftpm/xcode
    /Applications/Xcode-16.1.0.app/Contents/Developer/Toolchains/XcodeDefault.xctoolchain/usr/bin/swift-frontend -emit-module -experimental-skip-non-inlinable-function-bodies-without-types /Users/admin/builder/spi-builder-workspace/Sources/DCSettings/Extensions/Collection+Extended.swift /Users/admin/builder/spi-builder-workspace/Sources/DCSettings/Extensions/Color+Codable.swift /Users/admin/builder/spi-builder-workspace/Sources/DCSettings/Extensions/DCKeyRepresentableConformances.swift /Users/admin/builder/spi-builder-workspace/Sources/DCSettings/Extensions/NSUbiquitousKeyValueStore+DCKeyValueStore.swift /Users/admin/builder/spi-builder-workspace/Sources/DCSettings/Extensions/String+Extended.swift /Users/admin/builder/spi-builder-workspace/Sources/DCSettings/Extensions/Text+MonospacedDigit.swift /Users/admin/builder/spi-builder-workspace/Sources/DCSettings/Extensions/UserDefaults+DCKeyValueStore.swift /Users/admin/builder/spi-builder-workspace/Sources/DCSettings/Settings/DCKeyRepresentable.swift /Users/admin/builder/spi-builder-workspace/Sources/DCSettings/Settings/DCSetting.swift /Users/admin/builder/spi-builder-workspace/Sources/DCSettings/Settings/DCSettingConfiguration.swift /Users/admin/builder/spi-builder-workspace/Sources/DCSettings/Settings/DCSettingGroup.swift /Users/admin/builder/spi-builder-workspace/Sources/DCSettings/Settings/DCSettingOption.swift /Users/admin/builder/spi-builder-workspace/Sources/DCSettings/Settings/DCSettingsManager.swift /Users/admin/builder/spi-builder-workspace/Sources/DCSettings/Settings/DCStoredRepresentedValue.swift /Users/admin/builder/spi-builder-workspace/Sources/DCSettings/Settings/DCStoredValue.swift /Users/admin/builder/spi-builder-workspace/Sources/DCSettings/Settings/DCValueBounds.swift /Users/admin/builder/spi-builder-workspace/Sources/DCSettings/Store/DCKeyValueStore.swift /Users/admin/builder/spi-builder-workspace/Sources/DCSettings/Store/DCSettingStore.swift /Users/admin/builder/spi-builder-workspace/Sources/DCSettings/Views/DCSettingView.swift /Users/admin/builder/spi-builder-workspace/Sources/DCSettings/Views/DCSettingViewProviding.swift /Users/admin/builder/spi-builder-workspace/Sources/DCSettings/Views/DCSettingsView.swift -target arm64_32-apple-watchos6.0 -enable-objc-interop -sdk /Applications/Xcode-16.1.0.app/Contents/Developer/Platforms/WatchOS.platform/Developer/SDKs/WatchOS11.1.sdk -I /Users/admin/builder/spi-builder-workspace/.derivedData/Build/Products/Debug-watchos -I /Applications/Xcode-16.1.0.app/Contents/Developer/Platforms/WatchOS.platform/Developer/usr/lib -F /Users/admin/builder/spi-builder-workspace/.derivedData/Build/Products/Debug-watchos -F /Applications/Xcode-16.1.0.app/Contents/Developer/Platforms/WatchOS.platform/Developer/Library/Frameworks -F /Applications/Xcode-16.1.0.app/Contents/Developer/Platforms/WatchOS.platform/Developer/SDKs/WatchOS11.1.sdk/Developer/Library/Frameworks -no-color-diagnostics -enable-testing -g -debug-info-format\=dwarf -dwarf-version\=4 -module-cache-path /Users/admin/builder/spi-builder-workspace/.derivedData/ModuleCache.noindex -profile-generate -profile-coverage-mapping -swift-version 5 -enforce-exclusivity\=checked -stats-output-dir /Users/admin/builder/spi-builder-workspace/.swiftpm/xcode/.stats -Onone -D SWIFT_PACKAGE -D DEBUG -serialize-debugging-options -const-gather-protocols-file /Users/admin/builder/spi-builder-workspace/.derivedData/Build/Intermediates.noindex/DCSettings.build/Debug-watchos/DCSettings.build/Objects-normal/arm64_32/DCSettings_const_extract_protocols.json -enable-experimental-feature DebugDescriptionMacro -enable-experimental-feature OpaqueTypeErasure -enable-upcoming-feature StrictConcurrency -enable-upcoming-feature DisableOutwardActorInference -enable-upcoming-feature GlobalActorIsolatedTypesUsability -enable-upcoming-feature InferSendableFromCaptures -strict-concurrency\=complete -empty-abi-descriptor -plugin-path /Applications/Xcode-16.1.0.app/Contents/Developer/Toolchains/XcodeDefault.xctoolchain/usr/lib/swift/host/plugins/testing -validate-clang-modules-once -clang-build-session-file /Users/admin/builder/spi-builder-workspace/.derivedData/ModuleCache.noindex/Session.modulevalidation -Xcc -working-directory -Xcc /Users/admin/builder/spi-builder-workspace/.swiftpm/xcode -resource-dir /Applications/Xcode-16.1.0.app/Contents/Developer/Toolchains/XcodeDefault.xctoolchain/usr/lib/swift -enable-anonymous-context-mangled-names -file-compilation-dir /Users/admin/builder/spi-builder-workspace/.swiftpm/xcode -Xcc -D_LIBCPP_HARDENING_MODE\=_LIBCPP_HARDENING_MODE_DEBUG -Xcc -ivfsstatcache -Xcc /Users/admin/builder/spi-builder-workspace/.derivedData/SDKStatCaches.noindex/watchos11.1-22R574-7b9df0bda16bb4641b33636c68f04660.sdkstatcache -Xcc -I/Users/admin/builder/spi-builder-workspace/.derivedData/Build/Intermediates.noindex/DCSettings.build/Debug-watchos/DCSettings.build/swift-overrides.hmap -Xcc -I/Users/admin/builder/spi-builder-workspace/.derivedData/Build/Products/Debug-watchos/include -Xcc -I/Users/admin/builder/spi-builder-workspace/.derivedData/Build/Intermediates.noindex/DCSettings.build/Debug-watchos/DCSettings.build/DerivedSources-normal/arm64_32 -Xcc -I/Users/admin/builder/spi-builder-workspace/.derivedData/Build/Intermediates.noindex/DCSettings.build/Debug-watchos/DCSettings.build/DerivedSources/arm64_32 -Xcc -I/Users/admin/builder/spi-builder-workspace/.derivedData/Build/Intermediates.noindex/DCSettings.build/Debug-watchos/DCSettings.build/DerivedSources -Xcc -DSWIFT_PACKAGE -Xcc -DDEBUG\=1 -module-name DCSettings -package-name spi_builder_workspace -frontend-parseable-output -disable-clang-spi -target-sdk-version 11.1 -target-sdk-name watchos11.1 -external-plugin-path /Applications/Xcode-16.1.0.app/Contents/Developer/Platforms/WatchOS.platform/Developer/usr/lib/swift/host/plugins\#/Applications/Xcode-16.1.0.app/Contents/Developer/Platforms/WatchOS.platform/Developer/usr/bin/swift-plugin-server -external-plugin-path /Applications/Xcode-16.1.0.app/Contents/Developer/Platforms/WatchOS.platform/Developer/usr/local/lib/swift/host/plugins\#/Applications/Xcode-16.1.0.app/Contents/Developer/Platforms/WatchOS.platform/Developer/usr/bin/swift-plugin-server -plugin-path /Applications/Xcode-16.1.0.app/Contents/Developer/Toolchains/XcodeDefault.xctoolchain/usr/lib/swift/host/plugins -plugin-path /Applications/Xcode-16.1.0.app/Contents/Developer/Toolchains/XcodeDefault.xctoolchain/usr/local/lib/swift/host/plugins -emit-module-doc-path /Users/admin/builder/spi-builder-workspace/.derivedData/Build/Intermediates.noindex/DCSettings.build/Debug-watchos/DCSettings.build/Objects-normal/arm64_32/DCSettings.swiftdoc -emit-module-source-info-path /Users/admin/builder/spi-builder-workspace/.derivedData/Build/Intermediates.noindex/DCSettings.build/Debug-watchos/DCSettings.build/Objects-normal/arm64_32/DCSettings.swiftsourceinfo -emit-objc-header-path /Users/admin/builder/spi-builder-workspace/.derivedData/Build/Intermediates.noindex/DCSettings.build/Debug-watchos/DCSettings.build/Objects-normal/arm64_32/DCSettings-Swift.h -serialize-diagnostics-path /Users/admin/builder/spi-builder-workspace/.derivedData/Build/Intermediates.noindex/DCSettings.build/Debug-watchos/DCSettings.build/Objects-normal/arm64_32/DCSettings-master-emit-module.dia -emit-dependencies-path /Users/admin/builder/spi-builder-workspace/.derivedData/Build/Intermediates.noindex/DCSettings.build/Debug-watchos/DCSettings.build/Objects-normal/arm64_32/DCSettings-master-emit-module.d -o /Users/admin/builder/spi-builder-workspace/.derivedData/Build/Intermediates.noindex/DCSettings.build/Debug-watchos/DCSettings.build/Objects-normal/arm64_32/DCSettings.swiftmodule -emit-abi-descriptor-path /Users/admin/builder/spi-builder-workspace/.derivedData/Build/Intermediates.noindex/DCSettings.build/Debug-watchos/DCSettings.build/Objects-normal/arm64_32/DCSettings.abi.json
/Users/admin/builder/spi-builder-workspace/Sources/DCSettings/Settings/DCSettingsManager.swift:37:23: warning: static property 'shared' is not concurrency-safe because non-'Sendable' type 'DCSettingsManager' may have shared mutable state; this is an error in the Swift 6 language mode
    public static let shared = DCSettingsManager()
                      ^
/Users/admin/builder/spi-builder-workspace/Sources/DCSettings/Settings/DCSettingsManager.swift:34:14: note: class 'DCSettingsManager' does not conform to the 'Sendable' protocol
public class DCSettingsManager {
             ^
/Users/admin/builder/spi-builder-workspace/Sources/DCSettings/Settings/DCSettingsManager.swift:37:23: note: annotate 'shared' with '@MainActor' if property should only be accessed from the main actor
    public static let shared = DCSettingsManager()
                      ^
    @MainActor
/Users/admin/builder/spi-builder-workspace/Sources/DCSettings/Settings/DCSettingsManager.swift:37:23: note: disable concurrency-safety checks if accesses are protected by an external synchronization mechanism
    public static let shared = DCSettingsManager()
                      ^
    nonisolated(unsafe)
/Users/admin/builder/spi-builder-workspace/Sources/DCSettings/Views/DCSettingsView.swift:62:159: error: 'InsetGroupedListStyle' is unavailable in watchOS
        public init(settingsManager: DCSettingsManager = .shared, filter: Filter? = nil, contentProvider: Provider? = DCDefaultViewProvider(), listStyle: S = InsetGroupedListStyle()) {
                                                                                                                                                              ^~~~~~~~~~~~~~~~~~~~~
SwiftUI.InsetGroupedListStyle:5:15: note: 'InsetGroupedListStyle' has been explicitly marked unavailable here
public struct InsetGroupedListStyle : ListStyle {
              ^
SwiftEmitModule normal armv7k Emitting\ module\ for\ DCSettings (in target 'DCSettings' from project 'DCSettings')
    cd /Users/admin/builder/spi-builder-workspace/.swiftpm/xcode
    builtin-swiftTaskExecution -- /Applications/Xcode-16.1.0.app/Contents/Developer/Toolchains/XcodeDefault.xctoolchain/usr/bin/swift-frontend -frontend -emit-module -experimental-skip-non-inlinable-function-bodies-without-types /Users/admin/builder/spi-builder-workspace/Sources/DCSettings/Extensions/Collection+Extended.swift /Users/admin/builder/spi-builder-workspace/Sources/DCSettings/Extensions/Color+Codable.swift /Users/admin/builder/spi-builder-workspace/Sources/DCSettings/Extensions/DCKeyRepresentableConformances.swift /Users/admin/builder/spi-builder-workspace/Sources/DCSettings/Extensions/NSUbiquitousKeyValueStore+DCKeyValueStore.swift /Users/admin/builder/spi-builder-workspace/Sources/DCSettings/Extensions/String+Extended.swift /Users/admin/builder/spi-builder-workspace/Sources/DCSettings/Extensions/Text+MonospacedDigit.swift /Users/admin/builder/spi-builder-workspace/Sources/DCSettings/Extensions/UserDefaults+DCKeyValueStore.swift /Users/admin/builder/spi-builder-workspace/Sources/DCSettings/Settings/DCKeyRepresentable.swift /Users/admin/builder/spi-builder-workspace/Sources/DCSettings/Settings/DCSetting.swift /Users/admin/builder/spi-builder-workspace/Sources/DCSettings/Settings/DCSettingConfiguration.swift /Users/admin/builder/spi-builder-workspace/Sources/DCSettings/Settings/DCSettingGroup.swift /Users/admin/builder/spi-builder-workspace/Sources/DCSettings/Settings/DCSettingOption.swift /Users/admin/builder/spi-builder-workspace/Sources/DCSettings/Settings/DCSettingsManager.swift /Users/admin/builder/spi-builder-workspace/Sources/DCSettings/Settings/DCStoredRepresentedValue.swift /Users/admin/builder/spi-builder-workspace/Sources/DCSettings/Settings/DCStoredValue.swift /Users/admin/builder/spi-builder-workspace/Sources/DCSettings/Settings/DCValueBounds.swift /Users/admin/builder/spi-builder-workspace/Sources/DCSettings/Store/DCKeyValueStore.swift /Users/admin/builder/spi-builder-workspace/Sources/DCSettings/Store/DCSettingStore.swift /Users/admin/builder/spi-builder-workspace/Sources/DCSettings/Views/DCSettingView.swift /Users/admin/builder/spi-builder-workspace/Sources/DCSettings/Views/DCSettingViewProviding.swift /Users/admin/builder/spi-builder-workspace/Sources/DCSettings/Views/DCSettingsView.swift -target armv7k-apple-watchos6.0 -enable-objc-interop -stack-check -sdk /Applications/Xcode-16.1.0.app/Contents/Developer/Platforms/WatchOS.platform/Developer/SDKs/WatchOS11.1.sdk -I /Users/admin/builder/spi-builder-workspace/.derivedData/Build/Products/Debug-watchos -I /Applications/Xcode-16.1.0.app/Contents/Developer/Platforms/WatchOS.platform/Developer/usr/lib -F /Users/admin/builder/spi-builder-workspace/.derivedData/Build/Products/Debug-watchos -F /Applications/Xcode-16.1.0.app/Contents/Developer/Platforms/WatchOS.platform/Developer/Library/Frameworks -F /Applications/Xcode-16.1.0.app/Contents/Developer/Platforms/WatchOS.platform/Developer/SDKs/WatchOS11.1.sdk/Developer/Library/Frameworks -no-color-diagnostics -enable-testing -g -debug-info-format\=dwarf -dwarf-version\=4 -module-cache-path /Users/admin/builder/spi-builder-workspace/.derivedData/ModuleCache.noindex -profile-generate -profile-coverage-mapping -swift-version 5 -enforce-exclusivity\=checked -stats-output-dir /Users/admin/builder/spi-builder-workspace/.swiftpm/xcode/.stats -Onone -D SWIFT_PACKAGE -D DEBUG -serialize-debugging-options -const-gather-protocols-file /Users/admin/builder/spi-builder-workspace/.derivedData/Build/Intermediates.noindex/DCSettings.build/Debug-watchos/DCSettings.build/Objects-normal/armv7k/DCSettings_const_extract_protocols.json -enable-experimental-feature DebugDescriptionMacro -enable-experimental-feature OpaqueTypeErasure -enable-upcoming-feature StrictConcurrency -enable-upcoming-feature DisableOutwardActorInference -enable-upcoming-feature GlobalActorIsolatedTypesUsability -enable-upcoming-feature InferSendableFromCaptures -strict-concurrency\=complete -empty-abi-descriptor -plugin-path /Applications/Xcode-16.1.0.app/Contents/Developer/Toolchains/XcodeDefault.xctoolchain/usr/lib/swift/host/plugins/testing -validate-clang-modules-once -clang-build-session-file /Users/admin/builder/spi-builder-workspace/.derivedData/ModuleCache.noindex/Session.modulevalidation -Xcc -working-directory -Xcc /Users/admin/builder/spi-builder-workspace/.swiftpm/xcode -resource-dir /Applications/Xcode-16.1.0.app/Contents/Developer/Toolchains/XcodeDefault.xctoolchain/usr/lib/swift -enable-anonymous-context-mangled-names -file-compilation-dir /Users/admin/builder/spi-builder-workspace/.swiftpm/xcode -Xcc -D_LIBCPP_HARDENING_MODE\=_LIBCPP_HARDENING_MODE_DEBUG -Xcc -ivfsstatcache -Xcc /Users/admin/builder/spi-builder-workspace/.derivedData/SDKStatCaches.noindex/watchos11.1-22R574-7b9df0bda16bb4641b33636c68f04660.sdkstatcache -Xcc -I/Users/admin/builder/spi-builder-workspace/.derivedData/Build/Intermediates.noindex/DCSettings.build/Debug-watchos/DCSettings.build/swift-overrides.hmap -Xcc -I/Users/admin/builder/spi-builder-workspace/.derivedData/Build/Products/Debug-watchos/include -Xcc -I/Users/admin/builder/spi-builder-workspace/.derivedData/Build/Intermediates.noindex/DCSettings.build/Debug-watchos/DCSettings.build/DerivedSources-normal/armv7k -Xcc -I/Users/admin/builder/spi-builder-workspace/.derivedData/Build/Intermediates.noindex/DCSettings.build/Debug-watchos/DCSettings.build/DerivedSources/armv7k -Xcc -I/Users/admin/builder/spi-builder-workspace/.derivedData/Build/Intermediates.noindex/DCSettings.build/Debug-watchos/DCSettings.build/DerivedSources -Xcc -DSWIFT_PACKAGE -Xcc -DDEBUG\=1 -module-name DCSettings -package-name spi_builder_workspace -frontend-parseable-output -disable-clang-spi -target-sdk-version 11.1 -target-sdk-name watchos11.1 -external-plugin-path /Applications/Xcode-16.1.0.app/Contents/Developer/Platforms/WatchOS.platform/Developer/usr/lib/swift/host/plugins\#/Applications/Xcode-16.1.0.app/Contents/Developer/Platforms/WatchOS.platform/Developer/usr/bin/swift-plugin-server -external-plugin-path /Applications/Xcode-16.1.0.app/Contents/Developer/Platforms/WatchOS.platform/Developer/usr/local/lib/swift/host/plugins\#/Applications/Xcode-16.1.0.app/Contents/Developer/Platforms/WatchOS.platform/Developer/usr/bin/swift-plugin-server -plugin-path /Applications/Xcode-16.1.0.app/Contents/Developer/Toolchains/XcodeDefault.xctoolchain/usr/lib/swift/host/plugins -plugin-path /Applications/Xcode-16.1.0.app/Contents/Developer/Toolchains/XcodeDefault.xctoolchain/usr/local/lib/swift/host/plugins -emit-module-doc-path /Users/admin/builder/spi-builder-workspace/.derivedData/Build/Intermediates.noindex/DCSettings.build/Debug-watchos/DCSettings.build/Objects-normal/armv7k/DCSettings.swiftdoc -emit-module-source-info-path /Users/admin/builder/spi-builder-workspace/.derivedData/Build/Intermediates.noindex/DCSettings.build/Debug-watchos/DCSettings.build/Objects-normal/armv7k/DCSettings.swiftsourceinfo -emit-objc-header-path /Users/admin/builder/spi-builder-workspace/.derivedData/Build/Intermediates.noindex/DCSettings.build/Debug-watchos/DCSettings.build/Objects-normal/armv7k/DCSettings-Swift.h -serialize-diagnostics-path /Users/admin/builder/spi-builder-workspace/.derivedData/Build/Intermediates.noindex/DCSettings.build/Debug-watchos/DCSettings.build/Objects-normal/armv7k/DCSettings-master-emit-module.dia -emit-dependencies-path /Users/admin/builder/spi-builder-workspace/.derivedData/Build/Intermediates.noindex/DCSettings.build/Debug-watchos/DCSettings.build/Objects-normal/armv7k/DCSettings-master-emit-module.d -o /Users/admin/builder/spi-builder-workspace/.derivedData/Build/Intermediates.noindex/DCSettings.build/Debug-watchos/DCSettings.build/Objects-normal/armv7k/DCSettings.swiftmodule -emit-abi-descriptor-path /Users/admin/builder/spi-builder-workspace/.derivedData/Build/Intermediates.noindex/DCSettings.build/Debug-watchos/DCSettings.build/Objects-normal/armv7k/DCSettings.abi.json
Command SwiftEmitModule failed with a nonzero exit code
** BUILD FAILED **
The following build commands failed:
	SwiftEmitModule normal arm64_32 Emitting\ module\ for\ DCSettings (in target 'DCSettings' from project 'DCSettings')
	EmitSwiftModule normal arm64_32 (in target 'DCSettings' from project 'DCSettings')
	SwiftEmitModule normal armv7k Emitting\ module\ for\ DCSettings (in target 'DCSettings' from project 'DCSettings')
	Building workspace spi-builder-workspace with scheme DCSettings
(4 failures)
BUILD FAILURE 6.0 watchOS