The Swift Package Index logo.Swift Package Index

Track the adoption of Swift 6 strict concurrency checks for data race safety. How many packages are Ready for Swift 6?

Build Information

Failed to build Animatable, reference 0.2.0 (4ba963), with Swift 6.1 for Linux on 28 Apr 2025 21:24:27 UTC.

Build Command

bash -c docker run --pull=always --rm -v "checkouts-4609320-0":/host -w "$PWD" registry.gitlab.com/finestructure/spi-images:basic-6.1-latest swift build --triple x86_64-unknown-linux-gnu 2>&1

Build Log

========================================
RunAll
========================================
Builder version: 4.61.0
Interrupt handler set up.
========================================
Checkout
========================================
Clone URL: https://github.com/c-villain/Animatable.git
Reference: 0.2.0
Initialized empty Git repository in /host/spi-builder-workspace/.git/
hint: Using 'master' as the name for the initial branch. This default branch name
hint: is subject to change. To configure the initial branch name to use in all
hint: of your new repositories, which will suppress this warning, call:
hint:
hint: 	git config --global init.defaultBranch <name>
hint:
hint: Names commonly chosen instead of 'master' are 'main', 'trunk' and
hint: 'development'. The just-created branch can be renamed via this command:
hint:
hint: 	git branch -m <name>
From https://github.com/c-villain/Animatable
 * tag               0.2.0      -> FETCH_HEAD
HEAD is now at 4ba9631 no message
Cloned https://github.com/c-villain/Animatable.git
Revision (git rev-parse @):
4ba96313d4fde8ed5aae65992da42a84bddab5d7
SUCCESS checkout https://github.com/c-villain/Animatable.git at 0.2.0
========================================
Build
========================================
Selected platform:         linux
Swift version:             6.1
Building package at path:  $PWD
https://github.com/c-villain/Animatable.git
https://github.com/c-villain/Animatable.git
WARNING: environment variable SUPPRESS_SWIFT_6_FLAGS is not set
{
  "dependencies" : [
  ],
  "manifest_display_name" : "Animatable",
  "name" : "Animatable",
  "path" : "/host/spi-builder-workspace",
  "platforms" : [
    {
      "name" : "macos",
      "version" : "10.15"
    },
    {
      "name" : "ios",
      "version" : "13.0"
    }
  ],
  "products" : [
    {
      "name" : "Animatable",
      "targets" : [
        "Animatable"
      ],
      "type" : {
        "library" : [
          "automatic"
        ]
      }
    }
  ],
  "targets" : [
    {
      "c99name" : "Animatable",
      "module_type" : "SwiftTarget",
      "name" : "Animatable",
      "path" : "Sources/Animatable",
      "product_memberships" : [
        "Animatable"
      ],
      "sources" : [
        "Animatable.swift",
        "Core/CoveredModifier.swift",
        "Core/ValueChangedModifier.swift",
        "Modifiers/Blinking.swift",
        "Modifiers/Explosion.swift",
        "Modifiers/Fireworks.swift",
        "Modifiers/LiveComments.swift",
        "Modifiers/Rotating.swift",
        "Modifiers/Scaling.swift",
        "Modifiers/Shimmerable.swift",
        "Modifiers/Tweaking.swift"
      ],
      "type" : "library"
    }
  ],
  "tools_version" : "5.3"
}
Running build ...
bash -c docker run --pull=always --rm -v "checkouts-4609320-0":/host -w "$PWD" registry.gitlab.com/finestructure/spi-images:basic-6.1-latest swift build --triple x86_64-unknown-linux-gnu -Xswiftc -Xfrontend -Xswiftc -stats-output-dir -Xswiftc -Xfrontend -Xswiftc .stats -Xswiftc -strict-concurrency=complete -Xswiftc -enable-upcoming-feature -Xswiftc StrictConcurrency -Xswiftc -enable-upcoming-feature -Xswiftc DisableOutwardActorInference -Xswiftc -enable-upcoming-feature -Xswiftc GlobalActorIsolatedTypesUsability -Xswiftc -enable-upcoming-feature -Xswiftc InferSendableFromCaptures 2>&1
basic-6.1-latest: Pulling from finestructure/spi-images
Digest: sha256:3bdcac04179f4ed3e5b8e9dbd6e74bbf5ebc0f4fde48bbaad7d1e5c757e65bcb
Status: Image is up to date for registry.gitlab.com/finestructure/spi-images:basic-6.1-latest
Building for debugging...
[0/2] Write sources
[1/2] Write swift-version-24593BA9C3E375BF.txt
[3/13] Compiling Animatable LiveComments.swift
/host/spi-builder-workspace/Sources/Animatable/Animatable.swift:1:8: error: no such module 'SwiftUI'
 1 | import SwiftUI
   |        `- error: no such module 'SwiftUI'
 2 |
 3 | public enum AnimatableType {
[4/14] Compiling Animatable Explosion.swift
/host/spi-builder-workspace/Sources/Animatable/Animatable.swift:1:8: error: no such module 'SwiftUI'
 1 | import SwiftUI
   |        `- error: no such module 'SwiftUI'
 2 |
 3 | public enum AnimatableType {
[5/14] Compiling Animatable Fireworks.swift
/host/spi-builder-workspace/Sources/Animatable/Animatable.swift:1:8: error: no such module 'SwiftUI'
 1 | import SwiftUI
   |        `- error: no such module 'SwiftUI'
 2 |
 3 | public enum AnimatableType {
[6/14] Compiling Animatable Tweaking.swift
/host/spi-builder-workspace/Sources/Animatable/Animatable.swift:1:8: error: no such module 'SwiftUI'
 1 | import SwiftUI
   |        `- error: no such module 'SwiftUI'
 2 |
 3 | public enum AnimatableType {
[7/14] Compiling Animatable Rotating.swift
/host/spi-builder-workspace/Sources/Animatable/Animatable.swift:1:8: error: no such module 'SwiftUI'
 1 | import SwiftUI
   |        `- error: no such module 'SwiftUI'
 2 |
 3 | public enum AnimatableType {
[8/14] Compiling Animatable Shimmerable.swift
/host/spi-builder-workspace/Sources/Animatable/Animatable.swift:1:8: error: no such module 'SwiftUI'
 1 | import SwiftUI
   |        `- error: no such module 'SwiftUI'
 2 |
 3 | public enum AnimatableType {
[9/14] Compiling Animatable Scaling.swift
/host/spi-builder-workspace/Sources/Animatable/Animatable.swift:1:8: error: no such module 'SwiftUI'
 1 | import SwiftUI
   |        `- error: no such module 'SwiftUI'
 2 |
 3 | public enum AnimatableType {
error: emit-module command failed with exit code 1 (use -v to see invocation)
[10/14] Emitting module Animatable
/host/spi-builder-workspace/Sources/Animatable/Animatable.swift:1:8: error: no such module 'SwiftUI'
 1 | import SwiftUI
   |        `- error: no such module 'SwiftUI'
 2 |
 3 | public enum AnimatableType {
[11/14] Compiling Animatable Animatable.swift
/host/spi-builder-workspace/Sources/Animatable/Animatable.swift:1:8: error: no such module 'SwiftUI'
 1 | import SwiftUI
   |        `- error: no such module 'SwiftUI'
 2 |
 3 | public enum AnimatableType {
[12/14] Compiling Animatable CoveredModifier.swift
/host/spi-builder-workspace/Sources/Animatable/Animatable.swift:1:8: error: no such module 'SwiftUI'
 1 | import SwiftUI
   |        `- error: no such module 'SwiftUI'
 2 |
 3 | public enum AnimatableType {
[13/14] Compiling Animatable ValueChangedModifier.swift
/host/spi-builder-workspace/Sources/Animatable/Animatable.swift:1:8: error: no such module 'SwiftUI'
 1 | import SwiftUI
   |        `- error: no such module 'SwiftUI'
 2 |
 3 | public enum AnimatableType {
[14/14] Compiling Animatable Blinking.swift
/host/spi-builder-workspace/Sources/Animatable/Animatable.swift:1:8: error: no such module 'SwiftUI'
 1 | import SwiftUI
   |        `- error: no such module 'SwiftUI'
 2 |
 3 | public enum AnimatableType {
Running build ...
bash -c docker run --pull=always --rm -v "checkouts-4609320-0":/host -w "$PWD" registry.gitlab.com/finestructure/spi-images:basic-6.1-latest swift build --triple x86_64-unknown-linux-gnu 2>&1
basic-6.1-latest: Pulling from finestructure/spi-images
Digest: sha256:3bdcac04179f4ed3e5b8e9dbd6e74bbf5ebc0f4fde48bbaad7d1e5c757e65bcb
Status: Image is up to date for registry.gitlab.com/finestructure/spi-images:basic-6.1-latest
[0/1] Planning build
Building for debugging...
[0/1] Write swift-version-24593BA9C3E375BF.txt
[2/12] Compiling Animatable Rotating.swift
/host/spi-builder-workspace/Sources/Animatable/Animatable.swift:1:8: error: no such module 'SwiftUI'
 1 | import SwiftUI
   |        `- error: no such module 'SwiftUI'
 2 |
 3 | public enum AnimatableType {
[3/13] Compiling Animatable LiveComments.swift
/host/spi-builder-workspace/Sources/Animatable/Animatable.swift:1:8: error: no such module 'SwiftUI'
 1 | import SwiftUI
   |        `- error: no such module 'SwiftUI'
 2 |
 3 | public enum AnimatableType {
[4/13] Compiling Animatable Scaling.swift
/host/spi-builder-workspace/Sources/Animatable/Animatable.swift:1:8: error: no such module 'SwiftUI'
 1 | import SwiftUI
   |        `- error: no such module 'SwiftUI'
 2 |
 3 | public enum AnimatableType {
[5/13] Compiling Animatable Shimmerable.swift
/host/spi-builder-workspace/Sources/Animatable/Animatable.swift:1:8: error: no such module 'SwiftUI'
 1 | import SwiftUI
   |        `- error: no such module 'SwiftUI'
 2 |
 3 | public enum AnimatableType {
error: emit-module command failed with exit code 1 (use -v to see invocation)
[6/13] Emitting module Animatable
/host/spi-builder-workspace/Sources/Animatable/Animatable.swift:1:8: error: no such module 'SwiftUI'
 1 | import SwiftUI
   |        `- error: no such module 'SwiftUI'
 2 |
 3 | public enum AnimatableType {
[7/13] Compiling Animatable ValueChangedModifier.swift
/host/spi-builder-workspace/Sources/Animatable/Animatable.swift:1:8: error: no such module 'SwiftUI'
 1 | import SwiftUI
   |        `- error: no such module 'SwiftUI'
 2 |
 3 | public enum AnimatableType {
[8/13] Compiling Animatable Blinking.swift
/host/spi-builder-workspace/Sources/Animatable/Animatable.swift:1:8: error: no such module 'SwiftUI'
 1 | import SwiftUI
   |        `- error: no such module 'SwiftUI'
 2 |
 3 | public enum AnimatableType {
[9/13] Compiling Animatable Explosion.swift
/host/spi-builder-workspace/Sources/Animatable/Animatable.swift:1:8: error: no such module 'SwiftUI'
 1 | import SwiftUI
   |        `- error: no such module 'SwiftUI'
 2 |
 3 | public enum AnimatableType {
[10/13] Compiling Animatable Fireworks.swift
/host/spi-builder-workspace/Sources/Animatable/Animatable.swift:1:8: error: no such module 'SwiftUI'
 1 | import SwiftUI
   |        `- error: no such module 'SwiftUI'
 2 |
 3 | public enum AnimatableType {
[11/13] Compiling Animatable Animatable.swift
/host/spi-builder-workspace/Sources/Animatable/Animatable.swift:1:8: error: no such module 'SwiftUI'
 1 | import SwiftUI
   |        `- error: no such module 'SwiftUI'
 2 |
 3 | public enum AnimatableType {
[12/13] Compiling Animatable CoveredModifier.swift
/host/spi-builder-workspace/Sources/Animatable/Animatable.swift:1:8: error: no such module 'SwiftUI'
 1 | import SwiftUI
   |        `- error: no such module 'SwiftUI'
 2 |
 3 | public enum AnimatableType {
[13/13] Compiling Animatable Tweaking.swift
/host/spi-builder-workspace/Sources/Animatable/Animatable.swift:1:8: error: no such module 'SwiftUI'
 1 | import SwiftUI
   |        `- error: no such module 'SwiftUI'
 2 |
 3 | public enum AnimatableType {
BUILD FAILURE 6.1 linux