The Swift Package Index logo.Swift Package Index

Track the adoption of Swift 6 strict concurrency checks for data race safety. How many packages are Ready for Swift 6?

Build Information

Failed to build VisualEffectView, reference 5.0.0 (0bf63a), with Swift 6.1 for watchOS using Xcode 16.3 on 29 Apr 2025 06:21:09 UTC.

Build Command

env DEVELOPER_DIR=/Applications/Xcode-16.3.0.app xcrun xcodebuild -IDEClonedSourcePackagesDirPathOverride=$PWD/.dependencies -skipMacroValidation -skipPackagePluginValidation -derivedDataPath $PWD/.derivedData build -scheme VisualEffectView -destination generic/platform=watchOS

Build Log

========================================
RunAll
========================================
Builder version: 4.61.0
Interrupt handler set up.
========================================
Checkout
========================================
Clone URL: https://github.com/efremidze/VisualEffectView.git
Reference: 5.0.0
Initialized empty Git repository in /Users/admin/builder/spi-builder-workspace/.git/
From https://github.com/efremidze/VisualEffectView
 * tag               5.0.0      -> FETCH_HEAD
HEAD is now at 0bf63a6 5.0.0 (#44)
Cloned https://github.com/efremidze/VisualEffectView.git
Revision (git rev-parse @):
0bf63a6851b5535c6d9fa61e1bf9aa4ac329b82a
SUCCESS checkout https://github.com/efremidze/VisualEffectView.git at 5.0.0
========================================
Build
========================================
Selected platform:         watchOS
Swift version:             6.1
Building package at path:  $PWD
https://github.com/efremidze/VisualEffectView.git
https://github.com/efremidze/VisualEffectView.git
{
  "dependencies" : [
  ],
  "manifest_display_name" : "VisualEffectView",
  "name" : "VisualEffectView",
  "path" : "/Users/admin/builder/spi-builder-workspace",
  "platforms" : [
    {
      "name" : "ios",
      "version" : "9.0"
    }
  ],
  "products" : [
    {
      "name" : "VisualEffectView",
      "targets" : [
        "VisualEffectView"
      ],
      "type" : {
        "library" : [
          "automatic"
        ]
      }
    }
  ],
  "targets" : [
    {
      "c99name" : "VisualEffectView",
      "module_type" : "SwiftTarget",
      "name" : "VisualEffectView",
      "path" : "Sources",
      "product_memberships" : [
        "VisualEffectView"
      ],
      "sources" : [
        "UIViewEffectView+Helpers.swift",
        "VisualEffectView+SwiftUI.swift",
        "VisualEffectView.swift"
      ],
      "type" : "library"
    }
  ],
  "tools_version" : "5.0"
}
Command line invocation:
    /Applications/Xcode-16.3.0.app/Contents/Developer/usr/bin/xcodebuild -IDEClonedSourcePackagesDirPathOverride=/Users/admin/builder/spi-builder-workspace/.dependencies -resolvePackageDependencies
resolved source packages:
{
  "dependencies" : [
  ],
  "manifest_display_name" : "VisualEffectView",
  "name" : "VisualEffectView",
  "path" : "/Users/admin/builder/spi-builder-workspace",
  "platforms" : [
    {
      "name" : "ios",
      "version" : "9.0"
    }
  ],
  "products" : [
    {
      "name" : "VisualEffectView",
      "targets" : [
        "VisualEffectView"
      ],
      "type" : {
        "library" : [
          "automatic"
        ]
      }
    }
  ],
  "targets" : [
    {
      "c99name" : "VisualEffectView",
      "module_type" : "SwiftTarget",
      "name" : "VisualEffectView",
      "path" : "Sources",
      "product_memberships" : [
        "VisualEffectView"
      ],
      "sources" : [
        "UIViewEffectView+Helpers.swift",
        "VisualEffectView+SwiftUI.swift",
        "VisualEffectView.swift"
      ],
      "type" : "library"
    }
  ],
  "tools_version" : "5.0"
}
{
  "project" : {
    "configurations" : [
      "Debug",
      "Release"
    ],
    "name" : "VisualEffectView",
    "schemes" : [
      "Example",
      "VisualEffectView"
    ],
    "targets" : [
      "VisualEffectView",
      "Example"
    ]
  }
}
{
  "workspace" : {
    "name" : "spi-builder-workspace",
    "schemes" : [
      "VisualEffectView"
    ]
  }
}
Running build ...
env DEVELOPER_DIR=/Applications/Xcode-16.3.0.app xcrun xcodebuild -IDEClonedSourcePackagesDirPathOverride=$PWD/.dependencies -skipMacroValidation -skipPackagePluginValidation -derivedDataPath $PWD/.derivedData build -scheme VisualEffectView -destination generic/platform=watchOS OTHER_SWIFT_FLAGS=-stats-output-dir .stats -strict-concurrency=complete -enable-upcoming-feature StrictConcurrency -enable-upcoming-feature DisableOutwardActorInference -enable-upcoming-feature GlobalActorIsolatedTypesUsability -enable-upcoming-feature InferSendableFromCaptures
Command line invocation:
    /Applications/Xcode-16.3.0.app/Contents/Developer/usr/bin/xcodebuild -IDEClonedSourcePackagesDirPathOverride=/Users/admin/builder/spi-builder-workspace/.dependencies -skipMacroValidation -skipPackagePluginValidation -derivedDataPath /Users/admin/builder/spi-builder-workspace/.derivedData build -scheme VisualEffectView -destination generic/platform=watchOS "OTHER_SWIFT_FLAGS=-stats-output-dir .stats -strict-concurrency=complete -enable-upcoming-feature StrictConcurrency -enable-upcoming-feature DisableOutwardActorInference -enable-upcoming-feature GlobalActorIsolatedTypesUsability -enable-upcoming-feature InferSendableFromCaptures"
Build settings from command line:
    OTHER_SWIFT_FLAGS = -stats-output-dir .stats -strict-concurrency=complete -enable-upcoming-feature StrictConcurrency -enable-upcoming-feature DisableOutwardActorInference -enable-upcoming-feature GlobalActorIsolatedTypesUsability -enable-upcoming-feature InferSendableFromCaptures
Resolve Package Graph
Resolved source packages:
  VisualEffectView: /Users/admin/builder/spi-builder-workspace
ComputePackagePrebuildTargetDependencyGraph
Prepare packages
CreateBuildRequest
SendProjectDescription
CreateBuildOperation
ComputeTargetDependencyGraph
note: Building targets in dependency order
note: Target dependency graph (2 targets)
    Target 'VisualEffectView' in project 'VisualEffectView'
        ➜ Explicit dependency on target 'VisualEffectView' in project 'VisualEffectView'
    Target 'VisualEffectView' in project 'VisualEffectView' (no dependencies)
GatherProvisioningInputs
CreateBuildDescription
ExecuteExternalTool /Applications/Xcode-16.3.0.app/Contents/Developer/Toolchains/XcodeDefault.xctoolchain/usr/bin/clang -v -E -dM -isysroot /Applications/Xcode-16.3.0.app/Contents/Developer/Platforms/WatchOS.platform/Developer/SDKs/WatchOS11.4.sdk -x c -c /dev/null
ExecuteExternalTool /Applications/Xcode-16.3.0.app/Contents/Developer/Toolchains/XcodeDefault.xctoolchain/usr/bin/swiftc --version
ExecuteExternalTool /Applications/Xcode-16.3.0.app/Contents/Developer/Toolchains/XcodeDefault.xctoolchain/usr/bin/ld -version_details
Build description signature: 85e97956ca77d58197d4cbb497795c18
Build description path: /Users/admin/builder/spi-builder-workspace/.derivedData/Build/Intermediates.noindex/XCBuildData/85e97956ca77d58197d4cbb497795c18.xcbuilddata
CreateBuildDirectory /Users/admin/builder/spi-builder-workspace/.derivedData/Build/Products
    cd /Users/admin/builder/spi-builder-workspace/.swiftpm/xcode
    builtin-create-build-directory /Users/admin/builder/spi-builder-workspace/.derivedData/Build/Products
CreateBuildDirectory /Users/admin/builder/spi-builder-workspace/.derivedData/Build/Intermediates.noindex
    cd /Users/admin/builder/spi-builder-workspace/.swiftpm/xcode
    builtin-create-build-directory /Users/admin/builder/spi-builder-workspace/.derivedData/Build/Intermediates.noindex
ClangStatCache /Applications/Xcode-16.3.0.app/Contents/Developer/Toolchains/XcodeDefault.xctoolchain/usr/bin/clang-stat-cache /Applications/Xcode-16.3.0.app/Contents/Developer/Platforms/WatchOS.platform/Developer/SDKs/WatchOS11.4.sdk /Users/admin/builder/spi-builder-workspace/.derivedData/SDKStatCaches.noindex/watchos11.4-22T246-43efb940ff07ba2497b70ec94253f576.sdkstatcache
    cd /Users/admin/builder/spi-builder-workspace/.swiftpm/xcode
    /Applications/Xcode-16.3.0.app/Contents/Developer/Toolchains/XcodeDefault.xctoolchain/usr/bin/clang-stat-cache /Applications/Xcode-16.3.0.app/Contents/Developer/Platforms/WatchOS.platform/Developer/SDKs/WatchOS11.4.sdk -o /Users/admin/builder/spi-builder-workspace/.derivedData/SDKStatCaches.noindex/watchos11.4-22T246-43efb940ff07ba2497b70ec94253f576.sdkstatcache
CreateBuildDirectory /Users/admin/builder/spi-builder-workspace/.derivedData/Build/Products/Debug-watchos
    cd /Users/admin/builder/spi-builder-workspace/.swiftpm/xcode
    builtin-create-build-directory /Users/admin/builder/spi-builder-workspace/.derivedData/Build/Products/Debug-watchos
CreateBuildDirectory /Users/admin/builder/spi-builder-workspace/.derivedData/Build/Intermediates.noindex/EagerLinkingTBDs/Debug-watchos
    cd /Users/admin/builder/spi-builder-workspace/.swiftpm/xcode
    builtin-create-build-directory /Users/admin/builder/spi-builder-workspace/.derivedData/Build/Intermediates.noindex/EagerLinkingTBDs/Debug-watchos
CreateBuildDirectory /Users/admin/builder/spi-builder-workspace/.derivedData/Build/Products/Debug-watchos/PackageFrameworks
    cd /Users/admin/builder/spi-builder-workspace/.swiftpm/xcode
    builtin-create-build-directory /Users/admin/builder/spi-builder-workspace/.derivedData/Build/Products/Debug-watchos/PackageFrameworks
WriteAuxiliaryFile /Users/admin/builder/spi-builder-workspace/.derivedData/Build/Intermediates.noindex/VisualEffectView.build/Debug-watchos/VisualEffectView.build/VisualEffectView.modulemap (in target 'VisualEffectView' from project 'VisualEffectView')
    cd /Users/admin/builder/spi-builder-workspace
    write-file /Users/admin/builder/spi-builder-workspace/.derivedData/Build/Intermediates.noindex/VisualEffectView.build/Debug-watchos/VisualEffectView.build/VisualEffectView.modulemap
WriteAuxiliaryFile /Users/admin/builder/spi-builder-workspace/.derivedData/Build/Intermediates.noindex/VisualEffectView.build/Debug-watchos/VisualEffectView.build/VisualEffectView.DependencyStaticMetadataFileList (in target 'VisualEffectView' from project 'VisualEffectView')
    cd /Users/admin/builder/spi-builder-workspace
    write-file /Users/admin/builder/spi-builder-workspace/.derivedData/Build/Intermediates.noindex/VisualEffectView.build/Debug-watchos/VisualEffectView.build/VisualEffectView.DependencyStaticMetadataFileList
WriteAuxiliaryFile /Users/admin/builder/spi-builder-workspace/.derivedData/Build/Intermediates.noindex/VisualEffectView.build/Debug-watchos/VisualEffectView.build/VisualEffectView.DependencyMetadataFileList (in target 'VisualEffectView' from project 'VisualEffectView')
    cd /Users/admin/builder/spi-builder-workspace
    write-file /Users/admin/builder/spi-builder-workspace/.derivedData/Build/Intermediates.noindex/VisualEffectView.build/Debug-watchos/VisualEffectView.build/VisualEffectView.DependencyMetadataFileList
WriteAuxiliaryFile /Users/admin/builder/spi-builder-workspace/.derivedData/Build/Intermediates.noindex/VisualEffectView.build/Debug-watchos/VisualEffectView.build/Objects-normal/armv7k/VisualEffectView.LinkFileList (in target 'VisualEffectView' from project 'VisualEffectView')
    cd /Users/admin/builder/spi-builder-workspace
    write-file /Users/admin/builder/spi-builder-workspace/.derivedData/Build/Intermediates.noindex/VisualEffectView.build/Debug-watchos/VisualEffectView.build/Objects-normal/armv7k/VisualEffectView.LinkFileList
WriteAuxiliaryFile /Users/admin/builder/spi-builder-workspace/.derivedData/Build/Intermediates.noindex/VisualEffectView.build/Debug-watchos/VisualEffectView.build/Objects-normal/armv7k/VisualEffectView_const_extract_protocols.json (in target 'VisualEffectView' from project 'VisualEffectView')
    cd /Users/admin/builder/spi-builder-workspace
    write-file /Users/admin/builder/spi-builder-workspace/.derivedData/Build/Intermediates.noindex/VisualEffectView.build/Debug-watchos/VisualEffectView.build/Objects-normal/armv7k/VisualEffectView_const_extract_protocols.json
WriteAuxiliaryFile /Users/admin/builder/spi-builder-workspace/.derivedData/Build/Intermediates.noindex/VisualEffectView.build/Debug-watchos/VisualEffectView.build/Objects-normal/armv7k/VisualEffectView.SwiftConstValuesFileList (in target 'VisualEffectView' from project 'VisualEffectView')
    cd /Users/admin/builder/spi-builder-workspace
    write-file /Users/admin/builder/spi-builder-workspace/.derivedData/Build/Intermediates.noindex/VisualEffectView.build/Debug-watchos/VisualEffectView.build/Objects-normal/armv7k/VisualEffectView.SwiftConstValuesFileList
WriteAuxiliaryFile /Users/admin/builder/spi-builder-workspace/.derivedData/Build/Intermediates.noindex/VisualEffectView.build/Debug-watchos/VisualEffectView.build/Objects-normal/armv7k/VisualEffectView.SwiftFileList (in target 'VisualEffectView' from project 'VisualEffectView')
    cd /Users/admin/builder/spi-builder-workspace
    write-file /Users/admin/builder/spi-builder-workspace/.derivedData/Build/Intermediates.noindex/VisualEffectView.build/Debug-watchos/VisualEffectView.build/Objects-normal/armv7k/VisualEffectView.SwiftFileList
WriteAuxiliaryFile /Users/admin/builder/spi-builder-workspace/.derivedData/Build/Intermediates.noindex/VisualEffectView.build/Debug-watchos/VisualEffectView.build/Objects-normal/armv7k/VisualEffectView-OutputFileMap.json (in target 'VisualEffectView' from project 'VisualEffectView')
    cd /Users/admin/builder/spi-builder-workspace
    write-file /Users/admin/builder/spi-builder-workspace/.derivedData/Build/Intermediates.noindex/VisualEffectView.build/Debug-watchos/VisualEffectView.build/Objects-normal/armv7k/VisualEffectView-OutputFileMap.json
WriteAuxiliaryFile /Users/admin/builder/spi-builder-workspace/.derivedData/Build/Intermediates.noindex/VisualEffectView.build/Debug-watchos/VisualEffectView.build/Objects-normal/arm64_32/VisualEffectView_const_extract_protocols.json (in target 'VisualEffectView' from project 'VisualEffectView')
    cd /Users/admin/builder/spi-builder-workspace
    write-file /Users/admin/builder/spi-builder-workspace/.derivedData/Build/Intermediates.noindex/VisualEffectView.build/Debug-watchos/VisualEffectView.build/Objects-normal/arm64_32/VisualEffectView_const_extract_protocols.json
WriteAuxiliaryFile /Users/admin/builder/spi-builder-workspace/.derivedData/Build/Intermediates.noindex/VisualEffectView.build/Debug-watchos/VisualEffectView.build/Objects-normal/arm64_32/VisualEffectView.SwiftFileList (in target 'VisualEffectView' from project 'VisualEffectView')
    cd /Users/admin/builder/spi-builder-workspace
    write-file /Users/admin/builder/spi-builder-workspace/.derivedData/Build/Intermediates.noindex/VisualEffectView.build/Debug-watchos/VisualEffectView.build/Objects-normal/arm64_32/VisualEffectView.SwiftFileList
WriteAuxiliaryFile /Users/admin/builder/spi-builder-workspace/.derivedData/Build/Intermediates.noindex/VisualEffectView.build/Debug-watchos/VisualEffectView.build/Objects-normal/arm64_32/VisualEffectView.SwiftConstValuesFileList (in target 'VisualEffectView' from project 'VisualEffectView')
    cd /Users/admin/builder/spi-builder-workspace
    write-file /Users/admin/builder/spi-builder-workspace/.derivedData/Build/Intermediates.noindex/VisualEffectView.build/Debug-watchos/VisualEffectView.build/Objects-normal/arm64_32/VisualEffectView.SwiftConstValuesFileList
WriteAuxiliaryFile /Users/admin/builder/spi-builder-workspace/.derivedData/Build/Intermediates.noindex/VisualEffectView.build/Debug-watchos/VisualEffectView.build/Objects-normal/arm64_32/VisualEffectView.LinkFileList (in target 'VisualEffectView' from project 'VisualEffectView')
    cd /Users/admin/builder/spi-builder-workspace
    write-file /Users/admin/builder/spi-builder-workspace/.derivedData/Build/Intermediates.noindex/VisualEffectView.build/Debug-watchos/VisualEffectView.build/Objects-normal/arm64_32/VisualEffectView.LinkFileList
WriteAuxiliaryFile /Users/admin/builder/spi-builder-workspace/.derivedData/Build/Intermediates.noindex/VisualEffectView.build/Debug-watchos/VisualEffectView.build/Objects-normal/arm64_32/VisualEffectView-OutputFileMap.json (in target 'VisualEffectView' from project 'VisualEffectView')
    cd /Users/admin/builder/spi-builder-workspace
    write-file /Users/admin/builder/spi-builder-workspace/.derivedData/Build/Intermediates.noindex/VisualEffectView.build/Debug-watchos/VisualEffectView.build/Objects-normal/arm64_32/VisualEffectView-OutputFileMap.json
WriteAuxiliaryFile /Users/admin/builder/spi-builder-workspace/.derivedData/Build/Intermediates.noindex/VisualEffectView.build/Debug-watchos/VisualEffectView.build/Objects-normal/arm64/VisualEffectView_const_extract_protocols.json (in target 'VisualEffectView' from project 'VisualEffectView')
    cd /Users/admin/builder/spi-builder-workspace
    write-file /Users/admin/builder/spi-builder-workspace/.derivedData/Build/Intermediates.noindex/VisualEffectView.build/Debug-watchos/VisualEffectView.build/Objects-normal/arm64/VisualEffectView_const_extract_protocols.json
WriteAuxiliaryFile /Users/admin/builder/spi-builder-workspace/.derivedData/Build/Intermediates.noindex/VisualEffectView.build/Debug-watchos/VisualEffectView.build/Objects-normal/arm64/VisualEffectView.SwiftFileList (in target 'VisualEffectView' from project 'VisualEffectView')
    cd /Users/admin/builder/spi-builder-workspace
    write-file /Users/admin/builder/spi-builder-workspace/.derivedData/Build/Intermediates.noindex/VisualEffectView.build/Debug-watchos/VisualEffectView.build/Objects-normal/arm64/VisualEffectView.SwiftFileList
WriteAuxiliaryFile /Users/admin/builder/spi-builder-workspace/.derivedData/Build/Intermediates.noindex/VisualEffectView.build/Debug-watchos/VisualEffectView.build/Objects-normal/arm64/VisualEffectView.SwiftConstValuesFileList (in target 'VisualEffectView' from project 'VisualEffectView')
    cd /Users/admin/builder/spi-builder-workspace
    write-file /Users/admin/builder/spi-builder-workspace/.derivedData/Build/Intermediates.noindex/VisualEffectView.build/Debug-watchos/VisualEffectView.build/Objects-normal/arm64/VisualEffectView.SwiftConstValuesFileList
WriteAuxiliaryFile /Users/admin/builder/spi-builder-workspace/.derivedData/Build/Intermediates.noindex/VisualEffectView.build/Debug-watchos/VisualEffectView.build/Objects-normal/arm64/VisualEffectView.LinkFileList (in target 'VisualEffectView' from project 'VisualEffectView')
    cd /Users/admin/builder/spi-builder-workspace
    write-file /Users/admin/builder/spi-builder-workspace/.derivedData/Build/Intermediates.noindex/VisualEffectView.build/Debug-watchos/VisualEffectView.build/Objects-normal/arm64/VisualEffectView.LinkFileList
WriteAuxiliaryFile /Users/admin/builder/spi-builder-workspace/.derivedData/Build/Intermediates.noindex/VisualEffectView.build/Debug-watchos/VisualEffectView.build/Objects-normal/arm64/VisualEffectView-OutputFileMap.json (in target 'VisualEffectView' from project 'VisualEffectView')
    cd /Users/admin/builder/spi-builder-workspace
    write-file /Users/admin/builder/spi-builder-workspace/.derivedData/Build/Intermediates.noindex/VisualEffectView.build/Debug-watchos/VisualEffectView.build/Objects-normal/arm64/VisualEffectView-OutputFileMap.json
Copy /Users/admin/builder/spi-builder-workspace/.derivedData/Build/Intermediates.noindex/GeneratedModuleMaps-watchos/VisualEffectView.modulemap /Users/admin/builder/spi-builder-workspace/.derivedData/Build/Intermediates.noindex/VisualEffectView.build/Debug-watchos/VisualEffectView.build/VisualEffectView.modulemap (in target 'VisualEffectView' from project 'VisualEffectView')
    cd /Users/admin/builder/spi-builder-workspace
    builtin-copy -exclude .DS_Store -exclude CVS -exclude .svn -exclude .git -exclude .hg -resolve-src-symlinks /Users/admin/builder/spi-builder-workspace/.derivedData/Build/Intermediates.noindex/VisualEffectView.build/Debug-watchos/VisualEffectView.build/VisualEffectView.modulemap /Users/admin/builder/spi-builder-workspace/.derivedData/Build/Intermediates.noindex/GeneratedModuleMaps-watchos
SwiftDriver VisualEffectView normal arm64 com.apple.xcode.tools.swift.compiler (in target 'VisualEffectView' from project 'VisualEffectView')
    cd /Users/admin/builder/spi-builder-workspace/.swiftpm/xcode
    builtin-SwiftDriver -- /Applications/Xcode-16.3.0.app/Contents/Developer/Toolchains/XcodeDefault.xctoolchain/usr/bin/swiftc -module-name VisualEffectView -Onone -enforce-exclusivity\=checked @/Users/admin/builder/spi-builder-workspace/.derivedData/Build/Intermediates.noindex/VisualEffectView.build/Debug-watchos/VisualEffectView.build/Objects-normal/arm64/VisualEffectView.SwiftFileList -DSWIFT_PACKAGE -DDEBUG -stats-output-dir .stats -strict-concurrency\=complete -enable-upcoming-feature StrictConcurrency -enable-upcoming-feature DisableOutwardActorInference -enable-upcoming-feature GlobalActorIsolatedTypesUsability -enable-upcoming-feature InferSendableFromCaptures -plugin-path /Applications/Xcode-16.3.0.app/Contents/Developer/Toolchains/XcodeDefault.xctoolchain/usr/lib/swift/host/plugins/testing -enable-experimental-feature DebugDescriptionMacro -sdk /Applications/Xcode-16.3.0.app/Contents/Developer/Platforms/WatchOS.platform/Developer/SDKs/WatchOS11.4.sdk -target arm64-apple-watchos5.0 -g -module-cache-path /Users/admin/builder/spi-builder-workspace/.derivedData/ModuleCache.noindex -Xfrontend -serialize-debugging-options -enable-testing -index-store-path /Users/admin/builder/spi-builder-workspace/.derivedData/Index.noindex/DataStore -swift-version 5 -I /Users/admin/builder/spi-builder-workspace/.derivedData/Build/Products/Debug-watchos -I /Applications/Xcode-16.3.0.app/Contents/Developer/Platforms/WatchOS.platform/Developer/usr/lib -F /Users/admin/builder/spi-builder-workspace/.derivedData/Build/Products/Debug-watchos -F /Applications/Xcode-16.3.0.app/Contents/Developer/Platforms/WatchOS.platform/Developer/Library/Frameworks -F /Applications/Xcode-16.3.0.app/Contents/Developer/Platforms/WatchOS.platform/Developer/SDKs/WatchOS11.4.sdk/Developer/Library/Frameworks -c -j10 -enable-batch-mode -incremental -Xcc -ivfsstatcache -Xcc /Users/admin/builder/spi-builder-workspace/.derivedData/SDKStatCaches.noindex/watchos11.4-22T246-43efb940ff07ba2497b70ec94253f576.sdkstatcache -output-file-map /Users/admin/builder/spi-builder-workspace/.derivedData/Build/Intermediates.noindex/VisualEffectView.build/Debug-watchos/VisualEffectView.build/Objects-normal/arm64/VisualEffectView-OutputFileMap.json -use-frontend-parseable-output -save-temps -no-color-diagnostics -serialize-diagnostics -emit-dependencies -emit-module -emit-module-path /Users/admin/builder/spi-builder-workspace/.derivedData/Build/Intermediates.noindex/VisualEffectView.build/Debug-watchos/VisualEffectView.build/Objects-normal/arm64/VisualEffectView.swiftmodule -validate-clang-modules-once -clang-build-session-file /Users/admin/builder/spi-builder-workspace/.derivedData/ModuleCache.noindex/Session.modulevalidation -Xcc -I/Users/admin/builder/spi-builder-workspace/.derivedData/Build/Intermediates.noindex/VisualEffectView.build/Debug-watchos/VisualEffectView.build/swift-overrides.hmap -emit-const-values -Xfrontend -const-gather-protocols-file -Xfrontend /Users/admin/builder/spi-builder-workspace/.derivedData/Build/Intermediates.noindex/VisualEffectView.build/Debug-watchos/VisualEffectView.build/Objects-normal/arm64/VisualEffectView_const_extract_protocols.json -Xcc -I/Users/admin/builder/spi-builder-workspace/.derivedData/Build/Products/Debug-watchos/include -Xcc -I/Users/admin/builder/spi-builder-workspace/.derivedData/Build/Intermediates.noindex/VisualEffectView.build/Debug-watchos/VisualEffectView.build/DerivedSources-normal/arm64 -Xcc -I/Users/admin/builder/spi-builder-workspace/.derivedData/Build/Intermediates.noindex/VisualEffectView.build/Debug-watchos/VisualEffectView.build/DerivedSources/arm64 -Xcc -I/Users/admin/builder/spi-builder-workspace/.derivedData/Build/Intermediates.noindex/VisualEffectView.build/Debug-watchos/VisualEffectView.build/DerivedSources -Xcc -DSWIFT_PACKAGE -Xcc -DDEBUG\=1 -emit-objc-header -emit-objc-header-path /Users/admin/builder/spi-builder-workspace/.derivedData/Build/Intermediates.noindex/VisualEffectView.build/Debug-watchos/VisualEffectView.build/Objects-normal/arm64/VisualEffectView-Swift.h -working-directory /Users/admin/builder/spi-builder-workspace/.swiftpm/xcode -experimental-emit-module-separately -disable-cmo
SwiftDriver VisualEffectView normal armv7k com.apple.xcode.tools.swift.compiler (in target 'VisualEffectView' from project 'VisualEffectView')
    cd /Users/admin/builder/spi-builder-workspace/.swiftpm/xcode
    builtin-SwiftDriver -- /Applications/Xcode-16.3.0.app/Contents/Developer/Toolchains/XcodeDefault.xctoolchain/usr/bin/swiftc -module-name VisualEffectView -Onone -enforce-exclusivity\=checked @/Users/admin/builder/spi-builder-workspace/.derivedData/Build/Intermediates.noindex/VisualEffectView.build/Debug-watchos/VisualEffectView.build/Objects-normal/armv7k/VisualEffectView.SwiftFileList -DSWIFT_PACKAGE -DDEBUG -stats-output-dir .stats -strict-concurrency\=complete -enable-upcoming-feature StrictConcurrency -enable-upcoming-feature DisableOutwardActorInference -enable-upcoming-feature GlobalActorIsolatedTypesUsability -enable-upcoming-feature InferSendableFromCaptures -plugin-path /Applications/Xcode-16.3.0.app/Contents/Developer/Toolchains/XcodeDefault.xctoolchain/usr/lib/swift/host/plugins/testing -enable-experimental-feature DebugDescriptionMacro -sdk /Applications/Xcode-16.3.0.app/Contents/Developer/Platforms/WatchOS.platform/Developer/SDKs/WatchOS11.4.sdk -target armv7k-apple-watchos5.0 -g -module-cache-path /Users/admin/builder/spi-builder-workspace/.derivedData/ModuleCache.noindex -Xfrontend -serialize-debugging-options -enable-testing -index-store-path /Users/admin/builder/spi-builder-workspace/.derivedData/Index.noindex/DataStore -swift-version 5 -I /Users/admin/builder/spi-builder-workspace/.derivedData/Build/Products/Debug-watchos -I /Applications/Xcode-16.3.0.app/Contents/Developer/Platforms/WatchOS.platform/Developer/usr/lib -F /Users/admin/builder/spi-builder-workspace/.derivedData/Build/Products/Debug-watchos -F /Applications/Xcode-16.3.0.app/Contents/Developer/Platforms/WatchOS.platform/Developer/Library/Frameworks -F /Applications/Xcode-16.3.0.app/Contents/Developer/Platforms/WatchOS.platform/Developer/SDKs/WatchOS11.4.sdk/Developer/Library/Frameworks -c -j10 -enable-batch-mode -incremental -Xcc -ivfsstatcache -Xcc /Users/admin/builder/spi-builder-workspace/.derivedData/SDKStatCaches.noindex/watchos11.4-22T246-43efb940ff07ba2497b70ec94253f576.sdkstatcache -output-file-map /Users/admin/builder/spi-builder-workspace/.derivedData/Build/Intermediates.noindex/VisualEffectView.build/Debug-watchos/VisualEffectView.build/Objects-normal/armv7k/VisualEffectView-OutputFileMap.json -use-frontend-parseable-output -save-temps -no-color-diagnostics -serialize-diagnostics -emit-dependencies -emit-module -emit-module-path /Users/admin/builder/spi-builder-workspace/.derivedData/Build/Intermediates.noindex/VisualEffectView.build/Debug-watchos/VisualEffectView.build/Objects-normal/armv7k/VisualEffectView.swiftmodule -validate-clang-modules-once -clang-build-session-file /Users/admin/builder/spi-builder-workspace/.derivedData/ModuleCache.noindex/Session.modulevalidation -Xcc -I/Users/admin/builder/spi-builder-workspace/.derivedData/Build/Intermediates.noindex/VisualEffectView.build/Debug-watchos/VisualEffectView.build/swift-overrides.hmap -emit-const-values -Xfrontend -const-gather-protocols-file -Xfrontend /Users/admin/builder/spi-builder-workspace/.derivedData/Build/Intermediates.noindex/VisualEffectView.build/Debug-watchos/VisualEffectView.build/Objects-normal/armv7k/VisualEffectView_const_extract_protocols.json -Xcc -I/Users/admin/builder/spi-builder-workspace/.derivedData/Build/Products/Debug-watchos/include -Xcc -I/Users/admin/builder/spi-builder-workspace/.derivedData/Build/Intermediates.noindex/VisualEffectView.build/Debug-watchos/VisualEffectView.build/DerivedSources-normal/armv7k -Xcc -I/Users/admin/builder/spi-builder-workspace/.derivedData/Build/Intermediates.noindex/VisualEffectView.build/Debug-watchos/VisualEffectView.build/DerivedSources/armv7k -Xcc -I/Users/admin/builder/spi-builder-workspace/.derivedData/Build/Intermediates.noindex/VisualEffectView.build/Debug-watchos/VisualEffectView.build/DerivedSources -Xcc -DSWIFT_PACKAGE -Xcc -DDEBUG\=1 -emit-objc-header -emit-objc-header-path /Users/admin/builder/spi-builder-workspace/.derivedData/Build/Intermediates.noindex/VisualEffectView.build/Debug-watchos/VisualEffectView.build/Objects-normal/armv7k/VisualEffectView-Swift.h -working-directory /Users/admin/builder/spi-builder-workspace/.swiftpm/xcode -experimental-emit-module-separately -disable-cmo
SwiftDriver VisualEffectView normal arm64_32 com.apple.xcode.tools.swift.compiler (in target 'VisualEffectView' from project 'VisualEffectView')
    cd /Users/admin/builder/spi-builder-workspace/.swiftpm/xcode
    builtin-SwiftDriver -- /Applications/Xcode-16.3.0.app/Contents/Developer/Toolchains/XcodeDefault.xctoolchain/usr/bin/swiftc -module-name VisualEffectView -Onone -enforce-exclusivity\=checked @/Users/admin/builder/spi-builder-workspace/.derivedData/Build/Intermediates.noindex/VisualEffectView.build/Debug-watchos/VisualEffectView.build/Objects-normal/arm64_32/VisualEffectView.SwiftFileList -DSWIFT_PACKAGE -DDEBUG -stats-output-dir .stats -strict-concurrency\=complete -enable-upcoming-feature StrictConcurrency -enable-upcoming-feature DisableOutwardActorInference -enable-upcoming-feature GlobalActorIsolatedTypesUsability -enable-upcoming-feature InferSendableFromCaptures -plugin-path /Applications/Xcode-16.3.0.app/Contents/Developer/Toolchains/XcodeDefault.xctoolchain/usr/lib/swift/host/plugins/testing -enable-experimental-feature DebugDescriptionMacro -sdk /Applications/Xcode-16.3.0.app/Contents/Developer/Platforms/WatchOS.platform/Developer/SDKs/WatchOS11.4.sdk -target arm64_32-apple-watchos5.0 -g -module-cache-path /Users/admin/builder/spi-builder-workspace/.derivedData/ModuleCache.noindex -Xfrontend -serialize-debugging-options -enable-testing -index-store-path /Users/admin/builder/spi-builder-workspace/.derivedData/Index.noindex/DataStore -swift-version 5 -I /Users/admin/builder/spi-builder-workspace/.derivedData/Build/Products/Debug-watchos -I /Applications/Xcode-16.3.0.app/Contents/Developer/Platforms/WatchOS.platform/Developer/usr/lib -F /Users/admin/builder/spi-builder-workspace/.derivedData/Build/Products/Debug-watchos -F /Applications/Xcode-16.3.0.app/Contents/Developer/Platforms/WatchOS.platform/Developer/Library/Frameworks -F /Applications/Xcode-16.3.0.app/Contents/Developer/Platforms/WatchOS.platform/Developer/SDKs/WatchOS11.4.sdk/Developer/Library/Frameworks -c -j10 -enable-batch-mode -incremental -Xcc -ivfsstatcache -Xcc /Users/admin/builder/spi-builder-workspace/.derivedData/SDKStatCaches.noindex/watchos11.4-22T246-43efb940ff07ba2497b70ec94253f576.sdkstatcache -output-file-map /Users/admin/builder/spi-builder-workspace/.derivedData/Build/Intermediates.noindex/VisualEffectView.build/Debug-watchos/VisualEffectView.build/Objects-normal/arm64_32/VisualEffectView-OutputFileMap.json -use-frontend-parseable-output -save-temps -no-color-diagnostics -serialize-diagnostics -emit-dependencies -emit-module -emit-module-path /Users/admin/builder/spi-builder-workspace/.derivedData/Build/Intermediates.noindex/VisualEffectView.build/Debug-watchos/VisualEffectView.build/Objects-normal/arm64_32/VisualEffectView.swiftmodule -validate-clang-modules-once -clang-build-session-file /Users/admin/builder/spi-builder-workspace/.derivedData/ModuleCache.noindex/Session.modulevalidation -Xcc -I/Users/admin/builder/spi-builder-workspace/.derivedData/Build/Intermediates.noindex/VisualEffectView.build/Debug-watchos/VisualEffectView.build/swift-overrides.hmap -emit-const-values -Xfrontend -const-gather-protocols-file -Xfrontend /Users/admin/builder/spi-builder-workspace/.derivedData/Build/Intermediates.noindex/VisualEffectView.build/Debug-watchos/VisualEffectView.build/Objects-normal/arm64_32/VisualEffectView_const_extract_protocols.json -Xcc -I/Users/admin/builder/spi-builder-workspace/.derivedData/Build/Products/Debug-watchos/include -Xcc -I/Users/admin/builder/spi-builder-workspace/.derivedData/Build/Intermediates.noindex/VisualEffectView.build/Debug-watchos/VisualEffectView.build/DerivedSources-normal/arm64_32 -Xcc -I/Users/admin/builder/spi-builder-workspace/.derivedData/Build/Intermediates.noindex/VisualEffectView.build/Debug-watchos/VisualEffectView.build/DerivedSources/arm64_32 -Xcc -I/Users/admin/builder/spi-builder-workspace/.derivedData/Build/Intermediates.noindex/VisualEffectView.build/Debug-watchos/VisualEffectView.build/DerivedSources -Xcc -DSWIFT_PACKAGE -Xcc -DDEBUG\=1 -emit-objc-header -emit-objc-header-path /Users/admin/builder/spi-builder-workspace/.derivedData/Build/Intermediates.noindex/VisualEffectView.build/Debug-watchos/VisualEffectView.build/Objects-normal/arm64_32/VisualEffectView-Swift.h -working-directory /Users/admin/builder/spi-builder-workspace/.swiftpm/xcode -experimental-emit-module-separately -disable-cmo
SwiftCompile normal armv7k Compiling\ UIViewEffectView+Helpers.swift /Users/admin/builder/spi-builder-workspace/Sources/UIViewEffectView+Helpers.swift (in target 'VisualEffectView' from project 'VisualEffectView')
SwiftCompile normal armv7k /Users/admin/builder/spi-builder-workspace/Sources/UIViewEffectView+Helpers.swift (in target 'VisualEffectView' from project 'VisualEffectView')
    cd /Users/admin/builder/spi-builder-workspace/.swiftpm/xcode

SwiftEmitModule normal armv7k Emitting\ module\ for\ VisualEffectView (in target 'VisualEffectView' from project 'VisualEffectView')
Failed frontend command:
/Applications/Xcode-16.3.0.app/Contents/Developer/Toolchains/XcodeDefault.xctoolchain/usr/bin/swift-frontend -frontend -emit-module -experimental-skip-non-inlinable-function-bodies-without-types /Users/admin/builder/spi-builder-workspace/Sources/UIViewEffectView+Helpers.swift /Users/admin/builder/spi-builder-workspace/Sources/VisualEffectView+SwiftUI.swift /Users/admin/builder/spi-builder-workspace/Sources/VisualEffectView.swift -target armv7k-apple-watchos5.0 -enable-objc-interop -sdk /Applications/Xcode-16.3.0.app/Contents/Developer/Platforms/WatchOS.platform/Developer/SDKs/WatchOS11.4.sdk -I /Users/admin/builder/spi-builder-workspace/.derivedData/Build/Products/Debug-watchos -I /Applications/Xcode-16.3.0.app/Contents/Developer/Platforms/WatchOS.platform/Developer/usr/lib -F /Users/admin/builder/spi-builder-workspace/.derivedData/Build/Products/Debug-watchos -F /Applications/Xcode-16.3.0.app/Contents/Developer/Platforms/WatchOS.platform/Developer/Library/Frameworks -F /Applications/Xcode-16.3.0.app/Contents/Developer/Platforms/WatchOS.platform/Developer/SDKs/WatchOS11.4.sdk/Developer/Library/Frameworks -no-color-diagnostics -enable-testing -g -debug-info-format\=dwarf -dwarf-version\=4 -module-cache-path /Users/admin/builder/spi-builder-workspace/.derivedData/ModuleCache.noindex -swift-version 5 -enforce-exclusivity\=checked -stats-output-dir /Users/admin/builder/spi-builder-workspace/.swiftpm/xcode/.stats -Onone -D SWIFT_PACKAGE -D DEBUG -serialize-debugging-options -const-gather-protocols-file /Users/admin/builder/spi-builder-workspace/.derivedData/Build/Intermediates.noindex/VisualEffectView.build/Debug-watchos/VisualEffectView.build/Objects-normal/armv7k/VisualEffectView_const_extract_protocols.json -enable-upcoming-feature StrictConcurrency -enable-upcoming-feature DisableOutwardActorInference -enable-upcoming-feature GlobalActorIsolatedTypesUsability -enable-upcoming-feature InferSendableFromCaptures -enable-experimental-feature DebugDescriptionMacro -strict-concurrency\=complete -empty-abi-descriptor -plugin-path /Applications/Xcode-16.3.0.app/Contents/Developer/Toolchains/XcodeDefault.xctoolchain/usr/lib/swift/host/plugins/testing -validate-clang-modules-once -clang-build-session-file /Users/admin/builder/spi-builder-workspace/.derivedData/ModuleCache.noindex/Session.modulevalidation -Xcc -working-directory -Xcc /Users/admin/builder/spi-builder-workspace/.swiftpm/xcode -resource-dir /Applications/Xcode-16.3.0.app/Contents/Developer/Toolchains/XcodeDefault.xctoolchain/usr/lib/swift -enable-anonymous-context-mangled-names -file-compilation-dir /Users/admin/builder/spi-builder-workspace/.swiftpm/xcode -Xcc -ivfsstatcache -Xcc /Users/admin/builder/spi-builder-workspace/.derivedData/SDKStatCaches.noindex/watchos11.4-22T246-43efb940ff07ba2497b70ec94253f576.sdkstatcache -Xcc -I/Users/admin/builder/spi-builder-workspace/.derivedData/Build/Intermediates.noindex/VisualEffectView.build/Debug-watchos/VisualEffectView.build/swift-overrides.hmap -Xcc -I/Users/admin/builder/spi-builder-workspace/.derivedData/Build/Products/Debug-watchos/include -Xcc -I/Users/admin/builder/spi-builder-workspace/.derivedData/Build/Intermediates.noindex/VisualEffectView.build/Debug-watchos/VisualEffectView.build/DerivedSources-normal/armv7k -Xcc -I/Users/admin/builder/spi-builder-workspace/.derivedData/Build/Intermediates.noindex/VisualEffectView.build/Debug-watchos/VisualEffectView.build/DerivedSources/armv7k -Xcc -I/Users/admin/builder/spi-builder-workspace/.derivedData/Build/Intermediates.noindex/VisualEffectView.build/Debug-watchos/VisualEffectView.build/DerivedSources -Xcc -DSWIFT_PACKAGE -Xcc -DDEBUG\=1 -module-name VisualEffectView -frontend-parseable-output -disable-clang-spi -target-sdk-version 11.4 -target-sdk-name watchos11.4 -external-plugin-path /Applications/Xcode-16.3.0.app/Contents/Developer/Platforms/WatchOS.platform/Developer/usr/lib/swift/host/plugins\#/Applications/Xcode-16.3.0.app/Contents/Developer/Platforms/WatchOS.platform/Developer/usr/bin/swift-plugin-server -external-plugin-path /Applications/Xcode-16.3.0.app/Contents/Developer/Platforms/WatchOS.platform/Developer/usr/local/lib/swift/host/plugins\#/Applications/Xcode-16.3.0.app/Contents/Developer/Platforms/WatchOS.platform/Developer/usr/bin/swift-plugin-server -in-process-plugin-server-path /Applications/Xcode-16.3.0.app/Contents/Developer/Toolchains/XcodeDefault.xctoolchain/usr/lib/swift/host/libSwiftInProcPluginServer.dylib -plugin-path /Applications/Xcode-16.3.0.app/Contents/Developer/Toolchains/XcodeDefault.xctoolchain/usr/lib/swift/host/plugins -plugin-path /Applications/Xcode-16.3.0.app/Contents/Developer/Toolchains/XcodeDefault.xctoolchain/usr/local/lib/swift/host/plugins -emit-module-doc-path /Users/admin/builder/spi-builder-workspace/.derivedData/Build/Intermediates.noindex/VisualEffectView.build/Debug-watchos/VisualEffectView.build/Objects-normal/armv7k/VisualEffectView.swiftdoc -emit-module-source-info-path /Users/admin/builder/spi-builder-workspace/.derivedData/Build/Intermediates.noindex/VisualEffectView.build/Debug-watchos/VisualEffectView.build/Objects-normal/armv7k/VisualEffectView.swiftsourceinfo -emit-objc-header-path /Users/admin/builder/spi-builder-workspace/.derivedData/Build/Intermediates.noindex/VisualEffectView.build/Debug-watchos/VisualEffectView.build/Objects-normal/armv7k/VisualEffectView-Swift.h -serialize-diagnostics-path /Users/admin/builder/spi-builder-workspace/.derivedData/Build/Intermediates.noindex/VisualEffectView.build/Debug-watchos/VisualEffectView.build/Objects-normal/armv7k/VisualEffectView-master-emit-module.dia -emit-dependencies-path /Users/admin/builder/spi-builder-workspace/.derivedData/Build/Intermediates.noindex/VisualEffectView.build/Debug-watchos/VisualEffectView.build/Objects-normal/armv7k/VisualEffectView-master-emit-module.d -o /Users/admin/builder/spi-builder-workspace/.derivedData/Build/Intermediates.noindex/VisualEffectView.build/Debug-watchos/VisualEffectView.build/Objects-normal/armv7k/VisualEffectView.swiftmodule -emit-abi-descriptor-path /Users/admin/builder/spi-builder-workspace/.derivedData/Build/Intermediates.noindex/VisualEffectView.build/Debug-watchos/VisualEffectView.build/Objects-normal/armv7k/VisualEffectView.abi.json
EmitSwiftModule normal armv7k (in target 'VisualEffectView' from project 'VisualEffectView')
    cd /Users/admin/builder/spi-builder-workspace/.swiftpm/xcode

/Users/admin/builder/spi-builder-workspace/Sources/UIViewEffectView+Helpers.swift:10:11: error: cannot find type 'UIVisualEffectView' in scope
extension UIVisualEffectView {
          ^~~~~~~~~~~~~~~~~~
/Users/admin/builder/spi-builder-workspace/Sources/UIViewEffectView+Helpers.swift:42:19: error: cannot find type 'UIView' in scope
private extension UIView {
                  ^~~~~~
/Applications/Xcode-16.3.0.app/Contents/Developer/Platforms/WatchOS.platform/Developer/SDKs/WatchOS11.4.sdk/System/Library/Frameworks/UIKit.framework/Headers/NSTextAttachment.h:23:1: note: interface 'UIView' forward declared here
@class UIView;
^
/Users/admin/builder/spi-builder-workspace/Sources/VisualEffectView+SwiftUI.swift:12:20: error: 'Color' is only available in watchOS 6.0 or newer
    let colorTint: Color?
                   ^
/Users/admin/builder/spi-builder-workspace/Sources/VisualEffectView+SwiftUI.swift:11:15: note: add @available attribute to enclosing struct
public struct VisualEffect: UIViewRepresentable {
              ^
/Users/admin/builder/spi-builder-workspace/Sources/VisualEffectView+SwiftUI.swift:17:28: error: 'Color' is only available in watchOS 6.0 or newer
    public init(colorTint: Color? = nil, colorTintAlpha: CGFloat = 0, blurRadius: CGFloat = 0, scale: CGFloat = 1) {
                           ^
/Users/admin/builder/spi-builder-workspace/Sources/VisualEffectView+SwiftUI.swift:17:12: note: add @available attribute to enclosing initializer
    public init(colorTint: Color? = nil, colorTintAlpha: CGFloat = 0, blurRadius: CGFloat = 0, scale: CGFloat = 1) {
           ^
/Users/admin/builder/spi-builder-workspace/Sources/VisualEffectView+SwiftUI.swift:11:15: note: add @available attribute to enclosing struct
public struct VisualEffect: UIViewRepresentable {
              ^
/Users/admin/builder/spi-builder-workspace/Sources/VisualEffectView+SwiftUI.swift:24:37: error: cannot find type 'Context' in scope
    public func makeUIView(context: Context) -> VisualEffectView {
                                    ^~~~~~~
/Users/admin/builder/spi-builder-workspace/Sources/VisualEffectView+SwiftUI.swift:38:67: error: cannot find type 'Context' in scope
    public func updateUIView(_ uiView: VisualEffectView, context: Context) {
                                                                  ^~~~~~~
/Users/admin/builder/spi-builder-workspace/Sources/VisualEffectView+SwiftUI.swift:11:29: error: cannot find type 'UIViewRepresentable' in scope
public struct VisualEffect: UIViewRepresentable {
                            ^~~~~~~~~~~~~~~~~~~
/Users/admin/builder/spi-builder-workspace/Sources/VisualEffectView+SwiftUI.swift:49:26: error: 'some' return types are only available in watchOS 6.0.0 or newer
    static var previews: some View {
                         ^
/Users/admin/builder/spi-builder-workspace/Sources/VisualEffectView+SwiftUI.swift:49:16: note: add @available attribute to enclosing static property
    static var previews: some View {
               ^
/Users/admin/builder/spi-builder-workspace/Sources/VisualEffectView+SwiftUI.swift:48:8: note: add @available attribute to enclosing struct
struct VisualEffect_Previews: PreviewProvider {
       ^
/Users/admin/builder/spi-builder-workspace/Sources/VisualEffectView+SwiftUI.swift:49:31: error: 'View' is only available in watchOS 6.0 or newer
    static var previews: some View {
                              ^
/Users/admin/builder/spi-builder-workspace/Sources/VisualEffectView+SwiftUI.swift:49:16: note: add @available attribute to enclosing static property
    static var previews: some View {
               ^
/Users/admin/builder/spi-builder-workspace/Sources/VisualEffectView+SwiftUI.swift:48:8: note: add @available attribute to enclosing struct
struct VisualEffect_Previews: PreviewProvider {
       ^
/Users/admin/builder/spi-builder-workspace/Sources/VisualEffectView+SwiftUI.swift:61:19: error: 'Color' is only available in watchOS 6.0 or newer
private extension Color {
                  ^
/Users/admin/builder/spi-builder-workspace/Sources/VisualEffectView+SwiftUI.swift:61:9: note: add @available attribute to enclosing extension
private extension Color {
        ^
/Users/admin/builder/spi-builder-workspace/Sources/VisualEffectView.swift:16:76: error: cannot find type 'UIBlurEffect' in scope
    private let blurEffect = (NSClassFromString("_UICustomBlurEffect") as! UIBlurEffect.Type).init()
                                                                           ^~~~~~~~~~~~
/Users/admin/builder/spi-builder-workspace/Sources/VisualEffectView.swift:77:34: error: cannot find type 'UIVisualEffect' in scope
    public override init(effect: UIVisualEffect?) {
                                 ^~~~~~~~~~~~~~
/Users/admin/builder/spi-builder-workspace/Sources/VisualEffectView.swift:13:30: error: cannot find type 'UIVisualEffectView' in scope
open class VisualEffectView: UIVisualEffectView {
                             ^~~~~~~~~~~~~~~~~~
SwiftEmitModule normal arm64_32 Emitting\ module\ for\ VisualEffectView (in target 'VisualEffectView' from project 'VisualEffectView')
Failed frontend command:
/Applications/Xcode-16.3.0.app/Contents/Developer/Toolchains/XcodeDefault.xctoolchain/usr/bin/swift-frontend -frontend -emit-module -experimental-skip-non-inlinable-function-bodies-without-types /Users/admin/builder/spi-builder-workspace/Sources/UIViewEffectView+Helpers.swift /Users/admin/builder/spi-builder-workspace/Sources/VisualEffectView+SwiftUI.swift /Users/admin/builder/spi-builder-workspace/Sources/VisualEffectView.swift -target arm64_32-apple-watchos5.0 -enable-objc-interop -sdk /Applications/Xcode-16.3.0.app/Contents/Developer/Platforms/WatchOS.platform/Developer/SDKs/WatchOS11.4.sdk -I /Users/admin/builder/spi-builder-workspace/.derivedData/Build/Products/Debug-watchos -I /Applications/Xcode-16.3.0.app/Contents/Developer/Platforms/WatchOS.platform/Developer/usr/lib -F /Users/admin/builder/spi-builder-workspace/.derivedData/Build/Products/Debug-watchos -F /Applications/Xcode-16.3.0.app/Contents/Developer/Platforms/WatchOS.platform/Developer/Library/Frameworks -F /Applications/Xcode-16.3.0.app/Contents/Developer/Platforms/WatchOS.platform/Developer/SDKs/WatchOS11.4.sdk/Developer/Library/Frameworks -no-color-diagnostics -enable-testing -g -debug-info-format\=dwarf -dwarf-version\=4 -module-cache-path /Users/admin/builder/spi-builder-workspace/.derivedData/ModuleCache.noindex -swift-version 5 -enforce-exclusivity\=checked -stats-output-dir /Users/admin/builder/spi-builder-workspace/.swiftpm/xcode/.stats -Onone -D SWIFT_PACKAGE -D DEBUG -serialize-debugging-options -const-gather-protocols-file /Users/admin/builder/spi-builder-workspace/.derivedData/Build/Intermediates.noindex/VisualEffectView.build/Debug-watchos/VisualEffectView.build/Objects-normal/arm64_32/VisualEffectView_const_extract_protocols.json -enable-upcoming-feature StrictConcurrency -enable-upcoming-feature DisableOutwardActorInference -enable-upcoming-feature GlobalActorIsolatedTypesUsability -enable-upcoming-feature InferSendableFromCaptures -enable-experimental-feature DebugDescriptionMacro -strict-concurrency\=complete -empty-abi-descriptor -plugin-path /Applications/Xcode-16.3.0.app/Contents/Developer/Toolchains/XcodeDefault.xctoolchain/usr/lib/swift/host/plugins/testing -validate-clang-modules-once -clang-build-session-file /Users/admin/builder/spi-builder-workspace/.derivedData/ModuleCache.noindex/Session.modulevalidation -Xcc -working-directory -Xcc /Users/admin/builder/spi-builder-workspace/.swiftpm/xcode -resource-dir /Applications/Xcode-16.3.0.app/Contents/Developer/Toolchains/XcodeDefault.xctoolchain/usr/lib/swift -enable-anonymous-context-mangled-names -file-compilation-dir /Users/admin/builder/spi-builder-workspace/.swiftpm/xcode -Xcc -ivfsstatcache -Xcc /Users/admin/builder/spi-builder-workspace/.derivedData/SDKStatCaches.noindex/watchos11.4-22T246-43efb940ff07ba2497b70ec94253f576.sdkstatcache -Xcc -I/Users/admin/builder/spi-builder-workspace/.derivedData/Build/Intermediates.noindex/VisualEffectView.build/Debug-watchos/VisualEffectView.build/swift-overrides.hmap -Xcc -I/Users/admin/builder/spi-builder-workspace/.derivedData/Build/Products/Debug-watchos/include -Xcc -I/Users/admin/builder/spi-builder-workspace/.derivedData/Build/Intermediates.noindex/VisualEffectView.build/Debug-watchos/VisualEffectView.build/DerivedSources-normal/arm64_32 -Xcc -I/Users/admin/builder/spi-builder-workspace/.derivedData/Build/Intermediates.noindex/VisualEffectView.build/Debug-watchos/VisualEffectView.build/DerivedSources/arm64_32 -Xcc -I/Users/admin/builder/spi-builder-workspace/.derivedData/Build/Intermediates.noindex/VisualEffectView.build/Debug-watchos/VisualEffectView.build/DerivedSources -Xcc -DSWIFT_PACKAGE -Xcc -DDEBUG\=1 -module-name VisualEffectView -frontend-parseable-output -disable-clang-spi -target-sdk-version 11.4 -target-sdk-name watchos11.4 -external-plugin-path /Applications/Xcode-16.3.0.app/Contents/Developer/Platforms/WatchOS.platform/Developer/usr/lib/swift/host/plugins\#/Applications/Xcode-16.3.0.app/Contents/Developer/Platforms/WatchOS.platform/Developer/usr/bin/swift-plugin-server -external-plugin-path /Applications/Xcode-16.3.0.app/Contents/Developer/Platforms/WatchOS.platform/Developer/usr/local/lib/swift/host/plugins\#/Applications/Xcode-16.3.0.app/Contents/Developer/Platforms/WatchOS.platform/Developer/usr/bin/swift-plugin-server -in-process-plugin-server-path /Applications/Xcode-16.3.0.app/Contents/Developer/Toolchains/XcodeDefault.xctoolchain/usr/lib/swift/host/libSwiftInProcPluginServer.dylib -plugin-path /Applications/Xcode-16.3.0.app/Contents/Developer/Toolchains/XcodeDefault.xctoolchain/usr/lib/swift/host/plugins -plugin-path /Applications/Xcode-16.3.0.app/Contents/Developer/Toolchains/XcodeDefault.xctoolchain/usr/local/lib/swift/host/plugins -emit-module-doc-path /Users/admin/builder/spi-builder-workspace/.derivedData/Build/Intermediates.noindex/VisualEffectView.build/Debug-watchos/VisualEffectView.build/Objects-normal/arm64_32/VisualEffectView.swiftdoc -emit-module-source-info-path /Users/admin/builder/spi-builder-workspace/.derivedData/Build/Intermediates.noindex/VisualEffectView.build/Debug-watchos/VisualEffectView.build/Objects-normal/arm64_32/VisualEffectView.swiftsourceinfo -emit-objc-header-path /Users/admin/builder/spi-builder-workspace/.derivedData/Build/Intermediates.noindex/VisualEffectView.build/Debug-watchos/VisualEffectView.build/Objects-normal/arm64_32/VisualEffectView-Swift.h -serialize-diagnostics-path /Users/admin/builder/spi-builder-workspace/.derivedData/Build/Intermediates.noindex/VisualEffectView.build/Debug-watchos/VisualEffectView.build/Objects-normal/arm64_32/VisualEffectView-master-emit-module.dia -emit-dependencies-path /Users/admin/builder/spi-builder-workspace/.derivedData/Build/Intermediates.noindex/VisualEffectView.build/Debug-watchos/VisualEffectView.build/Objects-normal/arm64_32/VisualEffectView-master-emit-module.d -o /Users/admin/builder/spi-builder-workspace/.derivedData/Build/Intermediates.noindex/VisualEffectView.build/Debug-watchos/VisualEffectView.build/Objects-normal/arm64_32/VisualEffectView.swiftmodule -emit-abi-descriptor-path /Users/admin/builder/spi-builder-workspace/.derivedData/Build/Intermediates.noindex/VisualEffectView.build/Debug-watchos/VisualEffectView.build/Objects-normal/arm64_32/VisualEffectView.abi.json
EmitSwiftModule normal arm64_32 (in target 'VisualEffectView' from project 'VisualEffectView')
    cd /Users/admin/builder/spi-builder-workspace/.swiftpm/xcode

/Users/admin/builder/spi-builder-workspace/Sources/UIViewEffectView+Helpers.swift:10:11: error: cannot find type 'UIVisualEffectView' in scope
extension UIVisualEffectView {
          ^~~~~~~~~~~~~~~~~~
/Users/admin/builder/spi-builder-workspace/Sources/UIViewEffectView+Helpers.swift:42:19: error: cannot find type 'UIView' in scope
private extension UIView {
                  ^~~~~~
/Applications/Xcode-16.3.0.app/Contents/Developer/Platforms/WatchOS.platform/Developer/SDKs/WatchOS11.4.sdk/System/Library/Frameworks/UIKit.framework/Headers/NSTextAttachment.h:23:1: note: interface 'UIView' forward declared here
@class UIView;
^
/Users/admin/builder/spi-builder-workspace/Sources/VisualEffectView+SwiftUI.swift:12:20: error: 'Color' is only available in watchOS 6.0 or newer
    let colorTint: Color?
                   ^
/Users/admin/builder/spi-builder-workspace/Sources/VisualEffectView+SwiftUI.swift:11:15: note: add @available attribute to enclosing struct
public struct VisualEffect: UIViewRepresentable {
              ^
/Users/admin/builder/spi-builder-workspace/Sources/VisualEffectView+SwiftUI.swift:17:28: error: 'Color' is only available in watchOS 6.0 or newer
    public init(colorTint: Color? = nil, colorTintAlpha: CGFloat = 0, blurRadius: CGFloat = 0, scale: CGFloat = 1) {
                           ^
/Users/admin/builder/spi-builder-workspace/Sources/VisualEffectView+SwiftUI.swift:17:12: note: add @available attribute to enclosing initializer
    public init(colorTint: Color? = nil, colorTintAlpha: CGFloat = 0, blurRadius: CGFloat = 0, scale: CGFloat = 1) {
           ^
/Users/admin/builder/spi-builder-workspace/Sources/VisualEffectView+SwiftUI.swift:11:15: note: add @available attribute to enclosing struct
public struct VisualEffect: UIViewRepresentable {
              ^
/Users/admin/builder/spi-builder-workspace/Sources/VisualEffectView+SwiftUI.swift:24:37: error: cannot find type 'Context' in scope
    public func makeUIView(context: Context) -> VisualEffectView {
                                    ^~~~~~~
/Users/admin/builder/spi-builder-workspace/Sources/VisualEffectView+SwiftUI.swift:38:67: error: cannot find type 'Context' in scope
    public func updateUIView(_ uiView: VisualEffectView, context: Context) {
                                                                  ^~~~~~~
/Users/admin/builder/spi-builder-workspace/Sources/VisualEffectView+SwiftUI.swift:11:29: error: cannot find type 'UIViewRepresentable' in scope
public struct VisualEffect: UIViewRepresentable {
                            ^~~~~~~~~~~~~~~~~~~
/Users/admin/builder/spi-builder-workspace/Sources/VisualEffectView+SwiftUI.swift:49:26: error: 'some' return types are only available in watchOS 6.0.0 or newer
    static var previews: some View {
                         ^
/Users/admin/builder/spi-builder-workspace/Sources/VisualEffectView+SwiftUI.swift:49:16: note: add @available attribute to enclosing static property
    static var previews: some View {
               ^
/Users/admin/builder/spi-builder-workspace/Sources/VisualEffectView+SwiftUI.swift:48:8: note: add @available attribute to enclosing struct
struct VisualEffect_Previews: PreviewProvider {
       ^
/Users/admin/builder/spi-builder-workspace/Sources/VisualEffectView+SwiftUI.swift:49:31: error: 'View' is only available in watchOS 6.0 or newer
    static var previews: some View {
                              ^
/Users/admin/builder/spi-builder-workspace/Sources/VisualEffectView+SwiftUI.swift:49:16: note: add @available attribute to enclosing static property
    static var previews: some View {
               ^
/Users/admin/builder/spi-builder-workspace/Sources/VisualEffectView+SwiftUI.swift:48:8: note: add @available attribute to enclosing struct
struct VisualEffect_Previews: PreviewProvider {
       ^
/Users/admin/builder/spi-builder-workspace/Sources/VisualEffectView+SwiftUI.swift:61:19: error: 'Color' is only available in watchOS 6.0 or newer
private extension Color {
                  ^
/Users/admin/builder/spi-builder-workspace/Sources/VisualEffectView+SwiftUI.swift:61:9: note: add @available attribute to enclosing extension
private extension Color {
        ^
/Users/admin/builder/spi-builder-workspace/Sources/VisualEffectView.swift:16:76: error: cannot find type 'UIBlurEffect' in scope
    private let blurEffect = (NSClassFromString("_UICustomBlurEffect") as! UIBlurEffect.Type).init()
                                                                           ^~~~~~~~~~~~
/Users/admin/builder/spi-builder-workspace/Sources/VisualEffectView.swift:77:34: error: cannot find type 'UIVisualEffect' in scope
    public override init(effect: UIVisualEffect?) {
                                 ^~~~~~~~~~~~~~
/Users/admin/builder/spi-builder-workspace/Sources/VisualEffectView.swift:13:30: error: cannot find type 'UIVisualEffectView' in scope
open class VisualEffectView: UIVisualEffectView {
                             ^~~~~~~~~~~~~~~~~~
SwiftCompile normal armv7k Compiling\ VisualEffectView.swift /Users/admin/builder/spi-builder-workspace/Sources/VisualEffectView.swift (in target 'VisualEffectView' from project 'VisualEffectView')
SwiftCompile normal armv7k /Users/admin/builder/spi-builder-workspace/Sources/VisualEffectView.swift (in target 'VisualEffectView' from project 'VisualEffectView')
    cd /Users/admin/builder/spi-builder-workspace/.swiftpm/xcode

SwiftCompile normal armv7k Compiling\ VisualEffectView+SwiftUI.swift /Users/admin/builder/spi-builder-workspace/Sources/VisualEffectView+SwiftUI.swift (in target 'VisualEffectView' from project 'VisualEffectView')
SwiftCompile normal armv7k /Users/admin/builder/spi-builder-workspace/Sources/VisualEffectView+SwiftUI.swift (in target 'VisualEffectView' from project 'VisualEffectView')
    cd /Users/admin/builder/spi-builder-workspace/.swiftpm/xcode

SwiftCompile normal arm64_32 Compiling\ VisualEffectView+SwiftUI.swift /Users/admin/builder/spi-builder-workspace/Sources/VisualEffectView+SwiftUI.swift (in target 'VisualEffectView' from project 'VisualEffectView')
SwiftCompile normal arm64_32 /Users/admin/builder/spi-builder-workspace/Sources/VisualEffectView+SwiftUI.swift (in target 'VisualEffectView' from project 'VisualEffectView')
    cd /Users/admin/builder/spi-builder-workspace/.swiftpm/xcode

SwiftCompile normal arm64_32 Compiling\ UIViewEffectView+Helpers.swift /Users/admin/builder/spi-builder-workspace/Sources/UIViewEffectView+Helpers.swift (in target 'VisualEffectView' from project 'VisualEffectView')
SwiftCompile normal arm64_32 /Users/admin/builder/spi-builder-workspace/Sources/UIViewEffectView+Helpers.swift (in target 'VisualEffectView' from project 'VisualEffectView')
    cd /Users/admin/builder/spi-builder-workspace/.swiftpm/xcode

SwiftCompile normal arm64_32 Compiling\ VisualEffectView.swift /Users/admin/builder/spi-builder-workspace/Sources/VisualEffectView.swift (in target 'VisualEffectView' from project 'VisualEffectView')
SwiftCompile normal arm64_32 /Users/admin/builder/spi-builder-workspace/Sources/VisualEffectView.swift (in target 'VisualEffectView' from project 'VisualEffectView')
    cd /Users/admin/builder/spi-builder-workspace/.swiftpm/xcode

SwiftCompile normal arm64 Compiling\ VisualEffectView+SwiftUI.swift /Users/admin/builder/spi-builder-workspace/Sources/VisualEffectView+SwiftUI.swift (in target 'VisualEffectView' from project 'VisualEffectView')
SwiftCompile normal arm64 /Users/admin/builder/spi-builder-workspace/Sources/VisualEffectView+SwiftUI.swift (in target 'VisualEffectView' from project 'VisualEffectView')
    cd /Users/admin/builder/spi-builder-workspace/.swiftpm/xcode

SwiftEmitModule normal arm64 Emitting\ module\ for\ VisualEffectView (in target 'VisualEffectView' from project 'VisualEffectView')
EmitSwiftModule normal arm64 (in target 'VisualEffectView' from project 'VisualEffectView')
    cd /Users/admin/builder/spi-builder-workspace/.swiftpm/xcode

SwiftCompile normal arm64 Compiling\ VisualEffectView.swift /Users/admin/builder/spi-builder-workspace/Sources/VisualEffectView.swift (in target 'VisualEffectView' from project 'VisualEffectView')
Command SwiftCompile failed with a nonzero exit code
** BUILD FAILED **
The following build commands failed:
	SwiftEmitModule normal armv7k Emitting\ module\ for\ VisualEffectView (in target 'VisualEffectView' from project 'VisualEffectView')
	EmitSwiftModule normal armv7k (in target 'VisualEffectView' from project 'VisualEffectView')
	SwiftEmitModule normal arm64_32 Emitting\ module\ for\ VisualEffectView (in target 'VisualEffectView' from project 'VisualEffectView')
	EmitSwiftModule normal arm64_32 (in target 'VisualEffectView' from project 'VisualEffectView')
	SwiftCompile normal arm64 Compiling\ VisualEffectView.swift /Users/admin/builder/spi-builder-workspace/Sources/VisualEffectView.swift (in target 'VisualEffectView' from project 'VisualEffectView')
	Building workspace spi-builder-workspace with scheme VisualEffectView
(6 failures)
Command line invocation:
    /Applications/Xcode-16.3.0.app/Contents/Developer/usr/bin/xcodebuild -IDEClonedSourcePackagesDirPathOverride=/Users/admin/builder/spi-builder-workspace/.dependencies -resolvePackageDependencies
Resolve Package Graph
Resolved source packages:
  VisualEffectView: /Users/admin/builder/spi-builder-workspace
resolved source packages: VisualEffectView
{
  "dependencies" : [
  ],
  "manifest_display_name" : "VisualEffectView",
  "name" : "VisualEffectView",
  "path" : "/Users/admin/builder/spi-builder-workspace",
  "platforms" : [
    {
      "name" : "ios",
      "version" : "9.0"
    }
  ],
  "products" : [
    {
      "name" : "VisualEffectView",
      "targets" : [
        "VisualEffectView"
      ],
      "type" : {
        "library" : [
          "automatic"
        ]
      }
    }
  ],
  "targets" : [
    {
      "c99name" : "VisualEffectView",
      "module_type" : "SwiftTarget",
      "name" : "VisualEffectView",
      "path" : "Sources",
      "product_memberships" : [
        "VisualEffectView"
      ],
      "sources" : [
        "UIViewEffectView+Helpers.swift",
        "VisualEffectView+SwiftUI.swift",
        "VisualEffectView.swift"
      ],
      "type" : "library"
    }
  ],
  "tools_version" : "5.0"
}
{
  "workspace" : {
    "name" : "spi-builder-workspace",
    "schemes" : [
      "VisualEffectView"
    ]
  }
}
Running build ...
env DEVELOPER_DIR=/Applications/Xcode-16.3.0.app xcrun xcodebuild -IDEClonedSourcePackagesDirPathOverride=$PWD/.dependencies -skipMacroValidation -skipPackagePluginValidation -derivedDataPath $PWD/.derivedData build -scheme VisualEffectView -destination generic/platform=watchOS
Command line invocation:
    /Applications/Xcode-16.3.0.app/Contents/Developer/usr/bin/xcodebuild -IDEClonedSourcePackagesDirPathOverride=/Users/admin/builder/spi-builder-workspace/.dependencies -skipMacroValidation -skipPackagePluginValidation -derivedDataPath /Users/admin/builder/spi-builder-workspace/.derivedData build -scheme VisualEffectView -destination generic/platform=watchOS
Resolve Package Graph
Resolved source packages:
  VisualEffectView: /Users/admin/builder/spi-builder-workspace
ComputePackagePrebuildTargetDependencyGraph
Prepare packages
CreateBuildRequest
SendProjectDescription
CreateBuildOperation
ComputeTargetDependencyGraph
note: Building targets in dependency order
note: Target dependency graph (2 targets)
    Target 'VisualEffectView' in project 'VisualEffectView'
        ➜ Explicit dependency on target 'VisualEffectView' in project 'VisualEffectView'
    Target 'VisualEffectView' in project 'VisualEffectView' (no dependencies)
GatherProvisioningInputs
CreateBuildDescription
ExecuteExternalTool /Applications/Xcode-16.3.0.app/Contents/Developer/Toolchains/XcodeDefault.xctoolchain/usr/bin/clang -v -E -dM -isysroot /Applications/Xcode-16.3.0.app/Contents/Developer/Platforms/WatchOS.platform/Developer/SDKs/WatchOS11.4.sdk -x c -c /dev/null
ExecuteExternalTool /Applications/Xcode-16.3.0.app/Contents/Developer/Toolchains/XcodeDefault.xctoolchain/usr/bin/swiftc --version
ExecuteExternalTool /Applications/Xcode-16.3.0.app/Contents/Developer/Toolchains/XcodeDefault.xctoolchain/usr/bin/ld -version_details
Build description signature: 69db51737c62f8b0e3fdc02071c05ba0
Build description path: /Users/admin/builder/spi-builder-workspace/.derivedData/Build/Intermediates.noindex/XCBuildData/69db51737c62f8b0e3fdc02071c05ba0.xcbuilddata
ClangStatCache /Applications/Xcode-16.3.0.app/Contents/Developer/Toolchains/XcodeDefault.xctoolchain/usr/bin/clang-stat-cache /Applications/Xcode-16.3.0.app/Contents/Developer/Platforms/WatchOS.platform/Developer/SDKs/WatchOS11.4.sdk /Users/admin/builder/spi-builder-workspace/.derivedData/SDKStatCaches.noindex/watchos11.4-22T246-43efb940ff07ba2497b70ec94253f576.sdkstatcache
    cd /Users/admin/builder/spi-builder-workspace/.swiftpm/xcode
    /Applications/Xcode-16.3.0.app/Contents/Developer/Toolchains/XcodeDefault.xctoolchain/usr/bin/clang-stat-cache /Applications/Xcode-16.3.0.app/Contents/Developer/Platforms/WatchOS.platform/Developer/SDKs/WatchOS11.4.sdk -o /Users/admin/builder/spi-builder-workspace/.derivedData/SDKStatCaches.noindex/watchos11.4-22T246-43efb940ff07ba2497b70ec94253f576.sdkstatcache
SwiftDriver VisualEffectView normal arm64 com.apple.xcode.tools.swift.compiler (in target 'VisualEffectView' from project 'VisualEffectView')
    cd /Users/admin/builder/spi-builder-workspace/.swiftpm/xcode
    builtin-SwiftDriver -- /Applications/Xcode-16.3.0.app/Contents/Developer/Toolchains/XcodeDefault.xctoolchain/usr/bin/swiftc -module-name VisualEffectView -Onone -enforce-exclusivity\=checked @/Users/admin/builder/spi-builder-workspace/.derivedData/Build/Intermediates.noindex/VisualEffectView.build/Debug-watchos/VisualEffectView.build/Objects-normal/arm64/VisualEffectView.SwiftFileList -DSWIFT_PACKAGE -DDEBUG -DXcode -plugin-path /Applications/Xcode-16.3.0.app/Contents/Developer/Toolchains/XcodeDefault.xctoolchain/usr/lib/swift/host/plugins/testing -enable-experimental-feature DebugDescriptionMacro -sdk /Applications/Xcode-16.3.0.app/Contents/Developer/Platforms/WatchOS.platform/Developer/SDKs/WatchOS11.4.sdk -target arm64-apple-watchos5.0 -g -module-cache-path /Users/admin/builder/spi-builder-workspace/.derivedData/ModuleCache.noindex -Xfrontend -serialize-debugging-options -enable-testing -index-store-path /Users/admin/builder/spi-builder-workspace/.derivedData/Index.noindex/DataStore -swift-version 5 -I /Users/admin/builder/spi-builder-workspace/.derivedData/Build/Products/Debug-watchos -I /Applications/Xcode-16.3.0.app/Contents/Developer/Platforms/WatchOS.platform/Developer/usr/lib -F /Users/admin/builder/spi-builder-workspace/.derivedData/Build/Products/Debug-watchos -F /Applications/Xcode-16.3.0.app/Contents/Developer/Platforms/WatchOS.platform/Developer/Library/Frameworks -F /Applications/Xcode-16.3.0.app/Contents/Developer/Platforms/WatchOS.platform/Developer/SDKs/WatchOS11.4.sdk/Developer/Library/Frameworks -c -j10 -enable-batch-mode -incremental -Xcc -ivfsstatcache -Xcc /Users/admin/builder/spi-builder-workspace/.derivedData/SDKStatCaches.noindex/watchos11.4-22T246-43efb940ff07ba2497b70ec94253f576.sdkstatcache -output-file-map /Users/admin/builder/spi-builder-workspace/.derivedData/Build/Intermediates.noindex/VisualEffectView.build/Debug-watchos/VisualEffectView.build/Objects-normal/arm64/VisualEffectView-OutputFileMap.json -use-frontend-parseable-output -save-temps -no-color-diagnostics -serialize-diagnostics -emit-dependencies -emit-module -emit-module-path /Users/admin/builder/spi-builder-workspace/.derivedData/Build/Intermediates.noindex/VisualEffectView.build/Debug-watchos/VisualEffectView.build/Objects-normal/arm64/VisualEffectView.swiftmodule -validate-clang-modules-once -clang-build-session-file /Users/admin/builder/spi-builder-workspace/.derivedData/ModuleCache.noindex/Session.modulevalidation -Xcc -I/Users/admin/builder/spi-builder-workspace/.derivedData/Build/Intermediates.noindex/VisualEffectView.build/Debug-watchos/VisualEffectView.build/swift-overrides.hmap -emit-const-values -Xfrontend -const-gather-protocols-file -Xfrontend /Users/admin/builder/spi-builder-workspace/.derivedData/Build/Intermediates.noindex/VisualEffectView.build/Debug-watchos/VisualEffectView.build/Objects-normal/arm64/VisualEffectView_const_extract_protocols.json -Xcc -I/Users/admin/builder/spi-builder-workspace/.derivedData/Build/Products/Debug-watchos/include -Xcc -I/Users/admin/builder/spi-builder-workspace/.derivedData/Build/Intermediates.noindex/VisualEffectView.build/Debug-watchos/VisualEffectView.build/DerivedSources-normal/arm64 -Xcc -I/Users/admin/builder/spi-builder-workspace/.derivedData/Build/Intermediates.noindex/VisualEffectView.build/Debug-watchos/VisualEffectView.build/DerivedSources/arm64 -Xcc -I/Users/admin/builder/spi-builder-workspace/.derivedData/Build/Intermediates.noindex/VisualEffectView.build/Debug-watchos/VisualEffectView.build/DerivedSources -Xcc -DSWIFT_PACKAGE -Xcc -DDEBUG\=1 -emit-objc-header -emit-objc-header-path /Users/admin/builder/spi-builder-workspace/.derivedData/Build/Intermediates.noindex/VisualEffectView.build/Debug-watchos/VisualEffectView.build/Objects-normal/arm64/VisualEffectView-Swift.h -working-directory /Users/admin/builder/spi-builder-workspace/.swiftpm/xcode -experimental-emit-module-separately -disable-cmo
SwiftDriver VisualEffectView normal armv7k com.apple.xcode.tools.swift.compiler (in target 'VisualEffectView' from project 'VisualEffectView')
    cd /Users/admin/builder/spi-builder-workspace/.swiftpm/xcode
    builtin-SwiftDriver -- /Applications/Xcode-16.3.0.app/Contents/Developer/Toolchains/XcodeDefault.xctoolchain/usr/bin/swiftc -module-name VisualEffectView -Onone -enforce-exclusivity\=checked @/Users/admin/builder/spi-builder-workspace/.derivedData/Build/Intermediates.noindex/VisualEffectView.build/Debug-watchos/VisualEffectView.build/Objects-normal/armv7k/VisualEffectView.SwiftFileList -DSWIFT_PACKAGE -DDEBUG -DXcode -plugin-path /Applications/Xcode-16.3.0.app/Contents/Developer/Toolchains/XcodeDefault.xctoolchain/usr/lib/swift/host/plugins/testing -enable-experimental-feature DebugDescriptionMacro -sdk /Applications/Xcode-16.3.0.app/Contents/Developer/Platforms/WatchOS.platform/Developer/SDKs/WatchOS11.4.sdk -target armv7k-apple-watchos5.0 -g -module-cache-path /Users/admin/builder/spi-builder-workspace/.derivedData/ModuleCache.noindex -Xfrontend -serialize-debugging-options -enable-testing -index-store-path /Users/admin/builder/spi-builder-workspace/.derivedData/Index.noindex/DataStore -swift-version 5 -I /Users/admin/builder/spi-builder-workspace/.derivedData/Build/Products/Debug-watchos -I /Applications/Xcode-16.3.0.app/Contents/Developer/Platforms/WatchOS.platform/Developer/usr/lib -F /Users/admin/builder/spi-builder-workspace/.derivedData/Build/Products/Debug-watchos -F /Applications/Xcode-16.3.0.app/Contents/Developer/Platforms/WatchOS.platform/Developer/Library/Frameworks -F /Applications/Xcode-16.3.0.app/Contents/Developer/Platforms/WatchOS.platform/Developer/SDKs/WatchOS11.4.sdk/Developer/Library/Frameworks -c -j10 -enable-batch-mode -incremental -Xcc -ivfsstatcache -Xcc /Users/admin/builder/spi-builder-workspace/.derivedData/SDKStatCaches.noindex/watchos11.4-22T246-43efb940ff07ba2497b70ec94253f576.sdkstatcache -output-file-map /Users/admin/builder/spi-builder-workspace/.derivedData/Build/Intermediates.noindex/VisualEffectView.build/Debug-watchos/VisualEffectView.build/Objects-normal/armv7k/VisualEffectView-OutputFileMap.json -use-frontend-parseable-output -save-temps -no-color-diagnostics -serialize-diagnostics -emit-dependencies -emit-module -emit-module-path /Users/admin/builder/spi-builder-workspace/.derivedData/Build/Intermediates.noindex/VisualEffectView.build/Debug-watchos/VisualEffectView.build/Objects-normal/armv7k/VisualEffectView.swiftmodule -validate-clang-modules-once -clang-build-session-file /Users/admin/builder/spi-builder-workspace/.derivedData/ModuleCache.noindex/Session.modulevalidation -Xcc -I/Users/admin/builder/spi-builder-workspace/.derivedData/Build/Intermediates.noindex/VisualEffectView.build/Debug-watchos/VisualEffectView.build/swift-overrides.hmap -emit-const-values -Xfrontend -const-gather-protocols-file -Xfrontend /Users/admin/builder/spi-builder-workspace/.derivedData/Build/Intermediates.noindex/VisualEffectView.build/Debug-watchos/VisualEffectView.build/Objects-normal/armv7k/VisualEffectView_const_extract_protocols.json -Xcc -I/Users/admin/builder/spi-builder-workspace/.derivedData/Build/Products/Debug-watchos/include -Xcc -I/Users/admin/builder/spi-builder-workspace/.derivedData/Build/Intermediates.noindex/VisualEffectView.build/Debug-watchos/VisualEffectView.build/DerivedSources-normal/armv7k -Xcc -I/Users/admin/builder/spi-builder-workspace/.derivedData/Build/Intermediates.noindex/VisualEffectView.build/Debug-watchos/VisualEffectView.build/DerivedSources/armv7k -Xcc -I/Users/admin/builder/spi-builder-workspace/.derivedData/Build/Intermediates.noindex/VisualEffectView.build/Debug-watchos/VisualEffectView.build/DerivedSources -Xcc -DSWIFT_PACKAGE -Xcc -DDEBUG\=1 -emit-objc-header -emit-objc-header-path /Users/admin/builder/spi-builder-workspace/.derivedData/Build/Intermediates.noindex/VisualEffectView.build/Debug-watchos/VisualEffectView.build/Objects-normal/armv7k/VisualEffectView-Swift.h -working-directory /Users/admin/builder/spi-builder-workspace/.swiftpm/xcode -experimental-emit-module-separately -disable-cmo
SwiftDriver VisualEffectView normal arm64_32 com.apple.xcode.tools.swift.compiler (in target 'VisualEffectView' from project 'VisualEffectView')
    cd /Users/admin/builder/spi-builder-workspace/.swiftpm/xcode
    builtin-SwiftDriver -- /Applications/Xcode-16.3.0.app/Contents/Developer/Toolchains/XcodeDefault.xctoolchain/usr/bin/swiftc -module-name VisualEffectView -Onone -enforce-exclusivity\=checked @/Users/admin/builder/spi-builder-workspace/.derivedData/Build/Intermediates.noindex/VisualEffectView.build/Debug-watchos/VisualEffectView.build/Objects-normal/arm64_32/VisualEffectView.SwiftFileList -DSWIFT_PACKAGE -DDEBUG -DXcode -plugin-path /Applications/Xcode-16.3.0.app/Contents/Developer/Toolchains/XcodeDefault.xctoolchain/usr/lib/swift/host/plugins/testing -enable-experimental-feature DebugDescriptionMacro -sdk /Applications/Xcode-16.3.0.app/Contents/Developer/Platforms/WatchOS.platform/Developer/SDKs/WatchOS11.4.sdk -target arm64_32-apple-watchos5.0 -g -module-cache-path /Users/admin/builder/spi-builder-workspace/.derivedData/ModuleCache.noindex -Xfrontend -serialize-debugging-options -enable-testing -index-store-path /Users/admin/builder/spi-builder-workspace/.derivedData/Index.noindex/DataStore -swift-version 5 -I /Users/admin/builder/spi-builder-workspace/.derivedData/Build/Products/Debug-watchos -I /Applications/Xcode-16.3.0.app/Contents/Developer/Platforms/WatchOS.platform/Developer/usr/lib -F /Users/admin/builder/spi-builder-workspace/.derivedData/Build/Products/Debug-watchos -F /Applications/Xcode-16.3.0.app/Contents/Developer/Platforms/WatchOS.platform/Developer/Library/Frameworks -F /Applications/Xcode-16.3.0.app/Contents/Developer/Platforms/WatchOS.platform/Developer/SDKs/WatchOS11.4.sdk/Developer/Library/Frameworks -c -j10 -enable-batch-mode -incremental -Xcc -ivfsstatcache -Xcc /Users/admin/builder/spi-builder-workspace/.derivedData/SDKStatCaches.noindex/watchos11.4-22T246-43efb940ff07ba2497b70ec94253f576.sdkstatcache -output-file-map /Users/admin/builder/spi-builder-workspace/.derivedData/Build/Intermediates.noindex/VisualEffectView.build/Debug-watchos/VisualEffectView.build/Objects-normal/arm64_32/VisualEffectView-OutputFileMap.json -use-frontend-parseable-output -save-temps -no-color-diagnostics -serialize-diagnostics -emit-dependencies -emit-module -emit-module-path /Users/admin/builder/spi-builder-workspace/.derivedData/Build/Intermediates.noindex/VisualEffectView.build/Debug-watchos/VisualEffectView.build/Objects-normal/arm64_32/VisualEffectView.swiftmodule -validate-clang-modules-once -clang-build-session-file /Users/admin/builder/spi-builder-workspace/.derivedData/ModuleCache.noindex/Session.modulevalidation -Xcc -I/Users/admin/builder/spi-builder-workspace/.derivedData/Build/Intermediates.noindex/VisualEffectView.build/Debug-watchos/VisualEffectView.build/swift-overrides.hmap -emit-const-values -Xfrontend -const-gather-protocols-file -Xfrontend /Users/admin/builder/spi-builder-workspace/.derivedData/Build/Intermediates.noindex/VisualEffectView.build/Debug-watchos/VisualEffectView.build/Objects-normal/arm64_32/VisualEffectView_const_extract_protocols.json -Xcc -I/Users/admin/builder/spi-builder-workspace/.derivedData/Build/Products/Debug-watchos/include -Xcc -I/Users/admin/builder/spi-builder-workspace/.derivedData/Build/Intermediates.noindex/VisualEffectView.build/Debug-watchos/VisualEffectView.build/DerivedSources-normal/arm64_32 -Xcc -I/Users/admin/builder/spi-builder-workspace/.derivedData/Build/Intermediates.noindex/VisualEffectView.build/Debug-watchos/VisualEffectView.build/DerivedSources/arm64_32 -Xcc -I/Users/admin/builder/spi-builder-workspace/.derivedData/Build/Intermediates.noindex/VisualEffectView.build/Debug-watchos/VisualEffectView.build/DerivedSources -Xcc -DSWIFT_PACKAGE -Xcc -DDEBUG\=1 -emit-objc-header -emit-objc-header-path /Users/admin/builder/spi-builder-workspace/.derivedData/Build/Intermediates.noindex/VisualEffectView.build/Debug-watchos/VisualEffectView.build/Objects-normal/arm64_32/VisualEffectView-Swift.h -working-directory /Users/admin/builder/spi-builder-workspace/.swiftpm/xcode -experimental-emit-module-separately -disable-cmo
SwiftCompile normal armv7k Compiling\ UIViewEffectView+Helpers.swift /Users/admin/builder/spi-builder-workspace/Sources/UIViewEffectView+Helpers.swift (in target 'VisualEffectView' from project 'VisualEffectView')
SwiftCompile normal armv7k /Users/admin/builder/spi-builder-workspace/Sources/UIViewEffectView+Helpers.swift (in target 'VisualEffectView' from project 'VisualEffectView')
    cd /Users/admin/builder/spi-builder-workspace/.swiftpm/xcode

SwiftEmitModule normal armv7k Emitting\ module\ for\ VisualEffectView (in target 'VisualEffectView' from project 'VisualEffectView')
Failed frontend command:
/Applications/Xcode-16.3.0.app/Contents/Developer/Toolchains/XcodeDefault.xctoolchain/usr/bin/swift-frontend -frontend -emit-module -experimental-skip-non-inlinable-function-bodies-without-types /Users/admin/builder/spi-builder-workspace/Sources/UIViewEffectView+Helpers.swift /Users/admin/builder/spi-builder-workspace/Sources/VisualEffectView+SwiftUI.swift /Users/admin/builder/spi-builder-workspace/Sources/VisualEffectView.swift -target armv7k-apple-watchos5.0 -enable-objc-interop -sdk /Applications/Xcode-16.3.0.app/Contents/Developer/Platforms/WatchOS.platform/Developer/SDKs/WatchOS11.4.sdk -I /Users/admin/builder/spi-builder-workspace/.derivedData/Build/Products/Debug-watchos -I /Applications/Xcode-16.3.0.app/Contents/Developer/Platforms/WatchOS.platform/Developer/usr/lib -F /Users/admin/builder/spi-builder-workspace/.derivedData/Build/Products/Debug-watchos -F /Applications/Xcode-16.3.0.app/Contents/Developer/Platforms/WatchOS.platform/Developer/Library/Frameworks -F /Applications/Xcode-16.3.0.app/Contents/Developer/Platforms/WatchOS.platform/Developer/SDKs/WatchOS11.4.sdk/Developer/Library/Frameworks -no-color-diagnostics -enable-testing -g -debug-info-format\=dwarf -dwarf-version\=4 -module-cache-path /Users/admin/builder/spi-builder-workspace/.derivedData/ModuleCache.noindex -swift-version 5 -enforce-exclusivity\=checked -Onone -D SWIFT_PACKAGE -D DEBUG -D Xcode -serialize-debugging-options -const-gather-protocols-file /Users/admin/builder/spi-builder-workspace/.derivedData/Build/Intermediates.noindex/VisualEffectView.build/Debug-watchos/VisualEffectView.build/Objects-normal/armv7k/VisualEffectView_const_extract_protocols.json -enable-experimental-feature DebugDescriptionMacro -empty-abi-descriptor -plugin-path /Applications/Xcode-16.3.0.app/Contents/Developer/Toolchains/XcodeDefault.xctoolchain/usr/lib/swift/host/plugins/testing -validate-clang-modules-once -clang-build-session-file /Users/admin/builder/spi-builder-workspace/.derivedData/ModuleCache.noindex/Session.modulevalidation -Xcc -working-directory -Xcc /Users/admin/builder/spi-builder-workspace/.swiftpm/xcode -resource-dir /Applications/Xcode-16.3.0.app/Contents/Developer/Toolchains/XcodeDefault.xctoolchain/usr/lib/swift -enable-anonymous-context-mangled-names -file-compilation-dir /Users/admin/builder/spi-builder-workspace/.swiftpm/xcode -Xcc -ivfsstatcache -Xcc /Users/admin/builder/spi-builder-workspace/.derivedData/SDKStatCaches.noindex/watchos11.4-22T246-43efb940ff07ba2497b70ec94253f576.sdkstatcache -Xcc -I/Users/admin/builder/spi-builder-workspace/.derivedData/Build/Intermediates.noindex/VisualEffectView.build/Debug-watchos/VisualEffectView.build/swift-overrides.hmap -Xcc -I/Users/admin/builder/spi-builder-workspace/.derivedData/Build/Products/Debug-watchos/include -Xcc -I/Users/admin/builder/spi-builder-workspace/.derivedData/Build/Intermediates.noindex/VisualEffectView.build/Debug-watchos/VisualEffectView.build/DerivedSources-normal/armv7k -Xcc -I/Users/admin/builder/spi-builder-workspace/.derivedData/Build/Intermediates.noindex/VisualEffectView.build/Debug-watchos/VisualEffectView.build/DerivedSources/armv7k -Xcc -I/Users/admin/builder/spi-builder-workspace/.derivedData/Build/Intermediates.noindex/VisualEffectView.build/Debug-watchos/VisualEffectView.build/DerivedSources -Xcc -DSWIFT_PACKAGE -Xcc -DDEBUG\=1 -module-name VisualEffectView -frontend-parseable-output -disable-clang-spi -target-sdk-version 11.4 -target-sdk-name watchos11.4 -external-plugin-path /Applications/Xcode-16.3.0.app/Contents/Developer/Platforms/WatchOS.platform/Developer/usr/lib/swift/host/plugins\#/Applications/Xcode-16.3.0.app/Contents/Developer/Platforms/WatchOS.platform/Developer/usr/bin/swift-plugin-server -external-plugin-path /Applications/Xcode-16.3.0.app/Contents/Developer/Platforms/WatchOS.platform/Developer/usr/local/lib/swift/host/plugins\#/Applications/Xcode-16.3.0.app/Contents/Developer/Platforms/WatchOS.platform/Developer/usr/bin/swift-plugin-server -in-process-plugin-server-path /Applications/Xcode-16.3.0.app/Contents/Developer/Toolchains/XcodeDefault.xctoolchain/usr/lib/swift/host/libSwiftInProcPluginServer.dylib -plugin-path /Applications/Xcode-16.3.0.app/Contents/Developer/Toolchains/XcodeDefault.xctoolchain/usr/lib/swift/host/plugins -plugin-path /Applications/Xcode-16.3.0.app/Contents/Developer/Toolchains/XcodeDefault.xctoolchain/usr/local/lib/swift/host/plugins -emit-module-doc-path /Users/admin/builder/spi-builder-workspace/.derivedData/Build/Intermediates.noindex/VisualEffectView.build/Debug-watchos/VisualEffectView.build/Objects-normal/armv7k/VisualEffectView.swiftdoc -emit-module-source-info-path /Users/admin/builder/spi-builder-workspace/.derivedData/Build/Intermediates.noindex/VisualEffectView.build/Debug-watchos/VisualEffectView.build/Objects-normal/armv7k/VisualEffectView.swiftsourceinfo -emit-objc-header-path /Users/admin/builder/spi-builder-workspace/.derivedData/Build/Intermediates.noindex/VisualEffectView.build/Debug-watchos/VisualEffectView.build/Objects-normal/armv7k/VisualEffectView-Swift.h -serialize-diagnostics-path /Users/admin/builder/spi-builder-workspace/.derivedData/Build/Intermediates.noindex/VisualEffectView.build/Debug-watchos/VisualEffectView.build/Objects-normal/armv7k/VisualEffectView-master-emit-module.dia -emit-dependencies-path /Users/admin/builder/spi-builder-workspace/.derivedData/Build/Intermediates.noindex/VisualEffectView.build/Debug-watchos/VisualEffectView.build/Objects-normal/armv7k/VisualEffectView-master-emit-module.d -o /Users/admin/builder/spi-builder-workspace/.derivedData/Build/Intermediates.noindex/VisualEffectView.build/Debug-watchos/VisualEffectView.build/Objects-normal/armv7k/VisualEffectView.swiftmodule -emit-abi-descriptor-path /Users/admin/builder/spi-builder-workspace/.derivedData/Build/Intermediates.noindex/VisualEffectView.build/Debug-watchos/VisualEffectView.build/Objects-normal/armv7k/VisualEffectView.abi.json
EmitSwiftModule normal armv7k (in target 'VisualEffectView' from project 'VisualEffectView')
    cd /Users/admin/builder/spi-builder-workspace/.swiftpm/xcode

/Users/admin/builder/spi-builder-workspace/Sources/UIViewEffectView+Helpers.swift:10:11: error: cannot find type 'UIVisualEffectView' in scope
extension UIVisualEffectView {
          ^~~~~~~~~~~~~~~~~~
/Users/admin/builder/spi-builder-workspace/Sources/UIViewEffectView+Helpers.swift:42:19: error: cannot find type 'UIView' in scope
private extension UIView {
                  ^~~~~~
/Applications/Xcode-16.3.0.app/Contents/Developer/Platforms/WatchOS.platform/Developer/SDKs/WatchOS11.4.sdk/System/Library/Frameworks/UIKit.framework/Headers/NSTextAttachment.h:23:1: note: interface 'UIView' forward declared here
@class UIView;
^
/Users/admin/builder/spi-builder-workspace/Sources/VisualEffectView+SwiftUI.swift:12:20: error: 'Color' is only available in watchOS 6.0 or newer
    let colorTint: Color?
                   ^
/Users/admin/builder/spi-builder-workspace/Sources/VisualEffectView+SwiftUI.swift:11:15: note: add @available attribute to enclosing struct
public struct VisualEffect: UIViewRepresentable {
              ^
/Users/admin/builder/spi-builder-workspace/Sources/VisualEffectView+SwiftUI.swift:17:28: error: 'Color' is only available in watchOS 6.0 or newer
    public init(colorTint: Color? = nil, colorTintAlpha: CGFloat = 0, blurRadius: CGFloat = 0, scale: CGFloat = 1) {
                           ^
/Users/admin/builder/spi-builder-workspace/Sources/VisualEffectView+SwiftUI.swift:17:12: note: add @available attribute to enclosing initializer
    public init(colorTint: Color? = nil, colorTintAlpha: CGFloat = 0, blurRadius: CGFloat = 0, scale: CGFloat = 1) {
           ^
/Users/admin/builder/spi-builder-workspace/Sources/VisualEffectView+SwiftUI.swift:11:15: note: add @available attribute to enclosing struct
public struct VisualEffect: UIViewRepresentable {
              ^
/Users/admin/builder/spi-builder-workspace/Sources/VisualEffectView+SwiftUI.swift:24:37: error: cannot find type 'Context' in scope
    public func makeUIView(context: Context) -> VisualEffectView {
                                    ^~~~~~~
/Users/admin/builder/spi-builder-workspace/Sources/VisualEffectView+SwiftUI.swift:38:67: error: cannot find type 'Context' in scope
    public func updateUIView(_ uiView: VisualEffectView, context: Context) {
                                                                  ^~~~~~~
/Users/admin/builder/spi-builder-workspace/Sources/VisualEffectView+SwiftUI.swift:11:29: error: cannot find type 'UIViewRepresentable' in scope
public struct VisualEffect: UIViewRepresentable {
                            ^~~~~~~~~~~~~~~~~~~
/Users/admin/builder/spi-builder-workspace/Sources/VisualEffectView+SwiftUI.swift:49:26: error: 'some' return types are only available in watchOS 6.0.0 or newer
    static var previews: some View {
                         ^
/Users/admin/builder/spi-builder-workspace/Sources/VisualEffectView+SwiftUI.swift:49:16: note: add @available attribute to enclosing static property
    static var previews: some View {
               ^
/Users/admin/builder/spi-builder-workspace/Sources/VisualEffectView+SwiftUI.swift:48:8: note: add @available attribute to enclosing struct
struct VisualEffect_Previews: PreviewProvider {
       ^
/Users/admin/builder/spi-builder-workspace/Sources/VisualEffectView+SwiftUI.swift:49:31: error: 'View' is only available in watchOS 6.0 or newer
    static var previews: some View {
                              ^
/Users/admin/builder/spi-builder-workspace/Sources/VisualEffectView+SwiftUI.swift:49:16: note: add @available attribute to enclosing static property
    static var previews: some View {
               ^
/Users/admin/builder/spi-builder-workspace/Sources/VisualEffectView+SwiftUI.swift:48:8: note: add @available attribute to enclosing struct
struct VisualEffect_Previews: PreviewProvider {
       ^
/Users/admin/builder/spi-builder-workspace/Sources/VisualEffectView+SwiftUI.swift:61:19: error: 'Color' is only available in watchOS 6.0 or newer
private extension Color {
                  ^
/Users/admin/builder/spi-builder-workspace/Sources/VisualEffectView+SwiftUI.swift:61:9: note: add @available attribute to enclosing extension
private extension Color {
        ^
/Users/admin/builder/spi-builder-workspace/Sources/VisualEffectView.swift:16:76: error: cannot find type 'UIBlurEffect' in scope
    private let blurEffect = (NSClassFromString("_UICustomBlurEffect") as! UIBlurEffect.Type).init()
                                                                           ^~~~~~~~~~~~
/Users/admin/builder/spi-builder-workspace/Sources/VisualEffectView.swift:77:34: error: cannot find type 'UIVisualEffect' in scope
    public override init(effect: UIVisualEffect?) {
                                 ^~~~~~~~~~~~~~
/Users/admin/builder/spi-builder-workspace/Sources/VisualEffectView.swift:13:30: error: cannot find type 'UIVisualEffectView' in scope
open class VisualEffectView: UIVisualEffectView {
                             ^~~~~~~~~~~~~~~~~~
SwiftEmitModule normal arm64_32 Emitting\ module\ for\ VisualEffectView (in target 'VisualEffectView' from project 'VisualEffectView')
EmitSwiftModule normal arm64_32 (in target 'VisualEffectView' from project 'VisualEffectView')
    cd /Users/admin/builder/spi-builder-workspace/.swiftpm/xcode

/Users/admin/builder/spi-builder-workspace/Sources/UIViewEffectView+Helpers.swift:10:11: error: cannot find type 'UIVisualEffectView' in scope
extension UIVisualEffectView {
          ^~~~~~~~~~~~~~~~~~
/Users/admin/builder/spi-builder-workspace/Sources/UIViewEffectView+Helpers.swift:42:19: error: cannot find type 'UIView' in scope
private extension UIView {
                  ^~~~~~
/Applications/Xcode-16.3.0.app/Contents/Developer/Platforms/WatchOS.platform/Developer/SDKs/WatchOS11.4.sdk/System/Library/Frameworks/UIKit.framework/Headers/NSTextAttachment.h:23:1: note: interface 'UIView' forward declared here
@class UIView;
^
/Users/admin/builder/spi-builder-workspace/Sources/VisualEffectView+SwiftUI.swift:12:20: error: 'Color' is only available in watchOS 6.0 or newer
    let colorTint: Color?
                   ^
/Users/admin/builder/spi-builder-workspace/Sources/VisualEffectView+SwiftUI.swift:11:15: note: add @available attribute to enclosing struct
public struct VisualEffect: UIViewRepresentable {
              ^
/Users/admin/builder/spi-builder-workspace/Sources/VisualEffectView+SwiftUI.swift:17:28: error: 'Color' is only available in watchOS 6.0 or newer
    public init(colorTint: Color? = nil, colorTintAlpha: CGFloat = 0, blurRadius: CGFloat = 0, scale: CGFloat = 1) {
                           ^
/Users/admin/builder/spi-builder-workspace/Sources/VisualEffectView+SwiftUI.swift:17:12: note: add @available attribute to enclosing initializer
    public init(colorTint: Color? = nil, colorTintAlpha: CGFloat = 0, blurRadius: CGFloat = 0, scale: CGFloat = 1) {
           ^
/Users/admin/builder/spi-builder-workspace/Sources/VisualEffectView+SwiftUI.swift:11:15: note: add @available attribute to enclosing struct
public struct VisualEffect: UIViewRepresentable {
              ^
/Users/admin/builder/spi-builder-workspace/Sources/VisualEffectView+SwiftUI.swift:24:37: error: cannot find type 'Context' in scope
    public func makeUIView(context: Context) -> VisualEffectView {
                                    ^~~~~~~
/Users/admin/builder/spi-builder-workspace/Sources/VisualEffectView+SwiftUI.swift:38:67: error: cannot find type 'Context' in scope
    public func updateUIView(_ uiView: VisualEffectView, context: Context) {
                                                                  ^~~~~~~
/Users/admin/builder/spi-builder-workspace/Sources/VisualEffectView+SwiftUI.swift:11:29: error: cannot find type 'UIViewRepresentable' in scope
public struct VisualEffect: UIViewRepresentable {
                            ^~~~~~~~~~~~~~~~~~~
/Users/admin/builder/spi-builder-workspace/Sources/VisualEffectView+SwiftUI.swift:49:26: error: 'some' return types are only available in watchOS 6.0.0 or newer
    static var previews: some View {
                         ^
/Users/admin/builder/spi-builder-workspace/Sources/VisualEffectView+SwiftUI.swift:49:16: note: add @available attribute to enclosing static property
    static var previews: some View {
               ^
/Users/admin/builder/spi-builder-workspace/Sources/VisualEffectView+SwiftUI.swift:48:8: note: add @available attribute to enclosing struct
struct VisualEffect_Previews: PreviewProvider {
       ^
/Users/admin/builder/spi-builder-workspace/Sources/VisualEffectView+SwiftUI.swift:49:31: error: 'View' is only available in watchOS 6.0 or newer
    static var previews: some View {
                              ^
/Users/admin/builder/spi-builder-workspace/Sources/VisualEffectView+SwiftUI.swift:49:16: note: add @available attribute to enclosing static property
    static var previews: some View {
               ^
/Users/admin/builder/spi-builder-workspace/Sources/VisualEffectView+SwiftUI.swift:48:8: note: add @available attribute to enclosing struct
struct VisualEffect_Previews: PreviewProvider {
       ^
/Users/admin/builder/spi-builder-workspace/Sources/VisualEffectView+SwiftUI.swift:61:19: error: 'Color' is only available in watchOS 6.0 or newer
private extension Color {
                  ^
/Users/admin/builder/spi-builder-workspace/Sources/VisualEffectView+SwiftUI.swift:61:9: note: add @available attribute to enclosing extension
private extension Color {
        ^
/Users/admin/builder/spi-builder-workspace/Sources/VisualEffectView.swift:16:76: error: cannot find type 'UIBlurEffect' in scope
    private let blurEffect = (NSClassFromString("_UICustomBlurEffect") as! UIBlurEffect.Type).init()
                                                                           ^~~~~~~~~~~~
/Users/admin/builder/spi-builder-workspace/Sources/VisualEffectView.swift:77:34: error: cannot find type 'UIVisualEffect' in scope
    public override init(effect: UIVisualEffect?) {
                                 ^~~~~~~~~~~~~~
/Users/admin/builder/spi-builder-workspace/Sources/VisualEffectView.swift:13:30: error: cannot find type 'UIVisualEffectView' in scope
open class VisualEffectView: UIVisualEffectView {
                             ^~~~~~~~~~~~~~~~~~
SwiftCompile normal arm64_32 Compiling\ VisualEffectView+SwiftUI.swift /Users/admin/builder/spi-builder-workspace/Sources/VisualEffectView+SwiftUI.swift (in target 'VisualEffectView' from project 'VisualEffectView')
SwiftCompile normal arm64_32 /Users/admin/builder/spi-builder-workspace/Sources/VisualEffectView+SwiftUI.swift (in target 'VisualEffectView' from project 'VisualEffectView')
    cd /Users/admin/builder/spi-builder-workspace/.swiftpm/xcode

SwiftCompile normal arm64 Compiling\ UIViewEffectView+Helpers.swift /Users/admin/builder/spi-builder-workspace/Sources/UIViewEffectView+Helpers.swift (in target 'VisualEffectView' from project 'VisualEffectView')
SwiftCompile normal arm64 /Users/admin/builder/spi-builder-workspace/Sources/UIViewEffectView+Helpers.swift (in target 'VisualEffectView' from project 'VisualEffectView')
    cd /Users/admin/builder/spi-builder-workspace/.swiftpm/xcode

SwiftCompile normal armv7k Compiling\ VisualEffectView+SwiftUI.swift /Users/admin/builder/spi-builder-workspace/Sources/VisualEffectView+SwiftUI.swift (in target 'VisualEffectView' from project 'VisualEffectView')
SwiftCompile normal armv7k /Users/admin/builder/spi-builder-workspace/Sources/VisualEffectView+SwiftUI.swift (in target 'VisualEffectView' from project 'VisualEffectView')
    cd /Users/admin/builder/spi-builder-workspace/.swiftpm/xcode

SwiftEmitModule normal arm64 Emitting\ module\ for\ VisualEffectView (in target 'VisualEffectView' from project 'VisualEffectView')
EmitSwiftModule normal arm64 (in target 'VisualEffectView' from project 'VisualEffectView')
    cd /Users/admin/builder/spi-builder-workspace/.swiftpm/xcode

SwiftCompile normal arm64_32 Compiling\ UIViewEffectView+Helpers.swift /Users/admin/builder/spi-builder-workspace/Sources/UIViewEffectView+Helpers.swift (in target 'VisualEffectView' from project 'VisualEffectView')
SwiftCompile normal arm64_32 /Users/admin/builder/spi-builder-workspace/Sources/UIViewEffectView+Helpers.swift (in target 'VisualEffectView' from project 'VisualEffectView')
    cd /Users/admin/builder/spi-builder-workspace/.swiftpm/xcode

SwiftCompile normal arm64 Compiling\ VisualEffectView+SwiftUI.swift /Users/admin/builder/spi-builder-workspace/Sources/VisualEffectView+SwiftUI.swift (in target 'VisualEffectView' from project 'VisualEffectView')
SwiftCompile normal arm64 /Users/admin/builder/spi-builder-workspace/Sources/VisualEffectView+SwiftUI.swift (in target 'VisualEffectView' from project 'VisualEffectView')
    cd /Users/admin/builder/spi-builder-workspace/.swiftpm/xcode

SwiftCompile normal arm64_32 Compiling\ VisualEffectView.swift /Users/admin/builder/spi-builder-workspace/Sources/VisualEffectView.swift (in target 'VisualEffectView' from project 'VisualEffectView')
SwiftCompile normal arm64_32 /Users/admin/builder/spi-builder-workspace/Sources/VisualEffectView.swift (in target 'VisualEffectView' from project 'VisualEffectView')
    cd /Users/admin/builder/spi-builder-workspace/.swiftpm/xcode

SwiftCompile normal arm64 Compiling\ VisualEffectView.swift /Users/admin/builder/spi-builder-workspace/Sources/VisualEffectView.swift (in target 'VisualEffectView' from project 'VisualEffectView')
Command SwiftCompile failed with a nonzero exit code
** BUILD FAILED **
The following build commands failed:
	SwiftEmitModule normal armv7k Emitting\ module\ for\ VisualEffectView (in target 'VisualEffectView' from project 'VisualEffectView')
	EmitSwiftModule normal armv7k (in target 'VisualEffectView' from project 'VisualEffectView')
	EmitSwiftModule normal arm64_32 (in target 'VisualEffectView' from project 'VisualEffectView')
	SwiftCompile normal arm64 Compiling\ VisualEffectView.swift /Users/admin/builder/spi-builder-workspace/Sources/VisualEffectView.swift (in target 'VisualEffectView' from project 'VisualEffectView')
	Building workspace spi-builder-workspace with scheme VisualEffectView
(5 failures)
BUILD FAILURE 6.1 watchOS