Build Information
Failed to build SKHelper, reference 1.1.4 (67dff4
), with Swift 6.1 for tvOS using Xcode 16.3 on 29 Apr 2025 18:48:39 UTC.
Build Command
env DEVELOPER_DIR=/Applications/Xcode-16.3.0.app xcrun xcodebuild -IDEClonedSourcePackagesDirPathOverride=$PWD/.dependencies -skipMacroValidation -skipPackagePluginValidation -derivedDataPath $PWD/.derivedData build -scheme SKHelper -destination generic/platform=tvOS
Build Log
========================================
RunAll
========================================
Builder version: 4.61.1
Interrupt handler set up.
========================================
Checkout
========================================
Clone URL: https://github.com/russell-archer/SKHelper.git
Reference: 1.1.4
Initialized empty Git repository in /Users/admin/builder/spi-builder-workspace/.git/
From https://github.com/russell-archer/SKHelper
* tag 1.1.4 -> FETCH_HEAD
HEAD is now at 67dff45 Added OnTransaction(update) view modifier; refactored support files
Updating files: 81% (7729/9539)
Updating files: 82% (7822/9539)
Updating files: 83% (7918/9539)
Updating files: 84% (8013/9539)
Updating files: 85% (8109/9539)
Updating files: 86% (8204/9539)
Updating files: 87% (8299/9539)
Updating files: 88% (8395/9539)
Updating files: 89% (8490/9539)
Updating files: 90% (8586/9539)
Updating files: 91% (8681/9539)
Updating files: 92% (8776/9539)
Updating files: 93% (8872/9539)
Updating files: 94% (8967/9539)
Updating files: 95% (9063/9539)
Updating files: 96% (9158/9539)
Updating files: 97% (9253/9539)
Updating files: 98% (9349/9539)
Updating files: 99% (9444/9539)
Updating files: 100% (9539/9539)
Updating files: 100% (9539/9539), done.
Cloned https://github.com/russell-archer/SKHelper.git
Revision (git rev-parse @):
67dff4569331cc57520c778de213888a8e8e943f
SUCCESS checkout https://github.com/russell-archer/SKHelper.git at 1.1.4
========================================
Build
========================================
Selected platform: tvOS
Swift version: 6.1
Building package at path: $PWD
https://github.com/russell-archer/SKHelper.git
https://github.com/russell-archer/SKHelper.git
{
"dependencies" : [
{
"identity" : "swift-docc-plugin",
"requirement" : {
"range" : [
{
"lower_bound" : "1.3.0",
"upper_bound" : "2.0.0"
}
]
},
"type" : "sourceControl",
"url" : "https://github.com/apple/swift-docc-plugin.git"
}
],
"manifest_display_name" : "SKHelper",
"name" : "SKHelper",
"path" : "/Users/admin/builder/spi-builder-workspace",
"platforms" : [
{
"name" : "ios",
"version" : "17.0"
},
{
"name" : "macos",
"version" : "14.6"
}
],
"products" : [
{
"name" : "SKHelper",
"targets" : [
"SKHelper"
],
"type" : {
"library" : [
"automatic"
]
}
}
],
"targets" : [
{
"c99name" : "SKHelper",
"module_type" : "SwiftTarget",
"name" : "SKHelper",
"path" : "Sources/SKHelper",
"product_memberships" : [
"SKHelper"
],
"resources" : [
{
"path" : "/Users/admin/builder/spi-builder-workspace/Sources/SKHelper/Resources/PrivacyInfo.xcprivacy",
"rule" : {
"process" : {
}
}
},
{
"path" : "/Users/admin/builder/spi-builder-workspace/Sources/SKHelper/Resources/images/skhelper-logo-small.png",
"rule" : {
"process" : {
}
}
},
{
"path" : "/Users/admin/builder/spi-builder-workspace/Sources/SKHelper/Resources/images/skhelper-logo.png",
"rule" : {
"process" : {
}
}
}
],
"sources" : [
"Core/SKHelper+Extensions.swift",
"Core/SKHelper.swift",
"Core/SKHelperConfiguration.swift",
"Core/SKHelperConstants.swift",
"Core/SKHelperLog.swift",
"Core/SKHelperNotification.swift",
"Core/SKHelperProduct.swift",
"Core/SKHelperPurchaseInfo.swift",
"Core/SKHelperSubscriptionInfo.swift",
"Styles/SKHelperButtons.swift",
"Styles/SKHelperProductViewStyle.swift",
"Styles/SKHelperTapGesture.swift",
"Support/SKHelperEntitlementState.swift",
"Support/SKHelperPurchaseState.swift",
"Support/SKHelperSubscriptionState.swift",
"Support/SKHelperTransactionUpdateReason.swift",
"Support/SKHelperUnwrappedVerificationResult.swift",
"ViewModifiers/OnSubscriptionChange.swift",
"ViewModifiers/OnTransaction.swift",
"Views/SKHelperManagePurchaseView.swift",
"Views/SKHelperProductView.swift",
"Views/SKHelperPurchaseInfoFieldText.swift",
"Views/SKHelperPurchaseInfoFieldView.swift",
"Views/SKHelperPurchaseInfoMain.swift",
"Views/SKHelperPurchaseInfoManage.swift",
"Views/SKHelperPurchasesView.swift",
"Views/SKHelperSheetBarView.swift",
"Views/SKHelperStoreView.swift",
"Views/SKHelperSubscriptionInfoMain.swift",
"Views/SKHelperSubscriptionInfoManage.swift",
"Views/SKHelperSubscriptionStoreView.swift"
],
"type" : "library"
}
],
"tools_version" : "6.0"
}
Command line invocation:
/Applications/Xcode-16.3.0.app/Contents/Developer/usr/bin/xcodebuild -IDEClonedSourcePackagesDirPathOverride=/Users/admin/builder/spi-builder-workspace/.dependencies -resolvePackageDependencies
Resolve Package Graph
Fetching from https://github.com/apple/swift-docc-plugin.git
Fetching from https://github.com/swiftlang/swift-docc-symbolkit (cached)
Creating working copy of package ‘swift-docc-plugin’
Checking out 1.4.3 of package ‘swift-docc-plugin’
Creating working copy of package ‘swift-docc-symbolkit’
Checking out 1.0.0 of package ‘swift-docc-symbolkit’
Resolve Package Graph
Resolved source packages:
SKHelper: /Users/admin/builder/spi-builder-workspace
SwiftDocCPlugin: https://github.com/apple/swift-docc-plugin.git @ 1.4.3
SymbolKit: https://github.com/swiftlang/swift-docc-symbolkit @ 1.0.0
resolved source packages: SKHelper, SwiftDocCPlugin, SymbolKit
{
"dependencies" : [
{
"identity" : "swift-docc-plugin",
"requirement" : {
"range" : [
{
"lower_bound" : "1.3.0",
"upper_bound" : "2.0.0"
}
]
},
"type" : "sourceControl",
"url" : "https://github.com/apple/swift-docc-plugin.git"
}
],
"manifest_display_name" : "SKHelper",
"name" : "SKHelper",
"path" : "/Users/admin/builder/spi-builder-workspace",
"platforms" : [
{
"name" : "ios",
"version" : "17.0"
},
{
"name" : "macos",
"version" : "14.6"
}
],
"products" : [
{
"name" : "SKHelper",
"targets" : [
"SKHelper"
],
"type" : {
"library" : [
"automatic"
]
}
}
],
"targets" : [
{
"c99name" : "SKHelper",
"module_type" : "SwiftTarget",
"name" : "SKHelper",
"path" : "Sources/SKHelper",
"product_memberships" : [
"SKHelper"
],
"resources" : [
{
"path" : "/Users/admin/builder/spi-builder-workspace/Sources/SKHelper/Resources/PrivacyInfo.xcprivacy",
"rule" : {
"process" : {
}
}
},
{
"path" : "/Users/admin/builder/spi-builder-workspace/Sources/SKHelper/Resources/images/skhelper-logo-small.png",
"rule" : {
"process" : {
}
}
},
{
"path" : "/Users/admin/builder/spi-builder-workspace/Sources/SKHelper/Resources/images/skhelper-logo.png",
"rule" : {
"process" : {
}
}
}
],
"sources" : [
"Core/SKHelper+Extensions.swift",
"Core/SKHelper.swift",
"Core/SKHelperConfiguration.swift",
"Core/SKHelperConstants.swift",
"Core/SKHelperLog.swift",
"Core/SKHelperNotification.swift",
"Core/SKHelperProduct.swift",
"Core/SKHelperPurchaseInfo.swift",
"Core/SKHelperSubscriptionInfo.swift",
"Styles/SKHelperButtons.swift",
"Styles/SKHelperProductViewStyle.swift",
"Styles/SKHelperTapGesture.swift",
"Support/SKHelperEntitlementState.swift",
"Support/SKHelperPurchaseState.swift",
"Support/SKHelperSubscriptionState.swift",
"Support/SKHelperTransactionUpdateReason.swift",
"Support/SKHelperUnwrappedVerificationResult.swift",
"ViewModifiers/OnSubscriptionChange.swift",
"ViewModifiers/OnTransaction.swift",
"Views/SKHelperManagePurchaseView.swift",
"Views/SKHelperProductView.swift",
"Views/SKHelperPurchaseInfoFieldText.swift",
"Views/SKHelperPurchaseInfoFieldView.swift",
"Views/SKHelperPurchaseInfoMain.swift",
"Views/SKHelperPurchaseInfoManage.swift",
"Views/SKHelperPurchasesView.swift",
"Views/SKHelperSheetBarView.swift",
"Views/SKHelperStoreView.swift",
"Views/SKHelperSubscriptionInfoMain.swift",
"Views/SKHelperSubscriptionInfoManage.swift",
"Views/SKHelperSubscriptionStoreView.swift"
],
"type" : "library"
}
],
"tools_version" : "6.0"
}
{
"workspace" : {
"name" : "spi-builder-workspace",
"schemes" : [
"SKHelper"
]
}
}
Running build ...
env DEVELOPER_DIR=/Applications/Xcode-16.3.0.app xcrun xcodebuild -IDEClonedSourcePackagesDirPathOverride=$PWD/.dependencies -skipMacroValidation -skipPackagePluginValidation -derivedDataPath $PWD/.derivedData build -scheme SKHelper -destination generic/platform=tvOS OTHER_SWIFT_FLAGS=-stats-output-dir .stats
Command line invocation:
/Applications/Xcode-16.3.0.app/Contents/Developer/usr/bin/xcodebuild -IDEClonedSourcePackagesDirPathOverride=/Users/admin/builder/spi-builder-workspace/.dependencies -skipMacroValidation -skipPackagePluginValidation -derivedDataPath /Users/admin/builder/spi-builder-workspace/.derivedData build -scheme SKHelper -destination generic/platform=tvOS "OTHER_SWIFT_FLAGS=-stats-output-dir .stats"
Build settings from command line:
OTHER_SWIFT_FLAGS = -stats-output-dir .stats
Resolve Package Graph
Resolve Package Graph
Resolved source packages:
SKHelper: /Users/admin/builder/spi-builder-workspace
SwiftDocCPlugin: https://github.com/apple/swift-docc-plugin.git @ 1.4.3
SymbolKit: https://github.com/swiftlang/swift-docc-symbolkit @ 1.0.0
ComputePackagePrebuildTargetDependencyGraph
Prepare packages
CreateBuildRequest
SendProjectDescription
CreateBuildOperation
ComputeTargetDependencyGraph
note: Building targets in dependency order
note: Target dependency graph (3 targets)
Target 'SKHelper' in project 'SKHelper'
➜ Explicit dependency on target 'SKHelper' in project 'SKHelper'
➜ Explicit dependency on target 'SKHelper_SKHelper' in project 'SKHelper'
Target 'SKHelper' in project 'SKHelper'
➜ Explicit dependency on target 'SKHelper_SKHelper' in project 'SKHelper'
Target 'SKHelper_SKHelper' in project 'SKHelper' (no dependencies)
GatherProvisioningInputs
CreateBuildDescription
ExecuteExternalTool /Applications/Xcode-16.3.0.app/Contents/Developer/Toolchains/XcodeDefault.xctoolchain/usr/bin/clang -v -E -dM -isysroot /Applications/Xcode-16.3.0.app/Contents/Developer/Platforms/AppleTVOS.platform/Developer/SDKs/AppleTVOS18.4.sdk -x c -c /dev/null
ExecuteExternalTool /Applications/Xcode-16.3.0.app/Contents/Developer/Toolchains/XcodeDefault.xctoolchain/usr/bin/swiftc --version
ExecuteExternalTool /Applications/Xcode-16.3.0.app/Contents/Developer/Toolchains/XcodeDefault.xctoolchain/usr/bin/ld -version_details
ReadFileContents /Applications/Xcode-16.3.0.app/Contents/Developer/Toolchains/XcodeDefault.xctoolchain/usr/share/docc/features.json
Build description signature: d2b8e25be681b580c311fb7a900bfaaa
Build description path: /Users/admin/builder/spi-builder-workspace/.derivedData/Build/Intermediates.noindex/XCBuildData/d2b8e25be681b580c311fb7a900bfaaa.xcbuilddata
ClangStatCache /Applications/Xcode-16.3.0.app/Contents/Developer/Toolchains/XcodeDefault.xctoolchain/usr/bin/clang-stat-cache /Applications/Xcode-16.3.0.app/Contents/Developer/Platforms/AppleTVOS.platform/Developer/SDKs/AppleTVOS18.4.sdk /Users/admin/builder/spi-builder-workspace/.derivedData/SDKStatCaches.noindex/appletvos18.4-22L251-271d326055c85f9856fa135c41255102.sdkstatcache
cd /Users/admin/builder/spi-builder-workspace/.swiftpm/xcode
/Applications/Xcode-16.3.0.app/Contents/Developer/Toolchains/XcodeDefault.xctoolchain/usr/bin/clang-stat-cache /Applications/Xcode-16.3.0.app/Contents/Developer/Platforms/AppleTVOS.platform/Developer/SDKs/AppleTVOS18.4.sdk -o /Users/admin/builder/spi-builder-workspace/.derivedData/SDKStatCaches.noindex/appletvos18.4-22L251-271d326055c85f9856fa135c41255102.sdkstatcache
CreateBuildDirectory /Users/admin/builder/spi-builder-workspace/.derivedData/Build/Intermediates.noindex
cd /Users/admin/builder/spi-builder-workspace/.swiftpm/xcode
builtin-create-build-directory /Users/admin/builder/spi-builder-workspace/.derivedData/Build/Intermediates.noindex
CreateBuildDirectory /Users/admin/builder/spi-builder-workspace/.derivedData/Build/Products
cd /Users/admin/builder/spi-builder-workspace/.swiftpm/xcode
builtin-create-build-directory /Users/admin/builder/spi-builder-workspace/.derivedData/Build/Products
CreateBuildDirectory /Users/admin/builder/spi-builder-workspace/.derivedData/Build/Intermediates.noindex/EagerLinkingTBDs/Debug-appletvos
cd /Users/admin/builder/spi-builder-workspace/.swiftpm/xcode
builtin-create-build-directory /Users/admin/builder/spi-builder-workspace/.derivedData/Build/Intermediates.noindex/EagerLinkingTBDs/Debug-appletvos
CreateBuildDirectory /Users/admin/builder/spi-builder-workspace/.derivedData/Build/Products/Debug-appletvos
cd /Users/admin/builder/spi-builder-workspace/.swiftpm/xcode
builtin-create-build-directory /Users/admin/builder/spi-builder-workspace/.derivedData/Build/Products/Debug-appletvos
CreateBuildDirectory /Users/admin/builder/spi-builder-workspace/.derivedData/Build/Products/Debug-appletvos/PackageFrameworks
cd /Users/admin/builder/spi-builder-workspace/.swiftpm/xcode
builtin-create-build-directory /Users/admin/builder/spi-builder-workspace/.derivedData/Build/Products/Debug-appletvos/PackageFrameworks
WriteAuxiliaryFile /Users/admin/builder/spi-builder-workspace/.derivedData/Build/Intermediates.noindex/SKHelper.build/Debug-appletvos/SKHelper_SKHelper.build/SKHelper_SKHelper.DependencyMetadataFileList (in target 'SKHelper_SKHelper' from project 'SKHelper')
cd /Users/admin/builder/spi-builder-workspace
write-file /Users/admin/builder/spi-builder-workspace/.derivedData/Build/Intermediates.noindex/SKHelper.build/Debug-appletvos/SKHelper_SKHelper.build/SKHelper_SKHelper.DependencyMetadataFileList
WriteAuxiliaryFile /Users/admin/builder/spi-builder-workspace/.derivedData/Build/Intermediates.noindex/SKHelper.build/Debug-appletvos/SKHelper.build/SKHelper.DependencyStaticMetadataFileList (in target 'SKHelper' from project 'SKHelper')
cd /Users/admin/builder/spi-builder-workspace
write-file /Users/admin/builder/spi-builder-workspace/.derivedData/Build/Intermediates.noindex/SKHelper.build/Debug-appletvos/SKHelper.build/SKHelper.DependencyStaticMetadataFileList
WriteAuxiliaryFile /Users/admin/builder/spi-builder-workspace/.derivedData/Build/Intermediates.noindex/SKHelper.build/Debug-appletvos/SKHelper.build/SKHelper.DependencyMetadataFileList (in target 'SKHelper' from project 'SKHelper')
cd /Users/admin/builder/spi-builder-workspace
write-file /Users/admin/builder/spi-builder-workspace/.derivedData/Build/Intermediates.noindex/SKHelper.build/Debug-appletvos/SKHelper.build/SKHelper.DependencyMetadataFileList
WriteAuxiliaryFile /Users/admin/builder/spi-builder-workspace/.derivedData/Build/Intermediates.noindex/SKHelper.build/Debug-appletvos/SKHelper_SKHelper.build/empty-SKHelper_SKHelper.plist (in target 'SKHelper_SKHelper' from project 'SKHelper')
cd /Users/admin/builder/spi-builder-workspace
write-file /Users/admin/builder/spi-builder-workspace/.derivedData/Build/Intermediates.noindex/SKHelper.build/Debug-appletvos/SKHelper_SKHelper.build/empty-SKHelper_SKHelper.plist
WriteAuxiliaryFile /Users/admin/builder/spi-builder-workspace/.derivedData/Build/Intermediates.noindex/SKHelper.build/Debug-appletvos/SKHelper.build/SKHelper.modulemap (in target 'SKHelper' from project 'SKHelper')
cd /Users/admin/builder/spi-builder-workspace
write-file /Users/admin/builder/spi-builder-workspace/.derivedData/Build/Intermediates.noindex/SKHelper.build/Debug-appletvos/SKHelper.build/SKHelper.modulemap
WriteAuxiliaryFile /Users/admin/builder/spi-builder-workspace/.derivedData/Build/Intermediates.noindex/SKHelper.build/Debug-appletvos/SKHelper_SKHelper.build/SKHelper_SKHelper.DependencyStaticMetadataFileList (in target 'SKHelper_SKHelper' from project 'SKHelper')
cd /Users/admin/builder/spi-builder-workspace
write-file /Users/admin/builder/spi-builder-workspace/.derivedData/Build/Intermediates.noindex/SKHelper.build/Debug-appletvos/SKHelper_SKHelper.build/SKHelper_SKHelper.DependencyStaticMetadataFileList
WriteAuxiliaryFile /Users/admin/builder/spi-builder-workspace/.derivedData/Build/Intermediates.noindex/SKHelper.build/Debug-appletvos/SKHelper.build/Objects-normal/arm64/SKHelper.SwiftFileList (in target 'SKHelper' from project 'SKHelper')
cd /Users/admin/builder/spi-builder-workspace
write-file /Users/admin/builder/spi-builder-workspace/.derivedData/Build/Intermediates.noindex/SKHelper.build/Debug-appletvos/SKHelper.build/Objects-normal/arm64/SKHelper.SwiftFileList
WriteAuxiliaryFile /Users/admin/builder/spi-builder-workspace/.derivedData/Build/Intermediates.noindex/SKHelper.build/Debug-appletvos/SKHelper.build/Objects-normal/arm64/SKHelper_const_extract_protocols.json (in target 'SKHelper' from project 'SKHelper')
cd /Users/admin/builder/spi-builder-workspace
write-file /Users/admin/builder/spi-builder-workspace/.derivedData/Build/Intermediates.noindex/SKHelper.build/Debug-appletvos/SKHelper.build/Objects-normal/arm64/SKHelper_const_extract_protocols.json
WriteAuxiliaryFile /Users/admin/builder/spi-builder-workspace/.derivedData/Build/Intermediates.noindex/SKHelper.build/Debug-appletvos/SKHelper.build/Objects-normal/arm64/SKHelper.SwiftConstValuesFileList (in target 'SKHelper' from project 'SKHelper')
cd /Users/admin/builder/spi-builder-workspace
write-file /Users/admin/builder/spi-builder-workspace/.derivedData/Build/Intermediates.noindex/SKHelper.build/Debug-appletvos/SKHelper.build/Objects-normal/arm64/SKHelper.SwiftConstValuesFileList
WriteAuxiliaryFile /Users/admin/builder/spi-builder-workspace/.derivedData/Build/Intermediates.noindex/SKHelper.build/Debug-appletvos/SKHelper.build/Objects-normal/arm64/SKHelper.LinkFileList (in target 'SKHelper' from project 'SKHelper')
cd /Users/admin/builder/spi-builder-workspace
write-file /Users/admin/builder/spi-builder-workspace/.derivedData/Build/Intermediates.noindex/SKHelper.build/Debug-appletvos/SKHelper.build/Objects-normal/arm64/SKHelper.LinkFileList
WriteAuxiliaryFile /Users/admin/builder/spi-builder-workspace/.derivedData/Build/Intermediates.noindex/SKHelper.build/Debug-appletvos/SKHelper.build/Objects-normal/arm64/SKHelper-OutputFileMap.json (in target 'SKHelper' from project 'SKHelper')
cd /Users/admin/builder/spi-builder-workspace
write-file /Users/admin/builder/spi-builder-workspace/.derivedData/Build/Intermediates.noindex/SKHelper.build/Debug-appletvos/SKHelper.build/Objects-normal/arm64/SKHelper-OutputFileMap.json
WriteAuxiliaryFile /Users/admin/builder/spi-builder-workspace/.derivedData/Build/Intermediates.noindex/SKHelper.build/Debug-appletvos/SKHelper.build/DerivedSources/resource_bundle_accessor.swift (in target 'SKHelper' from project 'SKHelper')
cd /Users/admin/builder/spi-builder-workspace
write-file /Users/admin/builder/spi-builder-workspace/.derivedData/Build/Intermediates.noindex/SKHelper.build/Debug-appletvos/SKHelper.build/DerivedSources/resource_bundle_accessor.swift
MkDir /Users/admin/builder/spi-builder-workspace/.derivedData/Build/Products/Debug-appletvos/SKHelper_SKHelper.bundle (in target 'SKHelper_SKHelper' from project 'SKHelper')
cd /Users/admin/builder/spi-builder-workspace
/bin/mkdir -p /Users/admin/builder/spi-builder-workspace/.derivedData/Build/Products/Debug-appletvos/SKHelper_SKHelper.bundle
Copy /Users/admin/builder/spi-builder-workspace/.derivedData/Build/Intermediates.noindex/GeneratedModuleMaps-appletvos/SKHelper.modulemap /Users/admin/builder/spi-builder-workspace/.derivedData/Build/Intermediates.noindex/SKHelper.build/Debug-appletvos/SKHelper.build/SKHelper.modulemap (in target 'SKHelper' from project 'SKHelper')
cd /Users/admin/builder/spi-builder-workspace
builtin-copy -exclude .DS_Store -exclude CVS -exclude .svn -exclude .git -exclude .hg -resolve-src-symlinks /Users/admin/builder/spi-builder-workspace/.derivedData/Build/Intermediates.noindex/SKHelper.build/Debug-appletvos/SKHelper.build/SKHelper.modulemap /Users/admin/builder/spi-builder-workspace/.derivedData/Build/Intermediates.noindex/GeneratedModuleMaps-appletvos
ProcessInfoPlistFile /Users/admin/builder/spi-builder-workspace/.derivedData/Build/Products/Debug-appletvos/SKHelper_SKHelper.bundle/Info.plist /Users/admin/builder/spi-builder-workspace/.derivedData/Build/Intermediates.noindex/SKHelper.build/Debug-appletvos/SKHelper_SKHelper.build/empty-SKHelper_SKHelper.plist (in target 'SKHelper_SKHelper' from project 'SKHelper')
cd /Users/admin/builder/spi-builder-workspace
builtin-infoPlistUtility /Users/admin/builder/spi-builder-workspace/.derivedData/Build/Intermediates.noindex/SKHelper.build/Debug-appletvos/SKHelper_SKHelper.build/empty-SKHelper_SKHelper.plist -producttype com.apple.product-type.bundle -expandbuildsettings -format binary -platform appletvos -o /Users/admin/builder/spi-builder-workspace/.derivedData/Build/Products/Debug-appletvos/SKHelper_SKHelper.bundle/Info.plist
CpResource /Users/admin/builder/spi-builder-workspace/.derivedData/Build/Products/Debug-appletvos/SKHelper_SKHelper.bundle/skhelper-logo.png /Users/admin/builder/spi-builder-workspace/Sources/SKHelper/Resources/images/skhelper-logo.png (in target 'SKHelper_SKHelper' from project 'SKHelper')
cd /Users/admin/builder/spi-builder-workspace
builtin-copy -exclude .DS_Store -exclude CVS -exclude .svn -exclude .git -exclude .hg -resolve-src-symlinks /Users/admin/builder/spi-builder-workspace/Sources/SKHelper/Resources/images/skhelper-logo.png /Users/admin/builder/spi-builder-workspace/.derivedData/Build/Products/Debug-appletvos/SKHelper_SKHelper.bundle
CpResource /Users/admin/builder/spi-builder-workspace/.derivedData/Build/Products/Debug-appletvos/SKHelper_SKHelper.bundle/PrivacyInfo.xcprivacy /Users/admin/builder/spi-builder-workspace/Sources/SKHelper/Resources/PrivacyInfo.xcprivacy (in target 'SKHelper_SKHelper' from project 'SKHelper')
cd /Users/admin/builder/spi-builder-workspace
builtin-copy -exclude .DS_Store -exclude CVS -exclude .svn -exclude .git -exclude .hg -resolve-src-symlinks /Users/admin/builder/spi-builder-workspace/Sources/SKHelper/Resources/PrivacyInfo.xcprivacy /Users/admin/builder/spi-builder-workspace/.derivedData/Build/Products/Debug-appletvos/SKHelper_SKHelper.bundle
CpResource /Users/admin/builder/spi-builder-workspace/.derivedData/Build/Products/Debug-appletvos/SKHelper_SKHelper.bundle/skhelper-logo-small.png /Users/admin/builder/spi-builder-workspace/Sources/SKHelper/Resources/images/skhelper-logo-small.png (in target 'SKHelper_SKHelper' from project 'SKHelper')
cd /Users/admin/builder/spi-builder-workspace
builtin-copy -exclude .DS_Store -exclude CVS -exclude .svn -exclude .git -exclude .hg -resolve-src-symlinks /Users/admin/builder/spi-builder-workspace/Sources/SKHelper/Resources/images/skhelper-logo-small.png /Users/admin/builder/spi-builder-workspace/.derivedData/Build/Products/Debug-appletvos/SKHelper_SKHelper.bundle
RegisterExecutionPolicyException /Users/admin/builder/spi-builder-workspace/.derivedData/Build/Products/Debug-appletvos/SKHelper_SKHelper.bundle (in target 'SKHelper_SKHelper' from project 'SKHelper')
cd /Users/admin/builder/spi-builder-workspace
builtin-RegisterExecutionPolicyException /Users/admin/builder/spi-builder-workspace/.derivedData/Build/Products/Debug-appletvos/SKHelper_SKHelper.bundle
Touch /Users/admin/builder/spi-builder-workspace/.derivedData/Build/Products/Debug-appletvos/SKHelper_SKHelper.bundle (in target 'SKHelper_SKHelper' from project 'SKHelper')
cd /Users/admin/builder/spi-builder-workspace
/usr/bin/touch -c /Users/admin/builder/spi-builder-workspace/.derivedData/Build/Products/Debug-appletvos/SKHelper_SKHelper.bundle
SwiftDriver SKHelper normal arm64 com.apple.xcode.tools.swift.compiler (in target 'SKHelper' from project 'SKHelper')
cd /Users/admin/builder/spi-builder-workspace/.swiftpm/xcode
builtin-SwiftDriver -- /Applications/Xcode-16.3.0.app/Contents/Developer/Toolchains/XcodeDefault.xctoolchain/usr/bin/swiftc -module-name SKHelper -Onone -enforce-exclusivity\=checked @/Users/admin/builder/spi-builder-workspace/.derivedData/Build/Intermediates.noindex/SKHelper.build/Debug-appletvos/SKHelper.build/Objects-normal/arm64/SKHelper.SwiftFileList -DSWIFT_PACKAGE -DDEBUG -stats-output-dir .stats -plugin-path /Applications/Xcode-16.3.0.app/Contents/Developer/Toolchains/XcodeDefault.xctoolchain/usr/lib/swift/host/plugins/testing -enable-experimental-feature DebugDescriptionMacro -sdk /Applications/Xcode-16.3.0.app/Contents/Developer/Platforms/AppleTVOS.platform/Developer/SDKs/AppleTVOS18.4.sdk -target arm64-apple-tvos17.0 -g -module-cache-path /Users/admin/builder/spi-builder-workspace/.derivedData/ModuleCache.noindex -Xfrontend -serialize-debugging-options -profile-coverage-mapping -profile-generate -enable-testing -index-store-path /Users/admin/builder/spi-builder-workspace/.derivedData/Index.noindex/DataStore -swift-version 6 -I /Users/admin/builder/spi-builder-workspace/.derivedData/Build/Products/Debug-appletvos -I /Applications/Xcode-16.3.0.app/Contents/Developer/Platforms/AppleTVOS.platform/Developer/usr/lib -F /Users/admin/builder/spi-builder-workspace/.derivedData/Build/Products/Debug-appletvos -F /Applications/Xcode-16.3.0.app/Contents/Developer/Platforms/AppleTVOS.platform/Developer/Library/Frameworks -F /Applications/Xcode-16.3.0.app/Contents/Developer/Platforms/AppleTVOS.platform/Developer/SDKs/AppleTVOS18.4.sdk/Developer/Library/Frameworks -c -j10 -enable-batch-mode -incremental -Xcc -ivfsstatcache -Xcc /Users/admin/builder/spi-builder-workspace/.derivedData/SDKStatCaches.noindex/appletvos18.4-22L251-271d326055c85f9856fa135c41255102.sdkstatcache -output-file-map /Users/admin/builder/spi-builder-workspace/.derivedData/Build/Intermediates.noindex/SKHelper.build/Debug-appletvos/SKHelper.build/Objects-normal/arm64/SKHelper-OutputFileMap.json -use-frontend-parseable-output -save-temps -no-color-diagnostics -serialize-diagnostics -emit-dependencies -emit-module -emit-module-path /Users/admin/builder/spi-builder-workspace/.derivedData/Build/Intermediates.noindex/SKHelper.build/Debug-appletvos/SKHelper.build/Objects-normal/arm64/SKHelper.swiftmodule -validate-clang-modules-once -clang-build-session-file /Users/admin/builder/spi-builder-workspace/.derivedData/ModuleCache.noindex/Session.modulevalidation -package-name spi_builder_workspace -Xcc -I/Users/admin/builder/spi-builder-workspace/.derivedData/Build/Intermediates.noindex/SKHelper.build/Debug-appletvos/SKHelper.build/swift-overrides.hmap -emit-const-values -Xfrontend -const-gather-protocols-file -Xfrontend /Users/admin/builder/spi-builder-workspace/.derivedData/Build/Intermediates.noindex/SKHelper.build/Debug-appletvos/SKHelper.build/Objects-normal/arm64/SKHelper_const_extract_protocols.json -Xcc -I/Users/admin/builder/spi-builder-workspace/.derivedData/Build/Products/Debug-appletvos/include -Xcc -I/Users/admin/builder/spi-builder-workspace/.derivedData/Build/Intermediates.noindex/SKHelper.build/Debug-appletvos/SKHelper.build/DerivedSources-normal/arm64 -Xcc -I/Users/admin/builder/spi-builder-workspace/.derivedData/Build/Intermediates.noindex/SKHelper.build/Debug-appletvos/SKHelper.build/DerivedSources/arm64 -Xcc -I/Users/admin/builder/spi-builder-workspace/.derivedData/Build/Intermediates.noindex/SKHelper.build/Debug-appletvos/SKHelper.build/DerivedSources -Xcc -DSWIFT_PACKAGE -Xcc -DDEBUG\=1 -emit-objc-header -emit-objc-header-path /Users/admin/builder/spi-builder-workspace/.derivedData/Build/Intermediates.noindex/SKHelper.build/Debug-appletvos/SKHelper.build/Objects-normal/arm64/SKHelper-Swift.h -working-directory /Users/admin/builder/spi-builder-workspace/.swiftpm/xcode -experimental-emit-module-separately -disable-cmo
SwiftCompile normal arm64 Compiling\ SKHelperProductViewStyle.swift,\ SKHelperTapGesture.swift,\ SKHelperEntitlementState.swift /Users/admin/builder/spi-builder-workspace/Sources/SKHelper/Styles/SKHelperProductViewStyle.swift /Users/admin/builder/spi-builder-workspace/Sources/SKHelper/Styles/SKHelperTapGesture.swift /Users/admin/builder/spi-builder-workspace/Sources/SKHelper/Support/SKHelperEntitlementState.swift (in target 'SKHelper' from project 'SKHelper')
SwiftCompile normal arm64 /Users/admin/builder/spi-builder-workspace/Sources/SKHelper/Styles/SKHelperProductViewStyle.swift (in target 'SKHelper' from project 'SKHelper')
cd /Users/admin/builder/spi-builder-workspace/.swiftpm/xcode
SwiftCompile normal arm64 /Users/admin/builder/spi-builder-workspace/Sources/SKHelper/Styles/SKHelperTapGesture.swift (in target 'SKHelper' from project 'SKHelper')
cd /Users/admin/builder/spi-builder-workspace/.swiftpm/xcode
SwiftCompile normal arm64 /Users/admin/builder/spi-builder-workspace/Sources/SKHelper/Support/SKHelperEntitlementState.swift (in target 'SKHelper' from project 'SKHelper')
cd /Users/admin/builder/spi-builder-workspace/.swiftpm/xcode
SwiftCompile normal arm64 Compiling\ SKHelperConstants.swift,\ SKHelperLog.swift,\ SKHelperNotification.swift,\ SKHelperProduct.swift /Users/admin/builder/spi-builder-workspace/Sources/SKHelper/Core/SKHelperConstants.swift /Users/admin/builder/spi-builder-workspace/Sources/SKHelper/Core/SKHelperLog.swift /Users/admin/builder/spi-builder-workspace/Sources/SKHelper/Core/SKHelperNotification.swift /Users/admin/builder/spi-builder-workspace/Sources/SKHelper/Core/SKHelperProduct.swift (in target 'SKHelper' from project 'SKHelper')
SwiftCompile normal arm64 /Users/admin/builder/spi-builder-workspace/Sources/SKHelper/Core/SKHelperConstants.swift (in target 'SKHelper' from project 'SKHelper')
cd /Users/admin/builder/spi-builder-workspace/.swiftpm/xcode
SwiftCompile normal arm64 /Users/admin/builder/spi-builder-workspace/Sources/SKHelper/Core/SKHelperLog.swift (in target 'SKHelper' from project 'SKHelper')
cd /Users/admin/builder/spi-builder-workspace/.swiftpm/xcode
SwiftCompile normal arm64 /Users/admin/builder/spi-builder-workspace/Sources/SKHelper/Core/SKHelperNotification.swift (in target 'SKHelper' from project 'SKHelper')
cd /Users/admin/builder/spi-builder-workspace/.swiftpm/xcode
SwiftCompile normal arm64 /Users/admin/builder/spi-builder-workspace/Sources/SKHelper/Core/SKHelperProduct.swift (in target 'SKHelper' from project 'SKHelper')
cd /Users/admin/builder/spi-builder-workspace/.swiftpm/xcode
SwiftCompile normal arm64 Compiling\ SKHelperPurchaseInfo.swift,\ SKHelperSubscriptionInfo.swift,\ SKHelperButtons.swift /Users/admin/builder/spi-builder-workspace/Sources/SKHelper/Core/SKHelperPurchaseInfo.swift /Users/admin/builder/spi-builder-workspace/Sources/SKHelper/Core/SKHelperSubscriptionInfo.swift /Users/admin/builder/spi-builder-workspace/Sources/SKHelper/Styles/SKHelperButtons.swift (in target 'SKHelper' from project 'SKHelper')
SwiftCompile normal arm64 /Users/admin/builder/spi-builder-workspace/Sources/SKHelper/Core/SKHelperPurchaseInfo.swift (in target 'SKHelper' from project 'SKHelper')
cd /Users/admin/builder/spi-builder-workspace/.swiftpm/xcode
SwiftCompile normal arm64 /Users/admin/builder/spi-builder-workspace/Sources/SKHelper/Core/SKHelperSubscriptionInfo.swift (in target 'SKHelper' from project 'SKHelper')
cd /Users/admin/builder/spi-builder-workspace/.swiftpm/xcode
SwiftCompile normal arm64 /Users/admin/builder/spi-builder-workspace/Sources/SKHelper/Styles/SKHelperButtons.swift (in target 'SKHelper' from project 'SKHelper')
cd /Users/admin/builder/spi-builder-workspace/.swiftpm/xcode
SwiftCompile normal arm64 Compiling\ resource_bundle_accessor.swift,\ SKHelper+Extensions.swift,\ SKHelper.swift,\ SKHelperConfiguration.swift /Users/admin/builder/spi-builder-workspace/.derivedData/Build/Intermediates.noindex/SKHelper.build/Debug-appletvos/SKHelper.build/DerivedSources/resource_bundle_accessor.swift /Users/admin/builder/spi-builder-workspace/Sources/SKHelper/Core/SKHelper+Extensions.swift /Users/admin/builder/spi-builder-workspace/Sources/SKHelper/Core/SKHelper.swift /Users/admin/builder/spi-builder-workspace/Sources/SKHelper/Core/SKHelperConfiguration.swift (in target 'SKHelper' from project 'SKHelper')
SwiftCompile normal arm64 /Users/admin/builder/spi-builder-workspace/.derivedData/Build/Intermediates.noindex/SKHelper.build/Debug-appletvos/SKHelper.build/DerivedSources/resource_bundle_accessor.swift (in target 'SKHelper' from project 'SKHelper')
cd /Users/admin/builder/spi-builder-workspace/.swiftpm/xcode
SwiftCompile normal arm64 /Users/admin/builder/spi-builder-workspace/Sources/SKHelper/Core/SKHelper+Extensions.swift (in target 'SKHelper' from project 'SKHelper')
cd /Users/admin/builder/spi-builder-workspace/.swiftpm/xcode
SwiftCompile normal arm64 /Users/admin/builder/spi-builder-workspace/Sources/SKHelper/Core/SKHelper.swift (in target 'SKHelper' from project 'SKHelper')
cd /Users/admin/builder/spi-builder-workspace/.swiftpm/xcode
SwiftCompile normal arm64 /Users/admin/builder/spi-builder-workspace/Sources/SKHelper/Core/SKHelperConfiguration.swift (in target 'SKHelper' from project 'SKHelper')
cd /Users/admin/builder/spi-builder-workspace/.swiftpm/xcode
SwiftEmitModule normal arm64 Emitting\ module\ for\ SKHelper (in target 'SKHelper' from project 'SKHelper')
Failed frontend command:
/Applications/Xcode-16.3.0.app/Contents/Developer/Toolchains/XcodeDefault.xctoolchain/usr/bin/swift-frontend -frontend -emit-module -experimental-skip-non-inlinable-function-bodies-without-types /Users/admin/builder/spi-builder-workspace/.derivedData/Build/Intermediates.noindex/SKHelper.build/Debug-appletvos/SKHelper.build/DerivedSources/resource_bundle_accessor.swift /Users/admin/builder/spi-builder-workspace/Sources/SKHelper/Core/SKHelper+Extensions.swift /Users/admin/builder/spi-builder-workspace/Sources/SKHelper/Core/SKHelper.swift /Users/admin/builder/spi-builder-workspace/Sources/SKHelper/Core/SKHelperConfiguration.swift /Users/admin/builder/spi-builder-workspace/Sources/SKHelper/Core/SKHelperConstants.swift /Users/admin/builder/spi-builder-workspace/Sources/SKHelper/Core/SKHelperLog.swift /Users/admin/builder/spi-builder-workspace/Sources/SKHelper/Core/SKHelperNotification.swift /Users/admin/builder/spi-builder-workspace/Sources/SKHelper/Core/SKHelperProduct.swift /Users/admin/builder/spi-builder-workspace/Sources/SKHelper/Core/SKHelperPurchaseInfo.swift /Users/admin/builder/spi-builder-workspace/Sources/SKHelper/Core/SKHelperSubscriptionInfo.swift /Users/admin/builder/spi-builder-workspace/Sources/SKHelper/Styles/SKHelperButtons.swift /Users/admin/builder/spi-builder-workspace/Sources/SKHelper/Styles/SKHelperProductViewStyle.swift /Users/admin/builder/spi-builder-workspace/Sources/SKHelper/Styles/SKHelperTapGesture.swift /Users/admin/builder/spi-builder-workspace/Sources/SKHelper/Support/SKHelperEntitlementState.swift /Users/admin/builder/spi-builder-workspace/Sources/SKHelper/Support/SKHelperPurchaseState.swift /Users/admin/builder/spi-builder-workspace/Sources/SKHelper/Support/SKHelperSubscriptionState.swift /Users/admin/builder/spi-builder-workspace/Sources/SKHelper/Support/SKHelperTransactionUpdateReason.swift /Users/admin/builder/spi-builder-workspace/Sources/SKHelper/Support/SKHelperUnwrappedVerificationResult.swift /Users/admin/builder/spi-builder-workspace/Sources/SKHelper/ViewModifiers/OnSubscriptionChange.swift /Users/admin/builder/spi-builder-workspace/Sources/SKHelper/ViewModifiers/OnTransaction.swift /Users/admin/builder/spi-builder-workspace/Sources/SKHelper/Views/SKHelperManagePurchaseView.swift /Users/admin/builder/spi-builder-workspace/Sources/SKHelper/Views/SKHelperProductView.swift /Users/admin/builder/spi-builder-workspace/Sources/SKHelper/Views/SKHelperPurchaseInfoFieldText.swift /Users/admin/builder/spi-builder-workspace/Sources/SKHelper/Views/SKHelperPurchaseInfoFieldView.swift /Users/admin/builder/spi-builder-workspace/Sources/SKHelper/Views/SKHelperPurchaseInfoMain.swift /Users/admin/builder/spi-builder-workspace/Sources/SKHelper/Views/SKHelperPurchaseInfoManage.swift /Users/admin/builder/spi-builder-workspace/Sources/SKHelper/Views/SKHelperPurchasesView.swift /Users/admin/builder/spi-builder-workspace/Sources/SKHelper/Views/SKHelperSheetBarView.swift /Users/admin/builder/spi-builder-workspace/Sources/SKHelper/Views/SKHelperStoreView.swift /Users/admin/builder/spi-builder-workspace/Sources/SKHelper/Views/SKHelperSubscriptionInfoMain.swift /Users/admin/builder/spi-builder-workspace/Sources/SKHelper/Views/SKHelperSubscriptionInfoManage.swift /Users/admin/builder/spi-builder-workspace/Sources/SKHelper/Views/SKHelperSubscriptionStoreView.swift -target arm64-apple-tvos17.0 -Xllvm -aarch64-use-tbi -enable-objc-interop -stack-check -sdk /Applications/Xcode-16.3.0.app/Contents/Developer/Platforms/AppleTVOS.platform/Developer/SDKs/AppleTVOS18.4.sdk -I /Users/admin/builder/spi-builder-workspace/.derivedData/Build/Products/Debug-appletvos -I /Applications/Xcode-16.3.0.app/Contents/Developer/Platforms/AppleTVOS.platform/Developer/usr/lib -F /Users/admin/builder/spi-builder-workspace/.derivedData/Build/Products/Debug-appletvos -F /Applications/Xcode-16.3.0.app/Contents/Developer/Platforms/AppleTVOS.platform/Developer/Library/Frameworks -F /Applications/Xcode-16.3.0.app/Contents/Developer/Platforms/AppleTVOS.platform/Developer/SDKs/AppleTVOS18.4.sdk/Developer/Library/Frameworks -no-color-diagnostics -enable-testing -g -debug-info-format\=dwarf -dwarf-version\=4 -module-cache-path /Users/admin/builder/spi-builder-workspace/.derivedData/ModuleCache.noindex -profile-generate -profile-coverage-mapping -swift-version 6 -enforce-exclusivity\=checked -stats-output-dir /Users/admin/builder/spi-builder-workspace/.swiftpm/xcode/.stats -Onone -D SWIFT_PACKAGE -D DEBUG -serialize-debugging-options -const-gather-protocols-file /Users/admin/builder/spi-builder-workspace/.derivedData/Build/Intermediates.noindex/SKHelper.build/Debug-appletvos/SKHelper.build/Objects-normal/arm64/SKHelper_const_extract_protocols.json -enable-experimental-feature DebugDescriptionMacro -empty-abi-descriptor -plugin-path /Applications/Xcode-16.3.0.app/Contents/Developer/Toolchains/XcodeDefault.xctoolchain/usr/lib/swift/host/plugins/testing -validate-clang-modules-once -clang-build-session-file /Users/admin/builder/spi-builder-workspace/.derivedData/ModuleCache.noindex/Session.modulevalidation -Xcc -working-directory -Xcc /Users/admin/builder/spi-builder-workspace/.swiftpm/xcode -resource-dir /Applications/Xcode-16.3.0.app/Contents/Developer/Toolchains/XcodeDefault.xctoolchain/usr/lib/swift -enable-anonymous-context-mangled-names -file-compilation-dir /Users/admin/builder/spi-builder-workspace/.swiftpm/xcode -Xcc -ivfsstatcache -Xcc /Users/admin/builder/spi-builder-workspace/.derivedData/SDKStatCaches.noindex/appletvos18.4-22L251-271d326055c85f9856fa135c41255102.sdkstatcache -Xcc -I/Users/admin/builder/spi-builder-workspace/.derivedData/Build/Intermediates.noindex/SKHelper.build/Debug-appletvos/SKHelper.build/swift-overrides.hmap -Xcc -I/Users/admin/builder/spi-builder-workspace/.derivedData/Build/Products/Debug-appletvos/include -Xcc -I/Users/admin/builder/spi-builder-workspace/.derivedData/Build/Intermediates.noindex/SKHelper.build/Debug-appletvos/SKHelper.build/DerivedSources-normal/arm64 -Xcc -I/Users/admin/builder/spi-builder-workspace/.derivedData/Build/Intermediates.noindex/SKHelper.build/Debug-appletvos/SKHelper.build/DerivedSources/arm64 -Xcc -I/Users/admin/builder/spi-builder-workspace/.derivedData/Build/Intermediates.noindex/SKHelper.build/Debug-appletvos/SKHelper.build/DerivedSources -Xcc -DSWIFT_PACKAGE -Xcc -DDEBUG\=1 -module-name SKHelper -package-name spi_builder_workspace -frontend-parseable-output -disable-clang-spi -target-sdk-version 18.4 -target-sdk-name appletvos18.4 -external-plugin-path /Applications/Xcode-16.3.0.app/Contents/Developer/Platforms/AppleTVOS.platform/Developer/usr/lib/swift/host/plugins\#/Applications/Xcode-16.3.0.app/Contents/Developer/Platforms/AppleTVOS.platform/Developer/usr/bin/swift-plugin-server -external-plugin-path /Applications/Xcode-16.3.0.app/Contents/Developer/Platforms/AppleTVOS.platform/Developer/usr/local/lib/swift/host/plugins\#/Applications/Xcode-16.3.0.app/Contents/Developer/Platforms/AppleTVOS.platform/Developer/usr/bin/swift-plugin-server -in-process-plugin-server-path /Applications/Xcode-16.3.0.app/Contents/Developer/Toolchains/XcodeDefault.xctoolchain/usr/lib/swift/host/libSwiftInProcPluginServer.dylib -plugin-path /Applications/Xcode-16.3.0.app/Contents/Developer/Toolchains/XcodeDefault.xctoolchain/usr/lib/swift/host/plugins -plugin-path /Applications/Xcode-16.3.0.app/Contents/Developer/Toolchains/XcodeDefault.xctoolchain/usr/local/lib/swift/host/plugins -emit-module-doc-path /Users/admin/builder/spi-builder-workspace/.derivedData/Build/Intermediates.noindex/SKHelper.build/Debug-appletvos/SKHelper.build/Objects-normal/arm64/SKHelper.swiftdoc -emit-module-source-info-path /Users/admin/builder/spi-builder-workspace/.derivedData/Build/Intermediates.noindex/SKHelper.build/Debug-appletvos/SKHelper.build/Objects-normal/arm64/SKHelper.swiftsourceinfo -emit-objc-header-path /Users/admin/builder/spi-builder-workspace/.derivedData/Build/Intermediates.noindex/SKHelper.build/Debug-appletvos/SKHelper.build/Objects-normal/arm64/SKHelper-Swift.h -serialize-diagnostics-path /Users/admin/builder/spi-builder-workspace/.derivedData/Build/Intermediates.noindex/SKHelper.build/Debug-appletvos/SKHelper.build/Objects-normal/arm64/SKHelper-master-emit-module.dia -emit-dependencies-path /Users/admin/builder/spi-builder-workspace/.derivedData/Build/Intermediates.noindex/SKHelper.build/Debug-appletvos/SKHelper.build/Objects-normal/arm64/SKHelper-master-emit-module.d -o /Users/admin/builder/spi-builder-workspace/.derivedData/Build/Intermediates.noindex/SKHelper.build/Debug-appletvos/SKHelper.build/Objects-normal/arm64/SKHelper.swiftmodule -emit-abi-descriptor-path /Users/admin/builder/spi-builder-workspace/.derivedData/Build/Intermediates.noindex/SKHelper.build/Debug-appletvos/SKHelper.build/Objects-normal/arm64/SKHelper.abi.json
EmitSwiftModule normal arm64 (in target 'SKHelper' from project 'SKHelper')
cd /Users/admin/builder/spi-builder-workspace/.swiftpm/xcode
/Users/admin/builder/spi-builder-workspace/Sources/SKHelper/Views/SKHelperSheetBarView.swift:132:5: error: cannot find 'SKHelperSheetBarView' in scope
SKHelperSheetBarView(showSheet: Binding.constant(true), title: "Test", sysImage: "face.smiling")
^~~~~~~~~~~~~~~~~~~~
SwiftCompile normal arm64 Compiling\ SKHelperManagePurchaseView.swift,\ SKHelperProductView.swift,\ SKHelperPurchaseInfoFieldText.swift /Users/admin/builder/spi-builder-workspace/Sources/SKHelper/Views/SKHelperManagePurchaseView.swift /Users/admin/builder/spi-builder-workspace/Sources/SKHelper/Views/SKHelperProductView.swift /Users/admin/builder/spi-builder-workspace/Sources/SKHelper/Views/SKHelperPurchaseInfoFieldText.swift (in target 'SKHelper' from project 'SKHelper')
SwiftCompile normal arm64 /Users/admin/builder/spi-builder-workspace/Sources/SKHelper/Views/SKHelperManagePurchaseView.swift (in target 'SKHelper' from project 'SKHelper')
cd /Users/admin/builder/spi-builder-workspace/.swiftpm/xcode
SwiftCompile normal arm64 /Users/admin/builder/spi-builder-workspace/Sources/SKHelper/Views/SKHelperProductView.swift (in target 'SKHelper' from project 'SKHelper')
cd /Users/admin/builder/spi-builder-workspace/.swiftpm/xcode
SwiftCompile normal arm64 /Users/admin/builder/spi-builder-workspace/Sources/SKHelper/Views/SKHelperPurchaseInfoFieldText.swift (in target 'SKHelper' from project 'SKHelper')
cd /Users/admin/builder/spi-builder-workspace/.swiftpm/xcode
SwiftCompile normal arm64 Compiling\ SKHelperSubscriptionInfoMain.swift,\ SKHelperSubscriptionInfoManage.swift,\ SKHelperSubscriptionStoreView.swift /Users/admin/builder/spi-builder-workspace/Sources/SKHelper/Views/SKHelperSubscriptionInfoMain.swift /Users/admin/builder/spi-builder-workspace/Sources/SKHelper/Views/SKHelperSubscriptionInfoManage.swift /Users/admin/builder/spi-builder-workspace/Sources/SKHelper/Views/SKHelperSubscriptionStoreView.swift (in target 'SKHelper' from project 'SKHelper')
SwiftCompile normal arm64 /Users/admin/builder/spi-builder-workspace/Sources/SKHelper/Views/SKHelperSubscriptionInfoMain.swift (in target 'SKHelper' from project 'SKHelper')
cd /Users/admin/builder/spi-builder-workspace/.swiftpm/xcode
SwiftCompile normal arm64 /Users/admin/builder/spi-builder-workspace/Sources/SKHelper/Views/SKHelperSubscriptionInfoManage.swift (in target 'SKHelper' from project 'SKHelper')
cd /Users/admin/builder/spi-builder-workspace/.swiftpm/xcode
SwiftCompile normal arm64 /Users/admin/builder/spi-builder-workspace/Sources/SKHelper/Views/SKHelperSubscriptionStoreView.swift (in target 'SKHelper' from project 'SKHelper')
cd /Users/admin/builder/spi-builder-workspace/.swiftpm/xcode
SwiftCompile normal arm64 Compiling\ SKHelperPurchaseInfoFieldView.swift,\ SKHelperPurchaseInfoMain.swift,\ SKHelperPurchaseInfoManage.swift /Users/admin/builder/spi-builder-workspace/Sources/SKHelper/Views/SKHelperPurchaseInfoFieldView.swift /Users/admin/builder/spi-builder-workspace/Sources/SKHelper/Views/SKHelperPurchaseInfoMain.swift /Users/admin/builder/spi-builder-workspace/Sources/SKHelper/Views/SKHelperPurchaseInfoManage.swift (in target 'SKHelper' from project 'SKHelper')
SwiftCompile normal arm64 /Users/admin/builder/spi-builder-workspace/Sources/SKHelper/Views/SKHelperPurchaseInfoFieldView.swift (in target 'SKHelper' from project 'SKHelper')
cd /Users/admin/builder/spi-builder-workspace/.swiftpm/xcode
SwiftCompile normal arm64 /Users/admin/builder/spi-builder-workspace/Sources/SKHelper/Views/SKHelperPurchaseInfoMain.swift (in target 'SKHelper' from project 'SKHelper')
cd /Users/admin/builder/spi-builder-workspace/.swiftpm/xcode
SwiftCompile normal arm64 /Users/admin/builder/spi-builder-workspace/Sources/SKHelper/Views/SKHelperPurchaseInfoManage.swift (in target 'SKHelper' from project 'SKHelper')
cd /Users/admin/builder/spi-builder-workspace/.swiftpm/xcode
SwiftCompile normal arm64 Compiling\ SKHelperPurchaseState.swift,\ SKHelperSubscriptionState.swift,\ SKHelperTransactionUpdateReason.swift /Users/admin/builder/spi-builder-workspace/Sources/SKHelper/Support/SKHelperPurchaseState.swift /Users/admin/builder/spi-builder-workspace/Sources/SKHelper/Support/SKHelperSubscriptionState.swift /Users/admin/builder/spi-builder-workspace/Sources/SKHelper/Support/SKHelperTransactionUpdateReason.swift (in target 'SKHelper' from project 'SKHelper')
SwiftCompile normal arm64 /Users/admin/builder/spi-builder-workspace/Sources/SKHelper/Support/SKHelperPurchaseState.swift (in target 'SKHelper' from project 'SKHelper')
cd /Users/admin/builder/spi-builder-workspace/.swiftpm/xcode
SwiftCompile normal arm64 /Users/admin/builder/spi-builder-workspace/Sources/SKHelper/Support/SKHelperSubscriptionState.swift (in target 'SKHelper' from project 'SKHelper')
cd /Users/admin/builder/spi-builder-workspace/.swiftpm/xcode
SwiftCompile normal arm64 /Users/admin/builder/spi-builder-workspace/Sources/SKHelper/Support/SKHelperTransactionUpdateReason.swift (in target 'SKHelper' from project 'SKHelper')
cd /Users/admin/builder/spi-builder-workspace/.swiftpm/xcode
SwiftCompile normal arm64 Compiling\ SKHelperPurchasesView.swift,\ SKHelperSheetBarView.swift,\ SKHelperStoreView.swift /Users/admin/builder/spi-builder-workspace/Sources/SKHelper/Views/SKHelperPurchasesView.swift /Users/admin/builder/spi-builder-workspace/Sources/SKHelper/Views/SKHelperSheetBarView.swift /Users/admin/builder/spi-builder-workspace/Sources/SKHelper/Views/SKHelperStoreView.swift (in target 'SKHelper' from project 'SKHelper')
SwiftCompile normal arm64 /Users/admin/builder/spi-builder-workspace/Sources/SKHelper/Views/SKHelperPurchasesView.swift (in target 'SKHelper' from project 'SKHelper')
cd /Users/admin/builder/spi-builder-workspace/.swiftpm/xcode
SwiftCompile normal arm64 /Users/admin/builder/spi-builder-workspace/Sources/SKHelper/Views/SKHelperSheetBarView.swift (in target 'SKHelper' from project 'SKHelper')
cd /Users/admin/builder/spi-builder-workspace/.swiftpm/xcode
SwiftCompile normal arm64 /Users/admin/builder/spi-builder-workspace/Sources/SKHelper/Views/SKHelperStoreView.swift (in target 'SKHelper' from project 'SKHelper')
cd /Users/admin/builder/spi-builder-workspace/.swiftpm/xcode
SwiftCompile normal arm64 Compiling\ SKHelperUnwrappedVerificationResult.swift,\ OnSubscriptionChange.swift,\ OnTransaction.swift /Users/admin/builder/spi-builder-workspace/Sources/SKHelper/Support/SKHelperUnwrappedVerificationResult.swift /Users/admin/builder/spi-builder-workspace/Sources/SKHelper/ViewModifiers/OnSubscriptionChange.swift /Users/admin/builder/spi-builder-workspace/Sources/SKHelper/ViewModifiers/OnTransaction.swift (in target 'SKHelper' from project 'SKHelper')
Command SwiftCompile failed with a nonzero exit code
** BUILD FAILED **
The following build commands failed:
SwiftEmitModule normal arm64 Emitting\ module\ for\ SKHelper (in target 'SKHelper' from project 'SKHelper')
EmitSwiftModule normal arm64 (in target 'SKHelper' from project 'SKHelper')
SwiftCompile normal arm64 Compiling\ SKHelperUnwrappedVerificationResult.swift,\ OnSubscriptionChange.swift,\ OnTransaction.swift /Users/admin/builder/spi-builder-workspace/Sources/SKHelper/Support/SKHelperUnwrappedVerificationResult.swift /Users/admin/builder/spi-builder-workspace/Sources/SKHelper/ViewModifiers/OnSubscriptionChange.swift /Users/admin/builder/spi-builder-workspace/Sources/SKHelper/ViewModifiers/OnTransaction.swift (in target 'SKHelper' from project 'SKHelper')
Building workspace spi-builder-workspace with scheme SKHelper
(4 failures)
Command line invocation:
/Applications/Xcode-16.3.0.app/Contents/Developer/usr/bin/xcodebuild -IDEClonedSourcePackagesDirPathOverride=/Users/admin/builder/spi-builder-workspace/.dependencies -resolvePackageDependencies
Resolve Package Graph
Resolved source packages:
SwiftDocCPlugin: https://github.com/apple/swift-docc-plugin.git @ 1.4.3
SKHelper: /Users/admin/builder/spi-builder-workspace
SymbolKit: https://github.com/swiftlang/swift-docc-symbolkit @ 1.0.0
resolved source packages: SwiftDocCPlugin, SKHelper, SymbolKit
{
"dependencies" : [
{
"identity" : "swift-docc-plugin",
"requirement" : {
"range" : [
{
"lower_bound" : "1.3.0",
"upper_bound" : "2.0.0"
}
]
},
"type" : "sourceControl",
"url" : "https://github.com/apple/swift-docc-plugin.git"
}
],
"manifest_display_name" : "SKHelper",
"name" : "SKHelper",
"path" : "/Users/admin/builder/spi-builder-workspace",
"platforms" : [
{
"name" : "ios",
"version" : "17.0"
},
{
"name" : "macos",
"version" : "14.6"
}
],
"products" : [
{
"name" : "SKHelper",
"targets" : [
"SKHelper"
],
"type" : {
"library" : [
"automatic"
]
}
}
],
"targets" : [
{
"c99name" : "SKHelper",
"module_type" : "SwiftTarget",
"name" : "SKHelper",
"path" : "Sources/SKHelper",
"product_memberships" : [
"SKHelper"
],
"resources" : [
{
"path" : "/Users/admin/builder/spi-builder-workspace/Sources/SKHelper/Resources/PrivacyInfo.xcprivacy",
"rule" : {
"process" : {
}
}
},
{
"path" : "/Users/admin/builder/spi-builder-workspace/Sources/SKHelper/Resources/images/skhelper-logo-small.png",
"rule" : {
"process" : {
}
}
},
{
"path" : "/Users/admin/builder/spi-builder-workspace/Sources/SKHelper/Resources/images/skhelper-logo.png",
"rule" : {
"process" : {
}
}
}
],
"sources" : [
"Core/SKHelper+Extensions.swift",
"Core/SKHelper.swift",
"Core/SKHelperConfiguration.swift",
"Core/SKHelperConstants.swift",
"Core/SKHelperLog.swift",
"Core/SKHelperNotification.swift",
"Core/SKHelperProduct.swift",
"Core/SKHelperPurchaseInfo.swift",
"Core/SKHelperSubscriptionInfo.swift",
"Styles/SKHelperButtons.swift",
"Styles/SKHelperProductViewStyle.swift",
"Styles/SKHelperTapGesture.swift",
"Support/SKHelperEntitlementState.swift",
"Support/SKHelperPurchaseState.swift",
"Support/SKHelperSubscriptionState.swift",
"Support/SKHelperTransactionUpdateReason.swift",
"Support/SKHelperUnwrappedVerificationResult.swift",
"ViewModifiers/OnSubscriptionChange.swift",
"ViewModifiers/OnTransaction.swift",
"Views/SKHelperManagePurchaseView.swift",
"Views/SKHelperProductView.swift",
"Views/SKHelperPurchaseInfoFieldText.swift",
"Views/SKHelperPurchaseInfoFieldView.swift",
"Views/SKHelperPurchaseInfoMain.swift",
"Views/SKHelperPurchaseInfoManage.swift",
"Views/SKHelperPurchasesView.swift",
"Views/SKHelperSheetBarView.swift",
"Views/SKHelperStoreView.swift",
"Views/SKHelperSubscriptionInfoMain.swift",
"Views/SKHelperSubscriptionInfoManage.swift",
"Views/SKHelperSubscriptionStoreView.swift"
],
"type" : "library"
}
],
"tools_version" : "6.0"
}
{
"workspace" : {
"name" : "spi-builder-workspace",
"schemes" : [
"SKHelper"
]
}
}
Running build ...
env DEVELOPER_DIR=/Applications/Xcode-16.3.0.app xcrun xcodebuild -IDEClonedSourcePackagesDirPathOverride=$PWD/.dependencies -skipMacroValidation -skipPackagePluginValidation -derivedDataPath $PWD/.derivedData build -scheme SKHelper -destination generic/platform=tvOS
Command line invocation:
/Applications/Xcode-16.3.0.app/Contents/Developer/usr/bin/xcodebuild -IDEClonedSourcePackagesDirPathOverride=/Users/admin/builder/spi-builder-workspace/.dependencies -skipMacroValidation -skipPackagePluginValidation -derivedDataPath /Users/admin/builder/spi-builder-workspace/.derivedData build -scheme SKHelper -destination generic/platform=tvOS
Resolve Package Graph
Resolved source packages:
SymbolKit: https://github.com/swiftlang/swift-docc-symbolkit @ 1.0.0
SKHelper: /Users/admin/builder/spi-builder-workspace
SwiftDocCPlugin: https://github.com/apple/swift-docc-plugin.git @ 1.4.3
ComputePackagePrebuildTargetDependencyGraph
Prepare packages
CreateBuildRequest
SendProjectDescription
CreateBuildOperation
ComputeTargetDependencyGraph
note: Building targets in dependency order
note: Target dependency graph (3 targets)
Target 'SKHelper' in project 'SKHelper'
➜ Explicit dependency on target 'SKHelper' in project 'SKHelper'
➜ Explicit dependency on target 'SKHelper_SKHelper' in project 'SKHelper'
Target 'SKHelper' in project 'SKHelper'
➜ Explicit dependency on target 'SKHelper_SKHelper' in project 'SKHelper'
Target 'SKHelper_SKHelper' in project 'SKHelper' (no dependencies)
GatherProvisioningInputs
CreateBuildDescription
ExecuteExternalTool /Applications/Xcode-16.3.0.app/Contents/Developer/Toolchains/XcodeDefault.xctoolchain/usr/bin/clang -v -E -dM -isysroot /Applications/Xcode-16.3.0.app/Contents/Developer/Platforms/AppleTVOS.platform/Developer/SDKs/AppleTVOS18.4.sdk -x c -c /dev/null
ExecuteExternalTool /Applications/Xcode-16.3.0.app/Contents/Developer/Toolchains/XcodeDefault.xctoolchain/usr/bin/swiftc --version
ExecuteExternalTool /Applications/Xcode-16.3.0.app/Contents/Developer/Toolchains/XcodeDefault.xctoolchain/usr/bin/ld -version_details
ReadFileContents /Applications/Xcode-16.3.0.app/Contents/Developer/Toolchains/XcodeDefault.xctoolchain/usr/share/docc/features.json
Build description signature: a4f5dd62e1b65f10c8ebff5b736ea55b
Build description path: /Users/admin/builder/spi-builder-workspace/.derivedData/Build/Intermediates.noindex/XCBuildData/a4f5dd62e1b65f10c8ebff5b736ea55b.xcbuilddata
ClangStatCache /Applications/Xcode-16.3.0.app/Contents/Developer/Toolchains/XcodeDefault.xctoolchain/usr/bin/clang-stat-cache /Applications/Xcode-16.3.0.app/Contents/Developer/Platforms/AppleTVOS.platform/Developer/SDKs/AppleTVOS18.4.sdk /Users/admin/builder/spi-builder-workspace/.derivedData/SDKStatCaches.noindex/appletvos18.4-22L251-271d326055c85f9856fa135c41255102.sdkstatcache
cd /Users/admin/builder/spi-builder-workspace/.swiftpm/xcode
/Applications/Xcode-16.3.0.app/Contents/Developer/Toolchains/XcodeDefault.xctoolchain/usr/bin/clang-stat-cache /Applications/Xcode-16.3.0.app/Contents/Developer/Platforms/AppleTVOS.platform/Developer/SDKs/AppleTVOS18.4.sdk -o /Users/admin/builder/spi-builder-workspace/.derivedData/SDKStatCaches.noindex/appletvos18.4-22L251-271d326055c85f9856fa135c41255102.sdkstatcache
ProcessInfoPlistFile /Users/admin/builder/spi-builder-workspace/.derivedData/Build/Products/Debug-appletvos/SKHelper_SKHelper.bundle/Info.plist /Users/admin/builder/spi-builder-workspace/.derivedData/Build/Intermediates.noindex/SKHelper.build/Debug-appletvos/SKHelper_SKHelper.build/empty-SKHelper_SKHelper.plist (in target 'SKHelper_SKHelper' from project 'SKHelper')
cd /Users/admin/builder/spi-builder-workspace
builtin-infoPlistUtility /Users/admin/builder/spi-builder-workspace/.derivedData/Build/Intermediates.noindex/SKHelper.build/Debug-appletvos/SKHelper_SKHelper.build/empty-SKHelper_SKHelper.plist -producttype com.apple.product-type.bundle -expandbuildsettings -format binary -platform appletvos -o /Users/admin/builder/spi-builder-workspace/.derivedData/Build/Products/Debug-appletvos/SKHelper_SKHelper.bundle/Info.plist
SwiftDriver SKHelper normal arm64 com.apple.xcode.tools.swift.compiler (in target 'SKHelper' from project 'SKHelper')
cd /Users/admin/builder/spi-builder-workspace/.swiftpm/xcode
builtin-SwiftDriver -- /Applications/Xcode-16.3.0.app/Contents/Developer/Toolchains/XcodeDefault.xctoolchain/usr/bin/swiftc -module-name SKHelper -Onone -enforce-exclusivity\=checked @/Users/admin/builder/spi-builder-workspace/.derivedData/Build/Intermediates.noindex/SKHelper.build/Debug-appletvos/SKHelper.build/Objects-normal/arm64/SKHelper.SwiftFileList -DSWIFT_PACKAGE -DDEBUG -DXcode -plugin-path /Applications/Xcode-16.3.0.app/Contents/Developer/Toolchains/XcodeDefault.xctoolchain/usr/lib/swift/host/plugins/testing -enable-experimental-feature DebugDescriptionMacro -sdk /Applications/Xcode-16.3.0.app/Contents/Developer/Platforms/AppleTVOS.platform/Developer/SDKs/AppleTVOS18.4.sdk -target arm64-apple-tvos17.0 -g -module-cache-path /Users/admin/builder/spi-builder-workspace/.derivedData/ModuleCache.noindex -Xfrontend -serialize-debugging-options -profile-coverage-mapping -profile-generate -enable-testing -index-store-path /Users/admin/builder/spi-builder-workspace/.derivedData/Index.noindex/DataStore -swift-version 6 -I /Users/admin/builder/spi-builder-workspace/.derivedData/Build/Products/Debug-appletvos -I /Applications/Xcode-16.3.0.app/Contents/Developer/Platforms/AppleTVOS.platform/Developer/usr/lib -F /Users/admin/builder/spi-builder-workspace/.derivedData/Build/Products/Debug-appletvos -F /Applications/Xcode-16.3.0.app/Contents/Developer/Platforms/AppleTVOS.platform/Developer/Library/Frameworks -F /Applications/Xcode-16.3.0.app/Contents/Developer/Platforms/AppleTVOS.platform/Developer/SDKs/AppleTVOS18.4.sdk/Developer/Library/Frameworks -c -j10 -enable-batch-mode -incremental -Xcc -ivfsstatcache -Xcc /Users/admin/builder/spi-builder-workspace/.derivedData/SDKStatCaches.noindex/appletvos18.4-22L251-271d326055c85f9856fa135c41255102.sdkstatcache -output-file-map /Users/admin/builder/spi-builder-workspace/.derivedData/Build/Intermediates.noindex/SKHelper.build/Debug-appletvos/SKHelper.build/Objects-normal/arm64/SKHelper-OutputFileMap.json -use-frontend-parseable-output -save-temps -no-color-diagnostics -serialize-diagnostics -emit-dependencies -emit-module -emit-module-path /Users/admin/builder/spi-builder-workspace/.derivedData/Build/Intermediates.noindex/SKHelper.build/Debug-appletvos/SKHelper.build/Objects-normal/arm64/SKHelper.swiftmodule -validate-clang-modules-once -clang-build-session-file /Users/admin/builder/spi-builder-workspace/.derivedData/ModuleCache.noindex/Session.modulevalidation -package-name spi_builder_workspace -Xcc -I/Users/admin/builder/spi-builder-workspace/.derivedData/Build/Intermediates.noindex/SKHelper.build/Debug-appletvos/SKHelper.build/swift-overrides.hmap -emit-const-values -Xfrontend -const-gather-protocols-file -Xfrontend /Users/admin/builder/spi-builder-workspace/.derivedData/Build/Intermediates.noindex/SKHelper.build/Debug-appletvos/SKHelper.build/Objects-normal/arm64/SKHelper_const_extract_protocols.json -Xcc -I/Users/admin/builder/spi-builder-workspace/.derivedData/Build/Products/Debug-appletvos/include -Xcc -I/Users/admin/builder/spi-builder-workspace/.derivedData/Build/Intermediates.noindex/SKHelper.build/Debug-appletvos/SKHelper.build/DerivedSources-normal/arm64 -Xcc -I/Users/admin/builder/spi-builder-workspace/.derivedData/Build/Intermediates.noindex/SKHelper.build/Debug-appletvos/SKHelper.build/DerivedSources/arm64 -Xcc -I/Users/admin/builder/spi-builder-workspace/.derivedData/Build/Intermediates.noindex/SKHelper.build/Debug-appletvos/SKHelper.build/DerivedSources -Xcc -DSWIFT_PACKAGE -Xcc -DDEBUG\=1 -emit-objc-header -emit-objc-header-path /Users/admin/builder/spi-builder-workspace/.derivedData/Build/Intermediates.noindex/SKHelper.build/Debug-appletvos/SKHelper.build/Objects-normal/arm64/SKHelper-Swift.h -working-directory /Users/admin/builder/spi-builder-workspace/.swiftpm/xcode -experimental-emit-module-separately -disable-cmo
SwiftCompile normal arm64 Compiling\ SKHelperUnwrappedVerificationResult.swift,\ OnSubscriptionChange.swift,\ OnTransaction.swift /Users/admin/builder/spi-builder-workspace/Sources/SKHelper/Support/SKHelperUnwrappedVerificationResult.swift /Users/admin/builder/spi-builder-workspace/Sources/SKHelper/ViewModifiers/OnSubscriptionChange.swift /Users/admin/builder/spi-builder-workspace/Sources/SKHelper/ViewModifiers/OnTransaction.swift (in target 'SKHelper' from project 'SKHelper')
SwiftCompile normal arm64 /Users/admin/builder/spi-builder-workspace/Sources/SKHelper/Support/SKHelperUnwrappedVerificationResult.swift (in target 'SKHelper' from project 'SKHelper')
cd /Users/admin/builder/spi-builder-workspace/.swiftpm/xcode
SwiftCompile normal arm64 /Users/admin/builder/spi-builder-workspace/Sources/SKHelper/ViewModifiers/OnSubscriptionChange.swift (in target 'SKHelper' from project 'SKHelper')
cd /Users/admin/builder/spi-builder-workspace/.swiftpm/xcode
SwiftCompile normal arm64 /Users/admin/builder/spi-builder-workspace/Sources/SKHelper/ViewModifiers/OnTransaction.swift (in target 'SKHelper' from project 'SKHelper')
cd /Users/admin/builder/spi-builder-workspace/.swiftpm/xcode
SwiftCompile normal arm64 Compiling\ SKHelperPurchaseState.swift,\ SKHelperSubscriptionState.swift,\ SKHelperTransactionUpdateReason.swift /Users/admin/builder/spi-builder-workspace/Sources/SKHelper/Support/SKHelperPurchaseState.swift /Users/admin/builder/spi-builder-workspace/Sources/SKHelper/Support/SKHelperSubscriptionState.swift /Users/admin/builder/spi-builder-workspace/Sources/SKHelper/Support/SKHelperTransactionUpdateReason.swift (in target 'SKHelper' from project 'SKHelper')
SwiftCompile normal arm64 /Users/admin/builder/spi-builder-workspace/Sources/SKHelper/Support/SKHelperPurchaseState.swift (in target 'SKHelper' from project 'SKHelper')
cd /Users/admin/builder/spi-builder-workspace/.swiftpm/xcode
SwiftCompile normal arm64 /Users/admin/builder/spi-builder-workspace/Sources/SKHelper/Support/SKHelperSubscriptionState.swift (in target 'SKHelper' from project 'SKHelper')
cd /Users/admin/builder/spi-builder-workspace/.swiftpm/xcode
SwiftCompile normal arm64 /Users/admin/builder/spi-builder-workspace/Sources/SKHelper/Support/SKHelperTransactionUpdateReason.swift (in target 'SKHelper' from project 'SKHelper')
cd /Users/admin/builder/spi-builder-workspace/.swiftpm/xcode
SwiftCompile normal arm64 Compiling\ SKHelperProductViewStyle.swift,\ SKHelperTapGesture.swift,\ SKHelperEntitlementState.swift /Users/admin/builder/spi-builder-workspace/Sources/SKHelper/Styles/SKHelperProductViewStyle.swift /Users/admin/builder/spi-builder-workspace/Sources/SKHelper/Styles/SKHelperTapGesture.swift /Users/admin/builder/spi-builder-workspace/Sources/SKHelper/Support/SKHelperEntitlementState.swift (in target 'SKHelper' from project 'SKHelper')
SwiftCompile normal arm64 /Users/admin/builder/spi-builder-workspace/Sources/SKHelper/Styles/SKHelperProductViewStyle.swift (in target 'SKHelper' from project 'SKHelper')
cd /Users/admin/builder/spi-builder-workspace/.swiftpm/xcode
SwiftCompile normal arm64 /Users/admin/builder/spi-builder-workspace/Sources/SKHelper/Styles/SKHelperTapGesture.swift (in target 'SKHelper' from project 'SKHelper')
cd /Users/admin/builder/spi-builder-workspace/.swiftpm/xcode
SwiftCompile normal arm64 /Users/admin/builder/spi-builder-workspace/Sources/SKHelper/Support/SKHelperEntitlementState.swift (in target 'SKHelper' from project 'SKHelper')
cd /Users/admin/builder/spi-builder-workspace/.swiftpm/xcode
SwiftEmitModule normal arm64 Emitting\ module\ for\ SKHelper (in target 'SKHelper' from project 'SKHelper')
Failed frontend command:
/Applications/Xcode-16.3.0.app/Contents/Developer/Toolchains/XcodeDefault.xctoolchain/usr/bin/swift-frontend -frontend -emit-module -experimental-skip-non-inlinable-function-bodies-without-types /Users/admin/builder/spi-builder-workspace/.derivedData/Build/Intermediates.noindex/SKHelper.build/Debug-appletvos/SKHelper.build/DerivedSources/resource_bundle_accessor.swift /Users/admin/builder/spi-builder-workspace/Sources/SKHelper/Core/SKHelper+Extensions.swift /Users/admin/builder/spi-builder-workspace/Sources/SKHelper/Core/SKHelper.swift /Users/admin/builder/spi-builder-workspace/Sources/SKHelper/Core/SKHelperConfiguration.swift /Users/admin/builder/spi-builder-workspace/Sources/SKHelper/Core/SKHelperConstants.swift /Users/admin/builder/spi-builder-workspace/Sources/SKHelper/Core/SKHelperLog.swift /Users/admin/builder/spi-builder-workspace/Sources/SKHelper/Core/SKHelperNotification.swift /Users/admin/builder/spi-builder-workspace/Sources/SKHelper/Core/SKHelperProduct.swift /Users/admin/builder/spi-builder-workspace/Sources/SKHelper/Core/SKHelperPurchaseInfo.swift /Users/admin/builder/spi-builder-workspace/Sources/SKHelper/Core/SKHelperSubscriptionInfo.swift /Users/admin/builder/spi-builder-workspace/Sources/SKHelper/Styles/SKHelperButtons.swift /Users/admin/builder/spi-builder-workspace/Sources/SKHelper/Styles/SKHelperProductViewStyle.swift /Users/admin/builder/spi-builder-workspace/Sources/SKHelper/Styles/SKHelperTapGesture.swift /Users/admin/builder/spi-builder-workspace/Sources/SKHelper/Support/SKHelperEntitlementState.swift /Users/admin/builder/spi-builder-workspace/Sources/SKHelper/Support/SKHelperPurchaseState.swift /Users/admin/builder/spi-builder-workspace/Sources/SKHelper/Support/SKHelperSubscriptionState.swift /Users/admin/builder/spi-builder-workspace/Sources/SKHelper/Support/SKHelperTransactionUpdateReason.swift /Users/admin/builder/spi-builder-workspace/Sources/SKHelper/Support/SKHelperUnwrappedVerificationResult.swift /Users/admin/builder/spi-builder-workspace/Sources/SKHelper/ViewModifiers/OnSubscriptionChange.swift /Users/admin/builder/spi-builder-workspace/Sources/SKHelper/ViewModifiers/OnTransaction.swift /Users/admin/builder/spi-builder-workspace/Sources/SKHelper/Views/SKHelperManagePurchaseView.swift /Users/admin/builder/spi-builder-workspace/Sources/SKHelper/Views/SKHelperProductView.swift /Users/admin/builder/spi-builder-workspace/Sources/SKHelper/Views/SKHelperPurchaseInfoFieldText.swift /Users/admin/builder/spi-builder-workspace/Sources/SKHelper/Views/SKHelperPurchaseInfoFieldView.swift /Users/admin/builder/spi-builder-workspace/Sources/SKHelper/Views/SKHelperPurchaseInfoMain.swift /Users/admin/builder/spi-builder-workspace/Sources/SKHelper/Views/SKHelperPurchaseInfoManage.swift /Users/admin/builder/spi-builder-workspace/Sources/SKHelper/Views/SKHelperPurchasesView.swift /Users/admin/builder/spi-builder-workspace/Sources/SKHelper/Views/SKHelperSheetBarView.swift /Users/admin/builder/spi-builder-workspace/Sources/SKHelper/Views/SKHelperStoreView.swift /Users/admin/builder/spi-builder-workspace/Sources/SKHelper/Views/SKHelperSubscriptionInfoMain.swift /Users/admin/builder/spi-builder-workspace/Sources/SKHelper/Views/SKHelperSubscriptionInfoManage.swift /Users/admin/builder/spi-builder-workspace/Sources/SKHelper/Views/SKHelperSubscriptionStoreView.swift -target arm64-apple-tvos17.0 -Xllvm -aarch64-use-tbi -enable-objc-interop -stack-check -sdk /Applications/Xcode-16.3.0.app/Contents/Developer/Platforms/AppleTVOS.platform/Developer/SDKs/AppleTVOS18.4.sdk -I /Users/admin/builder/spi-builder-workspace/.derivedData/Build/Products/Debug-appletvos -I /Applications/Xcode-16.3.0.app/Contents/Developer/Platforms/AppleTVOS.platform/Developer/usr/lib -F /Users/admin/builder/spi-builder-workspace/.derivedData/Build/Products/Debug-appletvos -F /Applications/Xcode-16.3.0.app/Contents/Developer/Platforms/AppleTVOS.platform/Developer/Library/Frameworks -F /Applications/Xcode-16.3.0.app/Contents/Developer/Platforms/AppleTVOS.platform/Developer/SDKs/AppleTVOS18.4.sdk/Developer/Library/Frameworks -no-color-diagnostics -enable-testing -g -debug-info-format\=dwarf -dwarf-version\=4 -module-cache-path /Users/admin/builder/spi-builder-workspace/.derivedData/ModuleCache.noindex -profile-generate -profile-coverage-mapping -swift-version 6 -enforce-exclusivity\=checked -Onone -D SWIFT_PACKAGE -D DEBUG -D Xcode -serialize-debugging-options -const-gather-protocols-file /Users/admin/builder/spi-builder-workspace/.derivedData/Build/Intermediates.noindex/SKHelper.build/Debug-appletvos/SKHelper.build/Objects-normal/arm64/SKHelper_const_extract_protocols.json -enable-experimental-feature DebugDescriptionMacro -empty-abi-descriptor -plugin-path /Applications/Xcode-16.3.0.app/Contents/Developer/Toolchains/XcodeDefault.xctoolchain/usr/lib/swift/host/plugins/testing -validate-clang-modules-once -clang-build-session-file /Users/admin/builder/spi-builder-workspace/.derivedData/ModuleCache.noindex/Session.modulevalidation -Xcc -working-directory -Xcc /Users/admin/builder/spi-builder-workspace/.swiftpm/xcode -resource-dir /Applications/Xcode-16.3.0.app/Contents/Developer/Toolchains/XcodeDefault.xctoolchain/usr/lib/swift -enable-anonymous-context-mangled-names -file-compilation-dir /Users/admin/builder/spi-builder-workspace/.swiftpm/xcode -Xcc -ivfsstatcache -Xcc /Users/admin/builder/spi-builder-workspace/.derivedData/SDKStatCaches.noindex/appletvos18.4-22L251-271d326055c85f9856fa135c41255102.sdkstatcache -Xcc -I/Users/admin/builder/spi-builder-workspace/.derivedData/Build/Intermediates.noindex/SKHelper.build/Debug-appletvos/SKHelper.build/swift-overrides.hmap -Xcc -I/Users/admin/builder/spi-builder-workspace/.derivedData/Build/Products/Debug-appletvos/include -Xcc -I/Users/admin/builder/spi-builder-workspace/.derivedData/Build/Intermediates.noindex/SKHelper.build/Debug-appletvos/SKHelper.build/DerivedSources-normal/arm64 -Xcc -I/Users/admin/builder/spi-builder-workspace/.derivedData/Build/Intermediates.noindex/SKHelper.build/Debug-appletvos/SKHelper.build/DerivedSources/arm64 -Xcc -I/Users/admin/builder/spi-builder-workspace/.derivedData/Build/Intermediates.noindex/SKHelper.build/Debug-appletvos/SKHelper.build/DerivedSources -Xcc -DSWIFT_PACKAGE -Xcc -DDEBUG\=1 -module-name SKHelper -package-name spi_builder_workspace -frontend-parseable-output -disable-clang-spi -target-sdk-version 18.4 -target-sdk-name appletvos18.4 -external-plugin-path /Applications/Xcode-16.3.0.app/Contents/Developer/Platforms/AppleTVOS.platform/Developer/usr/lib/swift/host/plugins\#/Applications/Xcode-16.3.0.app/Contents/Developer/Platforms/AppleTVOS.platform/Developer/usr/bin/swift-plugin-server -external-plugin-path /Applications/Xcode-16.3.0.app/Contents/Developer/Platforms/AppleTVOS.platform/Developer/usr/local/lib/swift/host/plugins\#/Applications/Xcode-16.3.0.app/Contents/Developer/Platforms/AppleTVOS.platform/Developer/usr/bin/swift-plugin-server -in-process-plugin-server-path /Applications/Xcode-16.3.0.app/Contents/Developer/Toolchains/XcodeDefault.xctoolchain/usr/lib/swift/host/libSwiftInProcPluginServer.dylib -plugin-path /Applications/Xcode-16.3.0.app/Contents/Developer/Toolchains/XcodeDefault.xctoolchain/usr/lib/swift/host/plugins -plugin-path /Applications/Xcode-16.3.0.app/Contents/Developer/Toolchains/XcodeDefault.xctoolchain/usr/local/lib/swift/host/plugins -emit-module-doc-path /Users/admin/builder/spi-builder-workspace/.derivedData/Build/Intermediates.noindex/SKHelper.build/Debug-appletvos/SKHelper.build/Objects-normal/arm64/SKHelper.swiftdoc -emit-module-source-info-path /Users/admin/builder/spi-builder-workspace/.derivedData/Build/Intermediates.noindex/SKHelper.build/Debug-appletvos/SKHelper.build/Objects-normal/arm64/SKHelper.swiftsourceinfo -emit-objc-header-path /Users/admin/builder/spi-builder-workspace/.derivedData/Build/Intermediates.noindex/SKHelper.build/Debug-appletvos/SKHelper.build/Objects-normal/arm64/SKHelper-Swift.h -serialize-diagnostics-path /Users/admin/builder/spi-builder-workspace/.derivedData/Build/Intermediates.noindex/SKHelper.build/Debug-appletvos/SKHelper.build/Objects-normal/arm64/SKHelper-master-emit-module.dia -emit-dependencies-path /Users/admin/builder/spi-builder-workspace/.derivedData/Build/Intermediates.noindex/SKHelper.build/Debug-appletvos/SKHelper.build/Objects-normal/arm64/SKHelper-master-emit-module.d -o /Users/admin/builder/spi-builder-workspace/.derivedData/Build/Intermediates.noindex/SKHelper.build/Debug-appletvos/SKHelper.build/Objects-normal/arm64/SKHelper.swiftmodule -emit-abi-descriptor-path /Users/admin/builder/spi-builder-workspace/.derivedData/Build/Intermediates.noindex/SKHelper.build/Debug-appletvos/SKHelper.build/Objects-normal/arm64/SKHelper.abi.json
EmitSwiftModule normal arm64 (in target 'SKHelper' from project 'SKHelper')
cd /Users/admin/builder/spi-builder-workspace/.swiftpm/xcode
/Users/admin/builder/spi-builder-workspace/Sources/SKHelper/Views/SKHelperSheetBarView.swift:132:5: error: cannot find 'SKHelperSheetBarView' in scope
SKHelperSheetBarView(showSheet: Binding.constant(true), title: "Test", sysImage: "face.smiling")
^~~~~~~~~~~~~~~~~~~~
SwiftCompile normal arm64 Compiling\ SKHelperPurchasesView.swift,\ SKHelperSheetBarView.swift,\ SKHelperStoreView.swift /Users/admin/builder/spi-builder-workspace/Sources/SKHelper/Views/SKHelperPurchasesView.swift /Users/admin/builder/spi-builder-workspace/Sources/SKHelper/Views/SKHelperSheetBarView.swift /Users/admin/builder/spi-builder-workspace/Sources/SKHelper/Views/SKHelperStoreView.swift (in target 'SKHelper' from project 'SKHelper')
SwiftCompile normal arm64 /Users/admin/builder/spi-builder-workspace/Sources/SKHelper/Views/SKHelperPurchasesView.swift (in target 'SKHelper' from project 'SKHelper')
cd /Users/admin/builder/spi-builder-workspace/.swiftpm/xcode
SwiftCompile normal arm64 /Users/admin/builder/spi-builder-workspace/Sources/SKHelper/Views/SKHelperSheetBarView.swift (in target 'SKHelper' from project 'SKHelper')
cd /Users/admin/builder/spi-builder-workspace/.swiftpm/xcode
SwiftCompile normal arm64 /Users/admin/builder/spi-builder-workspace/Sources/SKHelper/Views/SKHelperStoreView.swift (in target 'SKHelper' from project 'SKHelper')
cd /Users/admin/builder/spi-builder-workspace/.swiftpm/xcode
SwiftCompile normal arm64 Compiling\ SKHelperSubscriptionInfoMain.swift,\ SKHelperSubscriptionInfoManage.swift,\ SKHelperSubscriptionStoreView.swift /Users/admin/builder/spi-builder-workspace/Sources/SKHelper/Views/SKHelperSubscriptionInfoMain.swift /Users/admin/builder/spi-builder-workspace/Sources/SKHelper/Views/SKHelperSubscriptionInfoManage.swift /Users/admin/builder/spi-builder-workspace/Sources/SKHelper/Views/SKHelperSubscriptionStoreView.swift (in target 'SKHelper' from project 'SKHelper')
SwiftCompile normal arm64 /Users/admin/builder/spi-builder-workspace/Sources/SKHelper/Views/SKHelperSubscriptionInfoMain.swift (in target 'SKHelper' from project 'SKHelper')
cd /Users/admin/builder/spi-builder-workspace/.swiftpm/xcode
SwiftCompile normal arm64 /Users/admin/builder/spi-builder-workspace/Sources/SKHelper/Views/SKHelperSubscriptionInfoManage.swift (in target 'SKHelper' from project 'SKHelper')
cd /Users/admin/builder/spi-builder-workspace/.swiftpm/xcode
SwiftCompile normal arm64 /Users/admin/builder/spi-builder-workspace/Sources/SKHelper/Views/SKHelperSubscriptionStoreView.swift (in target 'SKHelper' from project 'SKHelper')
cd /Users/admin/builder/spi-builder-workspace/.swiftpm/xcode
SwiftCompile normal arm64 Compiling\ SKHelperPurchaseInfoFieldView.swift,\ SKHelperPurchaseInfoMain.swift,\ SKHelperPurchaseInfoManage.swift /Users/admin/builder/spi-builder-workspace/Sources/SKHelper/Views/SKHelperPurchaseInfoFieldView.swift /Users/admin/builder/spi-builder-workspace/Sources/SKHelper/Views/SKHelperPurchaseInfoMain.swift /Users/admin/builder/spi-builder-workspace/Sources/SKHelper/Views/SKHelperPurchaseInfoManage.swift (in target 'SKHelper' from project 'SKHelper')
SwiftCompile normal arm64 /Users/admin/builder/spi-builder-workspace/Sources/SKHelper/Views/SKHelperPurchaseInfoFieldView.swift (in target 'SKHelper' from project 'SKHelper')
cd /Users/admin/builder/spi-builder-workspace/.swiftpm/xcode
SwiftCompile normal arm64 /Users/admin/builder/spi-builder-workspace/Sources/SKHelper/Views/SKHelperPurchaseInfoMain.swift (in target 'SKHelper' from project 'SKHelper')
cd /Users/admin/builder/spi-builder-workspace/.swiftpm/xcode
SwiftCompile normal arm64 /Users/admin/builder/spi-builder-workspace/Sources/SKHelper/Views/SKHelperPurchaseInfoManage.swift (in target 'SKHelper' from project 'SKHelper')
cd /Users/admin/builder/spi-builder-workspace/.swiftpm/xcode
SwiftCompile normal arm64 Compiling\ SKHelperConstants.swift,\ SKHelperLog.swift,\ SKHelperNotification.swift,\ SKHelperProduct.swift /Users/admin/builder/spi-builder-workspace/Sources/SKHelper/Core/SKHelperConstants.swift /Users/admin/builder/spi-builder-workspace/Sources/SKHelper/Core/SKHelperLog.swift /Users/admin/builder/spi-builder-workspace/Sources/SKHelper/Core/SKHelperNotification.swift /Users/admin/builder/spi-builder-workspace/Sources/SKHelper/Core/SKHelperProduct.swift (in target 'SKHelper' from project 'SKHelper')
SwiftCompile normal arm64 /Users/admin/builder/spi-builder-workspace/Sources/SKHelper/Core/SKHelperConstants.swift (in target 'SKHelper' from project 'SKHelper')
cd /Users/admin/builder/spi-builder-workspace/.swiftpm/xcode
SwiftCompile normal arm64 /Users/admin/builder/spi-builder-workspace/Sources/SKHelper/Core/SKHelperLog.swift (in target 'SKHelper' from project 'SKHelper')
cd /Users/admin/builder/spi-builder-workspace/.swiftpm/xcode
SwiftCompile normal arm64 /Users/admin/builder/spi-builder-workspace/Sources/SKHelper/Core/SKHelperNotification.swift (in target 'SKHelper' from project 'SKHelper')
cd /Users/admin/builder/spi-builder-workspace/.swiftpm/xcode
SwiftCompile normal arm64 /Users/admin/builder/spi-builder-workspace/Sources/SKHelper/Core/SKHelperProduct.swift (in target 'SKHelper' from project 'SKHelper')
cd /Users/admin/builder/spi-builder-workspace/.swiftpm/xcode
SwiftCompile normal arm64 Compiling\ resource_bundle_accessor.swift,\ SKHelper+Extensions.swift,\ SKHelper.swift,\ SKHelperConfiguration.swift /Users/admin/builder/spi-builder-workspace/.derivedData/Build/Intermediates.noindex/SKHelper.build/Debug-appletvos/SKHelper.build/DerivedSources/resource_bundle_accessor.swift /Users/admin/builder/spi-builder-workspace/Sources/SKHelper/Core/SKHelper+Extensions.swift /Users/admin/builder/spi-builder-workspace/Sources/SKHelper/Core/SKHelper.swift /Users/admin/builder/spi-builder-workspace/Sources/SKHelper/Core/SKHelperConfiguration.swift (in target 'SKHelper' from project 'SKHelper')
SwiftCompile normal arm64 /Users/admin/builder/spi-builder-workspace/.derivedData/Build/Intermediates.noindex/SKHelper.build/Debug-appletvos/SKHelper.build/DerivedSources/resource_bundle_accessor.swift (in target 'SKHelper' from project 'SKHelper')
cd /Users/admin/builder/spi-builder-workspace/.swiftpm/xcode
SwiftCompile normal arm64 /Users/admin/builder/spi-builder-workspace/Sources/SKHelper/Core/SKHelper+Extensions.swift (in target 'SKHelper' from project 'SKHelper')
cd /Users/admin/builder/spi-builder-workspace/.swiftpm/xcode
SwiftCompile normal arm64 /Users/admin/builder/spi-builder-workspace/Sources/SKHelper/Core/SKHelper.swift (in target 'SKHelper' from project 'SKHelper')
cd /Users/admin/builder/spi-builder-workspace/.swiftpm/xcode
SwiftCompile normal arm64 /Users/admin/builder/spi-builder-workspace/Sources/SKHelper/Core/SKHelperConfiguration.swift (in target 'SKHelper' from project 'SKHelper')
cd /Users/admin/builder/spi-builder-workspace/.swiftpm/xcode
SwiftCompile normal arm64 Compiling\ SKHelperPurchaseInfo.swift,\ SKHelperSubscriptionInfo.swift,\ SKHelperButtons.swift /Users/admin/builder/spi-builder-workspace/Sources/SKHelper/Core/SKHelperPurchaseInfo.swift /Users/admin/builder/spi-builder-workspace/Sources/SKHelper/Core/SKHelperSubscriptionInfo.swift /Users/admin/builder/spi-builder-workspace/Sources/SKHelper/Styles/SKHelperButtons.swift (in target 'SKHelper' from project 'SKHelper')
SwiftCompile normal arm64 /Users/admin/builder/spi-builder-workspace/Sources/SKHelper/Core/SKHelperPurchaseInfo.swift (in target 'SKHelper' from project 'SKHelper')
cd /Users/admin/builder/spi-builder-workspace/.swiftpm/xcode
SwiftCompile normal arm64 /Users/admin/builder/spi-builder-workspace/Sources/SKHelper/Core/SKHelperSubscriptionInfo.swift (in target 'SKHelper' from project 'SKHelper')
cd /Users/admin/builder/spi-builder-workspace/.swiftpm/xcode
SwiftCompile normal arm64 /Users/admin/builder/spi-builder-workspace/Sources/SKHelper/Styles/SKHelperButtons.swift (in target 'SKHelper' from project 'SKHelper')
cd /Users/admin/builder/spi-builder-workspace/.swiftpm/xcode
SwiftCompile normal arm64 Compiling\ SKHelperManagePurchaseView.swift,\ SKHelperProductView.swift,\ SKHelperPurchaseInfoFieldText.swift /Users/admin/builder/spi-builder-workspace/Sources/SKHelper/Views/SKHelperManagePurchaseView.swift /Users/admin/builder/spi-builder-workspace/Sources/SKHelper/Views/SKHelperProductView.swift /Users/admin/builder/spi-builder-workspace/Sources/SKHelper/Views/SKHelperPurchaseInfoFieldText.swift (in target 'SKHelper' from project 'SKHelper')
Command SwiftCompile failed with a nonzero exit code
** BUILD FAILED **
The following build commands failed:
SwiftEmitModule normal arm64 Emitting\ module\ for\ SKHelper (in target 'SKHelper' from project 'SKHelper')
EmitSwiftModule normal arm64 (in target 'SKHelper' from project 'SKHelper')
SwiftCompile normal arm64 Compiling\ SKHelperManagePurchaseView.swift,\ SKHelperProductView.swift,\ SKHelperPurchaseInfoFieldText.swift /Users/admin/builder/spi-builder-workspace/Sources/SKHelper/Views/SKHelperManagePurchaseView.swift /Users/admin/builder/spi-builder-workspace/Sources/SKHelper/Views/SKHelperProductView.swift /Users/admin/builder/spi-builder-workspace/Sources/SKHelper/Views/SKHelperPurchaseInfoFieldText.swift (in target 'SKHelper' from project 'SKHelper')
Building workspace spi-builder-workspace with scheme SKHelper
(4 failures)
BUILD FAILURE 6.1 tvOS