Build Information
Successful build of YPersistence, reference main (7de3f7
), with Swift 6.1 for iOS using Xcode 16.3 on 27 Apr 2025 22:08:36 UTC.
Swift 6 data race errors: 11
Build Command
env DEVELOPER_DIR=/Applications/Xcode-16.3.0.app xcrun xcodebuild -IDEClonedSourcePackagesDirPathOverride=$PWD/.dependencies -skipMacroValidation -skipPackagePluginValidation -derivedDataPath $PWD/.derivedData build -scheme YPersistence -destination generic/platform=iOS
Build Log
"name" : "YPersistence",
"path" : "Sources/YPersistence",
"product_memberships" : [
"YPersistence"
],
"sources" : [
"Extensions/DispatchQueue+executeOnMain.swift",
"Extensions/NSManagedObjectContext+SaveChanges.swift",
"Extensions/NSManagedObjectModel+init.swift",
"Manager/PersistenceManager+BulkDelete.swift",
"Manager/PersistenceManager+Clear.swift",
"Manager/PersistenceManager+Delete.swift",
"Manager/PersistenceManager+Fetch.swift",
"Manager/PersistenceManager+Save.swift",
"Manager/PersistenceManager+Sync.swift",
"Manager/PersistenceManager.swift",
"Protocols/CoreModel.swift",
"Protocols/DataRecord.swift",
"Protocols/ModelRepresentable.swift",
"Protocols/RecordFromModel.swift",
"Protocols/RecordToModel.swift",
"Protocols/SyncRecord.swift",
"SortColumn.swift",
"SortInfo.swift"
],
"type" : "library"
}
],
"tools_version" : "5.5"
}
Command line invocation:
/Applications/Xcode-16.3.0.app/Contents/Developer/usr/bin/xcodebuild -IDEClonedSourcePackagesDirPathOverride=/Users/admin/builder/spi-builder-workspace/.dependencies -resolvePackageDependencies
Resolve Package Graph
Resolved source packages:
YPersistence: /Users/admin/builder/spi-builder-workspace
resolved source packages: YPersistence
{
"dependencies" : [
],
"manifest_display_name" : "YPersistence",
"name" : "YPersistence",
"path" : "/Users/admin/builder/spi-builder-workspace",
"platforms" : [
],
"products" : [
{
"name" : "YPersistence",
"targets" : [
"YPersistence"
],
"type" : {
"library" : [
"automatic"
]
}
}
],
"targets" : [
{
"c99name" : "YPersistenceTests",
"module_type" : "SwiftTarget",
"name" : "YPersistenceTests",
"path" : "Tests/YPersistenceTests",
"sources" : [
"DataModel/Human/ManagedFruit.swift",
"DataModel/Human/ManagedGroceryProduct.swift",
"DataModel/Machine/_ManagedFruit.swift",
"DataModel/Machine/_ManagedGroceryProduct.swift",
"DataModel/Mocks/Fruit.swift",
"DataModel/Mocks/GroceryProduct.swift",
"Extensions/DispatchQueue+executeOnMainTests.swift",
"Extensions/NSManagedObjectContext+SaveChangesTests.swift",
"Extensions/NSManagedObjectModel+initTests.swift",
"Manager/PersistenceManager+BulkDeleteTests.swift",
"Manager/PersistenceManager+ClearTests.swift",
"Manager/PersistenceManager+DeleteTests.swift",
"Manager/PersistenceManager+FetchTests.swift",
"Manager/PersistenceManager+SaveTests.swift",
"Manager/PersistenceManager+SyncTests.swift",
"Manager/PersistenceManagerBaseTests.swift",
"Manager/PersistenceManagerTests.swift",
"Protocols/DataRecordTests.swift",
"Protocols/SyncRecordTests.swift",
"SortColumnTests.swift",
"SortInfoTests.swift"
],
"target_dependencies" : [
"YPersistence"
],
"type" : "test"
},
{
"c99name" : "YPersistence",
"module_type" : "SwiftTarget",
"name" : "YPersistence",
"path" : "Sources/YPersistence",
"product_memberships" : [
"YPersistence"
],
"sources" : [
"Extensions/DispatchQueue+executeOnMain.swift",
"Extensions/NSManagedObjectContext+SaveChanges.swift",
"Extensions/NSManagedObjectModel+init.swift",
"Manager/PersistenceManager+BulkDelete.swift",
"Manager/PersistenceManager+Clear.swift",
"Manager/PersistenceManager+Delete.swift",
"Manager/PersistenceManager+Fetch.swift",
"Manager/PersistenceManager+Save.swift",
"Manager/PersistenceManager+Sync.swift",
"Manager/PersistenceManager.swift",
"Protocols/CoreModel.swift",
"Protocols/DataRecord.swift",
"Protocols/ModelRepresentable.swift",
"Protocols/RecordFromModel.swift",
"Protocols/RecordToModel.swift",
"Protocols/SyncRecord.swift",
"SortColumn.swift",
"SortInfo.swift"
],
"type" : "library"
}
],
"tools_version" : "5.5"
}
{
"workspace" : {
"name" : "spi-builder-workspace",
"schemes" : [
"YPersistence"
]
}
}
Running build ...
env DEVELOPER_DIR=/Applications/Xcode-16.3.0.app xcrun xcodebuild -IDEClonedSourcePackagesDirPathOverride=$PWD/.dependencies -skipMacroValidation -skipPackagePluginValidation -derivedDataPath $PWD/.derivedData build -scheme YPersistence -destination generic/platform=iOS OTHER_SWIFT_FLAGS=-stats-output-dir .stats -strict-concurrency=complete -enable-upcoming-feature StrictConcurrency -enable-upcoming-feature DisableOutwardActorInference -enable-upcoming-feature GlobalActorIsolatedTypesUsability -enable-upcoming-feature InferSendableFromCaptures
Command line invocation:
/Applications/Xcode-16.3.0.app/Contents/Developer/usr/bin/xcodebuild -IDEClonedSourcePackagesDirPathOverride=/Users/admin/builder/spi-builder-workspace/.dependencies -skipMacroValidation -skipPackagePluginValidation -derivedDataPath /Users/admin/builder/spi-builder-workspace/.derivedData build -scheme YPersistence -destination generic/platform=iOS "OTHER_SWIFT_FLAGS=-stats-output-dir .stats -strict-concurrency=complete -enable-upcoming-feature StrictConcurrency -enable-upcoming-feature DisableOutwardActorInference -enable-upcoming-feature GlobalActorIsolatedTypesUsability -enable-upcoming-feature InferSendableFromCaptures"
Build settings from command line:
OTHER_SWIFT_FLAGS = -stats-output-dir .stats -strict-concurrency=complete -enable-upcoming-feature StrictConcurrency -enable-upcoming-feature DisableOutwardActorInference -enable-upcoming-feature GlobalActorIsolatedTypesUsability -enable-upcoming-feature InferSendableFromCaptures
Resolve Package Graph
Resolved source packages:
YPersistence: /Users/admin/builder/spi-builder-workspace
ComputePackagePrebuildTargetDependencyGraph
Prepare packages
CreateBuildRequest
SendProjectDescription
CreateBuildOperation
ComputeTargetDependencyGraph
note: Building targets in dependency order
note: Target dependency graph (4 targets)
Target 'YPersistenceTests' in project 'YPersistence'
➜ Explicit dependency on target 'YPersistence_YPersistenceTests' in project 'YPersistence'
➜ Explicit dependency on target 'YPersistence' in project 'YPersistence'
Target 'YPersistence_YPersistenceTests' in project 'YPersistence' (no dependencies)
Target 'YPersistence' in project 'YPersistence'
➜ Explicit dependency on target 'YPersistence' in project 'YPersistence'
Target 'YPersistence' in project 'YPersistence' (no dependencies)
GatherProvisioningInputs
CreateBuildDescription
ExecuteExternalTool /Applications/Xcode-16.3.0.app/Contents/Developer/Toolchains/XcodeDefault.xctoolchain/usr/bin/swiftc --version
ExecuteExternalTool /Applications/Xcode-16.3.0.app/Contents/Developer/Toolchains/XcodeDefault.xctoolchain/usr/bin/clang -v -E -dM -isysroot /Applications/Xcode-16.3.0.app/Contents/Developer/Platforms/iPhoneOS.platform/Developer/SDKs/iPhoneOS18.4.sdk -x c -c /dev/null
ExecuteExternalTool /Applications/Xcode-16.3.0.app/Contents/Developer/usr/bin/momc --dry-run --action generate --swift-version 5 --sdkroot /Applications/Xcode-16.3.0.app/Contents/Developer/Platforms/iPhoneOS.platform/Developer/SDKs/iPhoneOS18.4.sdk --iphoneos-deployment-target 13.0 --module YPersistenceTests /Users/admin/builder/spi-builder-workspace/Tests/YPersistenceTests/Assets/YPersistence.xcdatamodeld /Users/admin/builder/spi-builder-workspace/.derivedData/Build/Intermediates.noindex/YPersistence.build/Debug-iphoneos/YPersistenceTests.build/DerivedSources/CoreDataGenerated/YPersistence
ExecuteExternalTool /Applications/Xcode-16.3.0.app/Contents/Developer/Toolchains/XcodeDefault.xctoolchain/usr/bin/ld -version_details
Build description signature: 715ad662401d57e03bf234e2259e33f1
Build description path: /Users/admin/builder/spi-builder-workspace/.derivedData/Build/Intermediates.noindex/XCBuildData/715ad662401d57e03bf234e2259e33f1.xcbuilddata
ClangStatCache /Applications/Xcode-16.3.0.app/Contents/Developer/Toolchains/XcodeDefault.xctoolchain/usr/bin/clang-stat-cache /Applications/Xcode-16.3.0.app/Contents/Developer/Platforms/iPhoneOS.platform/Developer/SDKs/iPhoneOS18.4.sdk /Users/admin/builder/spi-builder-workspace/.derivedData/SDKStatCaches.noindex/iphoneos18.4-22E235-339d34bc69d7fc736c3220795c36f340.sdkstatcache
cd /Users/admin/builder/spi-builder-workspace/.swiftpm/xcode
/Applications/Xcode-16.3.0.app/Contents/Developer/Toolchains/XcodeDefault.xctoolchain/usr/bin/clang-stat-cache /Applications/Xcode-16.3.0.app/Contents/Developer/Platforms/iPhoneOS.platform/Developer/SDKs/iPhoneOS18.4.sdk -o /Users/admin/builder/spi-builder-workspace/.derivedData/SDKStatCaches.noindex/iphoneos18.4-22E235-339d34bc69d7fc736c3220795c36f340.sdkstatcache
CreateBuildDirectory /Users/admin/builder/spi-builder-workspace/.derivedData/Build/Products
cd /Users/admin/builder/spi-builder-workspace/.swiftpm/xcode
builtin-create-build-directory /Users/admin/builder/spi-builder-workspace/.derivedData/Build/Products
CreateBuildDirectory /Users/admin/builder/spi-builder-workspace/.derivedData/Build/Intermediates.noindex
cd /Users/admin/builder/spi-builder-workspace/.swiftpm/xcode
builtin-create-build-directory /Users/admin/builder/spi-builder-workspace/.derivedData/Build/Intermediates.noindex
CreateBuildDirectory /Users/admin/builder/spi-builder-workspace/.derivedData/Build/Intermediates.noindex/EagerLinkingTBDs/Debug-iphoneos
cd /Users/admin/builder/spi-builder-workspace/.swiftpm/xcode
builtin-create-build-directory /Users/admin/builder/spi-builder-workspace/.derivedData/Build/Intermediates.noindex/EagerLinkingTBDs/Debug-iphoneos
CreateBuildDirectory /Users/admin/builder/spi-builder-workspace/.derivedData/Build/Products/Debug-iphoneos
cd /Users/admin/builder/spi-builder-workspace/.swiftpm/xcode
builtin-create-build-directory /Users/admin/builder/spi-builder-workspace/.derivedData/Build/Products/Debug-iphoneos
CreateBuildDirectory /Users/admin/builder/spi-builder-workspace/.derivedData/Build/Products/Debug-iphoneos/PackageFrameworks
cd /Users/admin/builder/spi-builder-workspace/.swiftpm/xcode
builtin-create-build-directory /Users/admin/builder/spi-builder-workspace/.derivedData/Build/Products/Debug-iphoneos/PackageFrameworks
MkDir /Users/admin/builder/spi-builder-workspace/.derivedData/Build/Products/Debug-iphoneos/YPersistence_YPersistenceTests.bundle (in target 'YPersistence_YPersistenceTests' from project 'YPersistence')
cd /Users/admin/builder/spi-builder-workspace
/bin/mkdir -p /Users/admin/builder/spi-builder-workspace/.derivedData/Build/Products/Debug-iphoneos/YPersistence_YPersistenceTests.bundle
WriteAuxiliaryFile /Users/admin/builder/spi-builder-workspace/.derivedData/Build/Intermediates.noindex/YPersistence.build/Debug-iphoneos/YPersistenceTests.build/empty-YPersistenceTests.plist (in target 'YPersistenceTests' from project 'YPersistence')
cd /Users/admin/builder/spi-builder-workspace
write-file /Users/admin/builder/spi-builder-workspace/.derivedData/Build/Intermediates.noindex/YPersistence.build/Debug-iphoneos/YPersistenceTests.build/empty-YPersistenceTests.plist
WriteAuxiliaryFile /Users/admin/builder/spi-builder-workspace/.derivedData/Build/Intermediates.noindex/YPersistence.build/Debug-iphoneos/YPersistenceTests.build/YPersistenceTests.DependencyStaticMetadataFileList (in target 'YPersistenceTests' from project 'YPersistence')
cd /Users/admin/builder/spi-builder-workspace
write-file /Users/admin/builder/spi-builder-workspace/.derivedData/Build/Intermediates.noindex/YPersistence.build/Debug-iphoneos/YPersistenceTests.build/YPersistenceTests.DependencyStaticMetadataFileList
WriteAuxiliaryFile /Users/admin/builder/spi-builder-workspace/.derivedData/Build/Intermediates.noindex/YPersistence.build/Debug-iphoneos/YPersistenceTests.build/YPersistenceTests.DependencyMetadataFileList (in target 'YPersistenceTests' from project 'YPersistence')
cd /Users/admin/builder/spi-builder-workspace
write-file /Users/admin/builder/spi-builder-workspace/.derivedData/Build/Intermediates.noindex/YPersistence.build/Debug-iphoneos/YPersistenceTests.build/YPersistenceTests.DependencyMetadataFileList
WriteAuxiliaryFile /Users/admin/builder/spi-builder-workspace/.derivedData/Build/Intermediates.noindex/YPersistence.build/Debug-iphoneos/YPersistence_YPersistenceTests.build/YPersistence_YPersistenceTests.DependencyStaticMetadataFileList (in target 'YPersistence_YPersistenceTests' from project 'YPersistence')
cd /Users/admin/builder/spi-builder-workspace
write-file /Users/admin/builder/spi-builder-workspace/.derivedData/Build/Intermediates.noindex/YPersistence.build/Debug-iphoneos/YPersistence_YPersistenceTests.build/YPersistence_YPersistenceTests.DependencyStaticMetadataFileList
WriteAuxiliaryFile /Users/admin/builder/spi-builder-workspace/.derivedData/Build/Intermediates.noindex/YPersistence.build/Debug-iphoneos/YPersistence_YPersistenceTests.build/empty-YPersistence_YPersistenceTests.plist (in target 'YPersistence_YPersistenceTests' from project 'YPersistence')
cd /Users/admin/builder/spi-builder-workspace
write-file /Users/admin/builder/spi-builder-workspace/.derivedData/Build/Intermediates.noindex/YPersistence.build/Debug-iphoneos/YPersistence_YPersistenceTests.build/empty-YPersistence_YPersistenceTests.plist
WriteAuxiliaryFile /Users/admin/builder/spi-builder-workspace/.derivedData/Build/Intermediates.noindex/YPersistence.build/Debug-iphoneos/YPersistence_YPersistenceTests.build/YPersistence_YPersistenceTests.DependencyMetadataFileList (in target 'YPersistence_YPersistenceTests' from project 'YPersistence')
cd /Users/admin/builder/spi-builder-workspace
write-file /Users/admin/builder/spi-builder-workspace/.derivedData/Build/Intermediates.noindex/YPersistence.build/Debug-iphoneos/YPersistence_YPersistenceTests.build/YPersistence_YPersistenceTests.DependencyMetadataFileList
WriteAuxiliaryFile /Users/admin/builder/spi-builder-workspace/.derivedData/Build/Intermediates.noindex/YPersistence.build/Debug-iphoneos/YPersistenceTests.build/Objects-normal/arm64/YPersistenceTests.SwiftConstValuesFileList (in target 'YPersistenceTests' from project 'YPersistence')
cd /Users/admin/builder/spi-builder-workspace
write-file /Users/admin/builder/spi-builder-workspace/.derivedData/Build/Intermediates.noindex/YPersistence.build/Debug-iphoneos/YPersistenceTests.build/Objects-normal/arm64/YPersistenceTests.SwiftConstValuesFileList
WriteAuxiliaryFile /Users/admin/builder/spi-builder-workspace/.derivedData/Build/Intermediates.noindex/YPersistence.build/Debug-iphoneos/YPersistenceTests.build/Objects-normal/arm64/YPersistenceTests.SwiftFileList (in target 'YPersistenceTests' from project 'YPersistence')
cd /Users/admin/builder/spi-builder-workspace
write-file /Users/admin/builder/spi-builder-workspace/.derivedData/Build/Intermediates.noindex/YPersistence.build/Debug-iphoneos/YPersistenceTests.build/Objects-normal/arm64/YPersistenceTests.SwiftFileList
WriteAuxiliaryFile /Users/admin/builder/spi-builder-workspace/.derivedData/Build/Intermediates.noindex/YPersistence.build/Debug-iphoneos/YPersistenceTests.build/Objects-normal/arm64/YPersistenceTests_const_extract_protocols.json (in target 'YPersistenceTests' from project 'YPersistence')
cd /Users/admin/builder/spi-builder-workspace
write-file /Users/admin/builder/spi-builder-workspace/.derivedData/Build/Intermediates.noindex/YPersistence.build/Debug-iphoneos/YPersistenceTests.build/Objects-normal/arm64/YPersistenceTests_const_extract_protocols.json
WriteAuxiliaryFile /Users/admin/builder/spi-builder-workspace/.derivedData/Build/Intermediates.noindex/YPersistence.build/Debug-iphoneos/YPersistenceTests.build/Objects-normal/arm64/YPersistenceTests.LinkFileList (in target 'YPersistenceTests' from project 'YPersistence')
cd /Users/admin/builder/spi-builder-workspace
write-file /Users/admin/builder/spi-builder-workspace/.derivedData/Build/Intermediates.noindex/YPersistence.build/Debug-iphoneos/YPersistenceTests.build/Objects-normal/arm64/YPersistenceTests.LinkFileList
WriteAuxiliaryFile /Users/admin/builder/spi-builder-workspace/.derivedData/Build/Intermediates.noindex/YPersistence.build/Debug-iphoneos/YPersistenceTests.build/Objects-normal/arm64/YPersistenceTests-OutputFileMap.json (in target 'YPersistenceTests' from project 'YPersistence')
cd /Users/admin/builder/spi-builder-workspace
write-file /Users/admin/builder/spi-builder-workspace/.derivedData/Build/Intermediates.noindex/YPersistence.build/Debug-iphoneos/YPersistenceTests.build/Objects-normal/arm64/YPersistenceTests-OutputFileMap.json
WriteAuxiliaryFile /Users/admin/builder/spi-builder-workspace/.derivedData/Build/Intermediates.noindex/YPersistence.build/Debug-iphoneos/YPersistenceTests.build/DerivedSources/resource_bundle_accessor.swift (in target 'YPersistenceTests' from project 'YPersistence')
cd /Users/admin/builder/spi-builder-workspace
write-file /Users/admin/builder/spi-builder-workspace/.derivedData/Build/Intermediates.noindex/YPersistence.build/Debug-iphoneos/YPersistenceTests.build/DerivedSources/resource_bundle_accessor.swift
WriteAuxiliaryFile /Users/admin/builder/spi-builder-workspace/.derivedData/Build/Intermediates.noindex/YPersistence.build/Debug-iphoneos/YPersistence.build/YPersistence.DependencyStaticMetadataFileList (in target 'YPersistence' from project 'YPersistence')
cd /Users/admin/builder/spi-builder-workspace
write-file /Users/admin/builder/spi-builder-workspace/.derivedData/Build/Intermediates.noindex/YPersistence.build/Debug-iphoneos/YPersistence.build/YPersistence.DependencyStaticMetadataFileList
WriteAuxiliaryFile /Users/admin/builder/spi-builder-workspace/.derivedData/Build/Intermediates.noindex/YPersistence.build/Debug-iphoneos/YPersistence.build/YPersistence.DependencyMetadataFileList (in target 'YPersistence' from project 'YPersistence')
cd /Users/admin/builder/spi-builder-workspace
write-file /Users/admin/builder/spi-builder-workspace/.derivedData/Build/Intermediates.noindex/YPersistence.build/Debug-iphoneos/YPersistence.build/YPersistence.DependencyMetadataFileList
WriteAuxiliaryFile /Users/admin/builder/spi-builder-workspace/.derivedData/Build/Intermediates.noindex/YPersistence.build/Debug-iphoneos/YPersistence.build/YPersistence.modulemap (in target 'YPersistence' from project 'YPersistence')
cd /Users/admin/builder/spi-builder-workspace
write-file /Users/admin/builder/spi-builder-workspace/.derivedData/Build/Intermediates.noindex/YPersistence.build/Debug-iphoneos/YPersistence.build/YPersistence.modulemap
WriteAuxiliaryFile /Users/admin/builder/spi-builder-workspace/.derivedData/Build/Intermediates.noindex/YPersistence.build/Debug-iphoneos/YPersistence.build/Objects-normal/arm64/YPersistence.SwiftConstValuesFileList (in target 'YPersistence' from project 'YPersistence')
cd /Users/admin/builder/spi-builder-workspace
write-file /Users/admin/builder/spi-builder-workspace/.derivedData/Build/Intermediates.noindex/YPersistence.build/Debug-iphoneos/YPersistence.build/Objects-normal/arm64/YPersistence.SwiftConstValuesFileList
WriteAuxiliaryFile /Users/admin/builder/spi-builder-workspace/.derivedData/Build/Intermediates.noindex/YPersistence.build/Debug-iphoneos/YPersistence.build/Objects-normal/arm64/YPersistence.SwiftFileList (in target 'YPersistence' from project 'YPersistence')
cd /Users/admin/builder/spi-builder-workspace
write-file /Users/admin/builder/spi-builder-workspace/.derivedData/Build/Intermediates.noindex/YPersistence.build/Debug-iphoneos/YPersistence.build/Objects-normal/arm64/YPersistence.SwiftFileList
WriteAuxiliaryFile /Users/admin/builder/spi-builder-workspace/.derivedData/Build/Intermediates.noindex/YPersistence.build/Debug-iphoneos/YPersistence.build/Objects-normal/arm64/YPersistence_const_extract_protocols.json (in target 'YPersistence' from project 'YPersistence')
cd /Users/admin/builder/spi-builder-workspace
write-file /Users/admin/builder/spi-builder-workspace/.derivedData/Build/Intermediates.noindex/YPersistence.build/Debug-iphoneos/YPersistence.build/Objects-normal/arm64/YPersistence_const_extract_protocols.json
WriteAuxiliaryFile /Users/admin/builder/spi-builder-workspace/.derivedData/Build/Intermediates.noindex/YPersistence.build/Debug-iphoneos/YPersistence.build/Objects-normal/arm64/YPersistence.LinkFileList (in target 'YPersistence' from project 'YPersistence')
cd /Users/admin/builder/spi-builder-workspace
write-file /Users/admin/builder/spi-builder-workspace/.derivedData/Build/Intermediates.noindex/YPersistence.build/Debug-iphoneos/YPersistence.build/Objects-normal/arm64/YPersistence.LinkFileList
WriteAuxiliaryFile /Users/admin/builder/spi-builder-workspace/.derivedData/Build/Intermediates.noindex/YPersistence.build/Debug-iphoneos/YPersistence.build/Objects-normal/arm64/YPersistence-OutputFileMap.json (in target 'YPersistence' from project 'YPersistence')
cd /Users/admin/builder/spi-builder-workspace
write-file /Users/admin/builder/spi-builder-workspace/.derivedData/Build/Intermediates.noindex/YPersistence.build/Debug-iphoneos/YPersistence.build/Objects-normal/arm64/YPersistence-OutputFileMap.json
MkDir /Users/admin/builder/spi-builder-workspace/.derivedData/Build/Products/Debug-iphoneos/YPersistenceTests.xctest (in target 'YPersistenceTests' from project 'YPersistence')
cd /Users/admin/builder/spi-builder-workspace
/bin/mkdir -p /Users/admin/builder/spi-builder-workspace/.derivedData/Build/Products/Debug-iphoneos/YPersistenceTests.xctest
ProcessInfoPlistFile /Users/admin/builder/spi-builder-workspace/.derivedData/Build/Products/Debug-iphoneos/YPersistence_YPersistenceTests.bundle/Info.plist /Users/admin/builder/spi-builder-workspace/.derivedData/Build/Intermediates.noindex/YPersistence.build/Debug-iphoneos/YPersistence_YPersistenceTests.build/empty-YPersistence_YPersistenceTests.plist (in target 'YPersistence_YPersistenceTests' from project 'YPersistence')
cd /Users/admin/builder/spi-builder-workspace
builtin-infoPlistUtility /Users/admin/builder/spi-builder-workspace/.derivedData/Build/Intermediates.noindex/YPersistence.build/Debug-iphoneos/YPersistence_YPersistenceTests.build/empty-YPersistence_YPersistenceTests.plist -producttype com.apple.product-type.bundle -expandbuildsettings -format binary -platform iphoneos -requiredArchitecture arm64 -o /Users/admin/builder/spi-builder-workspace/.derivedData/Build/Products/Debug-iphoneos/YPersistence_YPersistenceTests.bundle/Info.plist
DataModelCompile /Users/admin/builder/spi-builder-workspace/.derivedData/Build/Products/Debug-iphoneos/YPersistence_YPersistenceTests.bundle/ /Users/admin/builder/spi-builder-workspace/Tests/YPersistenceTests/Assets/YPersistence.xcdatamodeld (in target 'YPersistence_YPersistenceTests' from project 'YPersistence')
cd /Users/admin/builder/spi-builder-workspace
/Applications/Xcode-16.3.0.app/Contents/Developer/usr/bin/momc --sdkroot /Applications/Xcode-16.3.0.app/Contents/Developer/Platforms/iPhoneOS.platform/Developer/SDKs/iPhoneOS18.4.sdk --iphoneos-deployment-target 12.0 --module YPersistence_YPersistenceTests /Users/admin/builder/spi-builder-workspace/Tests/YPersistenceTests/Assets/YPersistence.xcdatamodeld /Users/admin/builder/spi-builder-workspace/.derivedData/Build/Products/Debug-iphoneos/YPersistence_YPersistenceTests.bundle/
YPersistence.xcdatamodel: note: Model YPersistence version checksum: yeTkZEgDmZGJb5MP98mQtWqLHPSnvQbKmJgxYaFJ/rI=
Copy /Users/admin/builder/spi-builder-workspace/.derivedData/Build/Intermediates.noindex/GeneratedModuleMaps-iphoneos/YPersistence.modulemap /Users/admin/builder/spi-builder-workspace/.derivedData/Build/Intermediates.noindex/YPersistence.build/Debug-iphoneos/YPersistence.build/YPersistence.modulemap (in target 'YPersistence' from project 'YPersistence')
cd /Users/admin/builder/spi-builder-workspace
builtin-copy -exclude .DS_Store -exclude CVS -exclude .svn -exclude .git -exclude .hg -resolve-src-symlinks /Users/admin/builder/spi-builder-workspace/.derivedData/Build/Intermediates.noindex/YPersistence.build/Debug-iphoneos/YPersistence.build/YPersistence.modulemap /Users/admin/builder/spi-builder-workspace/.derivedData/Build/Intermediates.noindex/GeneratedModuleMaps-iphoneos
RegisterExecutionPolicyException /Users/admin/builder/spi-builder-workspace/.derivedData/Build/Products/Debug-iphoneos/YPersistence_YPersistenceTests.bundle (in target 'YPersistence_YPersistenceTests' from project 'YPersistence')
cd /Users/admin/builder/spi-builder-workspace
builtin-RegisterExecutionPolicyException /Users/admin/builder/spi-builder-workspace/.derivedData/Build/Products/Debug-iphoneos/YPersistence_YPersistenceTests.bundle
Touch /Users/admin/builder/spi-builder-workspace/.derivedData/Build/Products/Debug-iphoneos/YPersistence_YPersistenceTests.bundle (in target 'YPersistence_YPersistenceTests' from project 'YPersistence')
cd /Users/admin/builder/spi-builder-workspace
/usr/bin/touch -c /Users/admin/builder/spi-builder-workspace/.derivedData/Build/Products/Debug-iphoneos/YPersistence_YPersistenceTests.bundle
SwiftDriver YPersistence normal arm64 com.apple.xcode.tools.swift.compiler (in target 'YPersistence' from project 'YPersistence')
cd /Users/admin/builder/spi-builder-workspace/.swiftpm/xcode
builtin-SwiftDriver -- /Applications/Xcode-16.3.0.app/Contents/Developer/Toolchains/XcodeDefault.xctoolchain/usr/bin/swiftc -module-name YPersistence -Onone -enforce-exclusivity\=checked @/Users/admin/builder/spi-builder-workspace/.derivedData/Build/Intermediates.noindex/YPersistence.build/Debug-iphoneos/YPersistence.build/Objects-normal/arm64/YPersistence.SwiftFileList -DSWIFT_PACKAGE -DDEBUG -stats-output-dir .stats -strict-concurrency\=complete -enable-upcoming-feature StrictConcurrency -enable-upcoming-feature DisableOutwardActorInference -enable-upcoming-feature GlobalActorIsolatedTypesUsability -enable-upcoming-feature InferSendableFromCaptures -plugin-path /Applications/Xcode-16.3.0.app/Contents/Developer/Toolchains/XcodeDefault.xctoolchain/usr/lib/swift/host/plugins/testing -enable-experimental-feature DebugDescriptionMacro -sdk /Applications/Xcode-16.3.0.app/Contents/Developer/Platforms/iPhoneOS.platform/Developer/SDKs/iPhoneOS18.4.sdk -target arm64-apple-ios12.0 -g -module-cache-path /Users/admin/builder/spi-builder-workspace/.derivedData/ModuleCache.noindex -Xfrontend -serialize-debugging-options -profile-coverage-mapping -profile-generate -enable-testing -index-store-path /Users/admin/builder/spi-builder-workspace/.derivedData/Index.noindex/DataStore -swift-version 5 -I /Users/admin/builder/spi-builder-workspace/.derivedData/Build/Products/Debug-iphoneos -I /Applications/Xcode-16.3.0.app/Contents/Developer/Platforms/iPhoneOS.platform/Developer/usr/lib -F /Users/admin/builder/spi-builder-workspace/.derivedData/Build/Products/Debug-iphoneos -F /Applications/Xcode-16.3.0.app/Contents/Developer/Platforms/iPhoneOS.platform/Developer/Library/Frameworks -F /Applications/Xcode-16.3.0.app/Contents/Developer/Platforms/iPhoneOS.platform/Developer/SDKs/iPhoneOS18.4.sdk/Developer/Library/Frameworks -c -j10 -enable-batch-mode -incremental -Xcc -ivfsstatcache -Xcc /Users/admin/builder/spi-builder-workspace/.derivedData/SDKStatCaches.noindex/iphoneos18.4-22E235-339d34bc69d7fc736c3220795c36f340.sdkstatcache -output-file-map /Users/admin/builder/spi-builder-workspace/.derivedData/Build/Intermediates.noindex/YPersistence.build/Debug-iphoneos/YPersistence.build/Objects-normal/arm64/YPersistence-OutputFileMap.json -use-frontend-parseable-output -save-temps -no-color-diagnostics -serialize-diagnostics -emit-dependencies -emit-module -emit-module-path /Users/admin/builder/spi-builder-workspace/.derivedData/Build/Intermediates.noindex/YPersistence.build/Debug-iphoneos/YPersistence.build/Objects-normal/arm64/YPersistence.swiftmodule -validate-clang-modules-once -clang-build-session-file /Users/admin/builder/spi-builder-workspace/.derivedData/ModuleCache.noindex/Session.modulevalidation -Xcc -I/Users/admin/builder/spi-builder-workspace/.derivedData/Build/Intermediates.noindex/YPersistence.build/Debug-iphoneos/YPersistence.build/swift-overrides.hmap -emit-const-values -Xfrontend -const-gather-protocols-file -Xfrontend /Users/admin/builder/spi-builder-workspace/.derivedData/Build/Intermediates.noindex/YPersistence.build/Debug-iphoneos/YPersistence.build/Objects-normal/arm64/YPersistence_const_extract_protocols.json -Xcc -I/Users/admin/builder/spi-builder-workspace/.derivedData/Build/Products/Debug-iphoneos/include -Xcc -I/Users/admin/builder/spi-builder-workspace/.derivedData/Build/Intermediates.noindex/YPersistence.build/Debug-iphoneos/YPersistence.build/DerivedSources-normal/arm64 -Xcc -I/Users/admin/builder/spi-builder-workspace/.derivedData/Build/Intermediates.noindex/YPersistence.build/Debug-iphoneos/YPersistence.build/DerivedSources/arm64 -Xcc -I/Users/admin/builder/spi-builder-workspace/.derivedData/Build/Intermediates.noindex/YPersistence.build/Debug-iphoneos/YPersistence.build/DerivedSources -Xcc -DSWIFT_PACKAGE -Xcc -DDEBUG\=1 -emit-objc-header -emit-objc-header-path /Users/admin/builder/spi-builder-workspace/.derivedData/Build/Intermediates.noindex/YPersistence.build/Debug-iphoneos/YPersistence.build/Objects-normal/arm64/YPersistence-Swift.h -working-directory /Users/admin/builder/spi-builder-workspace/.swiftpm/xcode -experimental-emit-module-separately -disable-cmo
SwiftEmitModule normal arm64 Emitting\ module\ for\ YPersistence (in target 'YPersistence' from project 'YPersistence')
EmitSwiftModule normal arm64 (in target 'YPersistence' from project 'YPersistence')
cd /Users/admin/builder/spi-builder-workspace/.swiftpm/xcode
/Users/admin/builder/spi-builder-workspace/Sources/YPersistence/Manager/PersistenceManager.swift:25:61: warning: reference to var 'NSErrorMergePolicy' is not concurrency-safe because it involves shared mutable state; this is an error in the Swift 6 language mode
public init(modelName: String, mergePolicy: AnyObject = NSErrorMergePolicy, bundle: Bundle = .main) {
^
/Applications/Xcode-16.3.0.app/Contents/Developer/Platforms/iPhoneOS.platform/Developer/SDKs/iPhoneOS18.4.sdk/System/Library/Frameworks/CoreData.framework/Headers/NSMergePolicy.h:19:20: note: var declared here
COREDATA_EXTERN id NSErrorMergePolicy API_AVAILABLE(macosx(10.4),ios(3.0));
^
SwiftCompile normal arm64 Compiling\ PersistenceManager+Clear.swift,\ PersistenceManager+Delete.swift /Users/admin/builder/spi-builder-workspace/Sources/YPersistence/Manager/PersistenceManager+Clear.swift /Users/admin/builder/spi-builder-workspace/Sources/YPersistence/Manager/PersistenceManager+Delete.swift (in target 'YPersistence' from project 'YPersistence')
SwiftCompile normal arm64 /Users/admin/builder/spi-builder-workspace/Sources/YPersistence/Manager/PersistenceManager+Clear.swift (in target 'YPersistence' from project 'YPersistence')
cd /Users/admin/builder/spi-builder-workspace/.swiftpm/xcode
SwiftCompile normal arm64 /Users/admin/builder/spi-builder-workspace/Sources/YPersistence/Manager/PersistenceManager+Delete.swift (in target 'YPersistence' from project 'YPersistence')
cd /Users/admin/builder/spi-builder-workspace/.swiftpm/xcode
SwiftCompile normal arm64 Compiling\ PersistenceManager+Fetch.swift,\ PersistenceManager+Save.swift /Users/admin/builder/spi-builder-workspace/Sources/YPersistence/Manager/PersistenceManager+Fetch.swift /Users/admin/builder/spi-builder-workspace/Sources/YPersistence/Manager/PersistenceManager+Save.swift (in target 'YPersistence' from project 'YPersistence')
SwiftCompile normal arm64 /Users/admin/builder/spi-builder-workspace/Sources/YPersistence/Manager/PersistenceManager+Fetch.swift (in target 'YPersistence' from project 'YPersistence')
cd /Users/admin/builder/spi-builder-workspace/.swiftpm/xcode
SwiftCompile normal arm64 /Users/admin/builder/spi-builder-workspace/Sources/YPersistence/Manager/PersistenceManager+Save.swift (in target 'YPersistence' from project 'YPersistence')
cd /Users/admin/builder/spi-builder-workspace/.swiftpm/xcode
SwiftCompile normal arm64 Compiling\ SortColumn.swift /Users/admin/builder/spi-builder-workspace/Sources/YPersistence/SortColumn.swift (in target 'YPersistence' from project 'YPersistence')
SwiftCompile normal arm64 /Users/admin/builder/spi-builder-workspace/Sources/YPersistence/SortColumn.swift (in target 'YPersistence' from project 'YPersistence')
cd /Users/admin/builder/spi-builder-workspace/.swiftpm/xcode
SwiftCompile normal arm64 Compiling\ RecordToModel.swift,\ SyncRecord.swift /Users/admin/builder/spi-builder-workspace/Sources/YPersistence/Protocols/RecordToModel.swift /Users/admin/builder/spi-builder-workspace/Sources/YPersistence/Protocols/SyncRecord.swift (in target 'YPersistence' from project 'YPersistence')
SwiftCompile normal arm64 /Users/admin/builder/spi-builder-workspace/Sources/YPersistence/Protocols/RecordToModel.swift (in target 'YPersistence' from project 'YPersistence')
cd /Users/admin/builder/spi-builder-workspace/.swiftpm/xcode
SwiftCompile normal arm64 /Users/admin/builder/spi-builder-workspace/Sources/YPersistence/Protocols/SyncRecord.swift (in target 'YPersistence' from project 'YPersistence')
cd /Users/admin/builder/spi-builder-workspace/.swiftpm/xcode
SwiftCompile normal arm64 Compiling\ ModelRepresentable.swift,\ RecordFromModel.swift /Users/admin/builder/spi-builder-workspace/Sources/YPersistence/Protocols/ModelRepresentable.swift /Users/admin/builder/spi-builder-workspace/Sources/YPersistence/Protocols/RecordFromModel.swift (in target 'YPersistence' from project 'YPersistence')
SwiftCompile normal arm64 /Users/admin/builder/spi-builder-workspace/Sources/YPersistence/Protocols/ModelRepresentable.swift (in target 'YPersistence' from project 'YPersistence')
cd /Users/admin/builder/spi-builder-workspace/.swiftpm/xcode
SwiftCompile normal arm64 /Users/admin/builder/spi-builder-workspace/Sources/YPersistence/Protocols/RecordFromModel.swift (in target 'YPersistence' from project 'YPersistence')
cd /Users/admin/builder/spi-builder-workspace/.swiftpm/xcode
SwiftCompile normal arm64 Compiling\ CoreModel.swift,\ DataRecord.swift /Users/admin/builder/spi-builder-workspace/Sources/YPersistence/Protocols/CoreModel.swift /Users/admin/builder/spi-builder-workspace/Sources/YPersistence/Protocols/DataRecord.swift (in target 'YPersistence' from project 'YPersistence')
SwiftCompile normal arm64 /Users/admin/builder/spi-builder-workspace/Sources/YPersistence/Protocols/CoreModel.swift (in target 'YPersistence' from project 'YPersistence')
cd /Users/admin/builder/spi-builder-workspace/.swiftpm/xcode
SwiftCompile normal arm64 /Users/admin/builder/spi-builder-workspace/Sources/YPersistence/Protocols/DataRecord.swift (in target 'YPersistence' from project 'YPersistence')
cd /Users/admin/builder/spi-builder-workspace/.swiftpm/xcode
SwiftCompile normal arm64 Compiling\ SortInfo.swift /Users/admin/builder/spi-builder-workspace/Sources/YPersistence/SortInfo.swift (in target 'YPersistence' from project 'YPersistence')
SwiftCompile normal arm64 /Users/admin/builder/spi-builder-workspace/Sources/YPersistence/SortInfo.swift (in target 'YPersistence' from project 'YPersistence')
cd /Users/admin/builder/spi-builder-workspace/.swiftpm/xcode
SwiftCompile normal arm64 Compiling\ DispatchQueue+executeOnMain.swift,\ NSManagedObjectContext+SaveChanges.swift /Users/admin/builder/spi-builder-workspace/Sources/YPersistence/Extensions/DispatchQueue+executeOnMain.swift /Users/admin/builder/spi-builder-workspace/Sources/YPersistence/Extensions/NSManagedObjectContext+SaveChanges.swift (in target 'YPersistence' from project 'YPersistence')
SwiftCompile normal arm64 /Users/admin/builder/spi-builder-workspace/Sources/YPersistence/Extensions/DispatchQueue+executeOnMain.swift (in target 'YPersistence' from project 'YPersistence')
cd /Users/admin/builder/spi-builder-workspace/.swiftpm/xcode
/Users/admin/builder/spi-builder-workspace/Sources/YPersistence/Extensions/DispatchQueue+executeOnMain.swift:24:40: warning: sending 'work' risks causing data races; this is an error in the Swift 6 language mode
DispatchQueue.main.async { work() }
~~^~~~~~~~
/Users/admin/builder/spi-builder-workspace/Sources/YPersistence/Extensions/DispatchQueue+executeOnMain.swift:24:40: note: task-isolated 'work' is captured by a main actor-isolated closure. main actor-isolated uses in closure may race against later nonisolated uses
DispatchQueue.main.async { work() }
^~~~
SwiftCompile normal arm64 /Users/admin/builder/spi-builder-workspace/Sources/YPersistence/Extensions/NSManagedObjectContext+SaveChanges.swift (in target 'YPersistence' from project 'YPersistence')
cd /Users/admin/builder/spi-builder-workspace/.swiftpm/xcode
SwiftCompile normal arm64 Compiling\ PersistenceManager+Sync.swift,\ PersistenceManager.swift /Users/admin/builder/spi-builder-workspace/Sources/YPersistence/Manager/PersistenceManager+Sync.swift /Users/admin/builder/spi-builder-workspace/Sources/YPersistence/Manager/PersistenceManager.swift (in target 'YPersistence' from project 'YPersistence')
SwiftCompile normal arm64 /Users/admin/builder/spi-builder-workspace/Sources/YPersistence/Manager/PersistenceManager+Sync.swift (in target 'YPersistence' from project 'YPersistence')
cd /Users/admin/builder/spi-builder-workspace/.swiftpm/xcode
SwiftCompile normal arm64 /Users/admin/builder/spi-builder-workspace/Sources/YPersistence/Manager/PersistenceManager.swift (in target 'YPersistence' from project 'YPersistence')
cd /Users/admin/builder/spi-builder-workspace/.swiftpm/xcode
/Users/admin/builder/spi-builder-workspace/Sources/YPersistence/Manager/PersistenceManager.swift:25:61: warning: reference to var 'NSErrorMergePolicy' is not concurrency-safe because it involves shared mutable state; this is an error in the Swift 6 language mode
public init(modelName: String, mergePolicy: AnyObject = NSErrorMergePolicy, bundle: Bundle = .main) {
^
/Applications/Xcode-16.3.0.app/Contents/Developer/Platforms/iPhoneOS.platform/Developer/SDKs/iPhoneOS18.4.sdk/System/Library/Frameworks/CoreData.framework/Headers/NSMergePolicy.h:19:20: note: var declared here
COREDATA_EXTERN id NSErrorMergePolicy API_AVAILABLE(macosx(10.4),ios(3.0));
^
SwiftCompile normal arm64 Compiling\ NSManagedObjectModel+init.swift,\ PersistenceManager+BulkDelete.swift /Users/admin/builder/spi-builder-workspace/Sources/YPersistence/Extensions/NSManagedObjectModel+init.swift /Users/admin/builder/spi-builder-workspace/Sources/YPersistence/Manager/PersistenceManager+BulkDelete.swift (in target 'YPersistence' from project 'YPersistence')
SwiftCompile normal arm64 /Users/admin/builder/spi-builder-workspace/Sources/YPersistence/Extensions/NSManagedObjectModel+init.swift (in target 'YPersistence' from project 'YPersistence')
cd /Users/admin/builder/spi-builder-workspace/.swiftpm/xcode
SwiftCompile normal arm64 /Users/admin/builder/spi-builder-workspace/Sources/YPersistence/Manager/PersistenceManager+BulkDelete.swift (in target 'YPersistence' from project 'YPersistence')
cd /Users/admin/builder/spi-builder-workspace/.swiftpm/xcode
SwiftDriverJobDiscovery normal arm64 Emitting module for YPersistence (in target 'YPersistence' from project 'YPersistence')
SwiftDriver\ Compilation\ Requirements YPersistence normal arm64 com.apple.xcode.tools.swift.compiler (in target 'YPersistence' from project 'YPersistence')
cd /Users/admin/builder/spi-builder-workspace/.swiftpm/xcode
builtin-Swift-Compilation-Requirements -- /Applications/Xcode-16.3.0.app/Contents/Developer/Toolchains/XcodeDefault.xctoolchain/usr/bin/swiftc -module-name YPersistence -Onone -enforce-exclusivity\=checked @/Users/admin/builder/spi-builder-workspace/.derivedData/Build/Intermediates.noindex/YPersistence.build/Debug-iphoneos/YPersistence.build/Objects-normal/arm64/YPersistence.SwiftFileList -DSWIFT_PACKAGE -DDEBUG -stats-output-dir .stats -strict-concurrency\=complete -enable-upcoming-feature StrictConcurrency -enable-upcoming-feature DisableOutwardActorInference -enable-upcoming-feature GlobalActorIsolatedTypesUsability -enable-upcoming-feature InferSendableFromCaptures -plugin-path /Applications/Xcode-16.3.0.app/Contents/Developer/Toolchains/XcodeDefault.xctoolchain/usr/lib/swift/host/plugins/testing -enable-experimental-feature DebugDescriptionMacro -sdk /Applications/Xcode-16.3.0.app/Contents/Developer/Platforms/iPhoneOS.platform/Developer/SDKs/iPhoneOS18.4.sdk -target arm64-apple-ios12.0 -g -module-cache-path /Users/admin/builder/spi-builder-workspace/.derivedData/ModuleCache.noindex -Xfrontend -serialize-debugging-options -profile-coverage-mapping -profile-generate -enable-testing -index-store-path /Users/admin/builder/spi-builder-workspace/.derivedData/Index.noindex/DataStore -swift-version 5 -I /Users/admin/builder/spi-builder-workspace/.derivedData/Build/Products/Debug-iphoneos -I /Applications/Xcode-16.3.0.app/Contents/Developer/Platforms/iPhoneOS.platform/Developer/usr/lib -F /Users/admin/builder/spi-builder-workspace/.derivedData/Build/Products/Debug-iphoneos -F /Applications/Xcode-16.3.0.app/Contents/Developer/Platforms/iPhoneOS.platform/Developer/Library/Frameworks -F /Applications/Xcode-16.3.0.app/Contents/Developer/Platforms/iPhoneOS.platform/Developer/SDKs/iPhoneOS18.4.sdk/Developer/Library/Frameworks -c -j10 -enable-batch-mode -incremental -Xcc -ivfsstatcache -Xcc /Users/admin/builder/spi-builder-workspace/.derivedData/SDKStatCaches.noindex/iphoneos18.4-22E235-339d34bc69d7fc736c3220795c36f340.sdkstatcache -output-file-map /Users/admin/builder/spi-builder-workspace/.derivedData/Build/Intermediates.noindex/YPersistence.build/Debug-iphoneos/YPersistence.build/Objects-normal/arm64/YPersistence-OutputFileMap.json -use-frontend-parseable-output -save-temps -no-color-diagnostics -serialize-diagnostics -emit-dependencies -emit-module -emit-module-path /Users/admin/builder/spi-builder-workspace/.derivedData/Build/Intermediates.noindex/YPersistence.build/Debug-iphoneos/YPersistence.build/Objects-normal/arm64/YPersistence.swiftmodule -validate-clang-modules-once -clang-build-session-file /Users/admin/builder/spi-builder-workspace/.derivedData/ModuleCache.noindex/Session.modulevalidation -Xcc -I/Users/admin/builder/spi-builder-workspace/.derivedData/Build/Intermediates.noindex/YPersistence.build/Debug-iphoneos/YPersistence.build/swift-overrides.hmap -emit-const-values -Xfrontend -const-gather-protocols-file -Xfrontend /Users/admin/builder/spi-builder-workspace/.derivedData/Build/Intermediates.noindex/YPersistence.build/Debug-iphoneos/YPersistence.build/Objects-normal/arm64/YPersistence_const_extract_protocols.json -Xcc -I/Users/admin/builder/spi-builder-workspace/.derivedData/Build/Products/Debug-iphoneos/include -Xcc -I/Users/admin/builder/spi-builder-workspace/.derivedData/Build/Intermediates.noindex/YPersistence.build/Debug-iphoneos/YPersistence.build/DerivedSources-normal/arm64 -Xcc -I/Users/admin/builder/spi-builder-workspace/.derivedData/Build/Intermediates.noindex/YPersistence.build/Debug-iphoneos/YPersistence.build/DerivedSources/arm64 -Xcc -I/Users/admin/builder/spi-builder-workspace/.derivedData/Build/Intermediates.noindex/YPersistence.build/Debug-iphoneos/YPersistence.build/DerivedSources -Xcc -DSWIFT_PACKAGE -Xcc -DDEBUG\=1 -emit-objc-header -emit-objc-header-path /Users/admin/builder/spi-builder-workspace/.derivedData/Build/Intermediates.noindex/YPersistence.build/Debug-iphoneos/YPersistence.build/Objects-normal/arm64/YPersistence-Swift.h -working-directory /Users/admin/builder/spi-builder-workspace/.swiftpm/xcode -experimental-emit-module-separately -disable-cmo
SwiftDriverJobDiscovery normal arm64 Compiling ModelRepresentable.swift, RecordFromModel.swift (in target 'YPersistence' from project 'YPersistence')
SwiftMergeGeneratedHeaders /Users/admin/builder/spi-builder-workspace/.derivedData/Build/Intermediates.noindex/GeneratedModuleMaps-iphoneos/YPersistence-Swift.h /Users/admin/builder/spi-builder-workspace/.derivedData/Build/Intermediates.noindex/YPersistence.build/Debug-iphoneos/YPersistence.build/Objects-normal/arm64/YPersistence-Swift.h (in target 'YPersistence' from project 'YPersistence')
cd /Users/admin/builder/spi-builder-workspace
builtin-swiftHeaderTool -arch arm64 /Users/admin/builder/spi-builder-workspace/.derivedData/Build/Intermediates.noindex/YPersistence.build/Debug-iphoneos/YPersistence.build/Objects-normal/arm64/YPersistence-Swift.h -o /Users/admin/builder/spi-builder-workspace/.derivedData/Build/Intermediates.noindex/GeneratedModuleMaps-iphoneos/YPersistence-Swift.h
Copy /Users/admin/builder/spi-builder-workspace/.derivedData/Build/Products/Debug-iphoneos/YPersistence.swiftmodule/arm64-apple-ios.swiftmodule /Users/admin/builder/spi-builder-workspace/.derivedData/Build/Intermediates.noindex/YPersistence.build/Debug-iphoneos/YPersistence.build/Objects-normal/arm64/YPersistence.swiftmodule (in target 'YPersistence' from project 'YPersistence')
cd /Users/admin/builder/spi-builder-workspace
builtin-copy -exclude .DS_Store -exclude CVS -exclude .svn -exclude .git -exclude .hg -resolve-src-symlinks -rename /Users/admin/builder/spi-builder-workspace/.derivedData/Build/Intermediates.noindex/YPersistence.build/Debug-iphoneos/YPersistence.build/Objects-normal/arm64/YPersistence.swiftmodule /Users/admin/builder/spi-builder-workspace/.derivedData/Build/Products/Debug-iphoneos/YPersistence.swiftmodule/arm64-apple-ios.swiftmodule
Copy /Users/admin/builder/spi-builder-workspace/.derivedData/Build/Products/Debug-iphoneos/YPersistence.swiftmodule/arm64-apple-ios.swiftdoc /Users/admin/builder/spi-builder-workspace/.derivedData/Build/Intermediates.noindex/YPersistence.build/Debug-iphoneos/YPersistence.build/Objects-normal/arm64/YPersistence.swiftdoc (in target 'YPersistence' from project 'YPersistence')
cd /Users/admin/builder/spi-builder-workspace
builtin-copy -exclude .DS_Store -exclude CVS -exclude .svn -exclude .git -exclude .hg -resolve-src-symlinks -rename /Users/admin/builder/spi-builder-workspace/.derivedData/Build/Intermediates.noindex/YPersistence.build/Debug-iphoneos/YPersistence.build/Objects-normal/arm64/YPersistence.swiftdoc /Users/admin/builder/spi-builder-workspace/.derivedData/Build/Products/Debug-iphoneos/YPersistence.swiftmodule/arm64-apple-ios.swiftdoc
Copy /Users/admin/builder/spi-builder-workspace/.derivedData/Build/Products/Debug-iphoneos/YPersistence.swiftmodule/arm64-apple-ios.abi.json /Users/admin/builder/spi-builder-workspace/.derivedData/Build/Intermediates.noindex/YPersistence.build/Debug-iphoneos/YPersistence.build/Objects-normal/arm64/YPersistence.abi.json (in target 'YPersistence' from project 'YPersistence')
cd /Users/admin/builder/spi-builder-workspace
builtin-copy -exclude .DS_Store -exclude CVS -exclude .svn -exclude .git -exclude .hg -resolve-src-symlinks -rename /Users/admin/builder/spi-builder-workspace/.derivedData/Build/Intermediates.noindex/YPersistence.build/Debug-iphoneos/YPersistence.build/Objects-normal/arm64/YPersistence.abi.json /Users/admin/builder/spi-builder-workspace/.derivedData/Build/Products/Debug-iphoneos/YPersistence.swiftmodule/arm64-apple-ios.abi.json
SwiftDriverJobDiscovery normal arm64 Compiling SortColumn.swift (in target 'YPersistence' from project 'YPersistence')
Copy /Users/admin/builder/spi-builder-workspace/.derivedData/Build/Products/Debug-iphoneos/YPersistence.swiftmodule/Project/arm64-apple-ios.swiftsourceinfo /Users/admin/builder/spi-builder-workspace/.derivedData/Build/Intermediates.noindex/YPersistence.build/Debug-iphoneos/YPersistence.build/Objects-normal/arm64/YPersistence.swiftsourceinfo (in target 'YPersistence' from project 'YPersistence')
cd /Users/admin/builder/spi-builder-workspace
builtin-copy -exclude .DS_Store -exclude CVS -exclude .svn -exclude .git -exclude .hg -resolve-src-symlinks -rename /Users/admin/builder/spi-builder-workspace/.derivedData/Build/Intermediates.noindex/YPersistence.build/Debug-iphoneos/YPersistence.build/Objects-normal/arm64/YPersistence.swiftsourceinfo /Users/admin/builder/spi-builder-workspace/.derivedData/Build/Products/Debug-iphoneos/YPersistence.swiftmodule/Project/arm64-apple-ios.swiftsourceinfo
SwiftDriver YPersistenceTests normal arm64 com.apple.xcode.tools.swift.compiler (in target 'YPersistenceTests' from project 'YPersistence')
cd /Users/admin/builder/spi-builder-workspace/.swiftpm/xcode
builtin-SwiftDriver -- /Applications/Xcode-16.3.0.app/Contents/Developer/Toolchains/XcodeDefault.xctoolchain/usr/bin/swiftc -module-name YPersistenceTests -Onone -enforce-exclusivity\=checked @/Users/admin/builder/spi-builder-workspace/.derivedData/Build/Intermediates.noindex/YPersistence.build/Debug-iphoneos/YPersistenceTests.build/Objects-normal/arm64/YPersistenceTests.SwiftFileList -DSWIFT_PACKAGE -DDEBUG -stats-output-dir .stats -strict-concurrency\=complete -enable-upcoming-feature StrictConcurrency -enable-upcoming-feature DisableOutwardActorInference -enable-upcoming-feature GlobalActorIsolatedTypesUsability -enable-upcoming-feature InferSendableFromCaptures -plugin-path /Applications/Xcode-16.3.0.app/Contents/Developer/Toolchains/XcodeDefault.xctoolchain/usr/lib/swift/host/plugins/testing -enable-experimental-feature DebugDescriptionMacro -sdk /Applications/Xcode-16.3.0.app/Contents/Developer/Platforms/iPhoneOS.platform/Developer/SDKs/iPhoneOS18.4.sdk -target arm64-apple-ios13.0 -g -module-cache-path /Users/admin/builder/spi-builder-workspace/.derivedData/ModuleCache.noindex -Xfrontend -serialize-debugging-options -profile-coverage-mapping -profile-generate -enable-testing -index-store-path /Users/admin/builder/spi-builder-workspace/.derivedData/Index.noindex/DataStore -swift-version 5 -I /Users/admin/builder/spi-builder-workspace/.derivedData/Build/Products/Debug-iphoneos -I /Applications/Xcode-16.3.0.app/Contents/Developer/Platforms/iPhoneOS.platform/Developer/usr/lib -F /Users/admin/builder/spi-builder-workspace/.derivedData/Build/Products/Debug-iphoneos/PackageFrameworks -F /Users/admin/builder/spi-builder-workspace/.derivedData/Build/Products/Debug-iphoneos -F /Applications/Xcode-16.3.0.app/Contents/Developer/Platforms/iPhoneOS.platform/Developer/Library/Frameworks -F /Applications/Xcode-16.3.0.app/Contents/Developer/Platforms/iPhoneOS.platform/Developer/SDKs/iPhoneOS18.4.sdk/Developer/Library/Frameworks -c -j10 -enable-batch-mode -incremental -Xcc -ivfsstatcache -Xcc /Users/admin/builder/spi-builder-workspace/.derivedData/SDKStatCaches.noindex/iphoneos18.4-22E235-339d34bc69d7fc736c3220795c36f340.sdkstatcache -output-file-map /Users/admin/builder/spi-builder-workspace/.derivedData/Build/Intermediates.noindex/YPersistence.build/Debug-iphoneos/YPersistenceTests.build/Objects-normal/arm64/YPersistenceTests-OutputFileMap.json -use-frontend-parseable-output -save-temps -no-color-diagnostics -serialize-diagnostics -emit-dependencies -emit-module -emit-module-path /Users/admin/builder/spi-builder-workspace/.derivedData/Build/Intermediates.noindex/YPersistence.build/Debug-iphoneos/YPersistenceTests.build/Objects-normal/arm64/YPersistenceTests.swiftmodule -validate-clang-modules-once -clang-build-session-file /Users/admin/builder/spi-builder-workspace/.derivedData/ModuleCache.noindex/Session.modulevalidation -emit-const-values -Xfrontend -const-gather-protocols-file -Xfrontend /Users/admin/builder/spi-builder-workspace/.derivedData/Build/Intermediates.noindex/YPersistence.build/Debug-iphoneos/YPersistenceTests.build/Objects-normal/arm64/YPersistenceTests_const_extract_protocols.json -Xcc -I/Users/admin/builder/spi-builder-workspace/.derivedData/Build/Products/Debug-iphoneos/include -Xcc -I/Users/admin/builder/spi-builder-workspace/.derivedData/Build/Intermediates.noindex/YPersistence.build/Debug-iphoneos/YPersistenceTests.build/DerivedSources-normal/arm64 -Xcc -I/Users/admin/builder/spi-builder-workspace/.derivedData/Build/Intermediates.noindex/YPersistence.build/Debug-iphoneos/YPersistenceTests.build/DerivedSources/arm64 -Xcc -I/Users/admin/builder/spi-builder-workspace/.derivedData/Build/Intermediates.noindex/YPersistence.build/Debug-iphoneos/YPersistenceTests.build/DerivedSources -Xcc -DSWIFT_PACKAGE -Xcc -DDEBUG\=1 -working-directory /Users/admin/builder/spi-builder-workspace/.swiftpm/xcode -experimental-emit-module-separately -disable-cmo
SwiftDriverJobDiscovery normal arm64 Compiling RecordToModel.swift, SyncRecord.swift (in target 'YPersistence' from project 'YPersistence')
SwiftDriverJobDiscovery normal arm64 Compiling SortInfo.swift (in target 'YPersistence' from project 'YPersistence')
SwiftEmitModule normal arm64 Emitting\ module\ for\ YPersistenceTests (in target 'YPersistenceTests' from project 'YPersistence')
EmitSwiftModule normal arm64 (in target 'YPersistenceTests' from project 'YPersistence')
cd /Users/admin/builder/spi-builder-workspace/.swiftpm/xcode
/Users/admin/builder/spi-builder-workspace/Tests/YPersistenceTests/DataModel/Mocks/Fruit.swift:23:16: warning: static property 'mango' is not concurrency-safe because non-'Sendable' type 'Fruit' may have shared mutable state; this is an error in the Swift 6 language mode
static let mango = Fruit(
^
/Users/admin/builder/spi-builder-workspace/Tests/YPersistenceTests/DataModel/Mocks/Fruit.swift:12:15: note: consider making struct 'Fruit' conform to the 'Sendable' protocol
public struct Fruit: CoreModel, Equatable {
^
, Sendable
/Users/admin/builder/spi-builder-workspace/Tests/YPersistenceTests/DataModel/Mocks/Fruit.swift:23:16: note: add '@MainActor' to make static property 'mango' part of global actor 'MainActor'
static let mango = Fruit(
^
@MainActor
/Users/admin/builder/spi-builder-workspace/Tests/YPersistenceTests/DataModel/Mocks/Fruit.swift:23:16: note: disable concurrency-safety checks if accesses are protected by an external synchronization mechanism
static let mango = Fruit(
^
nonisolated(unsafe)
/Users/admin/builder/spi-builder-workspace/Tests/YPersistenceTests/DataModel/Mocks/Fruit.swift:28:16: warning: static property 'banana' is not concurrency-safe because non-'Sendable' type 'Fruit' may have shared mutable state; this is an error in the Swift 6 language mode
static let banana = Fruit(
^
/Users/admin/builder/spi-builder-workspace/Tests/YPersistenceTests/DataModel/Mocks/Fruit.swift:12:15: note: consider making struct 'Fruit' conform to the 'Sendable' protocol
public struct Fruit: CoreModel, Equatable {
^
, Sendable
/Users/admin/builder/spi-builder-workspace/Tests/YPersistenceTests/DataModel/Mocks/Fruit.swift:28:16: note: add '@MainActor' to make static property 'banana' part of global actor 'MainActor'
static let banana = Fruit(
^
@MainActor
/Users/admin/builder/spi-builder-workspace/Tests/YPersistenceTests/DataModel/Mocks/Fruit.swift:28:16: note: disable concurrency-safety checks if accesses are protected by an external synchronization mechanism
static let banana = Fruit(
^
nonisolated(unsafe)
/Users/admin/builder/spi-builder-workspace/Tests/YPersistenceTests/DataModel/Mocks/Fruit.swift:33:16: warning: static property 'apple' is not concurrency-safe because non-'Sendable' type 'Fruit' may have shared mutable state; this is an error in the Swift 6 language mode
static let apple = Fruit(
^
/Users/admin/builder/spi-builder-workspace/Tests/YPersistenceTests/DataModel/Mocks/Fruit.swift:12:15: note: consider making struct 'Fruit' conform to the 'Sendable' protocol
public struct Fruit: CoreModel, Equatable {
^
, Sendable
/Users/admin/builder/spi-builder-workspace/Tests/YPersistenceTests/DataModel/Mocks/Fruit.swift:33:16: note: add '@MainActor' to make static property 'apple' part of global actor 'MainActor'
static let apple = Fruit(
^
@MainActor
/Users/admin/builder/spi-builder-workspace/Tests/YPersistenceTests/DataModel/Mocks/Fruit.swift:33:16: note: disable concurrency-safety checks if accesses are protected by an external synchronization mechanism
static let apple = Fruit(
^
nonisolated(unsafe)
/Users/admin/builder/spi-builder-workspace/Tests/YPersistenceTests/DataModel/Mocks/Fruit.swift:38:16: warning: static property 'grapes' is not concurrency-safe because non-'Sendable' type 'Fruit' may have shared mutable state; this is an error in the Swift 6 language mode
static let grapes = Fruit(
^
/Users/admin/builder/spi-builder-workspace/Tests/YPersistenceTests/DataModel/Mocks/Fruit.swift:12:15: note: consider making struct 'Fruit' conform to the 'Sendable' protocol
public struct Fruit: CoreModel, Equatable {
^
, Sendable
/Users/admin/builder/spi-builder-workspace/Tests/YPersistenceTests/DataModel/Mocks/Fruit.swift:38:16: note: add '@MainActor' to make static property 'grapes' part of global actor 'MainActor'
static let grapes = Fruit(
^
@MainActor
/Users/admin/builder/spi-builder-workspace/Tests/YPersistenceTests/DataModel/Mocks/Fruit.swift:38:16: note: disable concurrency-safety checks if accesses are protected by an external synchronization mechanism
static let grapes = Fruit(
^
nonisolated(unsafe)
/Users/admin/builder/spi-builder-workspace/Tests/YPersistenceTests/DataModel/Mocks/GroceryProduct.swift:27:16: warning: static property 'durian' is not concurrency-safe because non-'Sendable' type 'GroceryProduct' may have shared mutable state; this is an error in the Swift 6 language mode
static let durian = GroceryProduct(
^
/Users/admin/builder/spi-builder-workspace/Tests/YPersistenceTests/DataModel/Mocks/GroceryProduct.swift:12:15: note: consider making struct 'GroceryProduct' conform to the 'Sendable' protocol
public struct GroceryProduct: CoreModel, Equatable {
^
, Sendable
/Users/admin/builder/spi-builder-workspace/Tests/YPersistenceTests/DataModel/Mocks/GroceryProduct.swift:27:16: note: add '@MainActor' to make static property 'durian' part of global actor 'MainActor'
static let durian = GroceryProduct(
^
@MainActor
/Users/admin/builder/spi-builder-workspace/Tests/YPersistenceTests/DataModel/Mocks/GroceryProduct.swift:27:16: note: disable concurrency-safety checks if accesses are protected by an external synchronization mechanism
static let durian = GroceryProduct(
^
nonisolated(unsafe)
/Users/admin/builder/spi-builder-workspace/Tests/YPersistenceTests/DataModel/Mocks/GroceryProduct.swift:34:16: warning: static property 'banana' is not concurrency-safe because non-'Sendable' type 'GroceryProduct' may have shared mutable state; this is an error in the Swift 6 language mode
static let banana = GroceryProduct(
^
/Users/admin/builder/spi-builder-workspace/Tests/YPersistenceTests/DataModel/Mocks/GroceryProduct.swift:12:15: note: consider making struct 'GroceryProduct' conform to the 'Sendable' protocol
public struct GroceryProduct: CoreModel, Equatable {
^
, Sendable
/Users/admin/builder/spi-builder-workspace/Tests/YPersistenceTests/DataModel/Mocks/GroceryProduct.swift:34:16: note: add '@MainActor' to make static property 'banana' part of global actor 'MainActor'
static let banana = GroceryProduct(
^
@MainActor
/Users/admin/builder/spi-builder-workspace/Tests/YPersistenceTests/DataModel/Mocks/GroceryProduct.swift:34:16: note: disable concurrency-safety checks if accesses are protected by an external synchronization mechanism
static let banana = GroceryProduct(
^
nonisolated(unsafe)
/Users/admin/builder/spi-builder-workspace/Tests/YPersistenceTests/DataModel/Mocks/GroceryProduct.swift:41:16: warning: static property 'mango' is not concurrency-safe because non-'Sendable' type 'GroceryProduct' may have shared mutable state; this is an error in the Swift 6 language mode
static let mango = GroceryProduct(
^
/Users/admin/builder/spi-builder-workspace/Tests/YPersistenceTests/DataModel/Mocks/GroceryProduct.swift:12:15: note: consider making struct 'GroceryProduct' conform to the 'Sendable' protocol
public struct GroceryProduct: CoreModel, Equatable {
^
, Sendable
/Users/admin/builder/spi-builder-workspace/Tests/YPersistenceTests/DataModel/Mocks/GroceryProduct.swift:41:16: note: add '@MainActor' to make static property 'mango' part of global actor 'MainActor'
static let mango = GroceryProduct(
^
@MainActor
/Users/admin/builder/spi-builder-workspace/Tests/YPersistenceTests/DataModel/Mocks/GroceryProduct.swift:41:16: note: disable concurrency-safety checks if accesses are protected by an external synchronization mechanism
static let mango = GroceryProduct(
^
nonisolated(unsafe)
/Users/admin/builder/spi-builder-workspace/Tests/YPersistenceTests/DataModel/Mocks/GroceryProduct.swift:48:16: warning: static property 'blackberry' is not concurrency-safe because non-'Sendable' type 'GroceryProduct' may have shared mutable state; this is an error in the Swift 6 language mode
static let blackberry = GroceryProduct(
^
/Users/admin/builder/spi-builder-workspace/Tests/YPersistenceTests/DataModel/Mocks/GroceryProduct.swift:12:15: note: consider making struct 'GroceryProduct' conform to the 'Sendable' protocol
public struct GroceryProduct: CoreModel, Equatable {
^
, Sendable
/Users/admin/builder/spi-builder-workspace/Tests/YPersistenceTests/DataModel/Mocks/GroceryProduct.swift:48:16: note: add '@MainActor' to make static property 'blackberry' part of global actor 'MainActor'
static let blackberry = GroceryProduct(
^
@MainActor
/Users/admin/builder/spi-builder-workspace/Tests/YPersistenceTests/DataModel/Mocks/GroceryProduct.swift:48:16: note: disable concurrency-safety checks if accesses are protected by an external synchronization mechanism
static let blackberry = GroceryProduct(
^
nonisolated(unsafe)
/Users/admin/builder/spi-builder-workspace/Tests/YPersistenceTests/Manager/PersistenceManagerBaseTests.swift:128:77: warning: reference to var 'NSErrorMergePolicy' is not concurrency-safe because it involves shared mutable state; this is an error in the Swift 6 language mode
func makePersistenceManager(modelName: String, mergePolicy: AnyObject = NSErrorMergePolicy) -> PersistenceManager {
^
/Applications/Xcode-16.3.0.app/Contents/Developer/Platforms/iPhoneOS.platform/Developer/SDKs/iPhoneOS18.4.sdk/System/Library/Frameworks/CoreData.framework/Headers/NSMergePolicy.h:19:20: note: var declared here
COREDATA_EXTERN id NSErrorMergePolicy API_AVAILABLE(macosx(10.4),ios(3.0));
^
/Users/admin/builder/spi-builder-workspace/Tests/YPersistenceTests/Protocols/SyncRecordTests.swift:64:16: warning: static property 'sort' is not concurrency-safe because it is nonisolated global shared mutable state; this is an error in the Swift 6 language mode
static var sort: SortInfo? = SortInfo(columns: columns)
^
/Users/admin/builder/spi-builder-workspace/Tests/YPersistenceTests/Protocols/SyncRecordTests.swift:64:16: note: convert 'sort' to a 'let' constant to make 'Sendable' shared state immutable
static var sort: SortInfo? = SortInfo(columns: columns)
~~~ ^
let
/Users/admin/builder/spi-builder-workspace/Tests/YPersistenceTests/Protocols/SyncRecordTests.swift:64:16: note: add '@MainActor' to make static property 'sort' part of global actor 'MainActor'
static var sort: SortInfo? = SortInfo(columns: columns)
^
@MainActor
/Users/admin/builder/spi-builder-workspace/Tests/YPersistenceTests/Protocols/SyncRecordTests.swift:64:16: note: disable concurrency-safety checks if accesses are protected by an external synchronization mechanism
static var sort: SortInfo? = SortInfo(columns: columns)
^
nonisolated(unsafe)
SwiftCompile normal arm64 Compiling\ resource_bundle_accessor.swift,\ ManagedFruit.swift,\ ManagedGroceryProduct.swift /Users/admin/builder/spi-builder-workspace/.derivedData/Build/Intermediates.noindex/YPersistence.build/Debug-iphoneos/YPersistenceTests.build/DerivedSources/resource_bundle_accessor.swift /Users/admin/builder/spi-builder-workspace/Tests/YPersistenceTests/DataModel/Human/ManagedFruit.swift /Users/admin/builder/spi-builder-workspace/Tests/YPersistenceTests/DataModel/Human/ManagedGroceryProduct.swift (in target 'YPersistenceTests' from project 'YPersistence')
SwiftCompile normal arm64 /Users/admin/builder/spi-builder-workspace/.derivedData/Build/Intermediates.noindex/YPersistence.build/Debug-iphoneos/YPersistenceTests.build/DerivedSources/resource_bundle_accessor.swift (in target 'YPersistenceTests' from project 'YPersistence')
cd /Users/admin/builder/spi-builder-workspace/.swiftpm/xcode
SwiftCompile normal arm64 /Users/admin/builder/spi-builder-workspace/Tests/YPersistenceTests/DataModel/Human/ManagedFruit.swift (in target 'YPersistenceTests' from project 'YPersistence')
cd /Users/admin/builder/spi-builder-workspace/.swiftpm/xcode
SwiftCompile normal arm64 /Users/admin/builder/spi-builder-workspace/Tests/YPersistenceTests/DataModel/Human/ManagedGroceryProduct.swift (in target 'YPersistenceTests' from project 'YPersistence')
cd /Users/admin/builder/spi-builder-workspace/.swiftpm/xcode
SwiftCompile normal arm64 Compiling\ PersistenceManagerBaseTests.swift,\ PersistenceManagerTests.swift /Users/admin/builder/spi-builder-workspace/Tests/YPersistenceTests/Manager/PersistenceManagerBaseTests.swift /Users/admin/builder/spi-builder-workspace/Tests/YPersistenceTests/Manager/PersistenceManagerTests.swift (in target 'YPersistenceTests' from project 'YPersistence')
SwiftCompile normal arm64 /Users/admin/builder/spi-builder-workspace/Tests/YPersistenceTests/Manager/PersistenceManagerBaseTests.swift (in target 'YPersistenceTests' from project 'YPersistence')
cd /Users/admin/builder/spi-builder-workspace/.swiftpm/xcode
/Users/admin/builder/spi-builder-workspace/Tests/YPersistenceTests/Manager/PersistenceManagerBaseTests.swift:128:77: warning: reference to var 'NSErrorMergePolicy' is not concurrency-safe because it involves shared mutable state; this is an error in the Swift 6 language mode
func makePersistenceManager(modelName: String, mergePolicy: AnyObject = NSErrorMergePolicy) -> PersistenceManager {
^
/Applications/Xcode-16.3.0.app/Contents/Developer/Platforms/iPhoneOS.platform/Developer/SDKs/iPhoneOS18.4.sdk/System/Library/Frameworks/CoreData.framework/Headers/NSMergePolicy.h:19:20: note: var declared here
COREDATA_EXTERN id NSErrorMergePolicy API_AVAILABLE(macosx(10.4),ios(3.0));
^
/Users/admin/builder/spi-builder-workspace/Tests/YPersistenceTests/Manager/PersistenceManagerBaseTests.swift:105:17: error: type of expression is ambiguous without a type annotation
context.performAndWait {
~~~~~~~~^~~~~~~~~~~~~~~~
/Users/admin/builder/spi-builder-workspace/Tests/YPersistenceTests/Manager/PersistenceManagerBaseTests.swift:118:17: error: type of expression is ambiguous without a type annotation
context.performAndWait {
~~~~~~~~^~~~~~~~~~~~~~~~
SwiftCompile normal arm64 /Users/admin/builder/spi-builder-workspace/Tests/YPersistenceTests/Manager/PersistenceManagerTests.swift (in target 'YPersistenceTests' from project 'YPersistence')
cd /Users/admin/builder/spi-builder-workspace/.swiftpm/xcode
/Users/admin/builder/spi-builder-workspace/Tests/YPersistenceTests/Manager/PersistenceManagerTests.swift:93:13: warning: capture of 'context2' with non-sendable type 'NSManagedObjectContext?' in a '@Sendable' closure
context2 = self.sut.contextForThread()
^
/Applications/Xcode-16.3.0.app/Contents/Developer/Platforms/iPhoneOS.platform/Developer/SDKs/iPhoneOS18.4.sdk/System/Library/Frameworks/CoreData.framework/Headers/NSManagedObjectContext.h:85:12: note: class 'NSManagedObjectContext' does not conform to the 'Sendable' protocol
@interface NSManagedObjectContext : NSObject <NSCoding, NSLocking> {
^
/Users/admin/builder/spi-builder-workspace/Tests/YPersistenceTests/Manager/PersistenceManagerTests.swift:10:1: warning: add '@preconcurrency' to suppress 'Sendable'-related warnings from module 'CoreData'
import CoreData
^
@preconcurrency
/Users/admin/builder/spi-builder-workspace/Tests/YPersistenceTests/Manager/PersistenceManagerTests.swift:93:24: warning: capture of 'self' with non-sendable type 'PersistenceManagerTests' in a '@Sendable' closure
context2 = self.sut.contextForThread()
^
/Users/admin/builder/spi-builder-workspace/Tests/YPersistenceTests/Manager/PersistenceManagerTests.swift:13:13: note: class 'PersistenceManagerTests' does not conform to the 'Sendable' protocol
final class PersistenceManagerTests: PersistenceManagerBaseTests {
^
/Users/admin/builder/spi-builder-workspace/Tests/YPersistenceTests/Manager/PersistenceManagerTests.swift:94:13: warning: capture of 'context3' with non-sendable type 'NSManagedObjectContext?' in a '@Sendable' closure
context3 = self.sut.contextForThread()
^
/Applications/Xcode-16.3.0.app/Contents/Developer/Platforms/iPhoneOS.platform/Developer/SDKs/iPhoneOS18.4.sdk/System/Library/Frameworks/CoreData.framework/Headers/NSManagedObjectContext.h:85:12: note: class 'NSManagedObjectContext' does not conform to the 'Sendable' protocol
@interface NSManagedObjectContext : NSObject <NSCoding, NSLocking> {
^
/Users/admin/builder/spi-builder-workspace/Tests/YPersistenceTests/Manager/PersistenceManagerTests.swift:93:13: warning: mutation of captured var 'context2' in concurrently-executing code
context2 = self.sut.contextForThread()
^
/Users/admin/builder/spi-builder-workspace/Tests/YPersistenceTests/Manager/PersistenceManagerTests.swift:94:13: warning: mutation of captured var 'context3' in concurrently-executing code
context3 = self.sut.contextForThread()
^
/Users/admin/builder/spi-builder-workspace/Tests/YPersistenceTests/Manager/PersistenceManagerTests.swift:100:13: warning: capture of 'context4' with non-sendable type 'NSManagedObjectContext?' in a '@Sendable' closure
context4 = self.sut.contextForThread()
^
/Applications/Xcode-16.3.0.app/Contents/Developer/Platforms/iPhoneOS.platform/Developer/SDKs/iPhoneOS18.4.sdk/System/Library/Frameworks/CoreData.framework/Headers/NSManagedObjectContext.h:85:12: note: class 'NSManagedObjectContext' does not conform to the 'Sendable' protocol
@interface NSManagedObjectContext : NSObject <NSCoding, NSLocking> {
^
/Users/admin/builder/spi-builder-workspace/Tests/YPersistenceTests/Manager/PersistenceManagerTests.swift:100:24: warning: capture of 'self' with non-sendable type 'PersistenceManagerTests' in a '@Sendable' closure
context4 = self.sut.contextForThread()
^
/Users/admin/builder/spi-builder-workspace/Tests/YPersistenceTests/Manager/PersistenceManagerTests.swift:13:13: note: class 'PersistenceManagerTests' does not conform to the 'Sendable' protocol
final class PersistenceManagerTests: PersistenceManagerBaseTests {
^
/Users/admin/builder/spi-builder-workspace/Tests/YPersistenceTests/Manager/PersistenceManagerTests.swift:100:13: warning: mutation of captured var 'context4' in concurrently-executing code
context4 = self.sut.contextForThread()
^
/Users/admin/builder/spi-builder-workspace/Tests/YPersistenceTests/Manager/PersistenceManagerTests.swift:130:13: warning: capture of 'store' with non-sendable type 'PersistenceManager' in a '@Sendable' closure
store.load { success in
^
/Users/admin/builder/spi-builder-workspace/Sources/YPersistence/Manager/PersistenceManager.swift:12:12: note: class 'PersistenceManager' does not conform to the 'Sendable' protocol
open class PersistenceManager {
^
/Users/admin/builder/spi-builder-workspace/Tests/YPersistenceTests/Manager/PersistenceManagerTests.swift:11:11: warning: add '@preconcurrency' to suppress 'Sendable'-related warnings from module 'YPersistence'
@testable import YPersistence
^
@preconcurrency
/Users/admin/builder/spi-builder-workspace/Tests/YPersistenceTests/Manager/PersistenceManagerTests.swift:133:17: warning: mutation of captured var 'result' in concurrently-executing code; this is an error in the Swift 6 language mode
result = success
^
Failed frontend command:
/Applications/Xcode-16.3.0.app/Contents/Developer/Toolchains/XcodeDefault.xctoolchain/usr/bin/swift-frontend -frontend -c /Users/admin/builder/spi-builder-workspace/.derivedData/Build/Intermediates.noindex/YPersistence.build/Debug-iphoneos/YPersistenceTests.build/DerivedSources/resource_bundle_accessor.swift /Users/admin/builder/spi-builder-workspace/Tests/YPersistenceTests/DataModel/Human/ManagedFruit.swift /Users/admin/builder/spi-builder-workspace/Tests/YPersistenceTests/DataModel/Human/ManagedGroceryProduct.swift /Users/admin/builder/spi-builder-workspace/Tests/YPersistenceTests/DataModel/Machine/_ManagedFruit.swift /Users/admin/builder/spi-builder-workspace/Tests/YPersistenceTests/DataModel/Machine/_ManagedGroceryProduct.swift /Users/admin/builder/spi-builder-workspace/Tests/YPersistenceTests/DataModel/Mocks/Fruit.swift /Users/admin/builder/spi-builder-workspace/Tests/YPersistenceTests/DataModel/Mocks/GroceryProduct.swift /Users/admin/builder/spi-builder-workspace/Tests/YPersistenceTests/Extensions/DispatchQueue+executeOnMainTests.swift /Users/admin/builder/spi-builder-workspace/Tests/YPersistenceTests/Extensions/NSManagedObjectContext+SaveChangesTests.swift /Users/admin/builder/spi-builder-workspace/Tests/YPersistenceTests/Extensions/NSManagedObjectModel+initTests.swift /Users/admin/builder/spi-builder-workspace/Tests/YPersistenceTests/Manager/PersistenceManager+BulkDeleteTests.swift /Users/admin/builder/spi-builder-workspace/Tests/YPersistenceTests/Manager/PersistenceManager+ClearTests.swift /Users/admin/builder/spi-builder-workspace/Tests/YPersistenceTests/Manager/PersistenceManager+DeleteTests.swift /Users/admin/builder/spi-builder-workspace/Tests/YPersistenceTests/Manager/PersistenceManager+FetchTests.swift /Users/admin/builder/spi-builder-workspace/Tests/YPersistenceTests/Manager/PersistenceManager+SaveTests.swift /Users/admin/builder/spi-builder-workspace/Tests/YPersistenceTests/Manager/PersistenceManager+SyncTests.swift -primary-file /Users/admin/builder/spi-builder-workspace/Tests/YPersistenceTests/Manager/PersistenceManagerBaseTests.swift -primary-file /Users/admin/builder/spi-builder-workspace/Tests/YPersistenceTests/Manager/PersistenceManagerTests.swift /Users/admin/builder/spi-builder-workspace/Tests/YPersistenceTests/Protocols/DataRecordTests.swift /Users/admin/builder/spi-builder-workspace/Tests/YPersistenceTests/Protocols/SyncRecordTests.swift /Users/admin/builder/spi-builder-workspace/Tests/YPersistenceTests/SortColumnTests.swift /Users/admin/builder/spi-builder-workspace/Tests/YPersistenceTests/SortInfoTests.swift -emit-dependencies-path /Users/admin/builder/spi-builder-workspace/.derivedData/Build/Intermediates.noindex/YPersistence.build/Debug-iphoneos/YPersistenceTests.build/Objects-normal/arm64/PersistenceManagerBaseTests.d -emit-const-values-path /Users/admin/builder/spi-builder-workspace/.derivedData/Build/Intermediates.noindex/YPersistence.build/Debug-iphoneos/YPersistenceTests.build/Objects-normal/arm64/PersistenceManagerBaseTests.swiftconstvalues -emit-reference-dependencies-path /Users/admin/builder/spi-builder-workspace/.derivedData/Build/Intermediates.noindex/YPersistence.build/Debug-iphoneos/YPersistenceTests.build/Objects-normal/arm64/PersistenceManagerBaseTests.swiftdeps -serialize-diagnostics-path /Users/admin/builder/spi-builder-workspace/.derivedData/Build/Intermediates.noindex/YPersistence.build/Debug-iphoneos/YPersistenceTests.build/Objects-normal/arm64/PersistenceManagerBaseTests.dia -emit-dependencies-path /Users/admin/builder/spi-builder-workspace/.derivedData/Build/Intermediates.noindex/YPersistence.build/Debug-iphoneos/YPersistenceTests.build/Objects-normal/arm64/PersistenceManagerTests.d -emit-const-values-path /Users/admin/builder/spi-builder-workspace/.derivedData/Build/Intermediates.noindex/YPersistence.build/Debug-iphoneos/YPersistenceTests.build/Objects-normal/arm64/PersistenceManagerTests.swiftconstvalues -emit-reference-dependencies-path /Users/admin/builder/spi-builder-workspace/.derivedData/Build/Intermediates.noindex/YPersistence.build/Debug-iphoneos/YPersistenceTests.build/Objects-normal/arm64/PersistenceManagerTests.swiftdeps -serialize-diagnostics-path /Users/admin/builder/spi-builder-workspace/.derivedData/Build/Intermediates.noindex/YPersistence.build/Debug-iphoneos/YPersistenceTests.build/Objects-normal/arm64/PersistenceManagerTests.dia -target arm64-apple-ios13.0 -Xllvm -aarch64-use-tbi -enable-objc-interop -stack-check -sdk /Applications/Xcode-16.3.0.app/Contents/Developer/Platforms/iPhoneOS.platform/Developer/SDKs/iPhoneOS18.4.sdk -I /Users/admin/builder/spi-builder-workspace/.derivedData/Build/Products/Debug-iphoneos -I /Applications/Xcode-16.3.0.app/Contents/Developer/Platforms/iPhoneOS.platform/Developer/usr/lib -F /Users/admin/builder/spi-builder-workspace/.derivedData/Build/Products/Debug-iphoneos/PackageFrameworks -F /Users/admin/builder/spi-builder-workspace/.derivedData/Build/Products/Debug-iphoneos -F /Applications/Xcode-16.3.0.app/Contents/Developer/Platforms/iPhoneOS.platform/Developer/Library/Frameworks -F /Applications/Xcode-16.3.0.app/Contents/Developer/Platforms/iPhoneOS.platform/Developer/SDKs/iPhoneOS18.4.sdk/Developer/Library/Frameworks -no-color-diagnostics -enable-testing -g -debug-info-format\=dwarf -dwarf-version\=4 -module-cache-path /Users/admin/builder/spi-builder-workspace/.derivedData/ModuleCache.noindex -profile-generate -profile-coverage-mapping -swift-version 5 -enforce-exclusivity\=checked -stats-output-dir /Users/admin/builder/spi-builder-workspace/.swiftpm/xcode/.stats -Onone -D SWIFT_PACKAGE -D DEBUG -serialize-debugging-options -const-gather-protocols-file /Users/admin/builder/spi-builder-workspace/.derivedData/Build/Intermediates.noindex/YPersistence.build/Debug-iphoneos/YPersistenceTests.build/Objects-normal/arm64/YPersistenceTests_const_extract_protocols.json -enable-upcoming-feature StrictConcurrency -enable-upcoming-feature DisableOutwardActorInference -enable-upcoming-feature GlobalActorIsolatedTypesUsability -enable-upcoming-feature InferSendableFromCaptures -enable-experimental-feature DebugDescriptionMacro -strict-concurrency\=complete -empty-abi-descriptor -plugin-path /Applications/Xcode-16.3.0.app/Contents/Developer/Toolchains/XcodeDefault.xctoolchain/usr/lib/swift/host/plugins/testing -validate-clang-modules-once -clang-build-session-file /Users/admin/builder/spi-builder-workspace/.derivedData/ModuleCache.noindex/Session.modulevalidation -Xcc -working-directory -Xcc /Users/admin/builder/spi-builder-workspace/.swiftpm/xcode -resource-dir /Applications/Xcode-16.3.0.app/Contents/Developer/Toolchains/XcodeDefault.xctoolchain/usr/lib/swift -enable-anonymous-context-mangled-names -file-compilation-dir /Users/admin/builder/spi-builder-workspace/.swiftpm/xcode -Xcc -ivfsstatcache -Xcc /Users/admin/builder/spi-builder-workspace/.derivedData/SDKStatCaches.noindex/iphoneos18.4-22E235-339d34bc69d7fc736c3220795c36f340.sdkstatcache -Xcc -I/Users/admin/builder/spi-builder-workspace/.derivedData/Build/Products/Debug-iphoneos/include -Xcc -I/Users/admin/builder/spi-builder-workspace/.derivedData/Build/Intermediates.noindex/YPersistence.build/Debug-iphoneos/YPersistenceTests.build/DerivedSources-normal/arm64 -Xcc -I/Users/admin/builder/spi-builder-workspace/.derivedData/Build/Intermediates.noindex/YPersistence.build/Debug-iphoneos/YPersistenceTests.build/DerivedSources/arm64 -Xcc -I/Users/admin/builder/spi-builder-workspace/.derivedData/Build/Intermediates.noindex/YPersistence.build/Debug-iphoneos/YPersistenceTests.build/DerivedSources -Xcc -DSWIFT_PACKAGE -Xcc -DDEBUG\=1 -module-name YPersistenceTests -frontend-parseable-output -disable-clang-spi -target-sdk-version 18.4 -target-sdk-name iphoneos18.4 -external-plugin-path /Applications/Xcode-16.3.0.app/Contents/Developer/Platforms/iPhoneOS.platform/Developer/usr/lib/swift/host/plugins\#/Applications/Xcode-16.3.0.app/Contents/Developer/Platforms/iPhoneOS.platform/Developer/usr/bin/swift-plugin-server -external-plugin-path /Applications/Xcode-16.3.0.app/Contents/Developer/Platforms/iPhoneOS.platform/Developer/usr/local/lib/swift/host/plugins\#/Applications/Xcode-16.3.0.app/Contents/Developer/Platforms/iPhoneOS.platform/Developer/usr/bin/swift-plugin-server -in-process-plugin-server-path /Applications/Xcode-16.3.0.app/Contents/Developer/Toolchains/XcodeDefault.xctoolchain/usr/lib/swift/host/libSwiftInProcPluginServer.dylib -plugin-path /Applications/Xcode-16.3.0.app/Contents/Developer/Toolchains/XcodeDefault.xctoolchain/usr/lib/swift/host/plugins -plugin-path /Applications/Xcode-16.3.0.app/Contents/Developer/Toolchains/XcodeDefault.xctoolchain/usr/local/lib/swift/host/plugins -o /Users/admin/builder/spi-builder-workspace/.derivedData/Build/Intermediates.noindex/YPersistence.build/Debug-iphoneos/YPersistenceTests.build/Objects-normal/arm64/PersistenceManagerBaseTests.o -o /Users/admin/builder/spi-builder-workspace/.derivedData/Build/Intermediates.noindex/YPersistence.build/Debug-iphoneos/YPersistenceTests.build/Objects-normal/arm64/PersistenceManagerTests.o -index-unit-output-path /YPersistence.build/Debug-iphoneos/YPersistenceTests.build/Objects-normal/arm64/PersistenceManagerBaseTests.o -index-unit-output-path /YPersistence.build/Debug-iphoneos/YPersistenceTests.build/Objects-normal/arm64/PersistenceManagerTests.o -index-store-path /Users/admin/builder/spi-builder-workspace/.derivedData/Index.noindex/DataStore -index-system-modules
SwiftCompile normal arm64 Compiling\ NSManagedObjectContext+SaveChangesTests.swift,\ NSManagedObjectModel+initTests.swift /Users/admin/builder/spi-builder-workspace/Tests/YPersistenceTests/Extensions/NSManagedObjectContext+SaveChangesTests.swift /Users/admin/builder/spi-builder-workspace/Tests/YPersistenceTests/Extensions/NSManagedObjectModel+initTests.swift (in target 'YPersistenceTests' from project 'YPersistence')
SwiftCompile normal arm64 /Users/admin/builder/spi-builder-workspace/Tests/YPersistenceTests/Extensions/NSManagedObjectContext+SaveChangesTests.swift (in target 'YPersistenceTests' from project 'YPersistence')
cd /Users/admin/builder/spi-builder-workspace/.swiftpm/xcode
SwiftCompile normal arm64 /Users/admin/builder/spi-builder-workspace/Tests/YPersistenceTests/Extensions/NSManagedObjectModel+initTests.swift (in target 'YPersistenceTests' from project 'YPersistence')
cd /Users/admin/builder/spi-builder-workspace/.swiftpm/xcode
SwiftCompile normal arm64 Compiling\ SortColumnTests.swift,\ SortInfoTests.swift /Users/admin/builder/spi-builder-workspace/Tests/YPersistenceTests/SortColumnTests.swift /Users/admin/builder/spi-builder-workspace/Tests/YPersistenceTests/SortInfoTests.swift (in target 'YPersistenceTests' from project 'YPersistence')
SwiftCompile normal arm64 /Users/admin/builder/spi-builder-workspace/Tests/YPersistenceTests/SortColumnTests.swift (in target 'YPersistenceTests' from project 'YPersistence')
cd /Users/admin/builder/spi-builder-workspace/.swiftpm/xcode
SwiftCompile normal arm64 /Users/admin/builder/spi-builder-workspace/Tests/YPersistenceTests/SortInfoTests.swift (in target 'YPersistenceTests' from project 'YPersistence')
cd /Users/admin/builder/spi-builder-workspace/.swiftpm/xcode
SwiftDriverJobDiscovery normal arm64 Compiling PersistenceManager+Clear.swift, PersistenceManager+Delete.swift (in target 'YPersistence' from project 'YPersistence')
SwiftCompile normal arm64 Compiling\ PersistenceManager+SaveTests.swift,\ PersistenceManager+SyncTests.swift /Users/admin/builder/spi-builder-workspace/Tests/YPersistenceTests/Manager/PersistenceManager+SaveTests.swift /Users/admin/builder/spi-builder-workspace/Tests/YPersistenceTests/Manager/PersistenceManager+SyncTests.swift (in target 'YPersistenceTests' from project 'YPersistence')
SwiftCompile normal arm64 /Users/admin/builder/spi-builder-workspace/Tests/YPersistenceTests/Manager/PersistenceManager+SaveTests.swift (in target 'YPersistenceTests' from project 'YPersistence')
cd /Users/admin/builder/spi-builder-workspace/.swiftpm/xcode
SwiftCompile normal arm64 /Users/admin/builder/spi-builder-workspace/Tests/YPersistenceTests/Manager/PersistenceManager+SyncTests.swift (in target 'YPersistenceTests' from project 'YPersistence')
cd /Users/admin/builder/spi-builder-workspace/.swiftpm/xcode
SwiftDriverJobDiscovery normal arm64 Compiling NSManagedObjectModel+init.swift, PersistenceManager+BulkDelete.swift (in target 'YPersistence' from project 'YPersistence')
SwiftCompile normal arm64 Compiling\ DataRecordTests.swift,\ SyncRecordTests.swift /Users/admin/builder/spi-builder-workspace/Tests/YPersistenceTests/Protocols/DataRecordTests.swift /Users/admin/builder/spi-builder-workspace/Tests/YPersistenceTests/Protocols/SyncRecordTests.swift (in target 'YPersistenceTests' from project 'YPersistence')
SwiftCompile normal arm64 /Users/admin/builder/spi-builder-workspace/Tests/YPersistenceTests/Protocols/DataRecordTests.swift (in target 'YPersistenceTests' from project 'YPersistence')
cd /Users/admin/builder/spi-builder-workspace/.swiftpm/xcode
SwiftCompile normal arm64 /Users/admin/builder/spi-builder-workspace/Tests/YPersistenceTests/Protocols/SyncRecordTests.swift (in target 'YPersistenceTests' from project 'YPersistence')
cd /Users/admin/builder/spi-builder-workspace/.swiftpm/xcode
/Users/admin/builder/spi-builder-workspace/Tests/YPersistenceTests/Protocols/SyncRecordTests.swift:64:16: warning: static property 'sort' is not concurrency-safe because it is nonisolated global shared mutable state; this is an error in the Swift 6 language mode
static var sort: SortInfo? = SortInfo(columns: columns)
^
/Users/admin/builder/spi-builder-workspace/Tests/YPersistenceTests/Protocols/SyncRecordTests.swift:64:16: note: convert 'sort' to a 'let' constant to make 'Sendable' shared state immutable
static var sort: SortInfo? = SortInfo(columns: columns)
~~~ ^
let
/Users/admin/builder/spi-builder-workspace/Tests/YPersistenceTests/Protocols/SyncRecordTests.swift:64:16: note: add '@MainActor' to make static property 'sort' part of global actor 'MainActor'
static var sort: SortInfo? = SortInfo(columns: columns)
^
@MainActor
/Users/admin/builder/spi-builder-workspace/Tests/YPersistenceTests/Protocols/SyncRecordTests.swift:64:16: note: disable concurrency-safety checks if accesses are protected by an external synchronization mechanism
static var sort: SortInfo? = SortInfo(columns: columns)
^
nonisolated(unsafe)
SwiftCompile normal arm64 Compiling\ PersistenceManager+BulkDeleteTests.swift,\ PersistenceManager+ClearTests.swift /Users/admin/builder/spi-builder-workspace/Tests/YPersistenceTests/Manager/PersistenceManager+BulkDeleteTests.swift /Users/admin/builder/spi-builder-workspace/Tests/YPersistenceTests/Manager/PersistenceManager+ClearTests.swift (in target 'YPersistenceTests' from project 'YPersistence')
SwiftCompile normal arm64 /Users/admin/builder/spi-builder-workspace/Tests/YPersistenceTests/Manager/PersistenceManager+BulkDeleteTests.swift (in target 'YPersistenceTests' from project 'YPersistence')
cd /Users/admin/builder/spi-builder-workspace/.swiftpm/xcode
SwiftCompile normal arm64 /Users/admin/builder/spi-builder-workspace/Tests/YPersistenceTests/Manager/PersistenceManager+ClearTests.swift (in target 'YPersistenceTests' from project 'YPersistence')
cd /Users/admin/builder/spi-builder-workspace/.swiftpm/xcode
SwiftDriverJobDiscovery normal arm64 Compiling PersistenceManager+Sync.swift, PersistenceManager.swift (in target 'YPersistence' from project 'YPersistence')
SwiftDriverJobDiscovery normal arm64 Compiling DispatchQueue+executeOnMain.swift, NSManagedObjectContext+SaveChanges.swift (in target 'YPersistence' from project 'YPersistence')
SwiftCompile normal arm64 Compiling\ PersistenceManager+DeleteTests.swift,\ PersistenceManager+FetchTests.swift /Users/admin/builder/spi-builder-workspace/Tests/YPersistenceTests/Manager/PersistenceManager+DeleteTests.swift /Users/admin/builder/spi-builder-workspace/Tests/YPersistenceTests/Manager/PersistenceManager+FetchTests.swift (in target 'YPersistenceTests' from project 'YPersistence')
SwiftCompile normal arm64 /Users/admin/builder/spi-builder-workspace/Tests/YPersistenceTests/Manager/PersistenceManager+DeleteTests.swift (in target 'YPersistenceTests' from project 'YPersistence')
cd /Users/admin/builder/spi-builder-workspace/.swiftpm/xcode
SwiftCompile normal arm64 /Users/admin/builder/spi-builder-workspace/Tests/YPersistenceTests/Manager/PersistenceManager+FetchTests.swift (in target 'YPersistenceTests' from project 'YPersistence')
cd /Users/admin/builder/spi-builder-workspace/.swiftpm/xcode
SwiftDriverJobDiscovery normal arm64 Compiling CoreModel.swift, DataRecord.swift (in target 'YPersistence' from project 'YPersistence')
SwiftCompile normal arm64 Compiling\ GroceryProduct.swift,\ DispatchQueue+executeOnMainTests.swift /Users/admin/builder/spi-builder-workspace/Tests/YPersistenceTests/DataModel/Mocks/GroceryProduct.swift /Users/admin/builder/spi-builder-workspace/Tests/YPersistenceTests/Extensions/DispatchQueue+executeOnMainTests.swift (in target 'YPersistenceTests' from project 'YPersistence')
SwiftCompile normal arm64 /Users/admin/builder/spi-builder-workspace/Tests/YPersistenceTests/DataModel/Mocks/GroceryProduct.swift (in target 'YPersistenceTests' from project 'YPersistence')
cd /Users/admin/builder/spi-builder-workspace/.swiftpm/xcode
/Users/admin/builder/spi-builder-workspace/Tests/YPersistenceTests/DataModel/Mocks/GroceryProduct.swift:27:16: warning: static property 'durian' is not concurrency-safe because non-'Sendable' type 'GroceryProduct' may have shared mutable state; this is an error in the Swift 6 language mode
static let durian = GroceryProduct(
^
/Users/admin/builder/spi-builder-workspace/Tests/YPersistenceTests/DataModel/Mocks/GroceryProduct.swift:12:15: note: consider making struct 'GroceryProduct' conform to the 'Sendable' protocol
public struct GroceryProduct: CoreModel, Equatable {
^
, Sendable
/Users/admin/builder/spi-builder-workspace/Tests/YPersistenceTests/DataModel/Mocks/GroceryProduct.swift:27:16: note: add '@MainActor' to make static property 'durian' part of global actor 'MainActor'
static let durian = GroceryProduct(
^
@MainActor
/Users/admin/builder/spi-builder-workspace/Tests/YPersistenceTests/DataModel/Mocks/GroceryProduct.swift:27:16: note: disable concurrency-safety checks if accesses are protected by an external synchronization mechanism
static let durian = GroceryProduct(
^
nonisolated(unsafe)
/Users/admin/builder/spi-builder-workspace/Tests/YPersistenceTests/DataModel/Mocks/GroceryProduct.swift:34:16: warning: static property 'banana' is not concurrency-safe because non-'Sendable' type 'GroceryProduct' may have shared mutable state; this is an error in the Swift 6 language mode
static let banana = GroceryProduct(
^
/Users/admin/builder/spi-builder-workspace/Tests/YPersistenceTests/DataModel/Mocks/GroceryProduct.swift:12:15: note: consider making struct 'GroceryProduct' conform to the 'Sendable' protocol
public struct GroceryProduct: CoreModel, Equatable {
^
, Sendable
/Users/admin/builder/spi-builder-workspace/Tests/YPersistenceTests/DataModel/Mocks/GroceryProduct.swift:34:16: note: add '@MainActor' to make static property 'banana' part of global actor 'MainActor'
static let banana = GroceryProduct(
^
@MainActor
/Users/admin/builder/spi-builder-workspace/Tests/YPersistenceTests/DataModel/Mocks/GroceryProduct.swift:34:16: note: disable concurrency-safety checks if accesses are protected by an external synchronization mechanism
static let banana = GroceryProduct(
^
nonisolated(unsafe)
/Users/admin/builder/spi-builder-workspace/Tests/YPersistenceTests/DataModel/Mocks/GroceryProduct.swift:41:16: warning: static property 'mango' is not concurrency-safe because non-'Sendable' type 'GroceryProduct' may have shared mutable state; this is an error in the Swift 6 language mode
static let mango = GroceryProduct(
^
/Users/admin/builder/spi-builder-workspace/Tests/YPersistenceTests/DataModel/Mocks/GroceryProduct.swift:12:15: note: consider making struct 'GroceryProduct' conform to the 'Sendable' protocol
public struct GroceryProduct: CoreModel, Equatable {
^
, Sendable
/Users/admin/builder/spi-builder-workspace/Tests/YPersistenceTests/DataModel/Mocks/GroceryProduct.swift:41:16: note: add '@MainActor' to make static property 'mango' part of global actor 'MainActor'
static let mango = GroceryProduct(
^
@MainActor
/Users/admin/builder/spi-builder-workspace/Tests/YPersistenceTests/DataModel/Mocks/GroceryProduct.swift:41:16: note: disable concurrency-safety checks if accesses are protected by an external synchronization mechanism
static let mango = GroceryProduct(
^
nonisolated(unsafe)
/Users/admin/builder/spi-builder-workspace/Tests/YPersistenceTests/DataModel/Mocks/GroceryProduct.swift:48:16: warning: static property 'blackberry' is not concurrency-safe because non-'Sendable' type 'GroceryProduct' may have shared mutable state; this is an error in the Swift 6 language mode
static let blackberry = GroceryProduct(
^
/Users/admin/builder/spi-builder-workspace/Tests/YPersistenceTests/DataModel/Mocks/GroceryProduct.swift:12:15: note: consider making struct 'GroceryProduct' conform to the 'Sendable' protocol
public struct GroceryProduct: CoreModel, Equatable {
^
, Sendable
/Users/admin/builder/spi-builder-workspace/Tests/YPersistenceTests/DataModel/Mocks/GroceryProduct.swift:48:16: note: add '@MainActor' to make static property 'blackberry' part of global actor 'MainActor'
static let blackberry = GroceryProduct(
^
@MainActor
/Users/admin/builder/spi-builder-workspace/Tests/YPersistenceTests/DataModel/Mocks/GroceryProduct.swift:48:16: note: disable concurrency-safety checks if accesses are protected by an external synchronization mechanism
static let blackberry = GroceryProduct(
^
nonisolated(unsafe)
SwiftCompile normal arm64 /Users/admin/builder/spi-builder-workspace/Tests/YPersistenceTests/Extensions/DispatchQueue+executeOnMainTests.swift (in target 'YPersistenceTests' from project 'YPersistence')
cd /Users/admin/builder/spi-builder-workspace/.swiftpm/xcode
/Users/admin/builder/spi-builder-workspace/Tests/YPersistenceTests/Extensions/DispatchQueue+executeOnMainTests.swift:33:17: warning: mutation of captured var 'executed' in concurrently-executing code; this is an error in the Swift 6 language mode
executed = true
^
/Users/admin/builder/spi-builder-workspace/Tests/YPersistenceTests/Extensions/DispatchQueue+executeOnMainTests.swift:37:13: warning: mutation of captured var 'wasExecutedImmediately' in concurrently-executing code
wasExecutedImmediately = (executed == true)
^
/Users/admin/builder/spi-builder-workspace/Tests/YPersistenceTests/Extensions/DispatchQueue+executeOnMainTests.swift:37:39: warning: reference to captured var 'executed' in concurrently-executing code
wasExecutedImmediately = (executed == true)
^
SwiftDriverJobDiscovery normal arm64 Compiling PersistenceManager+Fetch.swift, PersistenceManager+Save.swift (in target 'YPersistence' from project 'YPersistence')
SwiftCompile normal arm64 Compiling\ _ManagedFruit.swift,\ _ManagedGroceryProduct.swift,\ Fruit.swift /Users/admin/builder/spi-builder-workspace/Tests/YPersistenceTests/DataModel/Machine/_ManagedFruit.swift /Users/admin/builder/spi-builder-workspace/Tests/YPersistenceTests/DataModel/Machine/_ManagedGroceryProduct.swift /Users/admin/builder/spi-builder-workspace/Tests/YPersistenceTests/DataModel/Mocks/Fruit.swift (in target 'YPersistenceTests' from project 'YPersistence')
SwiftCompile normal arm64 /Users/admin/builder/spi-builder-workspace/Tests/YPersistenceTests/DataModel/Machine/_ManagedFruit.swift (in target 'YPersistenceTests' from project 'YPersistence')
cd /Users/admin/builder/spi-builder-workspace/.swiftpm/xcode
SwiftCompile normal arm64 /Users/admin/builder/spi-builder-workspace/Tests/YPersistenceTests/DataModel/Machine/_ManagedGroceryProduct.swift (in target 'YPersistenceTests' from project 'YPersistence')
cd /Users/admin/builder/spi-builder-workspace/.swiftpm/xcode
SwiftCompile normal arm64 /Users/admin/builder/spi-builder-workspace/Tests/YPersistenceTests/DataModel/Mocks/Fruit.swift (in target 'YPersistenceTests' from project 'YPersistence')
cd /Users/admin/builder/spi-builder-workspace/.swiftpm/xcode
/Users/admin/builder/spi-builder-workspace/Tests/YPersistenceTests/DataModel/Mocks/Fruit.swift:23:16: warning: static property 'mango' is not concurrency-safe because non-'Sendable' type 'Fruit' may have shared mutable state; this is an error in the Swift 6 language mode
static let mango = Fruit(
^
/Users/admin/builder/spi-builder-workspace/Tests/YPersistenceTests/DataModel/Mocks/Fruit.swift:12:15: note: consider making struct 'Fruit' conform to the 'Sendable' protocol
public struct Fruit: CoreModel, Equatable {
^
, Sendable
/Users/admin/builder/spi-builder-workspace/Tests/YPersistenceTests/DataModel/Mocks/Fruit.swift:23:16: note: add '@MainActor' to make static property 'mango' part of global actor 'MainActor'
static let mango = Fruit(
^
@MainActor
/Users/admin/builder/spi-builder-workspace/Tests/YPersistenceTests/DataModel/Mocks/Fruit.swift:23:16: note: disable concurrency-safety checks if accesses are protected by an external synchronization mechanism
static let mango = Fruit(
^
nonisolated(unsafe)
/Users/admin/builder/spi-builder-workspace/Tests/YPersistenceTests/DataModel/Mocks/Fruit.swift:28:16: warning: static property 'banana' is not concurrency-safe because non-'Sendable' type 'Fruit' may have shared mutable state; this is an error in the Swift 6 language mode
static let banana = Fruit(
^
/Users/admin/builder/spi-builder-workspace/Tests/YPersistenceTests/DataModel/Mocks/Fruit.swift:12:15: note: consider making struct 'Fruit' conform to the 'Sendable' protocol
public struct Fruit: CoreModel, Equatable {
^
, Sendable
/Users/admin/builder/spi-builder-workspace/Tests/YPersistenceTests/DataModel/Mocks/Fruit.swift:28:16: note: add '@MainActor' to make static property 'banana' part of global actor 'MainActor'
static let banana = Fruit(
^
@MainActor
/Users/admin/builder/spi-builder-workspace/Tests/YPersistenceTests/DataModel/Mocks/Fruit.swift:28:16: note: disable concurrency-safety checks if accesses are protected by an external synchronization mechanism
static let banana = Fruit(
^
nonisolated(unsafe)
/Users/admin/builder/spi-builder-workspace/Tests/YPersistenceTests/DataModel/Mocks/Fruit.swift:33:16: warning: static property 'apple' is not concurrency-safe because non-'Sendable' type 'Fruit' may have shared mutable state; this is an error in the Swift 6 language mode
static let apple = Fruit(
^
/Users/admin/builder/spi-builder-workspace/Tests/YPersistenceTests/DataModel/Mocks/Fruit.swift:12:15: note: consider making struct 'Fruit' conform to the 'Sendable' protocol
public struct Fruit: CoreModel, Equatable {
^
, Sendable
/Users/admin/builder/spi-builder-workspace/Tests/YPersistenceTests/DataModel/Mocks/Fruit.swift:33:16: note: add '@MainActor' to make static property 'apple' part of global actor 'MainActor'
static let apple = Fruit(
^
@MainActor
/Users/admin/builder/spi-builder-workspace/Tests/YPersistenceTests/DataModel/Mocks/Fruit.swift:33:16: note: disable concurrency-safety checks if accesses are protected by an external synchronization mechanism
static let apple = Fruit(
^
nonisolated(unsafe)
/Users/admin/builder/spi-builder-workspace/Tests/YPersistenceTests/DataModel/Mocks/Fruit.swift:38:16: warning: static property 'grapes' is not concurrency-safe because non-'Sendable' type 'Fruit' may have shared mutable state; this is an error in the Swift 6 language mode
static let grapes = Fruit(
^
/Users/admin/builder/spi-builder-workspace/Tests/YPersistenceTests/DataModel/Mocks/Fruit.swift:12:15: note: consider making struct 'Fruit' conform to the 'Sendable' protocol
public struct Fruit: CoreModel, Equatable {
^
, Sendable
/Users/admin/builder/spi-builder-workspace/Tests/YPersistenceTests/DataModel/Mocks/Fruit.swift:38:16: note: add '@MainActor' to make static property 'grapes' part of global actor 'MainActor'
static let grapes = Fruit(
^
@MainActor
/Users/admin/builder/spi-builder-workspace/Tests/YPersistenceTests/DataModel/Mocks/Fruit.swift:38:16: note: disable concurrency-safety checks if accesses are protected by an external synchronization mechanism
static let grapes = Fruit(
^
nonisolated(unsafe)
SwiftDriverJobDiscovery normal arm64 Emitting module for YPersistenceTests (in target 'YPersistenceTests' from project 'YPersistence')
SwiftDriver\ Compilation\ Requirements YPersistenceTests normal arm64 com.apple.xcode.tools.swift.compiler (in target 'YPersistenceTests' from project 'YPersistence')
cd /Users/admin/builder/spi-builder-workspace/.swiftpm/xcode
builtin-Swift-Compilation-Requirements -- /Applications/Xcode-16.3.0.app/Contents/Developer/Toolchains/XcodeDefault.xctoolchain/usr/bin/swiftc -module-name YPersistenceTests -Onone -enforce-exclusivity\=checked @/Users/admin/builder/spi-builder-workspace/.derivedData/Build/Intermediates.noindex/YPersistence.build/Debug-iphoneos/YPersistenceTests.build/Objects-normal/arm64/YPersistenceTests.SwiftFileList -DSWIFT_PACKAGE -DDEBUG -stats-output-dir .stats -strict-concurrency\=complete -enable-upcoming-feature StrictConcurrency -enable-upcoming-feature DisableOutwardActorInference -enable-upcoming-feature GlobalActorIsolatedTypesUsability -enable-upcoming-feature InferSendableFromCaptures -plugin-path /Applications/Xcode-16.3.0.app/Contents/Developer/Toolchains/XcodeDefault.xctoolchain/usr/lib/swift/host/plugins/testing -enable-experimental-feature DebugDescriptionMacro -sdk /Applications/Xcode-16.3.0.app/Contents/Developer/Platforms/iPhoneOS.platform/Developer/SDKs/iPhoneOS18.4.sdk -target arm64-apple-ios13.0 -g -module-cache-path /Users/admin/builder/spi-builder-workspace/.derivedData/ModuleCache.noindex -Xfrontend -serialize-debugging-options -profile-coverage-mapping -profile-generate -enable-testing -index-store-path /Users/admin/builder/spi-builder-workspace/.derivedData/Index.noindex/DataStore -swift-version 5 -I /Users/admin/builder/spi-builder-workspace/.derivedData/Build/Products/Debug-iphoneos -I /Applications/Xcode-16.3.0.app/Contents/Developer/Platforms/iPhoneOS.platform/Developer/usr/lib -F /Users/admin/builder/spi-builder-workspace/.derivedData/Build/Products/Debug-iphoneos/PackageFrameworks -F /Users/admin/builder/spi-builder-workspace/.derivedData/Build/Products/Debug-iphoneos -F /Applications/Xcode-16.3.0.app/Contents/Developer/Platforms/iPhoneOS.platform/Developer/Library/Frameworks -F /Applications/Xcode-16.3.0.app/Contents/Developer/Platforms/iPhoneOS.platform/Developer/SDKs/iPhoneOS18.4.sdk/Developer/Library/Frameworks -c -j10 -enable-batch-mode -incremental -Xcc -ivfsstatcache -Xcc /Users/admin/builder/spi-builder-workspace/.derivedData/SDKStatCaches.noindex/iphoneos18.4-22E235-339d34bc69d7fc736c3220795c36f340.sdkstatcache -output-file-map /Users/admin/builder/spi-builder-workspace/.derivedData/Build/Intermediates.noindex/YPersistence.build/Debug-iphoneos/YPersistenceTests.build/Objects-normal/arm64/YPersistenceTests-OutputFileMap.json -use-frontend-parseable-output -save-temps -no-color-diagnostics -serialize-diagnostics -emit-dependencies -emit-module -emit-module-path /Users/admin/builder/spi-builder-workspace/.derivedData/Build/Intermediates.noindex/YPersistence.build/Debug-iphoneos/YPersistenceTests.build/Objects-normal/arm64/YPersistenceTests.swiftmodule -validate-clang-modules-once -clang-build-session-file /Users/admin/builder/spi-builder-workspace/.derivedData/ModuleCache.noindex/Session.modulevalidation -emit-const-values -Xfrontend -const-gather-protocols-file -Xfrontend /Users/admin/builder/spi-builder-workspace/.derivedData/Build/Intermediates.noindex/YPersistence.build/Debug-iphoneos/YPersistenceTests.build/Objects-normal/arm64/YPersistenceTests_const_extract_protocols.json -Xcc -I/Users/admin/builder/spi-builder-workspace/.derivedData/Build/Products/Debug-iphoneos/include -Xcc -I/Users/admin/builder/spi-builder-workspace/.derivedData/Build/Intermediates.noindex/YPersistence.build/Debug-iphoneos/YPersistenceTests.build/DerivedSources-normal/arm64 -Xcc -I/Users/admin/builder/spi-builder-workspace/.derivedData/Build/Intermediates.noindex/YPersistence.build/Debug-iphoneos/YPersistenceTests.build/DerivedSources/arm64 -Xcc -I/Users/admin/builder/spi-builder-workspace/.derivedData/Build/Intermediates.noindex/YPersistence.build/Debug-iphoneos/YPersistenceTests.build/DerivedSources -Xcc -DSWIFT_PACKAGE -Xcc -DDEBUG\=1 -working-directory /Users/admin/builder/spi-builder-workspace/.swiftpm/xcode -experimental-emit-module-separately -disable-cmo
SwiftDriverJobDiscovery normal arm64 Compiling resource_bundle_accessor.swift, ManagedFruit.swift, ManagedGroceryProduct.swift (in target 'YPersistenceTests' from project 'YPersistence')
SwiftDriver\ Compilation YPersistence normal arm64 com.apple.xcode.tools.swift.compiler (in target 'YPersistence' from project 'YPersistence')
cd /Users/admin/builder/spi-builder-workspace/.swiftpm/xcode
builtin-Swift-Compilation -- /Applications/Xcode-16.3.0.app/Contents/Developer/Toolchains/XcodeDefault.xctoolchain/usr/bin/swiftc -module-name YPersistence -Onone -enforce-exclusivity\=checked @/Users/admin/builder/spi-builder-workspace/.derivedData/Build/Intermediates.noindex/YPersistence.build/Debug-iphoneos/YPersistence.build/Objects-normal/arm64/YPersistence.SwiftFileList -DSWIFT_PACKAGE -DDEBUG -stats-output-dir .stats -strict-concurrency\=complete -enable-upcoming-feature StrictConcurrency -enable-upcoming-feature DisableOutwardActorInference -enable-upcoming-feature GlobalActorIsolatedTypesUsability -enable-upcoming-feature InferSendableFromCaptures -plugin-path /Applications/Xcode-16.3.0.app/Contents/Developer/Toolchains/XcodeDefault.xctoolchain/usr/lib/swift/host/plugins/testing -enable-experimental-feature DebugDescriptionMacro -sdk /Applications/Xcode-16.3.0.app/Contents/Developer/Platforms/iPhoneOS.platform/Developer/SDKs/iPhoneOS18.4.sdk -target arm64-apple-ios12.0 -g -module-cache-path /Users/admin/builder/spi-builder-workspace/.derivedData/ModuleCache.noindex -Xfrontend -serialize-debugging-options -profile-coverage-mapping -profile-generate -enable-testing -index-store-path /Users/admin/builder/spi-builder-workspace/.derivedData/Index.noindex/DataStore -swift-version 5 -I /Users/admin/builder/spi-builder-workspace/.derivedData/Build/Products/Debug-iphoneos -I /Applications/Xcode-16.3.0.app/Contents/Developer/Platforms/iPhoneOS.platform/Developer/usr/lib -F /Users/admin/builder/spi-builder-workspace/.derivedData/Build/Products/Debug-iphoneos -F /Applications/Xcode-16.3.0.app/Contents/Developer/Platforms/iPhoneOS.platform/Developer/Library/Frameworks -F /Applications/Xcode-16.3.0.app/Contents/Developer/Platforms/iPhoneOS.platform/Developer/SDKs/iPhoneOS18.4.sdk/Developer/Library/Frameworks -c -j10 -enable-batch-mode -incremental -Xcc -ivfsstatcache -Xcc /Users/admin/builder/spi-builder-workspace/.derivedData/SDKStatCaches.noindex/iphoneos18.4-22E235-339d34bc69d7fc736c3220795c36f340.sdkstatcache -output-file-map /Users/admin/builder/spi-builder-workspace/.derivedData/Build/Intermediates.noindex/YPersistence.build/Debug-iphoneos/YPersistence.build/Objects-normal/arm64/YPersistence-OutputFileMap.json -use-frontend-parseable-output -save-temps -no-color-diagnostics -serialize-diagnostics -emit-dependencies -emit-module -emit-module-path /Users/admin/builder/spi-builder-workspace/.derivedData/Build/Intermediates.noindex/YPersistence.build/Debug-iphoneos/YPersistence.build/Objects-normal/arm64/YPersistence.swiftmodule -validate-clang-modules-once -clang-build-session-file /Users/admin/builder/spi-builder-workspace/.derivedData/ModuleCache.noindex/Session.modulevalidation -Xcc -I/Users/admin/builder/spi-builder-workspace/.derivedData/Build/Intermediates.noindex/YPersistence.build/Debug-iphoneos/YPersistence.build/swift-overrides.hmap -emit-const-values -Xfrontend -const-gather-protocols-file -Xfrontend /Users/admin/builder/spi-builder-workspace/.derivedData/Build/Intermediates.noindex/YPersistence.build/Debug-iphoneos/YPersistence.build/Objects-normal/arm64/YPersistence_const_extract_protocols.json -Xcc -I/Users/admin/builder/spi-builder-workspace/.derivedData/Build/Products/Debug-iphoneos/include -Xcc -I/Users/admin/builder/spi-builder-workspace/.derivedData/Build/Intermediates.noindex/YPersistence.build/Debug-iphoneos/YPersistence.build/DerivedSources-normal/arm64 -Xcc -I/Users/admin/builder/spi-builder-workspace/.derivedData/Build/Intermediates.noindex/YPersistence.build/Debug-iphoneos/YPersistence.build/DerivedSources/arm64 -Xcc -I/Users/admin/builder/spi-builder-workspace/.derivedData/Build/Intermediates.noindex/YPersistence.build/Debug-iphoneos/YPersistence.build/DerivedSources -Xcc -DSWIFT_PACKAGE -Xcc -DDEBUG\=1 -emit-objc-header -emit-objc-header-path /Users/admin/builder/spi-builder-workspace/.derivedData/Build/Intermediates.noindex/YPersistence.build/Debug-iphoneos/YPersistence.build/Objects-normal/arm64/YPersistence-Swift.h -working-directory /Users/admin/builder/spi-builder-workspace/.swiftpm/xcode -experimental-emit-module-separately -disable-cmo
Ld /Users/admin/builder/spi-builder-workspace/.derivedData/Build/Products/Debug-iphoneos/YPersistence.o normal (in target 'YPersistence' from project 'YPersistence')
cd /Users/admin/builder/spi-builder-workspace
/Applications/Xcode-16.3.0.app/Contents/Developer/Toolchains/XcodeDefault.xctoolchain/usr/bin/clang -Xlinker -reproducible -target arm64-apple-ios12.0 -r -isysroot /Applications/Xcode-16.3.0.app/Contents/Developer/Platforms/iPhoneOS.platform/Developer/SDKs/iPhoneOS18.4.sdk -O0 -L/Users/admin/builder/spi-builder-workspace/.derivedData/Build/Intermediates.noindex/EagerLinkingTBDs/Debug-iphoneos -L/Users/admin/builder/spi-builder-workspace/.derivedData/Build/Products/Debug-iphoneos -L/Applications/Xcode-16.3.0.app/Contents/Developer/Platforms/iPhoneOS.platform/Developer/usr/lib -F/Users/admin/builder/spi-builder-workspace/.derivedData/Build/Intermediates.noindex/EagerLinkingTBDs/Debug-iphoneos -F/Users/admin/builder/spi-builder-workspace/.derivedData/Build/Products/Debug-iphoneos -iframework /Applications/Xcode-16.3.0.app/Contents/Developer/Platforms/iPhoneOS.platform/Developer/Library/Frameworks -iframework /Applications/Xcode-16.3.0.app/Contents/Developer/Platforms/iPhoneOS.platform/Developer/SDKs/iPhoneOS18.4.sdk/Developer/Library/Frameworks -filelist /Users/admin/builder/spi-builder-workspace/.derivedData/Build/Intermediates.noindex/YPersistence.build/Debug-iphoneos/YPersistence.build/Objects-normal/arm64/YPersistence.LinkFileList -nostdlib -Xlinker -object_path_lto -Xlinker /Users/admin/builder/spi-builder-workspace/.derivedData/Build/Intermediates.noindex/YPersistence.build/Debug-iphoneos/YPersistence.build/Objects-normal/arm64/YPersistence_lto.o -rdynamic -Xlinker -no_deduplicate -Xlinker -debug_variant -Xlinker -dependency_info -Xlinker /Users/admin/builder/spi-builder-workspace/.derivedData/Build/Intermediates.noindex/YPersistence.build/Debug-iphoneos/YPersistence.build/Objects-normal/arm64/YPersistence_dependency_info.dat -fobjc-link-runtime -L/Applications/Xcode-16.3.0.app/Contents/Developer/Toolchains/XcodeDefault.xctoolchain/usr/lib/swift/iphoneos -L/usr/lib/swift -Xlinker -add_ast_path -Xlinker /Users/admin/builder/spi-builder-workspace/.derivedData/Build/Intermediates.noindex/YPersistence.build/Debug-iphoneos/YPersistence.build/Objects-normal/arm64/YPersistence.swiftmodule -o /Users/admin/builder/spi-builder-workspace/.derivedData/Build/Products/Debug-iphoneos/YPersistence.o
Copy /Users/admin/builder/spi-builder-workspace/.derivedData/Build/Products/Debug-iphoneos/YPersistenceTests.swiftmodule/arm64-apple-ios.swiftmodule /Users/admin/builder/spi-builder-workspace/.derivedData/Build/Intermediates.noindex/YPersistence.build/Debug-iphoneos/YPersistenceTests.build/Objects-normal/arm64/YPersistenceTests.swiftmodule (in target 'YPersistenceTests' from project 'YPersistence')
cd /Users/admin/builder/spi-builder-workspace
builtin-copy -exclude .DS_Store -exclude CVS -exclude .svn -exclude .git -exclude .hg -resolve-src-symlinks -rename /Users/admin/builder/spi-builder-workspace/.derivedData/Build/Intermediates.noindex/YPersistence.build/Debug-iphoneos/YPersistenceTests.build/Objects-normal/arm64/YPersistenceTests.swiftmodule /Users/admin/builder/spi-builder-workspace/.derivedData/Build/Products/Debug-iphoneos/YPersistenceTests.swiftmodule/arm64-apple-ios.swiftmodule
Copy /Users/admin/builder/spi-builder-workspace/.derivedData/Build/Products/Debug-iphoneos/YPersistenceTests.swiftmodule/arm64-apple-ios.swiftdoc /Users/admin/builder/spi-builder-workspace/.derivedData/Build/Intermediates.noindex/YPersistence.build/Debug-iphoneos/YPersistenceTests.build/Objects-normal/arm64/YPersistenceTests.swiftdoc (in target 'YPersistenceTests' from project 'YPersistence')
cd /Users/admin/builder/spi-builder-workspace
builtin-copy -exclude .DS_Store -exclude CVS -exclude .svn -exclude .git -exclude .hg -resolve-src-symlinks -rename /Users/admin/builder/spi-builder-workspace/.derivedData/Build/Intermediates.noindex/YPersistence.build/Debug-iphoneos/YPersistenceTests.build/Objects-normal/arm64/YPersistenceTests.swiftdoc /Users/admin/builder/spi-builder-workspace/.derivedData/Build/Products/Debug-iphoneos/YPersistenceTests.swiftmodule/arm64-apple-ios.swiftdoc
Copy /Users/admin/builder/spi-builder-workspace/.derivedData/Build/Products/Debug-iphoneos/YPersistenceTests.swiftmodule/arm64-apple-ios.abi.json /Users/admin/builder/spi-builder-workspace/.derivedData/Build/Intermediates.noindex/YPersistence.build/Debug-iphoneos/YPersistenceTests.build/Objects-normal/arm64/YPersistenceTests.abi.json (in target 'YPersistenceTests' from project 'YPersistence')
cd /Users/admin/builder/spi-builder-workspace
builtin-copy -exclude .DS_Store -exclude CVS -exclude .svn -exclude .git -exclude .hg -resolve-src-symlinks -rename /Users/admin/builder/spi-builder-workspace/.derivedData/Build/Intermediates.noindex/YPersistence.build/Debug-iphoneos/YPersistenceTests.build/Objects-normal/arm64/YPersistenceTests.abi.json /Users/admin/builder/spi-builder-workspace/.derivedData/Build/Products/Debug-iphoneos/YPersistenceTests.swiftmodule/arm64-apple-ios.abi.json
Copy /Users/admin/builder/spi-builder-workspace/.derivedData/Build/Products/Debug-iphoneos/YPersistenceTests.swiftmodule/Project/arm64-apple-ios.swiftsourceinfo /Users/admin/builder/spi-builder-workspace/.derivedData/Build/Intermediates.noindex/YPersistence.build/Debug-iphoneos/YPersistenceTests.build/Objects-normal/arm64/YPersistenceTests.swiftsourceinfo (in target 'YPersistenceTests' from project 'YPersistence')
cd /Users/admin/builder/spi-builder-workspace
builtin-copy -exclude .DS_Store -exclude CVS -exclude .svn -exclude .git -exclude .hg -resolve-src-symlinks -rename /Users/admin/builder/spi-builder-workspace/.derivedData/Build/Intermediates.noindex/YPersistence.build/Debug-iphoneos/YPersistenceTests.build/Objects-normal/arm64/YPersistenceTests.swiftsourceinfo /Users/admin/builder/spi-builder-workspace/.derivedData/Build/Products/Debug-iphoneos/YPersistenceTests.swiftmodule/Project/arm64-apple-ios.swiftsourceinfo
ExtractAppIntentsMetadata (in target 'YPersistence' from project 'YPersistence')
cd /Users/admin/builder/spi-builder-workspace
/Applications/Xcode-16.3.0.app/Contents/Developer/Toolchains/XcodeDefault.xctoolchain/usr/bin/appintentsmetadataprocessor --toolchain-dir /Applications/Xcode-16.3.0.app/Contents/Developer/Toolchains/XcodeDefault.xctoolchain --module-name YPersistence --sdk-root /Applications/Xcode-16.3.0.app/Contents/Developer/Platforms/iPhoneOS.platform/Developer/SDKs/iPhoneOS18.4.sdk --xcode-version 16E140 --platform-family iOS --deployment-target 12.0 --bundle-identifier spi-builder-workspace.YPersistence --output /Users/admin/builder/spi-builder-workspace/.derivedData/Build/Products/Debug-iphoneos/YPersistence.appintents --target-triple arm64-apple-ios12.0 --binary-file /Users/admin/builder/spi-builder-workspace/.derivedData/Build/Products/Debug-iphoneos/YPersistence.o --dependency-file /Users/admin/builder/spi-builder-workspace/.derivedData/Build/Intermediates.noindex/YPersistence.build/Debug-iphoneos/YPersistence.build/Objects-normal/arm64/YPersistence_dependency_info.dat --stringsdata-file /Users/admin/builder/spi-builder-workspace/.derivedData/Build/Intermediates.noindex/YPersistence.build/Debug-iphoneos/YPersistence.build/Objects-normal/arm64/ExtractedAppShortcutsMetadata.stringsdata --source-file-list /Users/admin/builder/spi-builder-workspace/.derivedData/Build/Intermediates.noindex/YPersistence.build/Debug-iphoneos/YPersistence.build/Objects-normal/arm64/YPersistence.SwiftFileList --metadata-file-list /Users/admin/builder/spi-builder-workspace/.derivedData/Build/Intermediates.noindex/YPersistence.build/Debug-iphoneos/YPersistence.build/YPersistence.DependencyMetadataFileList --static-metadata-file-list /Users/admin/builder/spi-builder-workspace/.derivedData/Build/Intermediates.noindex/YPersistence.build/Debug-iphoneos/YPersistence.build/YPersistence.DependencyStaticMetadataFileList --swift-const-vals-list /Users/admin/builder/spi-builder-workspace/.derivedData/Build/Intermediates.noindex/YPersistence.build/Debug-iphoneos/YPersistence.build/Objects-normal/arm64/YPersistence.SwiftConstValuesFileList --force --compile-time-extraction --deployment-aware-processing --validate-assistant-intents --no-app-shortcuts-localization
2025-04-27 15:08:30.337 appintentsmetadataprocessor[734:4297] Starting appintentsmetadataprocessor export
2025-04-27 15:08:30.386 appintentsmetadataprocessor[734:4297] Extracted no relevant App Intents symbols, skipping writing output
SwiftDriverJobDiscovery normal arm64 Compiling _ManagedFruit.swift, _ManagedGroceryProduct.swift, Fruit.swift (in target 'YPersistenceTests' from project 'YPersistence')
RegisterExecutionPolicyException /Users/admin/builder/spi-builder-workspace/.derivedData/Build/Products/Debug-iphoneos/YPersistence.o (in target 'YPersistence' from project 'YPersistence')
cd /Users/admin/builder/spi-builder-workspace
builtin-RegisterExecutionPolicyException /Users/admin/builder/spi-builder-workspace/.derivedData/Build/Products/Debug-iphoneos/YPersistence.o
ProcessInfoPlistFile /Users/admin/builder/spi-builder-workspace/.derivedData/Build/Products/Debug-iphoneos/YPersistenceTests.xctest/Info.plist /Users/admin/builder/spi-builder-workspace/.derivedData/Build/Intermediates.noindex/YPersistence.build/Debug-iphoneos/YPersistenceTests.build/empty-YPersistenceTests.plist (in target 'YPersistenceTests' from project 'YPersistence')
cd /Users/admin/builder/spi-builder-workspace
builtin-infoPlistUtility /Users/admin/builder/spi-builder-workspace/.derivedData/Build/Intermediates.noindex/YPersistence.build/Debug-iphoneos/YPersistenceTests.build/empty-YPersistenceTests.plist -producttype com.apple.product-type.bundle.unit-test -expandbuildsettings -format binary -platform iphoneos -requiredArchitecture arm64 -o /Users/admin/builder/spi-builder-workspace/.derivedData/Build/Products/Debug-iphoneos/YPersistenceTests.xctest/Info.plist
CpResource /Users/admin/builder/spi-builder-workspace/.derivedData/Build/Products/Debug-iphoneos/YPersistenceTests.xctest/YPersistence_YPersistenceTests.bundle /Users/admin/builder/spi-builder-workspace/.derivedData/Build/Products/Debug-iphoneos/YPersistence_YPersistenceTests.bundle (in target 'YPersistenceTests' from project 'YPersistence')
cd /Users/admin/builder/spi-builder-workspace
builtin-copy -exclude .DS_Store -exclude CVS -exclude .svn -exclude .git -exclude .hg -resolve-src-symlinks /Users/admin/builder/spi-builder-workspace/.derivedData/Build/Products/Debug-iphoneos/YPersistence_YPersistenceTests.bundle /Users/admin/builder/spi-builder-workspace/.derivedData/Build/Products/Debug-iphoneos/YPersistenceTests.xctest
SwiftDriverJobDiscovery normal arm64 Compiling SortColumnTests.swift, SortInfoTests.swift (in target 'YPersistenceTests' from project 'YPersistence')
** BUILD FAILED **
The following build commands failed:
SwiftCompile normal arm64 /Users/admin/builder/spi-builder-workspace/Tests/YPersistenceTests/Manager/PersistenceManagerBaseTests.swift (in target 'YPersistenceTests' from project 'YPersistence')
SwiftCompile normal arm64 Compiling\ PersistenceManagerBaseTests.swift,\ PersistenceManagerTests.swift /Users/admin/builder/spi-builder-workspace/Tests/YPersistenceTests/Manager/PersistenceManagerBaseTests.swift /Users/admin/builder/spi-builder-workspace/Tests/YPersistenceTests/Manager/PersistenceManagerTests.swift (in target 'YPersistenceTests' from project 'YPersistence')
Building workspace spi-builder-workspace with scheme YPersistence
(3 failures)
Command line invocation:
/Applications/Xcode-16.3.0.app/Contents/Developer/usr/bin/xcodebuild -IDEClonedSourcePackagesDirPathOverride=/Users/admin/builder/spi-builder-workspace/.dependencies -resolvePackageDependencies
Resolve Package Graph
Resolved source packages:
YPersistence: /Users/admin/builder/spi-builder-workspace
resolved source packages: YPersistence
{
"dependencies" : [
],
"manifest_display_name" : "YPersistence",
"name" : "YPersistence",
"path" : "/Users/admin/builder/spi-builder-workspace",
"platforms" : [
],
"products" : [
{
"name" : "YPersistence",
"targets" : [
"YPersistence"
],
"type" : {
"library" : [
"automatic"
]
}
}
],
"targets" : [
{
"c99name" : "YPersistenceTests",
"module_type" : "SwiftTarget",
"name" : "YPersistenceTests",
"path" : "Tests/YPersistenceTests",
"sources" : [
"DataModel/Human/ManagedFruit.swift",
"DataModel/Human/ManagedGroceryProduct.swift",
"DataModel/Machine/_ManagedFruit.swift",
"DataModel/Machine/_ManagedGroceryProduct.swift",
"DataModel/Mocks/Fruit.swift",
"DataModel/Mocks/GroceryProduct.swift",
"Extensions/DispatchQueue+executeOnMainTests.swift",
"Extensions/NSManagedObjectContext+SaveChangesTests.swift",
"Extensions/NSManagedObjectModel+initTests.swift",
"Manager/PersistenceManager+BulkDeleteTests.swift",
"Manager/PersistenceManager+ClearTests.swift",
"Manager/PersistenceManager+DeleteTests.swift",
"Manager/PersistenceManager+FetchTests.swift",
"Manager/PersistenceManager+SaveTests.swift",
"Manager/PersistenceManager+SyncTests.swift",
"Manager/PersistenceManagerBaseTests.swift",
"Manager/PersistenceManagerTests.swift",
"Protocols/DataRecordTests.swift",
"Protocols/SyncRecordTests.swift",
"SortColumnTests.swift",
"SortInfoTests.swift"
],
"target_dependencies" : [
"YPersistence"
],
"type" : "test"
},
{
"c99name" : "YPersistence",
"module_type" : "SwiftTarget",
"name" : "YPersistence",
"path" : "Sources/YPersistence",
"product_memberships" : [
"YPersistence"
],
"sources" : [
"Extensions/DispatchQueue+executeOnMain.swift",
"Extensions/NSManagedObjectContext+SaveChanges.swift",
"Extensions/NSManagedObjectModel+init.swift",
"Manager/PersistenceManager+BulkDelete.swift",
"Manager/PersistenceManager+Clear.swift",
"Manager/PersistenceManager+Delete.swift",
"Manager/PersistenceManager+Fetch.swift",
"Manager/PersistenceManager+Save.swift",
"Manager/PersistenceManager+Sync.swift",
"Manager/PersistenceManager.swift",
"Protocols/CoreModel.swift",
"Protocols/DataRecord.swift",
"Protocols/ModelRepresentable.swift",
"Protocols/RecordFromModel.swift",
"Protocols/RecordToModel.swift",
"Protocols/SyncRecord.swift",
"SortColumn.swift",
"SortInfo.swift"
],
"type" : "library"
}
],
"tools_version" : "5.5"
}
{
"workspace" : {
"name" : "spi-builder-workspace",
"schemes" : [
"YPersistence"
]
}
}
Running build ...
env DEVELOPER_DIR=/Applications/Xcode-16.3.0.app xcrun xcodebuild -IDEClonedSourcePackagesDirPathOverride=$PWD/.dependencies -skipMacroValidation -skipPackagePluginValidation -derivedDataPath $PWD/.derivedData build -scheme YPersistence -destination generic/platform=iOS
Command line invocation:
/Applications/Xcode-16.3.0.app/Contents/Developer/usr/bin/xcodebuild -IDEClonedSourcePackagesDirPathOverride=/Users/admin/builder/spi-builder-workspace/.dependencies -skipMacroValidation -skipPackagePluginValidation -derivedDataPath /Users/admin/builder/spi-builder-workspace/.derivedData build -scheme YPersistence -destination generic/platform=iOS
Resolve Package Graph
Resolved source packages:
YPersistence: /Users/admin/builder/spi-builder-workspace
ComputePackagePrebuildTargetDependencyGraph
Prepare packages
CreateBuildRequest
SendProjectDescription
CreateBuildOperation
ComputeTargetDependencyGraph
note: Building targets in dependency order
note: Target dependency graph (4 targets)
Target 'YPersistenceTests' in project 'YPersistence'
➜ Explicit dependency on target 'YPersistence_YPersistenceTests' in project 'YPersistence'
➜ Explicit dependency on target 'YPersistence' in project 'YPersistence'
Target 'YPersistence_YPersistenceTests' in project 'YPersistence' (no dependencies)
Target 'YPersistence' in project 'YPersistence'
➜ Explicit dependency on target 'YPersistence' in project 'YPersistence'
Target 'YPersistence' in project 'YPersistence' (no dependencies)
GatherProvisioningInputs
CreateBuildDescription
ExecuteExternalTool /Applications/Xcode-16.3.0.app/Contents/Developer/Toolchains/XcodeDefault.xctoolchain/usr/bin/swiftc --version
ExecuteExternalTool /Applications/Xcode-16.3.0.app/Contents/Developer/Toolchains/XcodeDefault.xctoolchain/usr/bin/clang -v -E -dM -isysroot /Applications/Xcode-16.3.0.app/Contents/Developer/Platforms/iPhoneOS.platform/Developer/SDKs/iPhoneOS18.4.sdk -x c -c /dev/null
ExecuteExternalTool /Applications/Xcode-16.3.0.app/Contents/Developer/usr/bin/momc --dry-run --action generate --swift-version 5 --sdkroot /Applications/Xcode-16.3.0.app/Contents/Developer/Platforms/iPhoneOS.platform/Developer/SDKs/iPhoneOS18.4.sdk --iphoneos-deployment-target 13.0 --module YPersistenceTests /Users/admin/builder/spi-builder-workspace/Tests/YPersistenceTests/Assets/YPersistence.xcdatamodeld /Users/admin/builder/spi-builder-workspace/.derivedData/Build/Intermediates.noindex/YPersistence.build/Debug-iphoneos/YPersistenceTests.build/DerivedSources/CoreDataGenerated/YPersistence
ExecuteExternalTool /Applications/Xcode-16.3.0.app/Contents/Developer/Toolchains/XcodeDefault.xctoolchain/usr/bin/ld -version_details
Build description signature: 3814cb2682d51e3b1d249ad308cfa4e6
Build description path: /Users/admin/builder/spi-builder-workspace/.derivedData/Build/Intermediates.noindex/XCBuildData/3814cb2682d51e3b1d249ad308cfa4e6.xcbuilddata
ClangStatCache /Applications/Xcode-16.3.0.app/Contents/Developer/Toolchains/XcodeDefault.xctoolchain/usr/bin/clang-stat-cache /Applications/Xcode-16.3.0.app/Contents/Developer/Platforms/iPhoneOS.platform/Developer/SDKs/iPhoneOS18.4.sdk /Users/admin/builder/spi-builder-workspace/.derivedData/SDKStatCaches.noindex/iphoneos18.4-22E235-339d34bc69d7fc736c3220795c36f340.sdkstatcache
cd /Users/admin/builder/spi-builder-workspace/.swiftpm/xcode
/Applications/Xcode-16.3.0.app/Contents/Developer/Toolchains/XcodeDefault.xctoolchain/usr/bin/clang-stat-cache /Applications/Xcode-16.3.0.app/Contents/Developer/Platforms/iPhoneOS.platform/Developer/SDKs/iPhoneOS18.4.sdk -o /Users/admin/builder/spi-builder-workspace/.derivedData/SDKStatCaches.noindex/iphoneos18.4-22E235-339d34bc69d7fc736c3220795c36f340.sdkstatcache
ProcessInfoPlistFile /Users/admin/builder/spi-builder-workspace/.derivedData/Build/Products/Debug-iphoneos/YPersistence_YPersistenceTests.bundle/Info.plist /Users/admin/builder/spi-builder-workspace/.derivedData/Build/Intermediates.noindex/YPersistence.build/Debug-iphoneos/YPersistence_YPersistenceTests.build/empty-YPersistence_YPersistenceTests.plist (in target 'YPersistence_YPersistenceTests' from project 'YPersistence')
cd /Users/admin/builder/spi-builder-workspace
builtin-infoPlistUtility /Users/admin/builder/spi-builder-workspace/.derivedData/Build/Intermediates.noindex/YPersistence.build/Debug-iphoneos/YPersistence_YPersistenceTests.build/empty-YPersistence_YPersistenceTests.plist -producttype com.apple.product-type.bundle -expandbuildsettings -format binary -platform iphoneos -requiredArchitecture arm64 -o /Users/admin/builder/spi-builder-workspace/.derivedData/Build/Products/Debug-iphoneos/YPersistence_YPersistenceTests.bundle/Info.plist
SwiftDriver YPersistence normal arm64 com.apple.xcode.tools.swift.compiler (in target 'YPersistence' from project 'YPersistence')
cd /Users/admin/builder/spi-builder-workspace/.swiftpm/xcode
builtin-SwiftDriver -- /Applications/Xcode-16.3.0.app/Contents/Developer/Toolchains/XcodeDefault.xctoolchain/usr/bin/swiftc -module-name YPersistence -Onone -enforce-exclusivity\=checked @/Users/admin/builder/spi-builder-workspace/.derivedData/Build/Intermediates.noindex/YPersistence.build/Debug-iphoneos/YPersistence.build/Objects-normal/arm64/YPersistence.SwiftFileList -DSWIFT_PACKAGE -DDEBUG -DXcode -plugin-path /Applications/Xcode-16.3.0.app/Contents/Developer/Toolchains/XcodeDefault.xctoolchain/usr/lib/swift/host/plugins/testing -enable-experimental-feature DebugDescriptionMacro -sdk /Applications/Xcode-16.3.0.app/Contents/Developer/Platforms/iPhoneOS.platform/Developer/SDKs/iPhoneOS18.4.sdk -target arm64-apple-ios12.0 -g -module-cache-path /Users/admin/builder/spi-builder-workspace/.derivedData/ModuleCache.noindex -Xfrontend -serialize-debugging-options -profile-coverage-mapping -profile-generate -enable-testing -index-store-path /Users/admin/builder/spi-builder-workspace/.derivedData/Index.noindex/DataStore -swift-version 5 -I /Users/admin/builder/spi-builder-workspace/.derivedData/Build/Products/Debug-iphoneos -I /Applications/Xcode-16.3.0.app/Contents/Developer/Platforms/iPhoneOS.platform/Developer/usr/lib -F /Users/admin/builder/spi-builder-workspace/.derivedData/Build/Products/Debug-iphoneos -F /Applications/Xcode-16.3.0.app/Contents/Developer/Platforms/iPhoneOS.platform/Developer/Library/Frameworks -F /Applications/Xcode-16.3.0.app/Contents/Developer/Platforms/iPhoneOS.platform/Developer/SDKs/iPhoneOS18.4.sdk/Developer/Library/Frameworks -c -j10 -enable-batch-mode -incremental -Xcc -ivfsstatcache -Xcc /Users/admin/builder/spi-builder-workspace/.derivedData/SDKStatCaches.noindex/iphoneos18.4-22E235-339d34bc69d7fc736c3220795c36f340.sdkstatcache -output-file-map /Users/admin/builder/spi-builder-workspace/.derivedData/Build/Intermediates.noindex/YPersistence.build/Debug-iphoneos/YPersistence.build/Objects-normal/arm64/YPersistence-OutputFileMap.json -use-frontend-parseable-output -save-temps -no-color-diagnostics -serialize-diagnostics -emit-dependencies -emit-module -emit-module-path /Users/admin/builder/spi-builder-workspace/.derivedData/Build/Intermediates.noindex/YPersistence.build/Debug-iphoneos/YPersistence.build/Objects-normal/arm64/YPersistence.swiftmodule -validate-clang-modules-once -clang-build-session-file /Users/admin/builder/spi-builder-workspace/.derivedData/ModuleCache.noindex/Session.modulevalidation -Xcc -I/Users/admin/builder/spi-builder-workspace/.derivedData/Build/Intermediates.noindex/YPersistence.build/Debug-iphoneos/YPersistence.build/swift-overrides.hmap -emit-const-values -Xfrontend -const-gather-protocols-file -Xfrontend /Users/admin/builder/spi-builder-workspace/.derivedData/Build/Intermediates.noindex/YPersistence.build/Debug-iphoneos/YPersistence.build/Objects-normal/arm64/YPersistence_const_extract_protocols.json -Xcc -I/Users/admin/builder/spi-builder-workspace/.derivedData/Build/Products/Debug-iphoneos/include -Xcc -I/Users/admin/builder/spi-builder-workspace/.derivedData/Build/Intermediates.noindex/YPersistence.build/Debug-iphoneos/YPersistence.build/DerivedSources-normal/arm64 -Xcc -I/Users/admin/builder/spi-builder-workspace/.derivedData/Build/Intermediates.noindex/YPersistence.build/Debug-iphoneos/YPersistence.build/DerivedSources/arm64 -Xcc -I/Users/admin/builder/spi-builder-workspace/.derivedData/Build/Intermediates.noindex/YPersistence.build/Debug-iphoneos/YPersistence.build/DerivedSources -Xcc -DSWIFT_PACKAGE -Xcc -DDEBUG\=1 -emit-objc-header -emit-objc-header-path /Users/admin/builder/spi-builder-workspace/.derivedData/Build/Intermediates.noindex/YPersistence.build/Debug-iphoneos/YPersistence.build/Objects-normal/arm64/YPersistence-Swift.h -working-directory /Users/admin/builder/spi-builder-workspace/.swiftpm/xcode -experimental-emit-module-separately -disable-cmo
SwiftCompile normal arm64 Compiling\ NSManagedObjectModel+init.swift,\ PersistenceManager+BulkDelete.swift /Users/admin/builder/spi-builder-workspace/Sources/YPersistence/Extensions/NSManagedObjectModel+init.swift /Users/admin/builder/spi-builder-workspace/Sources/YPersistence/Manager/PersistenceManager+BulkDelete.swift (in target 'YPersistence' from project 'YPersistence')
SwiftCompile normal arm64 /Users/admin/builder/spi-builder-workspace/Sources/YPersistence/Extensions/NSManagedObjectModel+init.swift (in target 'YPersistence' from project 'YPersistence')
cd /Users/admin/builder/spi-builder-workspace/.swiftpm/xcode
SwiftCompile normal arm64 /Users/admin/builder/spi-builder-workspace/Sources/YPersistence/Manager/PersistenceManager+BulkDelete.swift (in target 'YPersistence' from project 'YPersistence')
cd /Users/admin/builder/spi-builder-workspace/.swiftpm/xcode
SwiftCompile normal arm64 Compiling\ PersistenceManager+Fetch.swift,\ PersistenceManager+Save.swift /Users/admin/builder/spi-builder-workspace/Sources/YPersistence/Manager/PersistenceManager+Fetch.swift /Users/admin/builder/spi-builder-workspace/Sources/YPersistence/Manager/PersistenceManager+Save.swift (in target 'YPersistence' from project 'YPersistence')
SwiftCompile normal arm64 /Users/admin/builder/spi-builder-workspace/Sources/YPersistence/Manager/PersistenceManager+Fetch.swift (in target 'YPersistence' from project 'YPersistence')
cd /Users/admin/builder/spi-builder-workspace/.swiftpm/xcode
SwiftCompile normal arm64 /Users/admin/builder/spi-builder-workspace/Sources/YPersistence/Manager/PersistenceManager+Save.swift (in target 'YPersistence' from project 'YPersistence')
cd /Users/admin/builder/spi-builder-workspace/.swiftpm/xcode
SwiftCompile normal arm64 Compiling\ DispatchQueue+executeOnMain.swift,\ NSManagedObjectContext+SaveChanges.swift /Users/admin/builder/spi-builder-workspace/Sources/YPersistence/Extensions/DispatchQueue+executeOnMain.swift /Users/admin/builder/spi-builder-workspace/Sources/YPersistence/Extensions/NSManagedObjectContext+SaveChanges.swift (in target 'YPersistence' from project 'YPersistence')
SwiftCompile normal arm64 /Users/admin/builder/spi-builder-workspace/Sources/YPersistence/Extensions/DispatchQueue+executeOnMain.swift (in target 'YPersistence' from project 'YPersistence')
cd /Users/admin/builder/spi-builder-workspace/.swiftpm/xcode
SwiftCompile normal arm64 /Users/admin/builder/spi-builder-workspace/Sources/YPersistence/Extensions/NSManagedObjectContext+SaveChanges.swift (in target 'YPersistence' from project 'YPersistence')
cd /Users/admin/builder/spi-builder-workspace/.swiftpm/xcode
SwiftCompile normal arm64 Compiling\ PersistenceManager+Clear.swift,\ PersistenceManager+Delete.swift /Users/admin/builder/spi-builder-workspace/Sources/YPersistence/Manager/PersistenceManager+Clear.swift /Users/admin/builder/spi-builder-workspace/Sources/YPersistence/Manager/PersistenceManager+Delete.swift (in target 'YPersistence' from project 'YPersistence')
SwiftCompile normal arm64 /Users/admin/builder/spi-builder-workspace/Sources/YPersistence/Manager/PersistenceManager+Clear.swift (in target 'YPersistence' from project 'YPersistence')
cd /Users/admin/builder/spi-builder-workspace/.swiftpm/xcode
SwiftCompile normal arm64 /Users/admin/builder/spi-builder-workspace/Sources/YPersistence/Manager/PersistenceManager+Delete.swift (in target 'YPersistence' from project 'YPersistence')
cd /Users/admin/builder/spi-builder-workspace/.swiftpm/xcode
SwiftCompile normal arm64 Compiling\ CoreModel.swift,\ DataRecord.swift /Users/admin/builder/spi-builder-workspace/Sources/YPersistence/Protocols/CoreModel.swift /Users/admin/builder/spi-builder-workspace/Sources/YPersistence/Protocols/DataRecord.swift (in target 'YPersistence' from project 'YPersistence')
SwiftCompile normal arm64 /Users/admin/builder/spi-builder-workspace/Sources/YPersistence/Protocols/CoreModel.swift (in target 'YPersistence' from project 'YPersistence')
cd /Users/admin/builder/spi-builder-workspace/.swiftpm/xcode
SwiftCompile normal arm64 /Users/admin/builder/spi-builder-workspace/Sources/YPersistence/Protocols/DataRecord.swift (in target 'YPersistence' from project 'YPersistence')
cd /Users/admin/builder/spi-builder-workspace/.swiftpm/xcode
SwiftCompile normal arm64 Compiling\ ModelRepresentable.swift,\ RecordFromModel.swift /Users/admin/builder/spi-builder-workspace/Sources/YPersistence/Protocols/ModelRepresentable.swift /Users/admin/builder/spi-builder-workspace/Sources/YPersistence/Protocols/RecordFromModel.swift (in target 'YPersistence' from project 'YPersistence')
SwiftCompile normal arm64 /Users/admin/builder/spi-builder-workspace/Sources/YPersistence/Protocols/ModelRepresentable.swift (in target 'YPersistence' from project 'YPersistence')
cd /Users/admin/builder/spi-builder-workspace/.swiftpm/xcode
SwiftCompile normal arm64 /Users/admin/builder/spi-builder-workspace/Sources/YPersistence/Protocols/RecordFromModel.swift (in target 'YPersistence' from project 'YPersistence')
cd /Users/admin/builder/spi-builder-workspace/.swiftpm/xcode
SwiftCompile normal arm64 Compiling\ RecordToModel.swift,\ SyncRecord.swift /Users/admin/builder/spi-builder-workspace/Sources/YPersistence/Protocols/RecordToModel.swift /Users/admin/builder/spi-builder-workspace/Sources/YPersistence/Protocols/SyncRecord.swift (in target 'YPersistence' from project 'YPersistence')
SwiftCompile normal arm64 /Users/admin/builder/spi-builder-workspace/Sources/YPersistence/Protocols/RecordToModel.swift (in target 'YPersistence' from project 'YPersistence')
cd /Users/admin/builder/spi-builder-workspace/.swiftpm/xcode
SwiftCompile normal arm64 /Users/admin/builder/spi-builder-workspace/Sources/YPersistence/Protocols/SyncRecord.swift (in target 'YPersistence' from project 'YPersistence')
cd /Users/admin/builder/spi-builder-workspace/.swiftpm/xcode
SwiftCompile normal arm64 Compiling\ SortInfo.swift /Users/admin/builder/spi-builder-workspace/Sources/YPersistence/SortInfo.swift (in target 'YPersistence' from project 'YPersistence')
SwiftCompile normal arm64 /Users/admin/builder/spi-builder-workspace/Sources/YPersistence/SortInfo.swift (in target 'YPersistence' from project 'YPersistence')
cd /Users/admin/builder/spi-builder-workspace/.swiftpm/xcode
SwiftEmitModule normal arm64 Emitting\ module\ for\ YPersistence (in target 'YPersistence' from project 'YPersistence')
EmitSwiftModule normal arm64 (in target 'YPersistence' from project 'YPersistence')
cd /Users/admin/builder/spi-builder-workspace/.swiftpm/xcode
SwiftCompile normal arm64 Compiling\ SortColumn.swift /Users/admin/builder/spi-builder-workspace/Sources/YPersistence/SortColumn.swift (in target 'YPersistence' from project 'YPersistence')
SwiftCompile normal arm64 /Users/admin/builder/spi-builder-workspace/Sources/YPersistence/SortColumn.swift (in target 'YPersistence' from project 'YPersistence')
cd /Users/admin/builder/spi-builder-workspace/.swiftpm/xcode
SwiftCompile normal arm64 Compiling\ PersistenceManager+Sync.swift,\ PersistenceManager.swift /Users/admin/builder/spi-builder-workspace/Sources/YPersistence/Manager/PersistenceManager+Sync.swift /Users/admin/builder/spi-builder-workspace/Sources/YPersistence/Manager/PersistenceManager.swift (in target 'YPersistence' from project 'YPersistence')
SwiftCompile normal arm64 /Users/admin/builder/spi-builder-workspace/Sources/YPersistence/Manager/PersistenceManager+Sync.swift (in target 'YPersistence' from project 'YPersistence')
cd /Users/admin/builder/spi-builder-workspace/.swiftpm/xcode
SwiftCompile normal arm64 /Users/admin/builder/spi-builder-workspace/Sources/YPersistence/Manager/PersistenceManager.swift (in target 'YPersistence' from project 'YPersistence')
cd /Users/admin/builder/spi-builder-workspace/.swiftpm/xcode
SwiftDriverJobDiscovery normal arm64 Compiling CoreModel.swift, DataRecord.swift (in target 'YPersistence' from project 'YPersistence')
SwiftDriverJobDiscovery normal arm64 Compiling ModelRepresentable.swift, RecordFromModel.swift (in target 'YPersistence' from project 'YPersistence')
SwiftDriverJobDiscovery normal arm64 Compiling SortInfo.swift (in target 'YPersistence' from project 'YPersistence')
SwiftDriverJobDiscovery normal arm64 Compiling SortColumn.swift (in target 'YPersistence' from project 'YPersistence')
SwiftDriverJobDiscovery normal arm64 Compiling RecordToModel.swift, SyncRecord.swift (in target 'YPersistence' from project 'YPersistence')
SwiftDriverJobDiscovery normal arm64 Compiling DispatchQueue+executeOnMain.swift, NSManagedObjectContext+SaveChanges.swift (in target 'YPersistence' from project 'YPersistence')
SwiftDriverJobDiscovery normal arm64 Compiling NSManagedObjectModel+init.swift, PersistenceManager+BulkDelete.swift (in target 'YPersistence' from project 'YPersistence')
SwiftDriverJobDiscovery normal arm64 Emitting module for YPersistence (in target 'YPersistence' from project 'YPersistence')
SwiftDriver\ Compilation\ Requirements YPersistence normal arm64 com.apple.xcode.tools.swift.compiler (in target 'YPersistence' from project 'YPersistence')
cd /Users/admin/builder/spi-builder-workspace/.swiftpm/xcode
builtin-Swift-Compilation-Requirements -- /Applications/Xcode-16.3.0.app/Contents/Developer/Toolchains/XcodeDefault.xctoolchain/usr/bin/swiftc -module-name YPersistence -Onone -enforce-exclusivity\=checked @/Users/admin/builder/spi-builder-workspace/.derivedData/Build/Intermediates.noindex/YPersistence.build/Debug-iphoneos/YPersistence.build/Objects-normal/arm64/YPersistence.SwiftFileList -DSWIFT_PACKAGE -DDEBUG -DXcode -plugin-path /Applications/Xcode-16.3.0.app/Contents/Developer/Toolchains/XcodeDefault.xctoolchain/usr/lib/swift/host/plugins/testing -enable-experimental-feature DebugDescriptionMacro -sdk /Applications/Xcode-16.3.0.app/Contents/Developer/Platforms/iPhoneOS.platform/Developer/SDKs/iPhoneOS18.4.sdk -target arm64-apple-ios12.0 -g -module-cache-path /Users/admin/builder/spi-builder-workspace/.derivedData/ModuleCache.noindex -Xfrontend -serialize-debugging-options -profile-coverage-mapping -profile-generate -enable-testing -index-store-path /Users/admin/builder/spi-builder-workspace/.derivedData/Index.noindex/DataStore -swift-version 5 -I /Users/admin/builder/spi-builder-workspace/.derivedData/Build/Products/Debug-iphoneos -I /Applications/Xcode-16.3.0.app/Contents/Developer/Platforms/iPhoneOS.platform/Developer/usr/lib -F /Users/admin/builder/spi-builder-workspace/.derivedData/Build/Products/Debug-iphoneos -F /Applications/Xcode-16.3.0.app/Contents/Developer/Platforms/iPhoneOS.platform/Developer/Library/Frameworks -F /Applications/Xcode-16.3.0.app/Contents/Developer/Platforms/iPhoneOS.platform/Developer/SDKs/iPhoneOS18.4.sdk/Developer/Library/Frameworks -c -j10 -enable-batch-mode -incremental -Xcc -ivfsstatcache -Xcc /Users/admin/builder/spi-builder-workspace/.derivedData/SDKStatCaches.noindex/iphoneos18.4-22E235-339d34bc69d7fc736c3220795c36f340.sdkstatcache -output-file-map /Users/admin/builder/spi-builder-workspace/.derivedData/Build/Intermediates.noindex/YPersistence.build/Debug-iphoneos/YPersistence.build/Objects-normal/arm64/YPersistence-OutputFileMap.json -use-frontend-parseable-output -save-temps -no-color-diagnostics -serialize-diagnostics -emit-dependencies -emit-module -emit-module-path /Users/admin/builder/spi-builder-workspace/.derivedData/Build/Intermediates.noindex/YPersistence.build/Debug-iphoneos/YPersistence.build/Objects-normal/arm64/YPersistence.swiftmodule -validate-clang-modules-once -clang-build-session-file /Users/admin/builder/spi-builder-workspace/.derivedData/ModuleCache.noindex/Session.modulevalidation -Xcc -I/Users/admin/builder/spi-builder-workspace/.derivedData/Build/Intermediates.noindex/YPersistence.build/Debug-iphoneos/YPersistence.build/swift-overrides.hmap -emit-const-values -Xfrontend -const-gather-protocols-file -Xfrontend /Users/admin/builder/spi-builder-workspace/.derivedData/Build/Intermediates.noindex/YPersistence.build/Debug-iphoneos/YPersistence.build/Objects-normal/arm64/YPersistence_const_extract_protocols.json -Xcc -I/Users/admin/builder/spi-builder-workspace/.derivedData/Build/Products/Debug-iphoneos/include -Xcc -I/Users/admin/builder/spi-builder-workspace/.derivedData/Build/Intermediates.noindex/YPersistence.build/Debug-iphoneos/YPersistence.build/DerivedSources-normal/arm64 -Xcc -I/Users/admin/builder/spi-builder-workspace/.derivedData/Build/Intermediates.noindex/YPersistence.build/Debug-iphoneos/YPersistence.build/DerivedSources/arm64 -Xcc -I/Users/admin/builder/spi-builder-workspace/.derivedData/Build/Intermediates.noindex/YPersistence.build/Debug-iphoneos/YPersistence.build/DerivedSources -Xcc -DSWIFT_PACKAGE -Xcc -DDEBUG\=1 -emit-objc-header -emit-objc-header-path /Users/admin/builder/spi-builder-workspace/.derivedData/Build/Intermediates.noindex/YPersistence.build/Debug-iphoneos/YPersistence.build/Objects-normal/arm64/YPersistence-Swift.h -working-directory /Users/admin/builder/spi-builder-workspace/.swiftpm/xcode -experimental-emit-module-separately -disable-cmo
Copy /Users/admin/builder/spi-builder-workspace/.derivedData/Build/Products/Debug-iphoneos/YPersistence.swiftmodule/arm64-apple-ios.abi.json /Users/admin/builder/spi-builder-workspace/.derivedData/Build/Intermediates.noindex/YPersistence.build/Debug-iphoneos/YPersistence.build/Objects-normal/arm64/YPersistence.abi.json (in target 'YPersistence' from project 'YPersistence')
cd /Users/admin/builder/spi-builder-workspace
builtin-copy -exclude .DS_Store -exclude CVS -exclude .svn -exclude .git -exclude .hg -resolve-src-symlinks -rename /Users/admin/builder/spi-builder-workspace/.derivedData/Build/Intermediates.noindex/YPersistence.build/Debug-iphoneos/YPersistence.build/Objects-normal/arm64/YPersistence.abi.json /Users/admin/builder/spi-builder-workspace/.derivedData/Build/Products/Debug-iphoneos/YPersistence.swiftmodule/arm64-apple-ios.abi.json
SwiftDriverJobDiscovery normal arm64 Compiling PersistenceManager+Clear.swift, PersistenceManager+Delete.swift (in target 'YPersistence' from project 'YPersistence')
SwiftDriver YPersistenceTests normal arm64 com.apple.xcode.tools.swift.compiler (in target 'YPersistenceTests' from project 'YPersistence')
cd /Users/admin/builder/spi-builder-workspace/.swiftpm/xcode
builtin-SwiftDriver -- /Applications/Xcode-16.3.0.app/Contents/Developer/Toolchains/XcodeDefault.xctoolchain/usr/bin/swiftc -module-name YPersistenceTests -Onone -enforce-exclusivity\=checked @/Users/admin/builder/spi-builder-workspace/.derivedData/Build/Intermediates.noindex/YPersistence.build/Debug-iphoneos/YPersistenceTests.build/Objects-normal/arm64/YPersistenceTests.SwiftFileList -DSWIFT_PACKAGE -DDEBUG -DXcode -plugin-path /Applications/Xcode-16.3.0.app/Contents/Developer/Toolchains/XcodeDefault.xctoolchain/usr/lib/swift/host/plugins/testing -enable-experimental-feature DebugDescriptionMacro -sdk /Applications/Xcode-16.3.0.app/Contents/Developer/Platforms/iPhoneOS.platform/Developer/SDKs/iPhoneOS18.4.sdk -target arm64-apple-ios13.0 -g -module-cache-path /Users/admin/builder/spi-builder-workspace/.derivedData/ModuleCache.noindex -Xfrontend -serialize-debugging-options -profile-coverage-mapping -profile-generate -enable-testing -index-store-path /Users/admin/builder/spi-builder-workspace/.derivedData/Index.noindex/DataStore -swift-version 5 -I /Users/admin/builder/spi-builder-workspace/.derivedData/Build/Products/Debug-iphoneos -I /Applications/Xcode-16.3.0.app/Contents/Developer/Platforms/iPhoneOS.platform/Developer/usr/lib -F /Users/admin/builder/spi-builder-workspace/.derivedData/Build/Products/Debug-iphoneos/PackageFrameworks -F /Users/admin/builder/spi-builder-workspace/.derivedData/Build/Products/Debug-iphoneos -F /Applications/Xcode-16.3.0.app/Contents/Developer/Platforms/iPhoneOS.platform/Developer/Library/Frameworks -F /Applications/Xcode-16.3.0.app/Contents/Developer/Platforms/iPhoneOS.platform/Developer/SDKs/iPhoneOS18.4.sdk/Developer/Library/Frameworks -c -j10 -enable-batch-mode -incremental -Xcc -ivfsstatcache -Xcc /Users/admin/builder/spi-builder-workspace/.derivedData/SDKStatCaches.noindex/iphoneos18.4-22E235-339d34bc69d7fc736c3220795c36f340.sdkstatcache -output-file-map /Users/admin/builder/spi-builder-workspace/.derivedData/Build/Intermediates.noindex/YPersistence.build/Debug-iphoneos/YPersistenceTests.build/Objects-normal/arm64/YPersistenceTests-OutputFileMap.json -use-frontend-parseable-output -save-temps -no-color-diagnostics -serialize-diagnostics -emit-dependencies -emit-module -emit-module-path /Users/admin/builder/spi-builder-workspace/.derivedData/Build/Intermediates.noindex/YPersistence.build/Debug-iphoneos/YPersistenceTests.build/Objects-normal/arm64/YPersistenceTests.swiftmodule -validate-clang-modules-once -clang-build-session-file /Users/admin/builder/spi-builder-workspace/.derivedData/ModuleCache.noindex/Session.modulevalidation -emit-const-values -Xfrontend -const-gather-protocols-file -Xfrontend /Users/admin/builder/spi-builder-workspace/.derivedData/Build/Intermediates.noindex/YPersistence.build/Debug-iphoneos/YPersistenceTests.build/Objects-normal/arm64/YPersistenceTests_const_extract_protocols.json -Xcc -I/Users/admin/builder/spi-builder-workspace/.derivedData/Build/Products/Debug-iphoneos/include -Xcc -I/Users/admin/builder/spi-builder-workspace/.derivedData/Build/Intermediates.noindex/YPersistence.build/Debug-iphoneos/YPersistenceTests.build/DerivedSources-normal/arm64 -Xcc -I/Users/admin/builder/spi-builder-workspace/.derivedData/Build/Intermediates.noindex/YPersistence.build/Debug-iphoneos/YPersistenceTests.build/DerivedSources/arm64 -Xcc -I/Users/admin/builder/spi-builder-workspace/.derivedData/Build/Intermediates.noindex/YPersistence.build/Debug-iphoneos/YPersistenceTests.build/DerivedSources -Xcc -DSWIFT_PACKAGE -Xcc -DDEBUG\=1 -working-directory /Users/admin/builder/spi-builder-workspace/.swiftpm/xcode -experimental-emit-module-separately -disable-cmo
SwiftCompile normal arm64 Compiling\ resource_bundle_accessor.swift,\ ManagedFruit.swift,\ ManagedGroceryProduct.swift /Users/admin/builder/spi-builder-workspace/.derivedData/Build/Intermediates.noindex/YPersistence.build/Debug-iphoneos/YPersistenceTests.build/DerivedSources/resource_bundle_accessor.swift /Users/admin/builder/spi-builder-workspace/Tests/YPersistenceTests/DataModel/Human/ManagedFruit.swift /Users/admin/builder/spi-builder-workspace/Tests/YPersistenceTests/DataModel/Human/ManagedGroceryProduct.swift (in target 'YPersistenceTests' from project 'YPersistence')
SwiftCompile normal arm64 /Users/admin/builder/spi-builder-workspace/.derivedData/Build/Intermediates.noindex/YPersistence.build/Debug-iphoneos/YPersistenceTests.build/DerivedSources/resource_bundle_accessor.swift (in target 'YPersistenceTests' from project 'YPersistence')
cd /Users/admin/builder/spi-builder-workspace/.swiftpm/xcode
SwiftCompile normal arm64 /Users/admin/builder/spi-builder-workspace/Tests/YPersistenceTests/DataModel/Human/ManagedFruit.swift (in target 'YPersistenceTests' from project 'YPersistence')
cd /Users/admin/builder/spi-builder-workspace/.swiftpm/xcode
SwiftCompile normal arm64 /Users/admin/builder/spi-builder-workspace/Tests/YPersistenceTests/DataModel/Human/ManagedGroceryProduct.swift (in target 'YPersistenceTests' from project 'YPersistence')
cd /Users/admin/builder/spi-builder-workspace/.swiftpm/xcode
SwiftCompile normal arm64 Compiling\ GroceryProduct.swift,\ DispatchQueue+executeOnMainTests.swift /Users/admin/builder/spi-builder-workspace/Tests/YPersistenceTests/DataModel/Mocks/GroceryProduct.swift /Users/admin/builder/spi-builder-workspace/Tests/YPersistenceTests/Extensions/DispatchQueue+executeOnMainTests.swift (in target 'YPersistenceTests' from project 'YPersistence')
SwiftCompile normal arm64 /Users/admin/builder/spi-builder-workspace/Tests/YPersistenceTests/DataModel/Mocks/GroceryProduct.swift (in target 'YPersistenceTests' from project 'YPersistence')
cd /Users/admin/builder/spi-builder-workspace/.swiftpm/xcode
SwiftCompile normal arm64 /Users/admin/builder/spi-builder-workspace/Tests/YPersistenceTests/Extensions/DispatchQueue+executeOnMainTests.swift (in target 'YPersistenceTests' from project 'YPersistence')
cd /Users/admin/builder/spi-builder-workspace/.swiftpm/xcode
SwiftCompile normal arm64 Compiling\ _ManagedFruit.swift,\ _ManagedGroceryProduct.swift,\ Fruit.swift /Users/admin/builder/spi-builder-workspace/Tests/YPersistenceTests/DataModel/Machine/_ManagedFruit.swift /Users/admin/builder/spi-builder-workspace/Tests/YPersistenceTests/DataModel/Machine/_ManagedGroceryProduct.swift /Users/admin/builder/spi-builder-workspace/Tests/YPersistenceTests/DataModel/Mocks/Fruit.swift (in target 'YPersistenceTests' from project 'YPersistence')
SwiftCompile normal arm64 /Users/admin/builder/spi-builder-workspace/Tests/YPersistenceTests/DataModel/Machine/_ManagedFruit.swift (in target 'YPersistenceTests' from project 'YPersistence')
cd /Users/admin/builder/spi-builder-workspace/.swiftpm/xcode
SwiftCompile normal arm64 /Users/admin/builder/spi-builder-workspace/Tests/YPersistenceTests/DataModel/Machine/_ManagedGroceryProduct.swift (in target 'YPersistenceTests' from project 'YPersistence')
cd /Users/admin/builder/spi-builder-workspace/.swiftpm/xcode
SwiftCompile normal arm64 /Users/admin/builder/spi-builder-workspace/Tests/YPersistenceTests/DataModel/Mocks/Fruit.swift (in target 'YPersistenceTests' from project 'YPersistence')
cd /Users/admin/builder/spi-builder-workspace/.swiftpm/xcode
SwiftCompile normal arm64 Compiling\ NSManagedObjectContext+SaveChangesTests.swift,\ NSManagedObjectModel+initTests.swift /Users/admin/builder/spi-builder-workspace/Tests/YPersistenceTests/Extensions/NSManagedObjectContext+SaveChangesTests.swift /Users/admin/builder/spi-builder-workspace/Tests/YPersistenceTests/Extensions/NSManagedObjectModel+initTests.swift (in target 'YPersistenceTests' from project 'YPersistence')
SwiftCompile normal arm64 /Users/admin/builder/spi-builder-workspace/Tests/YPersistenceTests/Extensions/NSManagedObjectContext+SaveChangesTests.swift (in target 'YPersistenceTests' from project 'YPersistence')
cd /Users/admin/builder/spi-builder-workspace/.swiftpm/xcode
SwiftCompile normal arm64 /Users/admin/builder/spi-builder-workspace/Tests/YPersistenceTests/Extensions/NSManagedObjectModel+initTests.swift (in target 'YPersistenceTests' from project 'YPersistence')
cd /Users/admin/builder/spi-builder-workspace/.swiftpm/xcode
SwiftCompile normal arm64 Compiling\ PersistenceManager+BulkDeleteTests.swift,\ PersistenceManager+ClearTests.swift /Users/admin/builder/spi-builder-workspace/Tests/YPersistenceTests/Manager/PersistenceManager+BulkDeleteTests.swift /Users/admin/builder/spi-builder-workspace/Tests/YPersistenceTests/Manager/PersistenceManager+ClearTests.swift (in target 'YPersistenceTests' from project 'YPersistence')
SwiftCompile normal arm64 /Users/admin/builder/spi-builder-workspace/Tests/YPersistenceTests/Manager/PersistenceManager+BulkDeleteTests.swift (in target 'YPersistenceTests' from project 'YPersistence')
cd /Users/admin/builder/spi-builder-workspace/.swiftpm/xcode
SwiftCompile normal arm64 /Users/admin/builder/spi-builder-workspace/Tests/YPersistenceTests/Manager/PersistenceManager+ClearTests.swift (in target 'YPersistenceTests' from project 'YPersistence')
cd /Users/admin/builder/spi-builder-workspace/.swiftpm/xcode
SwiftCompile normal arm64 Compiling\ PersistenceManager+DeleteTests.swift,\ PersistenceManager+FetchTests.swift /Users/admin/builder/spi-builder-workspace/Tests/YPersistenceTests/Manager/PersistenceManager+DeleteTests.swift /Users/admin/builder/spi-builder-workspace/Tests/YPersistenceTests/Manager/PersistenceManager+FetchTests.swift (in target 'YPersistenceTests' from project 'YPersistence')
SwiftCompile normal arm64 /Users/admin/builder/spi-builder-workspace/Tests/YPersistenceTests/Manager/PersistenceManager+DeleteTests.swift (in target 'YPersistenceTests' from project 'YPersistence')
cd /Users/admin/builder/spi-builder-workspace/.swiftpm/xcode
SwiftCompile normal arm64 /Users/admin/builder/spi-builder-workspace/Tests/YPersistenceTests/Manager/PersistenceManager+FetchTests.swift (in target 'YPersistenceTests' from project 'YPersistence')
cd /Users/admin/builder/spi-builder-workspace/.swiftpm/xcode
SwiftEmitModule normal arm64 Emitting\ module\ for\ YPersistenceTests (in target 'YPersistenceTests' from project 'YPersistence')
EmitSwiftModule normal arm64 (in target 'YPersistenceTests' from project 'YPersistence')
cd /Users/admin/builder/spi-builder-workspace/.swiftpm/xcode
SwiftCompile normal arm64 Compiling\ PersistenceManagerBaseTests.swift,\ PersistenceManagerTests.swift /Users/admin/builder/spi-builder-workspace/Tests/YPersistenceTests/Manager/PersistenceManagerBaseTests.swift /Users/admin/builder/spi-builder-workspace/Tests/YPersistenceTests/Manager/PersistenceManagerTests.swift (in target 'YPersistenceTests' from project 'YPersistence')
SwiftCompile normal arm64 /Users/admin/builder/spi-builder-workspace/Tests/YPersistenceTests/Manager/PersistenceManagerBaseTests.swift (in target 'YPersistenceTests' from project 'YPersistence')
cd /Users/admin/builder/spi-builder-workspace/.swiftpm/xcode
SwiftCompile normal arm64 /Users/admin/builder/spi-builder-workspace/Tests/YPersistenceTests/Manager/PersistenceManagerTests.swift (in target 'YPersistenceTests' from project 'YPersistence')
cd /Users/admin/builder/spi-builder-workspace/.swiftpm/xcode
SwiftCompile normal arm64 Compiling\ DataRecordTests.swift,\ SyncRecordTests.swift /Users/admin/builder/spi-builder-workspace/Tests/YPersistenceTests/Protocols/DataRecordTests.swift /Users/admin/builder/spi-builder-workspace/Tests/YPersistenceTests/Protocols/SyncRecordTests.swift (in target 'YPersistenceTests' from project 'YPersistence')
SwiftCompile normal arm64 /Users/admin/builder/spi-builder-workspace/Tests/YPersistenceTests/Protocols/DataRecordTests.swift (in target 'YPersistenceTests' from project 'YPersistence')
cd /Users/admin/builder/spi-builder-workspace/.swiftpm/xcode
SwiftCompile normal arm64 /Users/admin/builder/spi-builder-workspace/Tests/YPersistenceTests/Protocols/SyncRecordTests.swift (in target 'YPersistenceTests' from project 'YPersistence')
cd /Users/admin/builder/spi-builder-workspace/.swiftpm/xcode
SwiftDriverJobDiscovery normal arm64 Compiling PersistenceManager+Fetch.swift, PersistenceManager+Save.swift (in target 'YPersistence' from project 'YPersistence')
SwiftCompile normal arm64 Compiling\ SortColumnTests.swift,\ SortInfoTests.swift /Users/admin/builder/spi-builder-workspace/Tests/YPersistenceTests/SortColumnTests.swift /Users/admin/builder/spi-builder-workspace/Tests/YPersistenceTests/SortInfoTests.swift (in target 'YPersistenceTests' from project 'YPersistence')
SwiftCompile normal arm64 /Users/admin/builder/spi-builder-workspace/Tests/YPersistenceTests/SortColumnTests.swift (in target 'YPersistenceTests' from project 'YPersistence')
cd /Users/admin/builder/spi-builder-workspace/.swiftpm/xcode
SwiftCompile normal arm64 /Users/admin/builder/spi-builder-workspace/Tests/YPersistenceTests/SortInfoTests.swift (in target 'YPersistenceTests' from project 'YPersistence')
cd /Users/admin/builder/spi-builder-workspace/.swiftpm/xcode
SwiftDriverJobDiscovery normal arm64 Compiling PersistenceManager+Sync.swift, PersistenceManager.swift (in target 'YPersistence' from project 'YPersistence')
SwiftCompile normal arm64 Compiling\ PersistenceManager+SaveTests.swift,\ PersistenceManager+SyncTests.swift /Users/admin/builder/spi-builder-workspace/Tests/YPersistenceTests/Manager/PersistenceManager+SaveTests.swift /Users/admin/builder/spi-builder-workspace/Tests/YPersistenceTests/Manager/PersistenceManager+SyncTests.swift (in target 'YPersistenceTests' from project 'YPersistence')
SwiftCompile normal arm64 /Users/admin/builder/spi-builder-workspace/Tests/YPersistenceTests/Manager/PersistenceManager+SaveTests.swift (in target 'YPersistenceTests' from project 'YPersistence')
cd /Users/admin/builder/spi-builder-workspace/.swiftpm/xcode
SwiftCompile normal arm64 /Users/admin/builder/spi-builder-workspace/Tests/YPersistenceTests/Manager/PersistenceManager+SyncTests.swift (in target 'YPersistenceTests' from project 'YPersistence')
cd /Users/admin/builder/spi-builder-workspace/.swiftpm/xcode
SwiftDriverJobDiscovery normal arm64 Compiling GroceryProduct.swift, DispatchQueue+executeOnMainTests.swift (in target 'YPersistenceTests' from project 'YPersistence')
SwiftDriver\ Compilation YPersistence normal arm64 com.apple.xcode.tools.swift.compiler (in target 'YPersistence' from project 'YPersistence')
cd /Users/admin/builder/spi-builder-workspace/.swiftpm/xcode
builtin-Swift-Compilation -- /Applications/Xcode-16.3.0.app/Contents/Developer/Toolchains/XcodeDefault.xctoolchain/usr/bin/swiftc -module-name YPersistence -Onone -enforce-exclusivity\=checked @/Users/admin/builder/spi-builder-workspace/.derivedData/Build/Intermediates.noindex/YPersistence.build/Debug-iphoneos/YPersistence.build/Objects-normal/arm64/YPersistence.SwiftFileList -DSWIFT_PACKAGE -DDEBUG -DXcode -plugin-path /Applications/Xcode-16.3.0.app/Contents/Developer/Toolchains/XcodeDefault.xctoolchain/usr/lib/swift/host/plugins/testing -enable-experimental-feature DebugDescriptionMacro -sdk /Applications/Xcode-16.3.0.app/Contents/Developer/Platforms/iPhoneOS.platform/Developer/SDKs/iPhoneOS18.4.sdk -target arm64-apple-ios12.0 -g -module-cache-path /Users/admin/builder/spi-builder-workspace/.derivedData/ModuleCache.noindex -Xfrontend -serialize-debugging-options -profile-coverage-mapping -profile-generate -enable-testing -index-store-path /Users/admin/builder/spi-builder-workspace/.derivedData/Index.noindex/DataStore -swift-version 5 -I /Users/admin/builder/spi-builder-workspace/.derivedData/Build/Products/Debug-iphoneos -I /Applications/Xcode-16.3.0.app/Contents/Developer/Platforms/iPhoneOS.platform/Developer/usr/lib -F /Users/admin/builder/spi-builder-workspace/.derivedData/Build/Products/Debug-iphoneos -F /Applications/Xcode-16.3.0.app/Contents/Developer/Platforms/iPhoneOS.platform/Developer/Library/Frameworks -F /Applications/Xcode-16.3.0.app/Contents/Developer/Platforms/iPhoneOS.platform/Developer/SDKs/iPhoneOS18.4.sdk/Developer/Library/Frameworks -c -j10 -enable-batch-mode -incremental -Xcc -ivfsstatcache -Xcc /Users/admin/builder/spi-builder-workspace/.derivedData/SDKStatCaches.noindex/iphoneos18.4-22E235-339d34bc69d7fc736c3220795c36f340.sdkstatcache -output-file-map /Users/admin/builder/spi-builder-workspace/.derivedData/Build/Intermediates.noindex/YPersistence.build/Debug-iphoneos/YPersistence.build/Objects-normal/arm64/YPersistence-OutputFileMap.json -use-frontend-parseable-output -save-temps -no-color-diagnostics -serialize-diagnostics -emit-dependencies -emit-module -emit-module-path /Users/admin/builder/spi-builder-workspace/.derivedData/Build/Intermediates.noindex/YPersistence.build/Debug-iphoneos/YPersistence.build/Objects-normal/arm64/YPersistence.swiftmodule -validate-clang-modules-once -clang-build-session-file /Users/admin/builder/spi-builder-workspace/.derivedData/ModuleCache.noindex/Session.modulevalidation -Xcc -I/Users/admin/builder/spi-builder-workspace/.derivedData/Build/Intermediates.noindex/YPersistence.build/Debug-iphoneos/YPersistence.build/swift-overrides.hmap -emit-const-values -Xfrontend -const-gather-protocols-file -Xfrontend /Users/admin/builder/spi-builder-workspace/.derivedData/Build/Intermediates.noindex/YPersistence.build/Debug-iphoneos/YPersistence.build/Objects-normal/arm64/YPersistence_const_extract_protocols.json -Xcc -I/Users/admin/builder/spi-builder-workspace/.derivedData/Build/Products/Debug-iphoneos/include -Xcc -I/Users/admin/builder/spi-builder-workspace/.derivedData/Build/Intermediates.noindex/YPersistence.build/Debug-iphoneos/YPersistence.build/DerivedSources-normal/arm64 -Xcc -I/Users/admin/builder/spi-builder-workspace/.derivedData/Build/Intermediates.noindex/YPersistence.build/Debug-iphoneos/YPersistence.build/DerivedSources/arm64 -Xcc -I/Users/admin/builder/spi-builder-workspace/.derivedData/Build/Intermediates.noindex/YPersistence.build/Debug-iphoneos/YPersistence.build/DerivedSources -Xcc -DSWIFT_PACKAGE -Xcc -DDEBUG\=1 -emit-objc-header -emit-objc-header-path /Users/admin/builder/spi-builder-workspace/.derivedData/Build/Intermediates.noindex/YPersistence.build/Debug-iphoneos/YPersistence.build/Objects-normal/arm64/YPersistence-Swift.h -working-directory /Users/admin/builder/spi-builder-workspace/.swiftpm/xcode -experimental-emit-module-separately -disable-cmo
SwiftDriverJobDiscovery normal arm64 Compiling _ManagedFruit.swift, _ManagedGroceryProduct.swift, Fruit.swift (in target 'YPersistenceTests' from project 'YPersistence')
Ld /Users/admin/builder/spi-builder-workspace/.derivedData/Build/Products/Debug-iphoneos/YPersistence.o normal (in target 'YPersistence' from project 'YPersistence')
cd /Users/admin/builder/spi-builder-workspace
/Applications/Xcode-16.3.0.app/Contents/Developer/Toolchains/XcodeDefault.xctoolchain/usr/bin/clang -Xlinker -reproducible -target arm64-apple-ios12.0 -r -isysroot /Applications/Xcode-16.3.0.app/Contents/Developer/Platforms/iPhoneOS.platform/Developer/SDKs/iPhoneOS18.4.sdk -O0 -L/Users/admin/builder/spi-builder-workspace/.derivedData/Build/Intermediates.noindex/EagerLinkingTBDs/Debug-iphoneos -L/Users/admin/builder/spi-builder-workspace/.derivedData/Build/Products/Debug-iphoneos -L/Applications/Xcode-16.3.0.app/Contents/Developer/Platforms/iPhoneOS.platform/Developer/usr/lib -F/Users/admin/builder/spi-builder-workspace/.derivedData/Build/Intermediates.noindex/EagerLinkingTBDs/Debug-iphoneos -F/Users/admin/builder/spi-builder-workspace/.derivedData/Build/Products/Debug-iphoneos -iframework /Applications/Xcode-16.3.0.app/Contents/Developer/Platforms/iPhoneOS.platform/Developer/Library/Frameworks -iframework /Applications/Xcode-16.3.0.app/Contents/Developer/Platforms/iPhoneOS.platform/Developer/SDKs/iPhoneOS18.4.sdk/Developer/Library/Frameworks -filelist /Users/admin/builder/spi-builder-workspace/.derivedData/Build/Intermediates.noindex/YPersistence.build/Debug-iphoneos/YPersistence.build/Objects-normal/arm64/YPersistence.LinkFileList -nostdlib -Xlinker -object_path_lto -Xlinker /Users/admin/builder/spi-builder-workspace/.derivedData/Build/Intermediates.noindex/YPersistence.build/Debug-iphoneos/YPersistence.build/Objects-normal/arm64/YPersistence_lto.o -rdynamic -Xlinker -no_deduplicate -Xlinker -debug_variant -Xlinker -dependency_info -Xlinker /Users/admin/builder/spi-builder-workspace/.derivedData/Build/Intermediates.noindex/YPersistence.build/Debug-iphoneos/YPersistence.build/Objects-normal/arm64/YPersistence_dependency_info.dat -fobjc-link-runtime -L/Applications/Xcode-16.3.0.app/Contents/Developer/Toolchains/XcodeDefault.xctoolchain/usr/lib/swift/iphoneos -L/usr/lib/swift -Xlinker -add_ast_path -Xlinker /Users/admin/builder/spi-builder-workspace/.derivedData/Build/Intermediates.noindex/YPersistence.build/Debug-iphoneos/YPersistence.build/Objects-normal/arm64/YPersistence.swiftmodule -o /Users/admin/builder/spi-builder-workspace/.derivedData/Build/Products/Debug-iphoneos/YPersistence.o
SwiftDriverJobDiscovery normal arm64 Compiling PersistenceManager+BulkDeleteTests.swift, PersistenceManager+ClearTests.swift (in target 'YPersistenceTests' from project 'YPersistence')
SwiftDriverJobDiscovery normal arm64 Compiling SortColumnTests.swift, SortInfoTests.swift (in target 'YPersistenceTests' from project 'YPersistence')
SwiftDriverJobDiscovery normal arm64 Compiling NSManagedObjectContext+SaveChangesTests.swift, NSManagedObjectModel+initTests.swift (in target 'YPersistenceTests' from project 'YPersistence')
SwiftDriverJobDiscovery normal arm64 Compiling DataRecordTests.swift, SyncRecordTests.swift (in target 'YPersistenceTests' from project 'YPersistence')
SwiftDriverJobDiscovery normal arm64 Compiling resource_bundle_accessor.swift, ManagedFruit.swift, ManagedGroceryProduct.swift (in target 'YPersistenceTests' from project 'YPersistence')
ExtractAppIntentsMetadata (in target 'YPersistence' from project 'YPersistence')
cd /Users/admin/builder/spi-builder-workspace
/Applications/Xcode-16.3.0.app/Contents/Developer/Toolchains/XcodeDefault.xctoolchain/usr/bin/appintentsmetadataprocessor --toolchain-dir /Applications/Xcode-16.3.0.app/Contents/Developer/Toolchains/XcodeDefault.xctoolchain --module-name YPersistence --sdk-root /Applications/Xcode-16.3.0.app/Contents/Developer/Platforms/iPhoneOS.platform/Developer/SDKs/iPhoneOS18.4.sdk --xcode-version 16E140 --platform-family iOS --deployment-target 12.0 --bundle-identifier spi-builder-workspace.YPersistence --output /Users/admin/builder/spi-builder-workspace/.derivedData/Build/Products/Debug-iphoneos/YPersistence.appintents --target-triple arm64-apple-ios12.0 --binary-file /Users/admin/builder/spi-builder-workspace/.derivedData/Build/Products/Debug-iphoneos/YPersistence.o --dependency-file /Users/admin/builder/spi-builder-workspace/.derivedData/Build/Intermediates.noindex/YPersistence.build/Debug-iphoneos/YPersistence.build/Objects-normal/arm64/YPersistence_dependency_info.dat --stringsdata-file /Users/admin/builder/spi-builder-workspace/.derivedData/Build/Intermediates.noindex/YPersistence.build/Debug-iphoneos/YPersistence.build/Objects-normal/arm64/ExtractedAppShortcutsMetadata.stringsdata --source-file-list /Users/admin/builder/spi-builder-workspace/.derivedData/Build/Intermediates.noindex/YPersistence.build/Debug-iphoneos/YPersistence.build/Objects-normal/arm64/YPersistence.SwiftFileList --metadata-file-list /Users/admin/builder/spi-builder-workspace/.derivedData/Build/Intermediates.noindex/YPersistence.build/Debug-iphoneos/YPersistence.build/YPersistence.DependencyMetadataFileList --static-metadata-file-list /Users/admin/builder/spi-builder-workspace/.derivedData/Build/Intermediates.noindex/YPersistence.build/Debug-iphoneos/YPersistence.build/YPersistence.DependencyStaticMetadataFileList --swift-const-vals-list /Users/admin/builder/spi-builder-workspace/.derivedData/Build/Intermediates.noindex/YPersistence.build/Debug-iphoneos/YPersistence.build/Objects-normal/arm64/YPersistence.SwiftConstValuesFileList --force --compile-time-extraction --deployment-aware-processing --validate-assistant-intents --no-app-shortcuts-localization
2025-04-27 15:08:35.144 appintentsmetadataprocessor[774:4594] Starting appintentsmetadataprocessor export
2025-04-27 15:08:35.178 appintentsmetadataprocessor[774:4594] Extracted no relevant App Intents symbols, skipping writing output
SwiftDriverJobDiscovery normal arm64 Emitting module for YPersistenceTests (in target 'YPersistenceTests' from project 'YPersistence')
SwiftDriver\ Compilation\ Requirements YPersistenceTests normal arm64 com.apple.xcode.tools.swift.compiler (in target 'YPersistenceTests' from project 'YPersistence')
cd /Users/admin/builder/spi-builder-workspace/.swiftpm/xcode
builtin-Swift-Compilation-Requirements -- /Applications/Xcode-16.3.0.app/Contents/Developer/Toolchains/XcodeDefault.xctoolchain/usr/bin/swiftc -module-name YPersistenceTests -Onone -enforce-exclusivity\=checked @/Users/admin/builder/spi-builder-workspace/.derivedData/Build/Intermediates.noindex/YPersistence.build/Debug-iphoneos/YPersistenceTests.build/Objects-normal/arm64/YPersistenceTests.SwiftFileList -DSWIFT_PACKAGE -DDEBUG -DXcode -plugin-path /Applications/Xcode-16.3.0.app/Contents/Developer/Toolchains/XcodeDefault.xctoolchain/usr/lib/swift/host/plugins/testing -enable-experimental-feature DebugDescriptionMacro -sdk /Applications/Xcode-16.3.0.app/Contents/Developer/Platforms/iPhoneOS.platform/Developer/SDKs/iPhoneOS18.4.sdk -target arm64-apple-ios13.0 -g -module-cache-path /Users/admin/builder/spi-builder-workspace/.derivedData/ModuleCache.noindex -Xfrontend -serialize-debugging-options -profile-coverage-mapping -profile-generate -enable-testing -index-store-path /Users/admin/builder/spi-builder-workspace/.derivedData/Index.noindex/DataStore -swift-version 5 -I /Users/admin/builder/spi-builder-workspace/.derivedData/Build/Products/Debug-iphoneos -I /Applications/Xcode-16.3.0.app/Contents/Developer/Platforms/iPhoneOS.platform/Developer/usr/lib -F /Users/admin/builder/spi-builder-workspace/.derivedData/Build/Products/Debug-iphoneos/PackageFrameworks -F /Users/admin/builder/spi-builder-workspace/.derivedData/Build/Products/Debug-iphoneos -F /Applications/Xcode-16.3.0.app/Contents/Developer/Platforms/iPhoneOS.platform/Developer/Library/Frameworks -F /Applications/Xcode-16.3.0.app/Contents/Developer/Platforms/iPhoneOS.platform/Developer/SDKs/iPhoneOS18.4.sdk/Developer/Library/Frameworks -c -j10 -enable-batch-mode -incremental -Xcc -ivfsstatcache -Xcc /Users/admin/builder/spi-builder-workspace/.derivedData/SDKStatCaches.noindex/iphoneos18.4-22E235-339d34bc69d7fc736c3220795c36f340.sdkstatcache -output-file-map /Users/admin/builder/spi-builder-workspace/.derivedData/Build/Intermediates.noindex/YPersistence.build/Debug-iphoneos/YPersistenceTests.build/Objects-normal/arm64/YPersistenceTests-OutputFileMap.json -use-frontend-parseable-output -save-temps -no-color-diagnostics -serialize-diagnostics -emit-dependencies -emit-module -emit-module-path /Users/admin/builder/spi-builder-workspace/.derivedData/Build/Intermediates.noindex/YPersistence.build/Debug-iphoneos/YPersistenceTests.build/Objects-normal/arm64/YPersistenceTests.swiftmodule -validate-clang-modules-once -clang-build-session-file /Users/admin/builder/spi-builder-workspace/.derivedData/ModuleCache.noindex/Session.modulevalidation -emit-const-values -Xfrontend -const-gather-protocols-file -Xfrontend /Users/admin/builder/spi-builder-workspace/.derivedData/Build/Intermediates.noindex/YPersistence.build/Debug-iphoneos/YPersistenceTests.build/Objects-normal/arm64/YPersistenceTests_const_extract_protocols.json -Xcc -I/Users/admin/builder/spi-builder-workspace/.derivedData/Build/Products/Debug-iphoneos/include -Xcc -I/Users/admin/builder/spi-builder-workspace/.derivedData/Build/Intermediates.noindex/YPersistence.build/Debug-iphoneos/YPersistenceTests.build/DerivedSources-normal/arm64 -Xcc -I/Users/admin/builder/spi-builder-workspace/.derivedData/Build/Intermediates.noindex/YPersistence.build/Debug-iphoneos/YPersistenceTests.build/DerivedSources/arm64 -Xcc -I/Users/admin/builder/spi-builder-workspace/.derivedData/Build/Intermediates.noindex/YPersistence.build/Debug-iphoneos/YPersistenceTests.build/DerivedSources -Xcc -DSWIFT_PACKAGE -Xcc -DDEBUG\=1 -working-directory /Users/admin/builder/spi-builder-workspace/.swiftpm/xcode -experimental-emit-module-separately -disable-cmo
Copy /Users/admin/builder/spi-builder-workspace/.derivedData/Build/Products/Debug-iphoneos/YPersistenceTests.swiftmodule/arm64-apple-ios.abi.json /Users/admin/builder/spi-builder-workspace/.derivedData/Build/Intermediates.noindex/YPersistence.build/Debug-iphoneos/YPersistenceTests.build/Objects-normal/arm64/YPersistenceTests.abi.json (in target 'YPersistenceTests' from project 'YPersistence')
cd /Users/admin/builder/spi-builder-workspace
builtin-copy -exclude .DS_Store -exclude CVS -exclude .svn -exclude .git -exclude .hg -resolve-src-symlinks -rename /Users/admin/builder/spi-builder-workspace/.derivedData/Build/Intermediates.noindex/YPersistence.build/Debug-iphoneos/YPersistenceTests.build/Objects-normal/arm64/YPersistenceTests.abi.json /Users/admin/builder/spi-builder-workspace/.derivedData/Build/Products/Debug-iphoneos/YPersistenceTests.swiftmodule/arm64-apple-ios.abi.json
SwiftDriverJobDiscovery normal arm64 Compiling PersistenceManager+DeleteTests.swift, PersistenceManager+FetchTests.swift (in target 'YPersistenceTests' from project 'YPersistence')
RegisterExecutionPolicyException /Users/admin/builder/spi-builder-workspace/.derivedData/Build/Products/Debug-iphoneos/YPersistence.o (in target 'YPersistence' from project 'YPersistence')
cd /Users/admin/builder/spi-builder-workspace
builtin-RegisterExecutionPolicyException /Users/admin/builder/spi-builder-workspace/.derivedData/Build/Products/Debug-iphoneos/YPersistence.o
ProcessInfoPlistFile /Users/admin/builder/spi-builder-workspace/.derivedData/Build/Products/Debug-iphoneos/YPersistenceTests.xctest/Info.plist /Users/admin/builder/spi-builder-workspace/.derivedData/Build/Intermediates.noindex/YPersistence.build/Debug-iphoneos/YPersistenceTests.build/empty-YPersistenceTests.plist (in target 'YPersistenceTests' from project 'YPersistence')
cd /Users/admin/builder/spi-builder-workspace
builtin-infoPlistUtility /Users/admin/builder/spi-builder-workspace/.derivedData/Build/Intermediates.noindex/YPersistence.build/Debug-iphoneos/YPersistenceTests.build/empty-YPersistenceTests.plist -producttype com.apple.product-type.bundle.unit-test -expandbuildsettings -format binary -platform iphoneos -requiredArchitecture arm64 -o /Users/admin/builder/spi-builder-workspace/.derivedData/Build/Products/Debug-iphoneos/YPersistenceTests.xctest/Info.plist
CpResource /Users/admin/builder/spi-builder-workspace/.derivedData/Build/Products/Debug-iphoneos/YPersistenceTests.xctest/YPersistence_YPersistenceTests.bundle /Users/admin/builder/spi-builder-workspace/.derivedData/Build/Products/Debug-iphoneos/YPersistence_YPersistenceTests.bundle (in target 'YPersistenceTests' from project 'YPersistence')
cd /Users/admin/builder/spi-builder-workspace
builtin-copy -exclude .DS_Store -exclude CVS -exclude .svn -exclude .git -exclude .hg -resolve-src-symlinks /Users/admin/builder/spi-builder-workspace/.derivedData/Build/Products/Debug-iphoneos/YPersistence_YPersistenceTests.bundle /Users/admin/builder/spi-builder-workspace/.derivedData/Build/Products/Debug-iphoneos/YPersistenceTests.xctest
SwiftDriverJobDiscovery normal arm64 Compiling PersistenceManagerBaseTests.swift, PersistenceManagerTests.swift (in target 'YPersistenceTests' from project 'YPersistence')
SwiftDriverJobDiscovery normal arm64 Compiling PersistenceManager+SaveTests.swift, PersistenceManager+SyncTests.swift (in target 'YPersistenceTests' from project 'YPersistence')
SwiftDriver\ Compilation YPersistenceTests normal arm64 com.apple.xcode.tools.swift.compiler (in target 'YPersistenceTests' from project 'YPersistence')
cd /Users/admin/builder/spi-builder-workspace/.swiftpm/xcode
builtin-Swift-Compilation -- /Applications/Xcode-16.3.0.app/Contents/Developer/Toolchains/XcodeDefault.xctoolchain/usr/bin/swiftc -module-name YPersistenceTests -Onone -enforce-exclusivity\=checked @/Users/admin/builder/spi-builder-workspace/.derivedData/Build/Intermediates.noindex/YPersistence.build/Debug-iphoneos/YPersistenceTests.build/Objects-normal/arm64/YPersistenceTests.SwiftFileList -DSWIFT_PACKAGE -DDEBUG -DXcode -plugin-path /Applications/Xcode-16.3.0.app/Contents/Developer/Toolchains/XcodeDefault.xctoolchain/usr/lib/swift/host/plugins/testing -enable-experimental-feature DebugDescriptionMacro -sdk /Applications/Xcode-16.3.0.app/Contents/Developer/Platforms/iPhoneOS.platform/Developer/SDKs/iPhoneOS18.4.sdk -target arm64-apple-ios13.0 -g -module-cache-path /Users/admin/builder/spi-builder-workspace/.derivedData/ModuleCache.noindex -Xfrontend -serialize-debugging-options -profile-coverage-mapping -profile-generate -enable-testing -index-store-path /Users/admin/builder/spi-builder-workspace/.derivedData/Index.noindex/DataStore -swift-version 5 -I /Users/admin/builder/spi-builder-workspace/.derivedData/Build/Products/Debug-iphoneos -I /Applications/Xcode-16.3.0.app/Contents/Developer/Platforms/iPhoneOS.platform/Developer/usr/lib -F /Users/admin/builder/spi-builder-workspace/.derivedData/Build/Products/Debug-iphoneos/PackageFrameworks -F /Users/admin/builder/spi-builder-workspace/.derivedData/Build/Products/Debug-iphoneos -F /Applications/Xcode-16.3.0.app/Contents/Developer/Platforms/iPhoneOS.platform/Developer/Library/Frameworks -F /Applications/Xcode-16.3.0.app/Contents/Developer/Platforms/iPhoneOS.platform/Developer/SDKs/iPhoneOS18.4.sdk/Developer/Library/Frameworks -c -j10 -enable-batch-mode -incremental -Xcc -ivfsstatcache -Xcc /Users/admin/builder/spi-builder-workspace/.derivedData/SDKStatCaches.noindex/iphoneos18.4-22E235-339d34bc69d7fc736c3220795c36f340.sdkstatcache -output-file-map /Users/admin/builder/spi-builder-workspace/.derivedData/Build/Intermediates.noindex/YPersistence.build/Debug-iphoneos/YPersistenceTests.build/Objects-normal/arm64/YPersistenceTests-OutputFileMap.json -use-frontend-parseable-output -save-temps -no-color-diagnostics -serialize-diagnostics -emit-dependencies -emit-module -emit-module-path /Users/admin/builder/spi-builder-workspace/.derivedData/Build/Intermediates.noindex/YPersistence.build/Debug-iphoneos/YPersistenceTests.build/Objects-normal/arm64/YPersistenceTests.swiftmodule -validate-clang-modules-once -clang-build-session-file /Users/admin/builder/spi-builder-workspace/.derivedData/ModuleCache.noindex/Session.modulevalidation -emit-const-values -Xfrontend -const-gather-protocols-file -Xfrontend /Users/admin/builder/spi-builder-workspace/.derivedData/Build/Intermediates.noindex/YPersistence.build/Debug-iphoneos/YPersistenceTests.build/Objects-normal/arm64/YPersistenceTests_const_extract_protocols.json -Xcc -I/Users/admin/builder/spi-builder-workspace/.derivedData/Build/Products/Debug-iphoneos/include -Xcc -I/Users/admin/builder/spi-builder-workspace/.derivedData/Build/Intermediates.noindex/YPersistence.build/Debug-iphoneos/YPersistenceTests.build/DerivedSources-normal/arm64 -Xcc -I/Users/admin/builder/spi-builder-workspace/.derivedData/Build/Intermediates.noindex/YPersistence.build/Debug-iphoneos/YPersistenceTests.build/DerivedSources/arm64 -Xcc -I/Users/admin/builder/spi-builder-workspace/.derivedData/Build/Intermediates.noindex/YPersistence.build/Debug-iphoneos/YPersistenceTests.build/DerivedSources -Xcc -DSWIFT_PACKAGE -Xcc -DDEBUG\=1 -working-directory /Users/admin/builder/spi-builder-workspace/.swiftpm/xcode -experimental-emit-module-separately -disable-cmo
Ld /Users/admin/builder/spi-builder-workspace/.derivedData/Build/Products/Debug-iphoneos/YPersistenceTests.xctest/YPersistenceTests normal (in target 'YPersistenceTests' from project 'YPersistence')
cd /Users/admin/builder/spi-builder-workspace
/Applications/Xcode-16.3.0.app/Contents/Developer/Toolchains/XcodeDefault.xctoolchain/usr/bin/clang -Xlinker -reproducible -target arm64-apple-ios13.0 -bundle -isysroot /Applications/Xcode-16.3.0.app/Contents/Developer/Platforms/iPhoneOS.platform/Developer/SDKs/iPhoneOS18.4.sdk -O0 -L/Users/admin/builder/spi-builder-workspace/.derivedData/Build/Intermediates.noindex/EagerLinkingTBDs/Debug-iphoneos -L/Users/admin/builder/spi-builder-workspace/.derivedData/Build/Products/Debug-iphoneos -L/Applications/Xcode-16.3.0.app/Contents/Developer/Platforms/iPhoneOS.platform/Developer/usr/lib -F/Users/admin/builder/spi-builder-workspace/.derivedData/Build/Intermediates.noindex/EagerLinkingTBDs/Debug-iphoneos -F/Users/admin/builder/spi-builder-workspace/.derivedData/Build/Products/Debug-iphoneos/PackageFrameworks -F/Users/admin/builder/spi-builder-workspace/.derivedData/Build/Products/Debug-iphoneos -iframework /Applications/Xcode-16.3.0.app/Contents/Developer/Platforms/iPhoneOS.platform/Developer/Library/Frameworks -iframework /Applications/Xcode-16.3.0.app/Contents/Developer/Platforms/iPhoneOS.platform/Developer/SDKs/iPhoneOS18.4.sdk/Developer/Library/Frameworks -filelist /Users/admin/builder/spi-builder-workspace/.derivedData/Build/Intermediates.noindex/YPersistence.build/Debug-iphoneos/YPersistenceTests.build/Objects-normal/arm64/YPersistenceTests.LinkFileList -Xlinker -rpath -Xlinker /usr/lib/swift -Xlinker -rpath -Xlinker /Users/admin/builder/spi-builder-workspace/.derivedData/Build/Products/Debug-iphoneos/PackageFrameworks -Xlinker -rpath -Xlinker @loader_path/Frameworks -Xlinker -rpath -Xlinker @loader_path/../Frameworks -dead_strip -Xlinker -object_path_lto -Xlinker /Users/admin/builder/spi-builder-workspace/.derivedData/Build/Intermediates.noindex/YPersistence.build/Debug-iphoneos/YPersistenceTests.build/Objects-normal/arm64/YPersistenceTests_lto.o -rdynamic -Xlinker -no_deduplicate -Xlinker -debug_variant -Xlinker -dependency_info -Xlinker /Users/admin/builder/spi-builder-workspace/.derivedData/Build/Intermediates.noindex/YPersistence.build/Debug-iphoneos/YPersistenceTests.build/Objects-normal/arm64/YPersistenceTests_dependency_info.dat -fobjc-link-runtime -fprofile-instr-generate -L/Applications/Xcode-16.3.0.app/Contents/Developer/Toolchains/XcodeDefault.xctoolchain/usr/lib/swift/iphoneos -L/usr/lib/swift -Xlinker -add_ast_path -Xlinker /Users/admin/builder/spi-builder-workspace/.derivedData/Build/Intermediates.noindex/YPersistence.build/Debug-iphoneos/YPersistenceTests.build/Objects-normal/arm64/YPersistenceTests.swiftmodule -Wl,-no_warn_duplicate_libraries -framework XCTest -lXCTestSwiftSupport -o /Users/admin/builder/spi-builder-workspace/.derivedData/Build/Products/Debug-iphoneos/YPersistenceTests.xctest/YPersistenceTests -Xlinker -add_ast_path -Xlinker /Users/admin/builder/spi-builder-workspace/.derivedData/Build/Intermediates.noindex/YPersistence.build/Debug-iphoneos/YPersistence.build/Objects-normal/arm64/YPersistence.swiftmodule
ExtractAppIntentsMetadata (in target 'YPersistenceTests' from project 'YPersistence')
cd /Users/admin/builder/spi-builder-workspace
/Applications/Xcode-16.3.0.app/Contents/Developer/Toolchains/XcodeDefault.xctoolchain/usr/bin/appintentsmetadataprocessor --toolchain-dir /Applications/Xcode-16.3.0.app/Contents/Developer/Toolchains/XcodeDefault.xctoolchain --module-name YPersistenceTests --sdk-root /Applications/Xcode-16.3.0.app/Contents/Developer/Platforms/iPhoneOS.platform/Developer/SDKs/iPhoneOS18.4.sdk --xcode-version 16E140 --platform-family iOS --deployment-target 13.0 --bundle-identifier spi-builder-workspace.YPersistenceTests --output /Users/admin/builder/spi-builder-workspace/.derivedData/Build/Products/Debug-iphoneos/YPersistenceTests.xctest --target-triple arm64-apple-ios13.0 --binary-file /Users/admin/builder/spi-builder-workspace/.derivedData/Build/Products/Debug-iphoneos/YPersistenceTests.xctest/YPersistenceTests --dependency-file /Users/admin/builder/spi-builder-workspace/.derivedData/Build/Intermediates.noindex/YPersistence.build/Debug-iphoneos/YPersistenceTests.build/Objects-normal/arm64/YPersistenceTests_dependency_info.dat --stringsdata-file /Users/admin/builder/spi-builder-workspace/.derivedData/Build/Intermediates.noindex/YPersistence.build/Debug-iphoneos/YPersistenceTests.build/Objects-normal/arm64/ExtractedAppShortcutsMetadata.stringsdata --source-file-list /Users/admin/builder/spi-builder-workspace/.derivedData/Build/Intermediates.noindex/YPersistence.build/Debug-iphoneos/YPersistenceTests.build/Objects-normal/arm64/YPersistenceTests.SwiftFileList --metadata-file-list /Users/admin/builder/spi-builder-workspace/.derivedData/Build/Intermediates.noindex/YPersistence.build/Debug-iphoneos/YPersistenceTests.build/YPersistenceTests.DependencyMetadataFileList --static-metadata-file-list /Users/admin/builder/spi-builder-workspace/.derivedData/Build/Intermediates.noindex/YPersistence.build/Debug-iphoneos/YPersistenceTests.build/YPersistenceTests.DependencyStaticMetadataFileList --swift-const-vals-list /Users/admin/builder/spi-builder-workspace/.derivedData/Build/Intermediates.noindex/YPersistence.build/Debug-iphoneos/YPersistenceTests.build/Objects-normal/arm64/YPersistenceTests.SwiftConstValuesFileList --compile-time-extraction --deployment-aware-processing --validate-assistant-intents --no-app-shortcuts-localization
2025-04-27 15:08:35.459 appintentsmetadataprocessor[777:4612] Starting appintentsmetadataprocessor export
2025-04-27 15:08:35.461 appintentsmetadataprocessor[777:4612] warning: Metadata extraction skipped. No AppIntents.framework dependency found.
CopySwiftLibs /Users/admin/builder/spi-builder-workspace/.derivedData/Build/Products/Debug-iphoneos/YPersistenceTests.xctest (in target 'YPersistenceTests' from project 'YPersistence')
cd /Users/admin/builder/spi-builder-workspace
builtin-swiftStdLibTool --copy --verbose --scan-executable /Users/admin/builder/spi-builder-workspace/.derivedData/Build/Products/Debug-iphoneos/YPersistenceTests.xctest/YPersistenceTests --scan-folder /Users/admin/builder/spi-builder-workspace/.derivedData/Build/Products/Debug-iphoneos/YPersistenceTests.xctest/Frameworks --scan-folder /Users/admin/builder/spi-builder-workspace/.derivedData/Build/Products/Debug-iphoneos/YPersistenceTests.xctest/PlugIns --scan-folder /Users/admin/builder/spi-builder-workspace/.derivedData/Build/Products/Debug-iphoneos/YPersistenceTests.xctest/SystemExtensions --scan-folder /Users/admin/builder/spi-builder-workspace/.derivedData/Build/Products/Debug-iphoneos/YPersistenceTests.xctest/Extensions --platform iphoneos --toolchain /Applications/Xcode-16.3.0.app/Contents/Developer/Toolchains/XcodeDefault.xctoolchain --destination /Users/admin/builder/spi-builder-workspace/.derivedData/Build/Products/Debug-iphoneos/YPersistenceTests.xctest/Frameworks --strip-bitcode --scan-executable /Applications/Xcode-16.3.0.app/Contents/Developer/Platforms/iPhoneOS.platform/Developer/usr/lib/libXCTestSwiftSupport.dylib --strip-bitcode-tool /Applications/Xcode-16.3.0.app/Contents/Developer/Toolchains/XcodeDefault.xctoolchain/usr/bin/bitcode_strip --emit-dependency-info /Users/admin/builder/spi-builder-workspace/.derivedData/Build/Intermediates.noindex/YPersistence.build/Debug-iphoneos/YPersistenceTests.build/SwiftStdLibToolInputDependencies.dep --filter-for-swift-os --back-deploy-swift-concurrency
Ignoring --strip-bitcode because --sign was not passed
Copying /Applications/Xcode-16.3.0.app/Contents/Developer/Toolchains/XcodeDefault.xctoolchain/usr/lib/swift-5.5/iphoneos/libswift_Concurrency.dylib to /Users/admin/builder/spi-builder-workspace/.derivedData/Build/Products/Debug-iphoneos/YPersistenceTests.xctest/Frameworks/libswift_Concurrency.dylib
GenerateDSYMFile /Users/admin/builder/spi-builder-workspace/.derivedData/Build/Products/Debug-iphoneos/YPersistenceTests.xctest.dSYM /Users/admin/builder/spi-builder-workspace/.derivedData/Build/Products/Debug-iphoneos/YPersistenceTests.xctest/YPersistenceTests (in target 'YPersistenceTests' from project 'YPersistence')
cd /Users/admin/builder/spi-builder-workspace
/Applications/Xcode-16.3.0.app/Contents/Developer/Toolchains/XcodeDefault.xctoolchain/usr/bin/dsymutil /Users/admin/builder/spi-builder-workspace/.derivedData/Build/Products/Debug-iphoneos/YPersistenceTests.xctest/YPersistenceTests -o /Users/admin/builder/spi-builder-workspace/.derivedData/Build/Products/Debug-iphoneos/YPersistenceTests.xctest.dSYM
AppIntentsSSUTraining (in target 'YPersistenceTests' from project 'YPersistence')
cd /Users/admin/builder/spi-builder-workspace
/Applications/Xcode-16.3.0.app/Contents/Developer/Toolchains/XcodeDefault.xctoolchain/usr/bin/appintentsnltrainingprocessor --infoplist-path /Users/admin/builder/spi-builder-workspace/.derivedData/Build/Products/Debug-iphoneos/YPersistenceTests.xctest/Info.plist --temp-dir-path /Users/admin/builder/spi-builder-workspace/.derivedData/Build/Intermediates.noindex/YPersistence.build/Debug-iphoneos/YPersistenceTests.build/ssu --bundle-id spi-builder-workspace.YPersistenceTests --product-path /Users/admin/builder/spi-builder-workspace/.derivedData/Build/Products/Debug-iphoneos/YPersistenceTests.xctest --extracted-metadata-path /Users/admin/builder/spi-builder-workspace/.derivedData/Build/Products/Debug-iphoneos/YPersistenceTests.xctest/Metadata.appintents --metadata-file-list /Users/admin/builder/spi-builder-workspace/.derivedData/Build/Intermediates.noindex/YPersistence.build/Debug-iphoneos/YPersistenceTests.build/YPersistenceTests.DependencyMetadataFileList --archive-ssu-assets
2025-04-27 15:08:35.492 appintentsnltrainingprocessor[779:4614] Parsing options for appintentsnltrainingprocessor
2025-04-27 15:08:35.493 appintentsnltrainingprocessor[779:4614] No AppShortcuts found - Skipping.
RegisterExecutionPolicyException /Users/admin/builder/spi-builder-workspace/.derivedData/Build/Products/Debug-iphoneos/YPersistenceTests.xctest (in target 'YPersistenceTests' from project 'YPersistence')
cd /Users/admin/builder/spi-builder-workspace
builtin-RegisterExecutionPolicyException /Users/admin/builder/spi-builder-workspace/.derivedData/Build/Products/Debug-iphoneos/YPersistenceTests.xctest
Touch /Users/admin/builder/spi-builder-workspace/.derivedData/Build/Products/Debug-iphoneos/YPersistenceTests.xctest (in target 'YPersistenceTests' from project 'YPersistence')
cd /Users/admin/builder/spi-builder-workspace
/usr/bin/touch -c /Users/admin/builder/spi-builder-workspace/.derivedData/Build/Products/Debug-iphoneos/YPersistenceTests.xctest
** BUILD SUCCEEDED **
Build complete.
{
"dependencies" : [
],
"manifest_display_name" : "YPersistence",
"name" : "YPersistence",
"path" : "/Users/admin/builder/spi-builder-workspace",
"platforms" : [
],
"products" : [
{
"name" : "YPersistence",
"targets" : [
"YPersistence"
],
"type" : {
"library" : [
"automatic"
]
}
}
],
"targets" : [
{
"c99name" : "YPersistenceTests",
"module_type" : "SwiftTarget",
"name" : "YPersistenceTests",
"path" : "Tests/YPersistenceTests",
"sources" : [
"DataModel/Human/ManagedFruit.swift",
"DataModel/Human/ManagedGroceryProduct.swift",
"DataModel/Machine/_ManagedFruit.swift",
"DataModel/Machine/_ManagedGroceryProduct.swift",
"DataModel/Mocks/Fruit.swift",
"DataModel/Mocks/GroceryProduct.swift",
"Extensions/DispatchQueue+executeOnMainTests.swift",
"Extensions/NSManagedObjectContext+SaveChangesTests.swift",
"Extensions/NSManagedObjectModel+initTests.swift",
"Manager/PersistenceManager+BulkDeleteTests.swift",
"Manager/PersistenceManager+ClearTests.swift",
"Manager/PersistenceManager+DeleteTests.swift",
"Manager/PersistenceManager+FetchTests.swift",
"Manager/PersistenceManager+SaveTests.swift",
"Manager/PersistenceManager+SyncTests.swift",
"Manager/PersistenceManagerBaseTests.swift",
"Manager/PersistenceManagerTests.swift",
"Protocols/DataRecordTests.swift",
"Protocols/SyncRecordTests.swift",
"SortColumnTests.swift",
"SortInfoTests.swift"
],
"target_dependencies" : [
"YPersistence"
],
"type" : "test"
},
{
"c99name" : "YPersistence",
"module_type" : "SwiftTarget",
"name" : "YPersistence",
"path" : "Sources/YPersistence",
"product_memberships" : [
"YPersistence"
],
"sources" : [
"Extensions/DispatchQueue+executeOnMain.swift",
"Extensions/NSManagedObjectContext+SaveChanges.swift",
"Extensions/NSManagedObjectModel+init.swift",
"Manager/PersistenceManager+BulkDelete.swift",
"Manager/PersistenceManager+Clear.swift",
"Manager/PersistenceManager+Delete.swift",
"Manager/PersistenceManager+Fetch.swift",
"Manager/PersistenceManager+Save.swift",
"Manager/PersistenceManager+Sync.swift",
"Manager/PersistenceManager.swift",
"Protocols/CoreModel.swift",
"Protocols/DataRecord.swift",
"Protocols/ModelRepresentable.swift",
"Protocols/RecordFromModel.swift",
"Protocols/RecordToModel.swift",
"Protocols/SyncRecord.swift",
"SortColumn.swift",
"SortInfo.swift"
],
"type" : "library"
}
],
"tools_version" : "5.5"
}
Done.