Build Information
Failed to build SwiftTheming, reference v2.0.0 (4843cc
), with Swift 6.1 for Linux on 27 Apr 2025 03:41:10 UTC.
Build Command
bash -c docker run --pull=always --rm -v "checkouts-4606859-0":/host -w "$PWD" registry.gitlab.com/finestructure/spi-images:basic-6.1-latest swift build --triple x86_64-unknown-linux-gnu 2>&1
Build Log
========================================
RunAll
========================================
Builder version: 4.61.0
Interrupt handler set up.
========================================
Checkout
========================================
Clone URL: https://github.com/dscyrescotti/SwiftTheming.git
Reference: v2.0.0
Initialized empty Git repository in /host/spi-builder-workspace/.git/
hint: Using 'master' as the name for the initial branch. This default branch name
hint: is subject to change. To configure the initial branch name to use in all
hint: of your new repositories, which will suppress this warning, call:
hint:
hint: git config --global init.defaultBranch <name>
hint:
hint: Names commonly chosen instead of 'master' are 'main', 'trunk' and
hint: 'development'. The just-created branch can be renamed via this command:
hint:
hint: git branch -m <name>
From https://github.com/dscyrescotti/SwiftTheming
* tag v2.0.0 -> FETCH_HEAD
HEAD is now at 4843ccf docs: regenerate documentation
Cloned https://github.com/dscyrescotti/SwiftTheming.git
Revision (git rev-parse @):
4843ccf46f473e6c2f82cc1675139a18b2a0f109
SUCCESS checkout https://github.com/dscyrescotti/SwiftTheming.git at v2.0.0
========================================
Build
========================================
Selected platform: linux
Swift version: 6.1
Building package at path: $PWD
https://github.com/dscyrescotti/SwiftTheming.git
https://github.com/dscyrescotti/SwiftTheming.git
WARNING: environment variable SUPPRESS_SWIFT_6_FLAGS is not set
{
"dependencies" : [
{
"identity" : "viewinspector",
"requirement" : {
"revision" : [
"0.9.0"
]
},
"type" : "sourceControl",
"url" : "https://github.com/nalexn/ViewInspector.git"
},
{
"identity" : "swift-docc-plugin",
"requirement" : {
"range" : [
{
"lower_bound" : "1.0.0",
"upper_bound" : "2.0.0"
}
]
},
"type" : "sourceControl",
"url" : "https://github.com/apple/swift-docc-plugin"
}
],
"manifest_display_name" : "SwiftTheming",
"name" : "SwiftTheming",
"path" : "/host/spi-builder-workspace",
"platforms" : [
{
"name" : "ios",
"version" : "14.0"
},
{
"name" : "macos",
"version" : "11.0"
},
{
"name" : "tvos",
"version" : "14.0"
},
{
"name" : "watchos",
"version" : "7.0"
}
],
"products" : [
{
"name" : "SwiftTheming",
"targets" : [
"SwiftTheming"
],
"type" : {
"library" : [
"automatic"
]
}
}
],
"swift_languages_versions" : [
"5"
],
"targets" : [
{
"c99name" : "SwiftThemingTests",
"module_type" : "SwiftTarget",
"name" : "SwiftThemingTests",
"path" : "Tests/SwiftThemingTests",
"product_dependencies" : [
"ViewInspector"
],
"sources" : [
"TestCases/AssetableTests.swift",
"TestCases/ColorTests.swift",
"TestCases/DefaultThemingTests.swift",
"TestCases/FontTests.swift",
"TestCases/GradientTests.swift",
"TestCases/ImageTests.swift",
"TestCases/ThemeProviderTests.swift",
"TestCases/ThemeProvidingTests.swift",
"TestCases/UserDefaultsTests.swift",
"Theme/Theme.swift",
"Utils/ValueSpy.swift",
"Views/SpyView.swift",
"Views/TestView.swift"
],
"target_dependencies" : [
"SwiftTheming"
],
"type" : "test"
},
{
"c99name" : "SwiftTheming",
"module_type" : "SwiftTarget",
"name" : "SwiftTheming",
"path" : "Sources/SwiftTheming",
"product_memberships" : [
"SwiftTheming"
],
"sources" : [
"Appearance/Appearance.swift",
"Appearance/PreferredAppearance.swift",
"Asset/AssetKeyWrappable.swift",
"Asset/Assetable.swift",
"Asset/EmptyAsset.swift",
"Asset/Sets/ColorSet.swift",
"Asset/Sets/FontSet.swift",
"Asset/Sets/GradientSet.swift",
"Asset/Sets/ImageSet.swift",
"Extensions/Color++.swift",
"Extensions/Font++.swift",
"Extensions/Gradient++.swift",
"Extensions/Image++.swift",
"Extensions/UserDefaults++.swift",
"Extensions/View++.swift",
"Theme/DefaultTheming.swift",
"Theme/Theme.swift",
"Theme/Themeable.swift",
"Theme/Themed.swift",
"ThemeProvider/ThemeProvider.swift",
"ThemeProvider/ThemeProviding.swift",
"ThemeProvider/ThemeProvidingViewModifier.swift"
],
"type" : "library"
}
],
"tools_version" : "5.5"
}
Running build ...
bash -c docker run --pull=always --rm -v "checkouts-4606859-0":/host -w "$PWD" registry.gitlab.com/finestructure/spi-images:basic-6.1-latest swift build --triple x86_64-unknown-linux-gnu -Xswiftc -Xfrontend -Xswiftc -stats-output-dir -Xswiftc -Xfrontend -Xswiftc .stats -Xswiftc -strict-concurrency=complete -Xswiftc -enable-upcoming-feature -Xswiftc StrictConcurrency -Xswiftc -enable-upcoming-feature -Xswiftc DisableOutwardActorInference -Xswiftc -enable-upcoming-feature -Xswiftc GlobalActorIsolatedTypesUsability -Xswiftc -enable-upcoming-feature -Xswiftc InferSendableFromCaptures 2>&1
basic-6.1-latest: Pulling from finestructure/spi-images
Digest: sha256:3bdcac04179f4ed3e5b8e9dbd6e74bbf5ebc0f4fde48bbaad7d1e5c757e65bcb
Status: Image is up to date for registry.gitlab.com/finestructure/spi-images:basic-6.1-latest
Fetching https://github.com/nalexn/ViewInspector.git
[1/12323] Fetching viewinspector
Fetched https://github.com/nalexn/ViewInspector.git from cache (0.51s)
Fetching https://github.com/apple/swift-docc-plugin
[1/2049] Fetching swift-docc-plugin
Fetched https://github.com/apple/swift-docc-plugin from cache (0.35s)
Computing version for https://github.com/apple/swift-docc-plugin
Computed https://github.com/apple/swift-docc-plugin at 1.4.3 (0.92s)
Fetching https://github.com/swiftlang/swift-docc-symbolkit
[1/3375] Fetching swift-docc-symbolkit
Fetched https://github.com/swiftlang/swift-docc-symbolkit from cache (0.36s)
Computing version for https://github.com/swiftlang/swift-docc-symbolkit
Computed https://github.com/swiftlang/swift-docc-symbolkit at 1.0.0 (0.96s)
Creating working copy for https://github.com/nalexn/ViewInspector.git
Working copy of https://github.com/nalexn/ViewInspector.git resolved at 0.9.0 (0d54687)
Creating working copy for https://github.com/apple/swift-docc-plugin
Working copy of https://github.com/apple/swift-docc-plugin resolved at 1.4.3
Creating working copy for https://github.com/swiftlang/swift-docc-symbolkit
Working copy of https://github.com/swiftlang/swift-docc-symbolkit resolved at 1.0.0
[1/1] Compiling plugin Swift-DocC Preview
[2/2] Compiling plugin Swift-DocC
Building for debugging...
[2/4] Write sources
[3/4] Write swift-version-24593BA9C3E375BF.txt
error: emit-module command failed with exit code 1 (use -v to see invocation)
[5/25] Emitting module SwiftTheming
/host/spi-builder-workspace/Sources/SwiftTheming/Appearance/Appearance.swift:1:8: error: no such module 'SwiftUI'
1 | import SwiftUI
| `- error: no such module 'SwiftUI'
2 |
3 | enum Appearance<T: Equatable>: Equatable {
[6/27] Compiling SwiftTheming Color++.swift
/host/spi-builder-workspace/Sources/SwiftTheming/Appearance/Appearance.swift:1:8: error: no such module 'SwiftUI'
1 | import SwiftUI
| `- error: no such module 'SwiftUI'
2 |
3 | enum Appearance<T: Equatable>: Equatable {
[7/27] Compiling SwiftTheming Font++.swift
/host/spi-builder-workspace/Sources/SwiftTheming/Appearance/Appearance.swift:1:8: error: no such module 'SwiftUI'
1 | import SwiftUI
| `- error: no such module 'SwiftUI'
2 |
3 | enum Appearance<T: Equatable>: Equatable {
[8/27] Compiling SwiftTheming Gradient++.swift
/host/spi-builder-workspace/Sources/SwiftTheming/Appearance/Appearance.swift:1:8: error: no such module 'SwiftUI'
1 | import SwiftUI
| `- error: no such module 'SwiftUI'
2 |
3 | enum Appearance<T: Equatable>: Equatable {
[9/27] Compiling SwiftTheming Themed.swift
/host/spi-builder-workspace/Sources/SwiftTheming/Appearance/Appearance.swift:1:8: error: no such module 'SwiftUI'
1 | import SwiftUI
| `- error: no such module 'SwiftUI'
2 |
3 | enum Appearance<T: Equatable>: Equatable {
[10/27] Compiling SwiftTheming ThemeProvider.swift
/host/spi-builder-workspace/Sources/SwiftTheming/Appearance/Appearance.swift:1:8: error: no such module 'SwiftUI'
1 | import SwiftUI
| `- error: no such module 'SwiftUI'
2 |
3 | enum Appearance<T: Equatable>: Equatable {
[11/27] Compiling SwiftTheming FontSet.swift
/host/spi-builder-workspace/Sources/SwiftTheming/Appearance/Appearance.swift:1:8: error: no such module 'SwiftUI'
1 | import SwiftUI
| `- error: no such module 'SwiftUI'
2 |
3 | enum Appearance<T: Equatable>: Equatable {
[12/27] Compiling SwiftTheming GradientSet.swift
/host/spi-builder-workspace/Sources/SwiftTheming/Appearance/Appearance.swift:1:8: error: no such module 'SwiftUI'
1 | import SwiftUI
| `- error: no such module 'SwiftUI'
2 |
3 | enum Appearance<T: Equatable>: Equatable {
[13/27] Compiling SwiftTheming ImageSet.swift
/host/spi-builder-workspace/Sources/SwiftTheming/Appearance/Appearance.swift:1:8: error: no such module 'SwiftUI'
1 | import SwiftUI
| `- error: no such module 'SwiftUI'
2 |
3 | enum Appearance<T: Equatable>: Equatable {
[14/27] Compiling SwiftTheming ThemeProviding.swift
/host/spi-builder-workspace/Sources/SwiftTheming/Appearance/Appearance.swift:1:8: error: no such module 'SwiftUI'
1 | import SwiftUI
| `- error: no such module 'SwiftUI'
2 |
3 | enum Appearance<T: Equatable>: Equatable {
[15/27] Compiling SwiftTheming ThemeProvidingViewModifier.swift
/host/spi-builder-workspace/Sources/SwiftTheming/Appearance/Appearance.swift:1:8: error: no such module 'SwiftUI'
1 | import SwiftUI
| `- error: no such module 'SwiftUI'
2 |
3 | enum Appearance<T: Equatable>: Equatable {
[16/27] Compiling SwiftTheming Appearance.swift
/host/spi-builder-workspace/Sources/SwiftTheming/Appearance/Appearance.swift:1:8: error: no such module 'SwiftUI'
1 | import SwiftUI
| `- error: no such module 'SwiftUI'
2 |
3 | enum Appearance<T: Equatable>: Equatable {
[17/27] Compiling SwiftTheming PreferredAppearance.swift
/host/spi-builder-workspace/Sources/SwiftTheming/Appearance/Appearance.swift:1:8: error: no such module 'SwiftUI'
1 | import SwiftUI
| `- error: no such module 'SwiftUI'
2 |
3 | enum Appearance<T: Equatable>: Equatable {
[18/27] Compiling SwiftTheming AssetKeyWrappable.swift
/host/spi-builder-workspace/Sources/SwiftTheming/Appearance/Appearance.swift:1:8: error: no such module 'SwiftUI'
1 | import SwiftUI
| `- error: no such module 'SwiftUI'
2 |
3 | enum Appearance<T: Equatable>: Equatable {
[19/27] Compiling SwiftTheming Image++.swift
/host/spi-builder-workspace/Sources/SwiftTheming/Appearance/Appearance.swift:1:8: error: no such module 'SwiftUI'
1 | import SwiftUI
| `- error: no such module 'SwiftUI'
2 |
3 | enum Appearance<T: Equatable>: Equatable {
[20/27] Compiling SwiftTheming UserDefaults++.swift
/host/spi-builder-workspace/Sources/SwiftTheming/Appearance/Appearance.swift:1:8: error: no such module 'SwiftUI'
1 | import SwiftUI
| `- error: no such module 'SwiftUI'
2 |
3 | enum Appearance<T: Equatable>: Equatable {
[21/27] Compiling SwiftTheming View++.swift
/host/spi-builder-workspace/Sources/SwiftTheming/Appearance/Appearance.swift:1:8: error: no such module 'SwiftUI'
1 | import SwiftUI
| `- error: no such module 'SwiftUI'
2 |
3 | enum Appearance<T: Equatable>: Equatable {
[22/27] Compiling SwiftTheming Assetable.swift
/host/spi-builder-workspace/Sources/SwiftTheming/Appearance/Appearance.swift:1:8: error: no such module 'SwiftUI'
1 | import SwiftUI
| `- error: no such module 'SwiftUI'
2 |
3 | enum Appearance<T: Equatable>: Equatable {
[23/27] Compiling SwiftTheming EmptyAsset.swift
/host/spi-builder-workspace/Sources/SwiftTheming/Appearance/Appearance.swift:1:8: error: no such module 'SwiftUI'
1 | import SwiftUI
| `- error: no such module 'SwiftUI'
2 |
3 | enum Appearance<T: Equatable>: Equatable {
[24/27] Compiling SwiftTheming ColorSet.swift
/host/spi-builder-workspace/Sources/SwiftTheming/Appearance/Appearance.swift:1:8: error: no such module 'SwiftUI'
1 | import SwiftUI
| `- error: no such module 'SwiftUI'
2 |
3 | enum Appearance<T: Equatable>: Equatable {
[25/27] Compiling SwiftTheming DefaultTheming.swift
/host/spi-builder-workspace/Sources/SwiftTheming/Appearance/Appearance.swift:1:8: error: no such module 'SwiftUI'
1 | import SwiftUI
| `- error: no such module 'SwiftUI'
2 |
3 | enum Appearance<T: Equatable>: Equatable {
[26/27] Compiling SwiftTheming Theme.swift
/host/spi-builder-workspace/Sources/SwiftTheming/Appearance/Appearance.swift:1:8: error: no such module 'SwiftUI'
1 | import SwiftUI
| `- error: no such module 'SwiftUI'
2 |
3 | enum Appearance<T: Equatable>: Equatable {
[27/27] Compiling SwiftTheming Themeable.swift
/host/spi-builder-workspace/Sources/SwiftTheming/Appearance/Appearance.swift:1:8: error: no such module 'SwiftUI'
1 | import SwiftUI
| `- error: no such module 'SwiftUI'
2 |
3 | enum Appearance<T: Equatable>: Equatable {
Running build ...
bash -c docker run --pull=always --rm -v "checkouts-4606859-0":/host -w "$PWD" registry.gitlab.com/finestructure/spi-images:basic-6.1-latest swift build --triple x86_64-unknown-linux-gnu 2>&1
basic-6.1-latest: Pulling from finestructure/spi-images
Digest: sha256:3bdcac04179f4ed3e5b8e9dbd6e74bbf5ebc0f4fde48bbaad7d1e5c757e65bcb
Status: Image is up to date for registry.gitlab.com/finestructure/spi-images:basic-6.1-latest
[0/1] Planning build
[1/1] Compiling plugin Swift-DocC Preview
[2/2] Compiling plugin Swift-DocC
Building for debugging...
[2/3] Write swift-version-24593BA9C3E375BF.txt
[4/24] Compiling SwiftTheming Assetable.swift
/host/spi-builder-workspace/Sources/SwiftTheming/Appearance/Appearance.swift:1:8: error: no such module 'SwiftUI'
1 | import SwiftUI
| `- error: no such module 'SwiftUI'
2 |
3 | enum Appearance<T: Equatable>: Equatable {
[5/24] Compiling SwiftTheming EmptyAsset.swift
/host/spi-builder-workspace/Sources/SwiftTheming/Appearance/Appearance.swift:1:8: error: no such module 'SwiftUI'
1 | import SwiftUI
| `- error: no such module 'SwiftUI'
2 |
3 | enum Appearance<T: Equatable>: Equatable {
[6/24] Compiling SwiftTheming ColorSet.swift
/host/spi-builder-workspace/Sources/SwiftTheming/Appearance/Appearance.swift:1:8: error: no such module 'SwiftUI'
1 | import SwiftUI
| `- error: no such module 'SwiftUI'
2 |
3 | enum Appearance<T: Equatable>: Equatable {
error: emit-module command failed with exit code 1 (use -v to see invocation)
[7/26] Emitting module SwiftTheming
/host/spi-builder-workspace/Sources/SwiftTheming/Appearance/Appearance.swift:1:8: error: no such module 'SwiftUI'
1 | import SwiftUI
| `- error: no such module 'SwiftUI'
2 |
3 | enum Appearance<T: Equatable>: Equatable {
[8/26] Compiling SwiftTheming Appearance.swift
/host/spi-builder-workspace/Sources/SwiftTheming/Appearance/Appearance.swift:1:8: error: no such module 'SwiftUI'
1 | import SwiftUI
| `- error: no such module 'SwiftUI'
2 |
3 | enum Appearance<T: Equatable>: Equatable {
[9/26] Compiling SwiftTheming PreferredAppearance.swift
/host/spi-builder-workspace/Sources/SwiftTheming/Appearance/Appearance.swift:1:8: error: no such module 'SwiftUI'
1 | import SwiftUI
| `- error: no such module 'SwiftUI'
2 |
3 | enum Appearance<T: Equatable>: Equatable {
[10/26] Compiling SwiftTheming AssetKeyWrappable.swift
/host/spi-builder-workspace/Sources/SwiftTheming/Appearance/Appearance.swift:1:8: error: no such module 'SwiftUI'
1 | import SwiftUI
| `- error: no such module 'SwiftUI'
2 |
3 | enum Appearance<T: Equatable>: Equatable {
[11/26] Compiling SwiftTheming FontSet.swift
/host/spi-builder-workspace/Sources/SwiftTheming/Appearance/Appearance.swift:1:8: error: no such module 'SwiftUI'
1 | import SwiftUI
| `- error: no such module 'SwiftUI'
2 |
3 | enum Appearance<T: Equatable>: Equatable {
[12/26] Compiling SwiftTheming GradientSet.swift
/host/spi-builder-workspace/Sources/SwiftTheming/Appearance/Appearance.swift:1:8: error: no such module 'SwiftUI'
1 | import SwiftUI
| `- error: no such module 'SwiftUI'
2 |
3 | enum Appearance<T: Equatable>: Equatable {
[13/26] Compiling SwiftTheming ImageSet.swift
/host/spi-builder-workspace/Sources/SwiftTheming/Appearance/Appearance.swift:1:8: error: no such module 'SwiftUI'
1 | import SwiftUI
| `- error: no such module 'SwiftUI'
2 |
3 | enum Appearance<T: Equatable>: Equatable {
[14/26] Compiling SwiftTheming Themed.swift
/host/spi-builder-workspace/Sources/SwiftTheming/Appearance/Appearance.swift:1:8: error: no such module 'SwiftUI'
1 | import SwiftUI
| `- error: no such module 'SwiftUI'
2 |
3 | enum Appearance<T: Equatable>: Equatable {
[15/26] Compiling SwiftTheming ThemeProvider.swift
/host/spi-builder-workspace/Sources/SwiftTheming/Appearance/Appearance.swift:1:8: error: no such module 'SwiftUI'
1 | import SwiftUI
| `- error: no such module 'SwiftUI'
2 |
3 | enum Appearance<T: Equatable>: Equatable {
[16/26] Compiling SwiftTheming Color++.swift
/host/spi-builder-workspace/Sources/SwiftTheming/Appearance/Appearance.swift:1:8: error: no such module 'SwiftUI'
1 | import SwiftUI
| `- error: no such module 'SwiftUI'
2 |
3 | enum Appearance<T: Equatable>: Equatable {
[17/26] Compiling SwiftTheming Font++.swift
/host/spi-builder-workspace/Sources/SwiftTheming/Appearance/Appearance.swift:1:8: error: no such module 'SwiftUI'
1 | import SwiftUI
| `- error: no such module 'SwiftUI'
2 |
3 | enum Appearance<T: Equatable>: Equatable {
[18/26] Compiling SwiftTheming Gradient++.swift
/host/spi-builder-workspace/Sources/SwiftTheming/Appearance/Appearance.swift:1:8: error: no such module 'SwiftUI'
1 | import SwiftUI
| `- error: no such module 'SwiftUI'
2 |
3 | enum Appearance<T: Equatable>: Equatable {
[19/26] Compiling SwiftTheming Image++.swift
/host/spi-builder-workspace/Sources/SwiftTheming/Appearance/Appearance.swift:1:8: error: no such module 'SwiftUI'
1 | import SwiftUI
| `- error: no such module 'SwiftUI'
2 |
3 | enum Appearance<T: Equatable>: Equatable {
[20/26] Compiling SwiftTheming UserDefaults++.swift
/host/spi-builder-workspace/Sources/SwiftTheming/Appearance/Appearance.swift:1:8: error: no such module 'SwiftUI'
1 | import SwiftUI
| `- error: no such module 'SwiftUI'
2 |
3 | enum Appearance<T: Equatable>: Equatable {
[21/26] Compiling SwiftTheming View++.swift
/host/spi-builder-workspace/Sources/SwiftTheming/Appearance/Appearance.swift:1:8: error: no such module 'SwiftUI'
1 | import SwiftUI
| `- error: no such module 'SwiftUI'
2 |
3 | enum Appearance<T: Equatable>: Equatable {
[22/26] Compiling SwiftTheming DefaultTheming.swift
/host/spi-builder-workspace/Sources/SwiftTheming/Appearance/Appearance.swift:1:8: error: no such module 'SwiftUI'
1 | import SwiftUI
| `- error: no such module 'SwiftUI'
2 |
3 | enum Appearance<T: Equatable>: Equatable {
[23/26] Compiling SwiftTheming Theme.swift
/host/spi-builder-workspace/Sources/SwiftTheming/Appearance/Appearance.swift:1:8: error: no such module 'SwiftUI'
1 | import SwiftUI
| `- error: no such module 'SwiftUI'
2 |
3 | enum Appearance<T: Equatable>: Equatable {
[24/26] Compiling SwiftTheming Themeable.swift
/host/spi-builder-workspace/Sources/SwiftTheming/Appearance/Appearance.swift:1:8: error: no such module 'SwiftUI'
1 | import SwiftUI
| `- error: no such module 'SwiftUI'
2 |
3 | enum Appearance<T: Equatable>: Equatable {
[25/26] Compiling SwiftTheming ThemeProviding.swift
/host/spi-builder-workspace/Sources/SwiftTheming/Appearance/Appearance.swift:1:8: error: no such module 'SwiftUI'
1 | import SwiftUI
| `- error: no such module 'SwiftUI'
2 |
3 | enum Appearance<T: Equatable>: Equatable {
[26/26] Compiling SwiftTheming ThemeProvidingViewModifier.swift
/host/spi-builder-workspace/Sources/SwiftTheming/Appearance/Appearance.swift:1:8: error: no such module 'SwiftUI'
1 | import SwiftUI
| `- error: no such module 'SwiftUI'
2 |
3 | enum Appearance<T: Equatable>: Equatable {
BUILD FAILURE 6.1 linux