Build Information
Failed to build iOSSnapshotTestCase, reference main (e4b811
), with Swift 6.1 for watchOS using Xcode 16.3 on 26 Apr 2025 16:29:43 UTC.
Build Command
env DEVELOPER_DIR=/Applications/Xcode-16.3.0.app xcrun xcodebuild -IDEClonedSourcePackagesDirPathOverride=$PWD/.dependencies -skipMacroValidation -skipPackagePluginValidation -derivedDataPath $PWD/.derivedData build -scheme iOSSnapshotTestCase -destination generic/platform=watchOS
Build Log
cd /Users/admin/builder/spi-builder-workspace/.swiftpm/xcode
builtin-precompileModule /Users/admin/builder/spi-builder-workspace/.derivedData/Build/Intermediates.noindex/ExplicitPrecompiledModules/_Builtin_stdatomic-5JYN7WM0SPYBZ2IZB7GK9SFRN.scan
PrecompileModule /Users/admin/builder/spi-builder-workspace/.derivedData/Build/Intermediates.noindex/ExplicitPrecompiledModules/_stdlib-5F2PSOGRF6MX0B21DX2SX0GZV.scan
cd /Users/admin/builder/spi-builder-workspace/.swiftpm/xcode
builtin-precompileModule /Users/admin/builder/spi-builder-workspace/.derivedData/Build/Intermediates.noindex/ExplicitPrecompiledModules/_stdlib-5F2PSOGRF6MX0B21DX2SX0GZV.scan
PrecompileModule /Users/admin/builder/spi-builder-workspace/.derivedData/Build/Intermediates.noindex/ExplicitPrecompiledModules/_stdlib-2UBK9C783O8WPLD5O1RMRQ3H9.scan
cd /Users/admin/builder/spi-builder-workspace/.swiftpm/xcode
builtin-precompileModule /Users/admin/builder/spi-builder-workspace/.derivedData/Build/Intermediates.noindex/ExplicitPrecompiledModules/_stdlib-2UBK9C783O8WPLD5O1RMRQ3H9.scan
PrecompileModule /Users/admin/builder/spi-builder-workspace/.derivedData/Build/Intermediates.noindex/ExplicitPrecompiledModules/_math-1BP51VECQ5JYORUW2RZKWZBTC.scan
cd /Users/admin/builder/spi-builder-workspace/.swiftpm/xcode
builtin-precompileModule /Users/admin/builder/spi-builder-workspace/.derivedData/Build/Intermediates.noindex/ExplicitPrecompiledModules/_math-1BP51VECQ5JYORUW2RZKWZBTC.scan
PrecompileModule /Users/admin/builder/spi-builder-workspace/.derivedData/Build/Intermediates.noindex/ExplicitPrecompiledModules/unistd-3E05WZ0AZOJULIJ1JFQS3PS1E.scan
cd /Users/admin/builder/spi-builder-workspace/.swiftpm/xcode
builtin-precompileModule /Users/admin/builder/spi-builder-workspace/.derivedData/Build/Intermediates.noindex/ExplicitPrecompiledModules/unistd-3E05WZ0AZOJULIJ1JFQS3PS1E.scan
PrecompileModule /Users/admin/builder/spi-builder-workspace/.derivedData/Build/Intermediates.noindex/ExplicitPrecompiledModules/unistd-EHZ5DIEIFOU2B1XYT3VLIQF0R.scan
cd /Users/admin/builder/spi-builder-workspace/.swiftpm/xcode
builtin-precompileModule /Users/admin/builder/spi-builder-workspace/.derivedData/Build/Intermediates.noindex/ExplicitPrecompiledModules/unistd-EHZ5DIEIFOU2B1XYT3VLIQF0R.scan
ScanDependencies /Users/admin/builder/spi-builder-workspace/.derivedData/Build/Intermediates.noindex/iOSSnapshotTestCase.build/Debug-watchos/iOSSnapshotTestCaseCore.build/Objects-normal/arm64_32/FBSnapshotTestCase.o /Users/admin/builder/spi-builder-workspace/src/iOSSnapshotTestCaseCore/FBSnapshotTestCase.m normal arm64_32 objective-c com.apple.compilers.llvm.clang.1_0.compiler (in target 'iOSSnapshotTestCaseCore' from project 'iOSSnapshotTestCase')
cd /Users/admin/builder/spi-builder-workspace/.swiftpm/xcode
Using response file: /Users/admin/builder/spi-builder-workspace/.derivedData/Build/Intermediates.noindex/iOSSnapshotTestCase.build/Debug-watchos/iOSSnapshotTestCaseCore.build/Objects-normal/arm64_32/e6072d4f65d7061329687fe24e3d63a7-common-args.resp
builtin-ScanDependencies -o /Users/admin/builder/spi-builder-workspace/.derivedData/Build/Intermediates.noindex/iOSSnapshotTestCase.build/Debug-watchos/iOSSnapshotTestCaseCore.build/Objects-normal/arm64_32/FBSnapshotTestCase.o.scan -- /Applications/Xcode-16.3.0.app/Contents/Developer/Toolchains/XcodeDefault.xctoolchain/usr/bin/clang -x objective-c -ivfsstatcache /Users/admin/builder/spi-builder-workspace/.derivedData/SDKStatCaches.noindex/watchos11.4-22T246-43efb940ff07ba2497b70ec94253f576.sdkstatcache -fmessage-length\=0 -fdiagnostics-show-note-include-stack -fmacro-backtrace-limit\=0 -fno-color-diagnostics -fmodules-prune-interval\=86400 -fmodules-prune-after\=345600 -fbuild-session-file\=/Users/admin/builder/spi-builder-workspace/.derivedData/ModuleCache.noindex/Session.modulevalidation -fmodules-validate-once-per-build-session -Wnon-modular-include-in-framework-module -Werror\=non-modular-include-in-framework-module -Wno-trigraphs -Wno-missing-field-initializers -Wno-missing-prototypes -Wno-return-type -Wno-implicit-atomic-properties -Wno-objc-interface-ivars -Wno-arc-repeated-use-of-weak -Wno-missing-braces -Wparentheses -Wswitch -Wno-unused-function -Wno-unused-label -Wno-unused-parameter -Wno-unused-variable -Wunused-value -Wno-empty-body -Wno-uninitialized -Wno-unknown-pragmas -Wno-shadow -Wno-four-char-constants -Wno-conversion -Wno-constant-conversion -Wno-int-conversion -Wno-bool-conversion -Wno-enum-conversion -Wno-float-conversion -Wno-non-literal-null-conversion -Wno-objc-literal-conversion -Wno-shorten-64-to-32 -Wpointer-sign -Wno-newline-eof -Wno-selector -Wno-strict-selector-match -Wno-undeclared-selector -Wno-deprecated-implementations -Wno-implicit-fallthrough -fstrict-aliasing -Wprotocol -Wdeprecated-declarations -Wno-sign-conversion -Wno-infinite-recursion -Wno-comma -Wno-block-capture-autoreleasing -Wno-strict-prototypes -Wno-semicolon-before-method-body -index-store-path /Users/admin/builder/spi-builder-workspace/.derivedData/Index.noindex/DataStore @/Users/admin/builder/spi-builder-workspace/.derivedData/Build/Intermediates.noindex/iOSSnapshotTestCase.build/Debug-watchos/iOSSnapshotTestCaseCore.build/Objects-normal/arm64_32/e6072d4f65d7061329687fe24e3d63a7-common-args.resp -MMD -MT dependencies -MF /Users/admin/builder/spi-builder-workspace/.derivedData/Build/Intermediates.noindex/iOSSnapshotTestCase.build/Debug-watchos/iOSSnapshotTestCaseCore.build/Objects-normal/arm64_32/FBSnapshotTestCase.d --serialize-diagnostics /Users/admin/builder/spi-builder-workspace/.derivedData/Build/Intermediates.noindex/iOSSnapshotTestCase.build/Debug-watchos/iOSSnapshotTestCaseCore.build/Objects-normal/arm64_32/FBSnapshotTestCase.dia -c /Users/admin/builder/spi-builder-workspace/src/iOSSnapshotTestCaseCore/FBSnapshotTestCase.m -o /Users/admin/builder/spi-builder-workspace/.derivedData/Build/Intermediates.noindex/iOSSnapshotTestCase.build/Debug-watchos/iOSSnapshotTestCaseCore.build/Objects-normal/arm64_32/FBSnapshotTestCase.o -index-unit-output-path /iOSSnapshotTestCase.build/Debug-watchos/iOSSnapshotTestCaseCore.build/Objects-normal/arm64_32/FBSnapshotTestCase.o
ScanDependencies /Users/admin/builder/spi-builder-workspace/.derivedData/Build/Intermediates.noindex/iOSSnapshotTestCase.build/Debug-watchos/iOSSnapshotTestCaseCore.build/Objects-normal/arm64/UIImage+Snapshot.o /Users/admin/builder/spi-builder-workspace/src/iOSSnapshotTestCaseCore/Categories/UIImage+Snapshot.m normal arm64 objective-c com.apple.compilers.llvm.clang.1_0.compiler (in target 'iOSSnapshotTestCaseCore' from project 'iOSSnapshotTestCase')
cd /Users/admin/builder/spi-builder-workspace/.swiftpm/xcode
Using response file: /Users/admin/builder/spi-builder-workspace/.derivedData/Build/Intermediates.noindex/iOSSnapshotTestCase.build/Debug-watchos/iOSSnapshotTestCaseCore.build/Objects-normal/arm64/e6072d4f65d7061329687fe24e3d63a7-common-args.resp
builtin-ScanDependencies -o /Users/admin/builder/spi-builder-workspace/.derivedData/Build/Intermediates.noindex/iOSSnapshotTestCase.build/Debug-watchos/iOSSnapshotTestCaseCore.build/Objects-normal/arm64/UIImage+Snapshot.o.scan -- /Applications/Xcode-16.3.0.app/Contents/Developer/Toolchains/XcodeDefault.xctoolchain/usr/bin/clang -x objective-c -ivfsstatcache /Users/admin/builder/spi-builder-workspace/.derivedData/SDKStatCaches.noindex/watchos11.4-22T246-43efb940ff07ba2497b70ec94253f576.sdkstatcache -fmessage-length\=0 -fdiagnostics-show-note-include-stack -fmacro-backtrace-limit\=0 -fno-color-diagnostics -fmodules-prune-interval\=86400 -fmodules-prune-after\=345600 -fbuild-session-file\=/Users/admin/builder/spi-builder-workspace/.derivedData/ModuleCache.noindex/Session.modulevalidation -fmodules-validate-once-per-build-session -Wnon-modular-include-in-framework-module -Werror\=non-modular-include-in-framework-module -Wno-trigraphs -Wno-missing-field-initializers -Wno-missing-prototypes -Wno-return-type -Wno-implicit-atomic-properties -Wno-objc-interface-ivars -Wno-arc-repeated-use-of-weak -Wno-missing-braces -Wparentheses -Wswitch -Wno-unused-function -Wno-unused-label -Wno-unused-parameter -Wno-unused-variable -Wunused-value -Wno-empty-body -Wno-uninitialized -Wno-unknown-pragmas -Wno-shadow -Wno-four-char-constants -Wno-conversion -Wno-constant-conversion -Wno-int-conversion -Wno-bool-conversion -Wno-enum-conversion -Wno-float-conversion -Wno-non-literal-null-conversion -Wno-objc-literal-conversion -Wshorten-64-to-32 -Wpointer-sign -Wno-newline-eof -Wno-selector -Wno-strict-selector-match -Wno-undeclared-selector -Wno-deprecated-implementations -Wno-implicit-fallthrough -fstrict-aliasing -Wprotocol -Wdeprecated-declarations -Wno-sign-conversion -Wno-infinite-recursion -Wno-comma -Wno-block-capture-autoreleasing -Wno-strict-prototypes -Wno-semicolon-before-method-body -index-store-path /Users/admin/builder/spi-builder-workspace/.derivedData/Index.noindex/DataStore @/Users/admin/builder/spi-builder-workspace/.derivedData/Build/Intermediates.noindex/iOSSnapshotTestCase.build/Debug-watchos/iOSSnapshotTestCaseCore.build/Objects-normal/arm64/e6072d4f65d7061329687fe24e3d63a7-common-args.resp -MMD -MT dependencies -MF /Users/admin/builder/spi-builder-workspace/.derivedData/Build/Intermediates.noindex/iOSSnapshotTestCase.build/Debug-watchos/iOSSnapshotTestCaseCore.build/Objects-normal/arm64/UIImage+Snapshot.d --serialize-diagnostics /Users/admin/builder/spi-builder-workspace/.derivedData/Build/Intermediates.noindex/iOSSnapshotTestCase.build/Debug-watchos/iOSSnapshotTestCaseCore.build/Objects-normal/arm64/UIImage+Snapshot.dia -c /Users/admin/builder/spi-builder-workspace/src/iOSSnapshotTestCaseCore/Categories/UIImage+Snapshot.m -o /Users/admin/builder/spi-builder-workspace/.derivedData/Build/Intermediates.noindex/iOSSnapshotTestCase.build/Debug-watchos/iOSSnapshotTestCaseCore.build/Objects-normal/arm64/UIImage+Snapshot.o -index-unit-output-path /iOSSnapshotTestCase.build/Debug-watchos/iOSSnapshotTestCaseCore.build/Objects-normal/arm64/UIImage+Snapshot.o
ScanDependencies /Users/admin/builder/spi-builder-workspace/.derivedData/Build/Intermediates.noindex/iOSSnapshotTestCase.build/Debug-watchos/iOSSnapshotTestCaseCore.build/Objects-normal/arm64/UIImage+Diff.o /Users/admin/builder/spi-builder-workspace/src/iOSSnapshotTestCaseCore/Categories/UIImage+Diff.m normal arm64 objective-c com.apple.compilers.llvm.clang.1_0.compiler (in target 'iOSSnapshotTestCaseCore' from project 'iOSSnapshotTestCase')
cd /Users/admin/builder/spi-builder-workspace/.swiftpm/xcode
Using response file: /Users/admin/builder/spi-builder-workspace/.derivedData/Build/Intermediates.noindex/iOSSnapshotTestCase.build/Debug-watchos/iOSSnapshotTestCaseCore.build/Objects-normal/arm64/e6072d4f65d7061329687fe24e3d63a7-common-args.resp
builtin-ScanDependencies -o /Users/admin/builder/spi-builder-workspace/.derivedData/Build/Intermediates.noindex/iOSSnapshotTestCase.build/Debug-watchos/iOSSnapshotTestCaseCore.build/Objects-normal/arm64/UIImage+Diff.o.scan -- /Applications/Xcode-16.3.0.app/Contents/Developer/Toolchains/XcodeDefault.xctoolchain/usr/bin/clang -x objective-c -ivfsstatcache /Users/admin/builder/spi-builder-workspace/.derivedData/SDKStatCaches.noindex/watchos11.4-22T246-43efb940ff07ba2497b70ec94253f576.sdkstatcache -fmessage-length\=0 -fdiagnostics-show-note-include-stack -fmacro-backtrace-limit\=0 -fno-color-diagnostics -fmodules-prune-interval\=86400 -fmodules-prune-after\=345600 -fbuild-session-file\=/Users/admin/builder/spi-builder-workspace/.derivedData/ModuleCache.noindex/Session.modulevalidation -fmodules-validate-once-per-build-session -Wnon-modular-include-in-framework-module -Werror\=non-modular-include-in-framework-module -Wno-trigraphs -Wno-missing-field-initializers -Wno-missing-prototypes -Wno-return-type -Wno-implicit-atomic-properties -Wno-objc-interface-ivars -Wno-arc-repeated-use-of-weak -Wno-missing-braces -Wparentheses -Wswitch -Wno-unused-function -Wno-unused-label -Wno-unused-parameter -Wno-unused-variable -Wunused-value -Wno-empty-body -Wno-uninitialized -Wno-unknown-pragmas -Wno-shadow -Wno-four-char-constants -Wno-conversion -Wno-constant-conversion -Wno-int-conversion -Wno-bool-conversion -Wno-enum-conversion -Wno-float-conversion -Wno-non-literal-null-conversion -Wno-objc-literal-conversion -Wshorten-64-to-32 -Wpointer-sign -Wno-newline-eof -Wno-selector -Wno-strict-selector-match -Wno-undeclared-selector -Wno-deprecated-implementations -Wno-implicit-fallthrough -fstrict-aliasing -Wprotocol -Wdeprecated-declarations -Wno-sign-conversion -Wno-infinite-recursion -Wno-comma -Wno-block-capture-autoreleasing -Wno-strict-prototypes -Wno-semicolon-before-method-body -index-store-path /Users/admin/builder/spi-builder-workspace/.derivedData/Index.noindex/DataStore @/Users/admin/builder/spi-builder-workspace/.derivedData/Build/Intermediates.noindex/iOSSnapshotTestCase.build/Debug-watchos/iOSSnapshotTestCaseCore.build/Objects-normal/arm64/e6072d4f65d7061329687fe24e3d63a7-common-args.resp -MMD -MT dependencies -MF /Users/admin/builder/spi-builder-workspace/.derivedData/Build/Intermediates.noindex/iOSSnapshotTestCase.build/Debug-watchos/iOSSnapshotTestCaseCore.build/Objects-normal/arm64/UIImage+Diff.d --serialize-diagnostics /Users/admin/builder/spi-builder-workspace/.derivedData/Build/Intermediates.noindex/iOSSnapshotTestCase.build/Debug-watchos/iOSSnapshotTestCaseCore.build/Objects-normal/arm64/UIImage+Diff.dia -c /Users/admin/builder/spi-builder-workspace/src/iOSSnapshotTestCaseCore/Categories/UIImage+Diff.m -o /Users/admin/builder/spi-builder-workspace/.derivedData/Build/Intermediates.noindex/iOSSnapshotTestCase.build/Debug-watchos/iOSSnapshotTestCaseCore.build/Objects-normal/arm64/UIImage+Diff.o -index-unit-output-path /iOSSnapshotTestCase.build/Debug-watchos/iOSSnapshotTestCaseCore.build/Objects-normal/arm64/UIImage+Diff.o
ScanDependencies /Users/admin/builder/spi-builder-workspace/.derivedData/Build/Intermediates.noindex/iOSSnapshotTestCase.build/Debug-watchos/iOSSnapshotTestCaseCore.build/Objects-normal/arm64/UIImage+Compare.o /Users/admin/builder/spi-builder-workspace/src/iOSSnapshotTestCaseCore/Categories/UIImage+Compare.m normal arm64 objective-c com.apple.compilers.llvm.clang.1_0.compiler (in target 'iOSSnapshotTestCaseCore' from project 'iOSSnapshotTestCase')
cd /Users/admin/builder/spi-builder-workspace/.swiftpm/xcode
Using response file: /Users/admin/builder/spi-builder-workspace/.derivedData/Build/Intermediates.noindex/iOSSnapshotTestCase.build/Debug-watchos/iOSSnapshotTestCaseCore.build/Objects-normal/arm64/e6072d4f65d7061329687fe24e3d63a7-common-args.resp
builtin-ScanDependencies -o /Users/admin/builder/spi-builder-workspace/.derivedData/Build/Intermediates.noindex/iOSSnapshotTestCase.build/Debug-watchos/iOSSnapshotTestCaseCore.build/Objects-normal/arm64/UIImage+Compare.o.scan -- /Applications/Xcode-16.3.0.app/Contents/Developer/Toolchains/XcodeDefault.xctoolchain/usr/bin/clang -x objective-c -ivfsstatcache /Users/admin/builder/spi-builder-workspace/.derivedData/SDKStatCaches.noindex/watchos11.4-22T246-43efb940ff07ba2497b70ec94253f576.sdkstatcache -fmessage-length\=0 -fdiagnostics-show-note-include-stack -fmacro-backtrace-limit\=0 -fno-color-diagnostics -fmodules-prune-interval\=86400 -fmodules-prune-after\=345600 -fbuild-session-file\=/Users/admin/builder/spi-builder-workspace/.derivedData/ModuleCache.noindex/Session.modulevalidation -fmodules-validate-once-per-build-session -Wnon-modular-include-in-framework-module -Werror\=non-modular-include-in-framework-module -Wno-trigraphs -Wno-missing-field-initializers -Wno-missing-prototypes -Wno-return-type -Wno-implicit-atomic-properties -Wno-objc-interface-ivars -Wno-arc-repeated-use-of-weak -Wno-missing-braces -Wparentheses -Wswitch -Wno-unused-function -Wno-unused-label -Wno-unused-parameter -Wno-unused-variable -Wunused-value -Wno-empty-body -Wno-uninitialized -Wno-unknown-pragmas -Wno-shadow -Wno-four-char-constants -Wno-conversion -Wno-constant-conversion -Wno-int-conversion -Wno-bool-conversion -Wno-enum-conversion -Wno-float-conversion -Wno-non-literal-null-conversion -Wno-objc-literal-conversion -Wshorten-64-to-32 -Wpointer-sign -Wno-newline-eof -Wno-selector -Wno-strict-selector-match -Wno-undeclared-selector -Wno-deprecated-implementations -Wno-implicit-fallthrough -fstrict-aliasing -Wprotocol -Wdeprecated-declarations -Wno-sign-conversion -Wno-infinite-recursion -Wno-comma -Wno-block-capture-autoreleasing -Wno-strict-prototypes -Wno-semicolon-before-method-body -index-store-path /Users/admin/builder/spi-builder-workspace/.derivedData/Index.noindex/DataStore @/Users/admin/builder/spi-builder-workspace/.derivedData/Build/Intermediates.noindex/iOSSnapshotTestCase.build/Debug-watchos/iOSSnapshotTestCaseCore.build/Objects-normal/arm64/e6072d4f65d7061329687fe24e3d63a7-common-args.resp -MMD -MT dependencies -MF /Users/admin/builder/spi-builder-workspace/.derivedData/Build/Intermediates.noindex/iOSSnapshotTestCase.build/Debug-watchos/iOSSnapshotTestCaseCore.build/Objects-normal/arm64/UIImage+Compare.d --serialize-diagnostics /Users/admin/builder/spi-builder-workspace/.derivedData/Build/Intermediates.noindex/iOSSnapshotTestCase.build/Debug-watchos/iOSSnapshotTestCaseCore.build/Objects-normal/arm64/UIImage+Compare.dia -c /Users/admin/builder/spi-builder-workspace/src/iOSSnapshotTestCaseCore/Categories/UIImage+Compare.m -o /Users/admin/builder/spi-builder-workspace/.derivedData/Build/Intermediates.noindex/iOSSnapshotTestCase.build/Debug-watchos/iOSSnapshotTestCaseCore.build/Objects-normal/arm64/UIImage+Compare.o -index-unit-output-path /iOSSnapshotTestCase.build/Debug-watchos/iOSSnapshotTestCaseCore.build/Objects-normal/arm64/UIImage+Compare.o
ScanDependencies /Users/admin/builder/spi-builder-workspace/.derivedData/Build/Intermediates.noindex/iOSSnapshotTestCase.build/Debug-watchos/iOSSnapshotTestCaseCore.build/Objects-normal/arm64/UIApplication+KeyWindow.o /Users/admin/builder/spi-builder-workspace/src/iOSSnapshotTestCaseCore/Categories/UIApplication+KeyWindow.m normal arm64 objective-c com.apple.compilers.llvm.clang.1_0.compiler (in target 'iOSSnapshotTestCaseCore' from project 'iOSSnapshotTestCase')
cd /Users/admin/builder/spi-builder-workspace/.swiftpm/xcode
Using response file: /Users/admin/builder/spi-builder-workspace/.derivedData/Build/Intermediates.noindex/iOSSnapshotTestCase.build/Debug-watchos/iOSSnapshotTestCaseCore.build/Objects-normal/arm64/e6072d4f65d7061329687fe24e3d63a7-common-args.resp
builtin-ScanDependencies -o /Users/admin/builder/spi-builder-workspace/.derivedData/Build/Intermediates.noindex/iOSSnapshotTestCase.build/Debug-watchos/iOSSnapshotTestCaseCore.build/Objects-normal/arm64/UIApplication+KeyWindow.o.scan -- /Applications/Xcode-16.3.0.app/Contents/Developer/Toolchains/XcodeDefault.xctoolchain/usr/bin/clang -x objective-c -ivfsstatcache /Users/admin/builder/spi-builder-workspace/.derivedData/SDKStatCaches.noindex/watchos11.4-22T246-43efb940ff07ba2497b70ec94253f576.sdkstatcache -fmessage-length\=0 -fdiagnostics-show-note-include-stack -fmacro-backtrace-limit\=0 -fno-color-diagnostics -fmodules-prune-interval\=86400 -fmodules-prune-after\=345600 -fbuild-session-file\=/Users/admin/builder/spi-builder-workspace/.derivedData/ModuleCache.noindex/Session.modulevalidation -fmodules-validate-once-per-build-session -Wnon-modular-include-in-framework-module -Werror\=non-modular-include-in-framework-module -Wno-trigraphs -Wno-missing-field-initializers -Wno-missing-prototypes -Wno-return-type -Wno-implicit-atomic-properties -Wno-objc-interface-ivars -Wno-arc-repeated-use-of-weak -Wno-missing-braces -Wparentheses -Wswitch -Wno-unused-function -Wno-unused-label -Wno-unused-parameter -Wno-unused-variable -Wunused-value -Wno-empty-body -Wno-uninitialized -Wno-unknown-pragmas -Wno-shadow -Wno-four-char-constants -Wno-conversion -Wno-constant-conversion -Wno-int-conversion -Wno-bool-conversion -Wno-enum-conversion -Wno-float-conversion -Wno-non-literal-null-conversion -Wno-objc-literal-conversion -Wshorten-64-to-32 -Wpointer-sign -Wno-newline-eof -Wno-selector -Wno-strict-selector-match -Wno-undeclared-selector -Wno-deprecated-implementations -Wno-implicit-fallthrough -fstrict-aliasing -Wprotocol -Wdeprecated-declarations -Wno-sign-conversion -Wno-infinite-recursion -Wno-comma -Wno-block-capture-autoreleasing -Wno-strict-prototypes -Wno-semicolon-before-method-body -index-store-path /Users/admin/builder/spi-builder-workspace/.derivedData/Index.noindex/DataStore @/Users/admin/builder/spi-builder-workspace/.derivedData/Build/Intermediates.noindex/iOSSnapshotTestCase.build/Debug-watchos/iOSSnapshotTestCaseCore.build/Objects-normal/arm64/e6072d4f65d7061329687fe24e3d63a7-common-args.resp -MMD -MT dependencies -MF /Users/admin/builder/spi-builder-workspace/.derivedData/Build/Intermediates.noindex/iOSSnapshotTestCase.build/Debug-watchos/iOSSnapshotTestCaseCore.build/Objects-normal/arm64/UIApplication+KeyWindow.d --serialize-diagnostics /Users/admin/builder/spi-builder-workspace/.derivedData/Build/Intermediates.noindex/iOSSnapshotTestCase.build/Debug-watchos/iOSSnapshotTestCaseCore.build/Objects-normal/arm64/UIApplication+KeyWindow.dia -c /Users/admin/builder/spi-builder-workspace/src/iOSSnapshotTestCaseCore/Categories/UIApplication+KeyWindow.m -o /Users/admin/builder/spi-builder-workspace/.derivedData/Build/Intermediates.noindex/iOSSnapshotTestCase.build/Debug-watchos/iOSSnapshotTestCaseCore.build/Objects-normal/arm64/UIApplication+KeyWindow.o -index-unit-output-path /iOSSnapshotTestCase.build/Debug-watchos/iOSSnapshotTestCaseCore.build/Objects-normal/arm64/UIApplication+KeyWindow.o
PrecompileModule /Users/admin/builder/spi-builder-workspace/.derivedData/Build/Intermediates.noindex/ExplicitPrecompiledModules/_tgmath-D1EKR4AYHQELN8ILB42TM69CW.scan
cd /Users/admin/builder/spi-builder-workspace/.swiftpm/xcode
builtin-precompileModule /Users/admin/builder/spi-builder-workspace/.derivedData/Build/Intermediates.noindex/ExplicitPrecompiledModules/_tgmath-D1EKR4AYHQELN8ILB42TM69CW.scan
PrecompileModule /Users/admin/builder/spi-builder-workspace/.derivedData/Build/Intermediates.noindex/ExplicitPrecompiledModules/Darwin-BN1NRD7M31J32F7KIYDMORIUI.scan
cd /Users/admin/builder/spi-builder-workspace/.swiftpm/xcode
builtin-precompileModule /Users/admin/builder/spi-builder-workspace/.derivedData/Build/Intermediates.noindex/ExplicitPrecompiledModules/Darwin-BN1NRD7M31J32F7KIYDMORIUI.scan
ScanDependencies /Users/admin/builder/spi-builder-workspace/.derivedData/Build/Intermediates.noindex/iOSSnapshotTestCase.build/Debug-watchos/iOSSnapshotTestCaseCore.build/Objects-normal/arm64/FBSnapshotTestController.o /Users/admin/builder/spi-builder-workspace/src/iOSSnapshotTestCaseCore/FBSnapshotTestController.m normal arm64 objective-c com.apple.compilers.llvm.clang.1_0.compiler (in target 'iOSSnapshotTestCaseCore' from project 'iOSSnapshotTestCase')
cd /Users/admin/builder/spi-builder-workspace/.swiftpm/xcode
Using response file: /Users/admin/builder/spi-builder-workspace/.derivedData/Build/Intermediates.noindex/iOSSnapshotTestCase.build/Debug-watchos/iOSSnapshotTestCaseCore.build/Objects-normal/arm64/e6072d4f65d7061329687fe24e3d63a7-common-args.resp
builtin-ScanDependencies -o /Users/admin/builder/spi-builder-workspace/.derivedData/Build/Intermediates.noindex/iOSSnapshotTestCase.build/Debug-watchos/iOSSnapshotTestCaseCore.build/Objects-normal/arm64/FBSnapshotTestController.o.scan -- /Applications/Xcode-16.3.0.app/Contents/Developer/Toolchains/XcodeDefault.xctoolchain/usr/bin/clang -x objective-c -ivfsstatcache /Users/admin/builder/spi-builder-workspace/.derivedData/SDKStatCaches.noindex/watchos11.4-22T246-43efb940ff07ba2497b70ec94253f576.sdkstatcache -fmessage-length\=0 -fdiagnostics-show-note-include-stack -fmacro-backtrace-limit\=0 -fno-color-diagnostics -fmodules-prune-interval\=86400 -fmodules-prune-after\=345600 -fbuild-session-file\=/Users/admin/builder/spi-builder-workspace/.derivedData/ModuleCache.noindex/Session.modulevalidation -fmodules-validate-once-per-build-session -Wnon-modular-include-in-framework-module -Werror\=non-modular-include-in-framework-module -Wno-trigraphs -Wno-missing-field-initializers -Wno-missing-prototypes -Wno-return-type -Wno-implicit-atomic-properties -Wno-objc-interface-ivars -Wno-arc-repeated-use-of-weak -Wno-missing-braces -Wparentheses -Wswitch -Wno-unused-function -Wno-unused-label -Wno-unused-parameter -Wno-unused-variable -Wunused-value -Wno-empty-body -Wno-uninitialized -Wno-unknown-pragmas -Wno-shadow -Wno-four-char-constants -Wno-conversion -Wno-constant-conversion -Wno-int-conversion -Wno-bool-conversion -Wno-enum-conversion -Wno-float-conversion -Wno-non-literal-null-conversion -Wno-objc-literal-conversion -Wshorten-64-to-32 -Wpointer-sign -Wno-newline-eof -Wno-selector -Wno-strict-selector-match -Wno-undeclared-selector -Wno-deprecated-implementations -Wno-implicit-fallthrough -fstrict-aliasing -Wprotocol -Wdeprecated-declarations -Wno-sign-conversion -Wno-infinite-recursion -Wno-comma -Wno-block-capture-autoreleasing -Wno-strict-prototypes -Wno-semicolon-before-method-body -index-store-path /Users/admin/builder/spi-builder-workspace/.derivedData/Index.noindex/DataStore @/Users/admin/builder/spi-builder-workspace/.derivedData/Build/Intermediates.noindex/iOSSnapshotTestCase.build/Debug-watchos/iOSSnapshotTestCaseCore.build/Objects-normal/arm64/e6072d4f65d7061329687fe24e3d63a7-common-args.resp -MMD -MT dependencies -MF /Users/admin/builder/spi-builder-workspace/.derivedData/Build/Intermediates.noindex/iOSSnapshotTestCase.build/Debug-watchos/iOSSnapshotTestCaseCore.build/Objects-normal/arm64/FBSnapshotTestController.d --serialize-diagnostics /Users/admin/builder/spi-builder-workspace/.derivedData/Build/Intermediates.noindex/iOSSnapshotTestCase.build/Debug-watchos/iOSSnapshotTestCaseCore.build/Objects-normal/arm64/FBSnapshotTestController.dia -c /Users/admin/builder/spi-builder-workspace/src/iOSSnapshotTestCaseCore/FBSnapshotTestController.m -o /Users/admin/builder/spi-builder-workspace/.derivedData/Build/Intermediates.noindex/iOSSnapshotTestCase.build/Debug-watchos/iOSSnapshotTestCaseCore.build/Objects-normal/arm64/FBSnapshotTestController.o -index-unit-output-path /iOSSnapshotTestCase.build/Debug-watchos/iOSSnapshotTestCaseCore.build/Objects-normal/arm64/FBSnapshotTestController.o
ScanDependencies /Users/admin/builder/spi-builder-workspace/.derivedData/Build/Intermediates.noindex/iOSSnapshotTestCase.build/Debug-watchos/iOSSnapshotTestCaseCore.build/Objects-normal/arm64/FBSnapshotTestCasePlatform.o /Users/admin/builder/spi-builder-workspace/src/iOSSnapshotTestCaseCore/FBSnapshotTestCasePlatform.m normal arm64 objective-c com.apple.compilers.llvm.clang.1_0.compiler (in target 'iOSSnapshotTestCaseCore' from project 'iOSSnapshotTestCase')
cd /Users/admin/builder/spi-builder-workspace/.swiftpm/xcode
Using response file: /Users/admin/builder/spi-builder-workspace/.derivedData/Build/Intermediates.noindex/iOSSnapshotTestCase.build/Debug-watchos/iOSSnapshotTestCaseCore.build/Objects-normal/arm64/e6072d4f65d7061329687fe24e3d63a7-common-args.resp
builtin-ScanDependencies -o /Users/admin/builder/spi-builder-workspace/.derivedData/Build/Intermediates.noindex/iOSSnapshotTestCase.build/Debug-watchos/iOSSnapshotTestCaseCore.build/Objects-normal/arm64/FBSnapshotTestCasePlatform.o.scan -- /Applications/Xcode-16.3.0.app/Contents/Developer/Toolchains/XcodeDefault.xctoolchain/usr/bin/clang -x objective-c -ivfsstatcache /Users/admin/builder/spi-builder-workspace/.derivedData/SDKStatCaches.noindex/watchos11.4-22T246-43efb940ff07ba2497b70ec94253f576.sdkstatcache -fmessage-length\=0 -fdiagnostics-show-note-include-stack -fmacro-backtrace-limit\=0 -fno-color-diagnostics -fmodules-prune-interval\=86400 -fmodules-prune-after\=345600 -fbuild-session-file\=/Users/admin/builder/spi-builder-workspace/.derivedData/ModuleCache.noindex/Session.modulevalidation -fmodules-validate-once-per-build-session -Wnon-modular-include-in-framework-module -Werror\=non-modular-include-in-framework-module -Wno-trigraphs -Wno-missing-field-initializers -Wno-missing-prototypes -Wno-return-type -Wno-implicit-atomic-properties -Wno-objc-interface-ivars -Wno-arc-repeated-use-of-weak -Wno-missing-braces -Wparentheses -Wswitch -Wno-unused-function -Wno-unused-label -Wno-unused-parameter -Wno-unused-variable -Wunused-value -Wno-empty-body -Wno-uninitialized -Wno-unknown-pragmas -Wno-shadow -Wno-four-char-constants -Wno-conversion -Wno-constant-conversion -Wno-int-conversion -Wno-bool-conversion -Wno-enum-conversion -Wno-float-conversion -Wno-non-literal-null-conversion -Wno-objc-literal-conversion -Wshorten-64-to-32 -Wpointer-sign -Wno-newline-eof -Wno-selector -Wno-strict-selector-match -Wno-undeclared-selector -Wno-deprecated-implementations -Wno-implicit-fallthrough -fstrict-aliasing -Wprotocol -Wdeprecated-declarations -Wno-sign-conversion -Wno-infinite-recursion -Wno-comma -Wno-block-capture-autoreleasing -Wno-strict-prototypes -Wno-semicolon-before-method-body -index-store-path /Users/admin/builder/spi-builder-workspace/.derivedData/Index.noindex/DataStore @/Users/admin/builder/spi-builder-workspace/.derivedData/Build/Intermediates.noindex/iOSSnapshotTestCase.build/Debug-watchos/iOSSnapshotTestCaseCore.build/Objects-normal/arm64/e6072d4f65d7061329687fe24e3d63a7-common-args.resp -MMD -MT dependencies -MF /Users/admin/builder/spi-builder-workspace/.derivedData/Build/Intermediates.noindex/iOSSnapshotTestCase.build/Debug-watchos/iOSSnapshotTestCaseCore.build/Objects-normal/arm64/FBSnapshotTestCasePlatform.d --serialize-diagnostics /Users/admin/builder/spi-builder-workspace/.derivedData/Build/Intermediates.noindex/iOSSnapshotTestCase.build/Debug-watchos/iOSSnapshotTestCaseCore.build/Objects-normal/arm64/FBSnapshotTestCasePlatform.dia -c /Users/admin/builder/spi-builder-workspace/src/iOSSnapshotTestCaseCore/FBSnapshotTestCasePlatform.m -o /Users/admin/builder/spi-builder-workspace/.derivedData/Build/Intermediates.noindex/iOSSnapshotTestCase.build/Debug-watchos/iOSSnapshotTestCaseCore.build/Objects-normal/arm64/FBSnapshotTestCasePlatform.o -index-unit-output-path /iOSSnapshotTestCase.build/Debug-watchos/iOSSnapshotTestCaseCore.build/Objects-normal/arm64/FBSnapshotTestCasePlatform.o
PrecompileModule /Users/admin/builder/spi-builder-workspace/.derivedData/Build/Intermediates.noindex/ExplicitPrecompiledModules/_Builtin_tgmath-2H53FQDVVTUKLPLWTV0FZAFEN.scan
cd /Users/admin/builder/spi-builder-workspace/.swiftpm/xcode
builtin-precompileModule /Users/admin/builder/spi-builder-workspace/.derivedData/Build/Intermediates.noindex/ExplicitPrecompiledModules/_Builtin_tgmath-2H53FQDVVTUKLPLWTV0FZAFEN.scan
PrecompileModule /Users/admin/builder/spi-builder-workspace/.derivedData/Build/Intermediates.noindex/ExplicitPrecompiledModules/ObjectiveC-BW1J3CWO64B0IT161WUKP08PH.scan
cd /Users/admin/builder/spi-builder-workspace/.swiftpm/xcode
builtin-precompileModule /Users/admin/builder/spi-builder-workspace/.derivedData/Build/Intermediates.noindex/ExplicitPrecompiledModules/ObjectiveC-BW1J3CWO64B0IT161WUKP08PH.scan
PrecompileModule /Users/admin/builder/spi-builder-workspace/.derivedData/Build/Intermediates.noindex/ExplicitPrecompiledModules/Darwin-90O5WYUI10VTT6ZMOOOUT7ASW.scan
cd /Users/admin/builder/spi-builder-workspace/.swiftpm/xcode
builtin-precompileModule /Users/admin/builder/spi-builder-workspace/.derivedData/Build/Intermediates.noindex/ExplicitPrecompiledModules/Darwin-90O5WYUI10VTT6ZMOOOUT7ASW.scan
PrecompileModule /Users/admin/builder/spi-builder-workspace/.derivedData/Build/Intermediates.noindex/ExplicitPrecompiledModules/os_object-3WIXUYER3ZSMUYJWIUI86TT1G.scan
cd /Users/admin/builder/spi-builder-workspace/.swiftpm/xcode
builtin-precompileModule /Users/admin/builder/spi-builder-workspace/.derivedData/Build/Intermediates.noindex/ExplicitPrecompiledModules/os_object-3WIXUYER3ZSMUYJWIUI86TT1G.scan
PrecompileModule /Users/admin/builder/spi-builder-workspace/.derivedData/Build/Intermediates.noindex/ExplicitPrecompiledModules/ptrauth-ESTT4JEX31ZTPUP3GS6PV8RUK.scan
cd /Users/admin/builder/spi-builder-workspace/.swiftpm/xcode
builtin-precompileModule /Users/admin/builder/spi-builder-workspace/.derivedData/Build/Intermediates.noindex/ExplicitPrecompiledModules/ptrauth-ESTT4JEX31ZTPUP3GS6PV8RUK.scan
PrecompileModule /Users/admin/builder/spi-builder-workspace/.derivedData/Build/Intermediates.noindex/ExplicitPrecompiledModules/_Builtin_stdbool-AHRV1GAUPIR2GE3RUH74OEAJS.scan
cd /Users/admin/builder/spi-builder-workspace/.swiftpm/xcode
builtin-precompileModule /Users/admin/builder/spi-builder-workspace/.derivedData/Build/Intermediates.noindex/ExplicitPrecompiledModules/_Builtin_stdbool-AHRV1GAUPIR2GE3RUH74OEAJS.scan
PrecompileModule /Users/admin/builder/spi-builder-workspace/.derivedData/Build/Intermediates.noindex/ExplicitPrecompiledModules/ptrcheck-5GVTN7CONISCPL51P8FN1YP42.scan
cd /Users/admin/builder/spi-builder-workspace/.swiftpm/xcode
builtin-precompileModule /Users/admin/builder/spi-builder-workspace/.derivedData/Build/Intermediates.noindex/ExplicitPrecompiledModules/ptrcheck-5GVTN7CONISCPL51P8FN1YP42.scan
PrecompileModule /Users/admin/builder/spi-builder-workspace/.derivedData/Build/Intermediates.noindex/ExplicitPrecompiledModules/_float-7611EP188SONDQ6SF8JESK2P1.scan
cd /Users/admin/builder/spi-builder-workspace/.swiftpm/xcode
builtin-precompileModule /Users/admin/builder/spi-builder-workspace/.derivedData/Build/Intermediates.noindex/ExplicitPrecompiledModules/_float-7611EP188SONDQ6SF8JESK2P1.scan
PrecompileModule /Users/admin/builder/spi-builder-workspace/.derivedData/Build/Intermediates.noindex/ExplicitPrecompiledModules/os_workgroup-DNGZJE1IMHLAX40URD08I1IEQ.scan
cd /Users/admin/builder/spi-builder-workspace/.swiftpm/xcode
builtin-precompileModule /Users/admin/builder/spi-builder-workspace/.derivedData/Build/Intermediates.noindex/ExplicitPrecompiledModules/os_workgroup-DNGZJE1IMHLAX40URD08I1IEQ.scan
PrecompileModule /Users/admin/builder/spi-builder-workspace/.derivedData/Build/Intermediates.noindex/ExplicitPrecompiledModules/_fenv-8IGUMFR63EAWXTYAJZ6DUTCG5.scan
cd /Users/admin/builder/spi-builder-workspace/.swiftpm/xcode
builtin-precompileModule /Users/admin/builder/spi-builder-workspace/.derivedData/Build/Intermediates.noindex/ExplicitPrecompiledModules/_fenv-8IGUMFR63EAWXTYAJZ6DUTCG5.scan
PrecompileModule /Users/admin/builder/spi-builder-workspace/.derivedData/Build/Intermediates.noindex/ExplicitPrecompiledModules/_Builtin_iso646-U9MT95LFQA2EDPSBWLQ137OJ.scan
cd /Users/admin/builder/spi-builder-workspace/.swiftpm/xcode
builtin-precompileModule /Users/admin/builder/spi-builder-workspace/.derivedData/Build/Intermediates.noindex/ExplicitPrecompiledModules/_Builtin_iso646-U9MT95LFQA2EDPSBWLQ137OJ.scan
PrecompileModule /Users/admin/builder/spi-builder-workspace/.derivedData/Build/Intermediates.noindex/ExplicitPrecompiledModules/_Builtin_float-7PLZKY2MJZNOZE9TM7RB7EONE.scan
cd /Users/admin/builder/spi-builder-workspace/.swiftpm/xcode
builtin-precompileModule /Users/admin/builder/spi-builder-workspace/.derivedData/Build/Intermediates.noindex/ExplicitPrecompiledModules/_Builtin_float-7PLZKY2MJZNOZE9TM7RB7EONE.scan
PrecompileModule /Users/admin/builder/spi-builder-workspace/.derivedData/Build/Intermediates.noindex/ExplicitPrecompiledModules/_Builtin_stdarg-75IXHVTPEV7SPDHE87FY2GXCS.scan
cd /Users/admin/builder/spi-builder-workspace/.swiftpm/xcode
builtin-precompileModule /Users/admin/builder/spi-builder-workspace/.derivedData/Build/Intermediates.noindex/ExplicitPrecompiledModules/_Builtin_stdarg-75IXHVTPEV7SPDHE87FY2GXCS.scan
PrecompileModule /Users/admin/builder/spi-builder-workspace/.derivedData/Build/Intermediates.noindex/ExplicitPrecompiledModules/_Builtin_stddef-C0T579JLXLJPP42EBZUURGHZB.scan
cd /Users/admin/builder/spi-builder-workspace/.swiftpm/xcode
builtin-precompileModule /Users/admin/builder/spi-builder-workspace/.derivedData/Build/Intermediates.noindex/ExplicitPrecompiledModules/_Builtin_stddef-C0T579JLXLJPP42EBZUURGHZB.scan
PrecompileModule /Users/admin/builder/spi-builder-workspace/.derivedData/Build/Intermediates.noindex/ExplicitPrecompiledModules/os_availability_internal-506KSAZ4V7X2U0T3NBHQWVIEN.scan
cd /Users/admin/builder/spi-builder-workspace/.swiftpm/xcode
builtin-precompileModule /Users/admin/builder/spi-builder-workspace/.derivedData/Build/Intermediates.noindex/ExplicitPrecompiledModules/os_availability_internal-506KSAZ4V7X2U0T3NBHQWVIEN.scan
PrecompileModule /Users/admin/builder/spi-builder-workspace/.derivedData/Build/Intermediates.noindex/ExplicitPrecompiledModules/Dispatch-AVUEL9WPIDOXQE8GIV0NCQQJA.scan
cd /Users/admin/builder/spi-builder-workspace/.swiftpm/xcode
builtin-precompileModule /Users/admin/builder/spi-builder-workspace/.derivedData/Build/Intermediates.noindex/ExplicitPrecompiledModules/Dispatch-AVUEL9WPIDOXQE8GIV0NCQQJA.scan
PrecompileModule /Users/admin/builder/spi-builder-workspace/.derivedData/Build/Intermediates.noindex/ExplicitPrecompiledModules/TargetConditionals-DELVL21RXJ1N7WKN8OK6JAH4L.scan
cd /Users/admin/builder/spi-builder-workspace/.swiftpm/xcode
builtin-precompileModule /Users/admin/builder/spi-builder-workspace/.derivedData/Build/Intermediates.noindex/ExplicitPrecompiledModules/TargetConditionals-DELVL21RXJ1N7WKN8OK6JAH4L.scan
ScanDependencies /Users/admin/builder/spi-builder-workspace/.derivedData/Build/Intermediates.noindex/iOSSnapshotTestCase.build/Debug-watchos/iOSSnapshotTestCaseCore.build/Objects-normal/arm64/FBSnapshotTestCase.o /Users/admin/builder/spi-builder-workspace/src/iOSSnapshotTestCaseCore/FBSnapshotTestCase.m normal arm64 objective-c com.apple.compilers.llvm.clang.1_0.compiler (in target 'iOSSnapshotTestCaseCore' from project 'iOSSnapshotTestCase')
cd /Users/admin/builder/spi-builder-workspace/.swiftpm/xcode
Using response file: /Users/admin/builder/spi-builder-workspace/.derivedData/Build/Intermediates.noindex/iOSSnapshotTestCase.build/Debug-watchos/iOSSnapshotTestCaseCore.build/Objects-normal/arm64/e6072d4f65d7061329687fe24e3d63a7-common-args.resp
builtin-ScanDependencies -o /Users/admin/builder/spi-builder-workspace/.derivedData/Build/Intermediates.noindex/iOSSnapshotTestCase.build/Debug-watchos/iOSSnapshotTestCaseCore.build/Objects-normal/arm64/FBSnapshotTestCase.o.scan -- /Applications/Xcode-16.3.0.app/Contents/Developer/Toolchains/XcodeDefault.xctoolchain/usr/bin/clang -x objective-c -ivfsstatcache /Users/admin/builder/spi-builder-workspace/.derivedData/SDKStatCaches.noindex/watchos11.4-22T246-43efb940ff07ba2497b70ec94253f576.sdkstatcache -fmessage-length\=0 -fdiagnostics-show-note-include-stack -fmacro-backtrace-limit\=0 -fno-color-diagnostics -fmodules-prune-interval\=86400 -fmodules-prune-after\=345600 -fbuild-session-file\=/Users/admin/builder/spi-builder-workspace/.derivedData/ModuleCache.noindex/Session.modulevalidation -fmodules-validate-once-per-build-session -Wnon-modular-include-in-framework-module -Werror\=non-modular-include-in-framework-module -Wno-trigraphs -Wno-missing-field-initializers -Wno-missing-prototypes -Wno-return-type -Wno-implicit-atomic-properties -Wno-objc-interface-ivars -Wno-arc-repeated-use-of-weak -Wno-missing-braces -Wparentheses -Wswitch -Wno-unused-function -Wno-unused-label -Wno-unused-parameter -Wno-unused-variable -Wunused-value -Wno-empty-body -Wno-uninitialized -Wno-unknown-pragmas -Wno-shadow -Wno-four-char-constants -Wno-conversion -Wno-constant-conversion -Wno-int-conversion -Wno-bool-conversion -Wno-enum-conversion -Wno-float-conversion -Wno-non-literal-null-conversion -Wno-objc-literal-conversion -Wshorten-64-to-32 -Wpointer-sign -Wno-newline-eof -Wno-selector -Wno-strict-selector-match -Wno-undeclared-selector -Wno-deprecated-implementations -Wno-implicit-fallthrough -fstrict-aliasing -Wprotocol -Wdeprecated-declarations -Wno-sign-conversion -Wno-infinite-recursion -Wno-comma -Wno-block-capture-autoreleasing -Wno-strict-prototypes -Wno-semicolon-before-method-body -index-store-path /Users/admin/builder/spi-builder-workspace/.derivedData/Index.noindex/DataStore @/Users/admin/builder/spi-builder-workspace/.derivedData/Build/Intermediates.noindex/iOSSnapshotTestCase.build/Debug-watchos/iOSSnapshotTestCaseCore.build/Objects-normal/arm64/e6072d4f65d7061329687fe24e3d63a7-common-args.resp -MMD -MT dependencies -MF /Users/admin/builder/spi-builder-workspace/.derivedData/Build/Intermediates.noindex/iOSSnapshotTestCase.build/Debug-watchos/iOSSnapshotTestCaseCore.build/Objects-normal/arm64/FBSnapshotTestCase.d --serialize-diagnostics /Users/admin/builder/spi-builder-workspace/.derivedData/Build/Intermediates.noindex/iOSSnapshotTestCase.build/Debug-watchos/iOSSnapshotTestCaseCore.build/Objects-normal/arm64/FBSnapshotTestCase.dia -c /Users/admin/builder/spi-builder-workspace/src/iOSSnapshotTestCaseCore/FBSnapshotTestCase.m -o /Users/admin/builder/spi-builder-workspace/.derivedData/Build/Intermediates.noindex/iOSSnapshotTestCase.build/Debug-watchos/iOSSnapshotTestCaseCore.build/Objects-normal/arm64/FBSnapshotTestCase.o -index-unit-output-path /iOSSnapshotTestCase.build/Debug-watchos/iOSSnapshotTestCaseCore.build/Objects-normal/arm64/FBSnapshotTestCase.o
SwiftCompile normal armv7k Compiling\ SwiftSupport.swift /Users/admin/builder/spi-builder-workspace/src/iOSSnapshotTestCase/SwiftSupport.swift (in target 'iOSSnapshotTestCase' from project 'iOSSnapshotTestCase')
SwiftCompile normal armv7k /Users/admin/builder/spi-builder-workspace/src/iOSSnapshotTestCase/SwiftSupport.swift (in target 'iOSSnapshotTestCase' from project 'iOSSnapshotTestCase')
cd /Users/admin/builder/spi-builder-workspace/.swiftpm/xcode
PrecompileModule /Users/admin/builder/spi-builder-workspace/.derivedData/Build/Intermediates.noindex/ExplicitPrecompiledModules/os_availability-9QQ6V6MDCJZQL0N7B2UOB5D5Q.scan
cd /Users/admin/builder/spi-builder-workspace/.swiftpm/xcode
builtin-precompileModule /Users/admin/builder/spi-builder-workspace/.derivedData/Build/Intermediates.noindex/ExplicitPrecompiledModules/os_availability-9QQ6V6MDCJZQL0N7B2UOB5D5Q.scan
SwiftCompile normal arm64_32 Compiling\ SwiftSupport.swift /Users/admin/builder/spi-builder-workspace/src/iOSSnapshotTestCase/SwiftSupport.swift (in target 'iOSSnapshotTestCase' from project 'iOSSnapshotTestCase')
SwiftCompile normal arm64_32 /Users/admin/builder/spi-builder-workspace/src/iOSSnapshotTestCase/SwiftSupport.swift (in target 'iOSSnapshotTestCase' from project 'iOSSnapshotTestCase')
cd /Users/admin/builder/spi-builder-workspace/.swiftpm/xcode
SwiftCompile normal arm64 Compiling\ SwiftSupport.swift /Users/admin/builder/spi-builder-workspace/src/iOSSnapshotTestCase/SwiftSupport.swift (in target 'iOSSnapshotTestCase' from project 'iOSSnapshotTestCase')
SwiftCompile normal arm64 /Users/admin/builder/spi-builder-workspace/src/iOSSnapshotTestCase/SwiftSupport.swift (in target 'iOSSnapshotTestCase' from project 'iOSSnapshotTestCase')
cd /Users/admin/builder/spi-builder-workspace/.swiftpm/xcode
PrecompileModule /Users/admin/builder/spi-builder-workspace/.derivedData/Build/Intermediates.noindex/ExplicitPrecompiledModules/DarwinFoundation-ATDFCML0KKZUGVU9AXTMT9ZLG.scan
cd /Users/admin/builder/spi-builder-workspace/.swiftpm/xcode
builtin-precompileModule /Users/admin/builder/spi-builder-workspace/.derivedData/Build/Intermediates.noindex/ExplicitPrecompiledModules/DarwinFoundation-ATDFCML0KKZUGVU9AXTMT9ZLG.scan
PrecompileModule /Users/admin/builder/spi-builder-workspace/.derivedData/Build/Intermediates.noindex/ExplicitPrecompiledModules/AvailabilityMacros-Y7APP0WMUIYYNCRXJ84XUL6T.scan
cd /Users/admin/builder/spi-builder-workspace/.swiftpm/xcode
builtin-precompileModule /Users/admin/builder/spi-builder-workspace/.derivedData/Build/Intermediates.noindex/ExplicitPrecompiledModules/AvailabilityMacros-Y7APP0WMUIYYNCRXJ84XUL6T.scan
PrecompileModule /Users/admin/builder/spi-builder-workspace/.derivedData/Build/Intermediates.noindex/ExplicitPrecompiledModules/CoreFoundation-7PDSL9QVKOTJ3KUV5L1PNS8CZ.scan
cd /Users/admin/builder/spi-builder-workspace/.swiftpm/xcode
builtin-precompileModule /Users/admin/builder/spi-builder-workspace/.derivedData/Build/Intermediates.noindex/ExplicitPrecompiledModules/CoreFoundation-7PDSL9QVKOTJ3KUV5L1PNS8CZ.scan
PrecompileModule /Users/admin/builder/spi-builder-workspace/.derivedData/Build/Intermediates.noindex/ExplicitPrecompiledModules/ObjectiveC-3LSMXY72ESF7SZQHDE2FAURJB.scan
cd /Users/admin/builder/spi-builder-workspace/.swiftpm/xcode
builtin-precompileModule /Users/admin/builder/spi-builder-workspace/.derivedData/Build/Intermediates.noindex/ExplicitPrecompiledModules/ObjectiveC-3LSMXY72ESF7SZQHDE2FAURJB.scan
PrecompileModule /Users/admin/builder/spi-builder-workspace/.derivedData/Build/Intermediates.noindex/ExplicitPrecompiledModules/uuid-CL65F873S45LWXH66OU4MNHI3.scan
cd /Users/admin/builder/spi-builder-workspace/.swiftpm/xcode
builtin-precompileModule /Users/admin/builder/spi-builder-workspace/.derivedData/Build/Intermediates.noindex/ExplicitPrecompiledModules/uuid-CL65F873S45LWXH66OU4MNHI3.scan
PrecompileModule /Users/admin/builder/spi-builder-workspace/.derivedData/Build/Intermediates.noindex/ExplicitPrecompiledModules/_sys_select-6VKWOLFE2RKEHXWC0LDEMKZAQ.scan
cd /Users/admin/builder/spi-builder-workspace/.swiftpm/xcode
builtin-precompileModule /Users/admin/builder/spi-builder-workspace/.derivedData/Build/Intermediates.noindex/ExplicitPrecompiledModules/_sys_select-6VKWOLFE2RKEHXWC0LDEMKZAQ.scan
PrecompileModule /Users/admin/builder/spi-builder-workspace/.derivedData/Build/Intermediates.noindex/ExplicitPrecompiledModules/_limits-5GZUQOXUSRSM3OHST6W6RSG62.scan
cd /Users/admin/builder/spi-builder-workspace/.swiftpm/xcode
builtin-precompileModule /Users/admin/builder/spi-builder-workspace/.derivedData/Build/Intermediates.noindex/ExplicitPrecompiledModules/_limits-5GZUQOXUSRSM3OHST6W6RSG62.scan
PrecompileModule /Users/admin/builder/spi-builder-workspace/.derivedData/Build/Intermediates.noindex/ExplicitPrecompiledModules/_locale-J0INBNPRBPS966OGXJZ0YAJ7.scan
cd /Users/admin/builder/spi-builder-workspace/.swiftpm/xcode
builtin-precompileModule /Users/admin/builder/spi-builder-workspace/.derivedData/Build/Intermediates.noindex/ExplicitPrecompiledModules/_locale-J0INBNPRBPS966OGXJZ0YAJ7.scan
PrecompileModule /Users/admin/builder/spi-builder-workspace/.derivedData/Build/Intermediates.noindex/ExplicitPrecompiledModules/_complex-EQG7SXCXGTCKBYSNT6O67F495.scan
cd /Users/admin/builder/spi-builder-workspace/.swiftpm/xcode
builtin-precompileModule /Users/admin/builder/spi-builder-workspace/.derivedData/Build/Intermediates.noindex/ExplicitPrecompiledModules/_complex-EQG7SXCXGTCKBYSNT6O67F495.scan
PrecompileModule /Users/admin/builder/spi-builder-workspace/.derivedData/Build/Intermediates.noindex/ExplicitPrecompiledModules/_errno-2QINKDVU7WCSYUMX5MGSWLKWU.scan
cd /Users/admin/builder/spi-builder-workspace/.swiftpm/xcode
builtin-precompileModule /Users/admin/builder/spi-builder-workspace/.derivedData/Build/Intermediates.noindex/ExplicitPrecompiledModules/_errno-2QINKDVU7WCSYUMX5MGSWLKWU.scan
PrecompileModule /Users/admin/builder/spi-builder-workspace/.derivedData/Build/Intermediates.noindex/ExplicitPrecompiledModules/runetype-6IJ7BT0BG9ZKLQJ7QSO22RF40.scan
cd /Users/admin/builder/spi-builder-workspace/.swiftpm/xcode
builtin-precompileModule /Users/admin/builder/spi-builder-workspace/.derivedData/Build/Intermediates.noindex/ExplicitPrecompiledModules/runetype-6IJ7BT0BG9ZKLQJ7QSO22RF40.scan
PrecompileModule /Users/admin/builder/spi-builder-workspace/.derivedData/Build/Intermediates.noindex/ExplicitPrecompiledModules/alloca-6200Q64HOM265NTV32QKEVBQP.scan
cd /Users/admin/builder/spi-builder-workspace/.swiftpm/xcode
builtin-precompileModule /Users/admin/builder/spi-builder-workspace/.derivedData/Build/Intermediates.noindex/ExplicitPrecompiledModules/alloca-6200Q64HOM265NTV32QKEVBQP.scan
PrecompileModule /Users/admin/builder/spi-builder-workspace/.derivedData/Build/Intermediates.noindex/ExplicitPrecompiledModules/xlocale-5Y1ICI7F2T6Y1H17UDAHWCRVA.scan
cd /Users/admin/builder/spi-builder-workspace/.swiftpm/xcode
builtin-precompileModule /Users/admin/builder/spi-builder-workspace/.derivedData/Build/Intermediates.noindex/ExplicitPrecompiledModules/xlocale-5Y1ICI7F2T6Y1H17UDAHWCRVA.scan
PrecompileModule /Users/admin/builder/spi-builder-workspace/.derivedData/Build/Intermediates.noindex/ExplicitPrecompiledModules/mach-D2D4EAPLJ5Y6BOJRZAXTNNULT.scan
cd /Users/admin/builder/spi-builder-workspace/.swiftpm/xcode
builtin-precompileModule /Users/admin/builder/spi-builder-workspace/.derivedData/Build/Intermediates.noindex/ExplicitPrecompiledModules/mach-D2D4EAPLJ5Y6BOJRZAXTNNULT.scan
PrecompileModule /Users/admin/builder/spi-builder-workspace/.derivedData/Build/Intermediates.noindex/ExplicitPrecompiledModules/CoreGraphics-80N6A1Z2JU1ZJLPPAAE7N8KTU.scan
cd /Users/admin/builder/spi-builder-workspace/.swiftpm/xcode
builtin-precompileModule /Users/admin/builder/spi-builder-workspace/.derivedData/Build/Intermediates.noindex/ExplicitPrecompiledModules/CoreGraphics-80N6A1Z2JU1ZJLPPAAE7N8KTU.scan
PrecompileModule /Users/admin/builder/spi-builder-workspace/.derivedData/Build/Intermediates.noindex/ExplicitPrecompiledModules/netinet_in-FODK2YZP1Z78G4XNXQPQWBL5.scan
cd /Users/admin/builder/spi-builder-workspace/.swiftpm/xcode
builtin-precompileModule /Users/admin/builder/spi-builder-workspace/.derivedData/Build/Intermediates.noindex/ExplicitPrecompiledModules/netinet_in-FODK2YZP1Z78G4XNXQPQWBL5.scan
PrecompileModule /Users/admin/builder/spi-builder-workspace/.derivedData/Build/Intermediates.noindex/ExplicitPrecompiledModules/sys_time-CVE1VHAVWUMGLGB1K1X9I63GY.scan
cd /Users/admin/builder/spi-builder-workspace/.swiftpm/xcode
builtin-precompileModule /Users/admin/builder/spi-builder-workspace/.derivedData/Build/Intermediates.noindex/ExplicitPrecompiledModules/sys_time-CVE1VHAVWUMGLGB1K1X9I63GY.scan
PrecompileModule /Users/admin/builder/spi-builder-workspace/.derivedData/Build/Intermediates.noindex/ExplicitPrecompiledModules/_setjmp-9O23KGH03E5FZC752PYOGU4FE.scan
cd /Users/admin/builder/spi-builder-workspace/.swiftpm/xcode
builtin-precompileModule /Users/admin/builder/spi-builder-workspace/.derivedData/Build/Intermediates.noindex/ExplicitPrecompiledModules/_setjmp-9O23KGH03E5FZC752PYOGU4FE.scan
PrecompileModule /Users/admin/builder/spi-builder-workspace/.derivedData/Build/Intermediates.noindex/ExplicitPrecompiledModules/_math-Y6EMOZP5F0UCU6E101N975C4.scan
cd /Users/admin/builder/spi-builder-workspace/.swiftpm/xcode
builtin-precompileModule /Users/admin/builder/spi-builder-workspace/.derivedData/Build/Intermediates.noindex/ExplicitPrecompiledModules/_math-Y6EMOZP5F0UCU6E101N975C4.scan
PrecompileModule /Users/admin/builder/spi-builder-workspace/.derivedData/Build/Intermediates.noindex/ExplicitPrecompiledModules/_ctype-2XT31TR7I96K116PBS9XG5RKB.scan
cd /Users/admin/builder/spi-builder-workspace/.swiftpm/xcode
builtin-precompileModule /Users/admin/builder/spi-builder-workspace/.derivedData/Build/Intermediates.noindex/ExplicitPrecompiledModules/_ctype-2XT31TR7I96K116PBS9XG5RKB.scan
PrecompileModule /Users/admin/builder/spi-builder-workspace/.derivedData/Build/Intermediates.noindex/ExplicitPrecompiledModules/_useconds_t-EZE7SYE5CPSUW2KFAZO1RP94P.scan
cd /Users/admin/builder/spi-builder-workspace/.swiftpm/xcode
builtin-precompileModule /Users/admin/builder/spi-builder-workspace/.derivedData/Build/Intermediates.noindex/ExplicitPrecompiledModules/_useconds_t-EZE7SYE5CPSUW2KFAZO1RP94P.scan
PrecompileModule /Users/admin/builder/spi-builder-workspace/.derivedData/Build/Intermediates.noindex/ExplicitPrecompiledModules/_stdint-A5SU9I8A3QDGZM1FELAT6F9HU.scan
cd /Users/admin/builder/spi-builder-workspace/.swiftpm/xcode
builtin-precompileModule /Users/admin/builder/spi-builder-workspace/.derivedData/Build/Intermediates.noindex/ExplicitPrecompiledModules/_stdint-A5SU9I8A3QDGZM1FELAT6F9HU.scan
PrecompileModule /Users/admin/builder/spi-builder-workspace/.derivedData/Build/Intermediates.noindex/ExplicitPrecompiledModules/_tgmath-4CC93127ONITJLKJ6ZD4V8K5G.scan
cd /Users/admin/builder/spi-builder-workspace/.swiftpm/xcode
builtin-precompileModule /Users/admin/builder/spi-builder-workspace/.derivedData/Build/Intermediates.noindex/ExplicitPrecompiledModules/_tgmath-4CC93127ONITJLKJ6ZD4V8K5G.scan
PrecompileModule /Users/admin/builder/spi-builder-workspace/.derivedData/Build/Intermediates.noindex/ExplicitPrecompiledModules/__wctype-2IXFMV34RFSGMCX2Z6QMB467H.scan
cd /Users/admin/builder/spi-builder-workspace/.swiftpm/xcode
builtin-precompileModule /Users/admin/builder/spi-builder-workspace/.derivedData/Build/Intermediates.noindex/ExplicitPrecompiledModules/__wctype-2IXFMV34RFSGMCX2Z6QMB467H.scan
PrecompileModule /Users/admin/builder/spi-builder-workspace/.derivedData/Build/Intermediates.noindex/ExplicitPrecompiledModules/sys_types-4ZLLEB13NXL1D1509AJZG6HWX.scan
cd /Users/admin/builder/spi-builder-workspace/.swiftpm/xcode
builtin-precompileModule /Users/admin/builder/spi-builder-workspace/.derivedData/Build/Intermediates.noindex/ExplicitPrecompiledModules/sys_types-4ZLLEB13NXL1D1509AJZG6HWX.scan
PrecompileModule /Users/admin/builder/spi-builder-workspace/.derivedData/Build/Intermediates.noindex/ExplicitPrecompiledModules/_Builtin_stdint-CJFIIFJFH6NWQ0Q8WB39GD0DE.scan
cd /Users/admin/builder/spi-builder-workspace/.swiftpm/xcode
builtin-precompileModule /Users/admin/builder/spi-builder-workspace/.derivedData/Build/Intermediates.noindex/ExplicitPrecompiledModules/_Builtin_stdint-CJFIIFJFH6NWQ0Q8WB39GD0DE.scan
PrecompileModule /Users/admin/builder/spi-builder-workspace/.derivedData/Build/Intermediates.noindex/ExplicitPrecompiledModules/CoreText-2ZA9DB003BYLGE8500YWOA7DU.scan
cd /Users/admin/builder/spi-builder-workspace/.swiftpm/xcode
builtin-precompileModule /Users/admin/builder/spi-builder-workspace/.derivedData/Build/Intermediates.noindex/ExplicitPrecompiledModules/CoreText-2ZA9DB003BYLGE8500YWOA7DU.scan
PrecompileModule /Users/admin/builder/spi-builder-workspace/.derivedData/Build/Intermediates.noindex/ExplicitPrecompiledModules/_Builtin_tgmath-8D7V0AQ0VMP3BWP2W9GQ63GGP.scan
cd /Users/admin/builder/spi-builder-workspace/.swiftpm/xcode
builtin-precompileModule /Users/admin/builder/spi-builder-workspace/.derivedData/Build/Intermediates.noindex/ExplicitPrecompiledModules/_Builtin_tgmath-8D7V0AQ0VMP3BWP2W9GQ63GGP.scan
PrecompileModule /Users/admin/builder/spi-builder-workspace/.derivedData/Build/Intermediates.noindex/ExplicitPrecompiledModules/CoreVideo-97WGA22TXYIS2R0MIGCOJURGA.scan
cd /Users/admin/builder/spi-builder-workspace/.swiftpm/xcode
builtin-precompileModule /Users/admin/builder/spi-builder-workspace/.derivedData/Build/Intermediates.noindex/ExplicitPrecompiledModules/CoreVideo-97WGA22TXYIS2R0MIGCOJURGA.scan
PrecompileModule /Users/admin/builder/spi-builder-workspace/.derivedData/Build/Intermediates.noindex/ExplicitPrecompiledModules/_signal-74GVKZZUG80RQ0C9S8JODEV9J.scan
cd /Users/admin/builder/spi-builder-workspace/.swiftpm/xcode
builtin-precompileModule /Users/admin/builder/spi-builder-workspace/.derivedData/Build/Intermediates.noindex/ExplicitPrecompiledModules/_signal-74GVKZZUG80RQ0C9S8JODEV9J.scan
PrecompileModule /Users/admin/builder/spi-builder-workspace/.derivedData/Build/Intermediates.noindex/ExplicitPrecompiledModules/_inttypes-EMG2B2F0RNC65S59NXHJ1PSWA.scan
cd /Users/admin/builder/spi-builder-workspace/.swiftpm/xcode
builtin-precompileModule /Users/admin/builder/spi-builder-workspace/.derivedData/Build/Intermediates.noindex/ExplicitPrecompiledModules/_inttypes-EMG2B2F0RNC65S59NXHJ1PSWA.scan
PrecompileModule /Users/admin/builder/spi-builder-workspace/.derivedData/Build/Intermediates.noindex/ExplicitPrecompiledModules/_Builtin_stdatomic-E6403XT7BISGKL6FV2N0XBQL8.scan
cd /Users/admin/builder/spi-builder-workspace/.swiftpm/xcode
builtin-precompileModule /Users/admin/builder/spi-builder-workspace/.derivedData/Build/Intermediates.noindex/ExplicitPrecompiledModules/_Builtin_stdatomic-E6403XT7BISGKL6FV2N0XBQL8.scan
PrecompileModule /Users/admin/builder/spi-builder-workspace/.derivedData/Build/Intermediates.noindex/ExplicitPrecompiledModules/_stdio-7RCAC9JNFXOX2G9999N1YGWNR.scan
cd /Users/admin/builder/spi-builder-workspace/.swiftpm/xcode
builtin-precompileModule /Users/admin/builder/spi-builder-workspace/.derivedData/Build/Intermediates.noindex/ExplicitPrecompiledModules/_stdio-7RCAC9JNFXOX2G9999N1YGWNR.scan
PrecompileModule /Users/admin/builder/spi-builder-workspace/.derivedData/Build/Intermediates.noindex/ExplicitPrecompiledModules/_Builtin_inttypes-DT4G8TSZDIZC11HH7S0CKTFSY.scan
cd /Users/admin/builder/spi-builder-workspace/.swiftpm/xcode
builtin-precompileModule /Users/admin/builder/spi-builder-workspace/.derivedData/Build/Intermediates.noindex/ExplicitPrecompiledModules/_Builtin_inttypes-DT4G8TSZDIZC11HH7S0CKTFSY.scan
PrecompileModule /Users/admin/builder/spi-builder-workspace/.derivedData/Build/Intermediates.noindex/ExplicitPrecompiledModules/sys_resource-DMS47YV5QA0E9X6RPGKRWRL8L.scan
cd /Users/admin/builder/spi-builder-workspace/.swiftpm/xcode
builtin-precompileModule /Users/admin/builder/spi-builder-workspace/.derivedData/Build/Intermediates.noindex/ExplicitPrecompiledModules/sys_resource-DMS47YV5QA0E9X6RPGKRWRL8L.scan
PrecompileModule /Users/admin/builder/spi-builder-workspace/.derivedData/Build/Intermediates.noindex/ExplicitPrecompiledModules/nl_types-EP8WMDWVXVY27NGQB1VTAO9RA.scan
cd /Users/admin/builder/spi-builder-workspace/.swiftpm/xcode
builtin-precompileModule /Users/admin/builder/spi-builder-workspace/.derivedData/Build/Intermediates.noindex/ExplicitPrecompiledModules/nl_types-EP8WMDWVXVY27NGQB1VTAO9RA.scan
PrecompileModule /Users/admin/builder/spi-builder-workspace/.derivedData/Build/Intermediates.noindex/ExplicitPrecompiledModules/Security-81YTM2BXTMIZYA5CZEZP7J5LC.scan
cd /Users/admin/builder/spi-builder-workspace/.swiftpm/xcode
builtin-precompileModule /Users/admin/builder/spi-builder-workspace/.derivedData/Build/Intermediates.noindex/ExplicitPrecompiledModules/Security-81YTM2BXTMIZYA5CZEZP7J5LC.scan
PrecompileModule /Users/admin/builder/spi-builder-workspace/.derivedData/Build/Intermediates.noindex/ExplicitPrecompiledModules/_time-DRLH6YHGIXLD55Q5YP9WCFOU0.scan
cd /Users/admin/builder/spi-builder-workspace/.swiftpm/xcode
builtin-precompileModule /Users/admin/builder/spi-builder-workspace/.derivedData/Build/Intermediates.noindex/ExplicitPrecompiledModules/_time-DRLH6YHGIXLD55Q5YP9WCFOU0.scan
PrecompileModule /Users/admin/builder/spi-builder-workspace/.derivedData/Build/Intermediates.noindex/ExplicitPrecompiledModules/os_object-5CN1C4C37F3A5PPYMBTOXMIRZ.scan
cd /Users/admin/builder/spi-builder-workspace/.swiftpm/xcode
builtin-precompileModule /Users/admin/builder/spi-builder-workspace/.derivedData/Build/Intermediates.noindex/ExplicitPrecompiledModules/os_object-5CN1C4C37F3A5PPYMBTOXMIRZ.scan
PrecompileModule /Users/admin/builder/spi-builder-workspace/.derivedData/Build/Intermediates.noindex/ExplicitPrecompiledModules/sys_wait-9G4UGJDERWT3W5S0UC9KA1OZV.scan
cd /Users/admin/builder/spi-builder-workspace/.swiftpm/xcode
builtin-precompileModule /Users/admin/builder/spi-builder-workspace/.derivedData/Build/Intermediates.noindex/ExplicitPrecompiledModules/sys_wait-9G4UGJDERWT3W5S0UC9KA1OZV.scan
PrecompileModule /Users/admin/builder/spi-builder-workspace/.derivedData/Build/Intermediates.noindex/ExplicitPrecompiledModules/_wctype-DURV901BLRNOH2RDMWY5WGJ3Y.scan
cd /Users/admin/builder/spi-builder-workspace/.swiftpm/xcode
builtin-precompileModule /Users/admin/builder/spi-builder-workspace/.derivedData/Build/Intermediates.noindex/ExplicitPrecompiledModules/_wctype-DURV901BLRNOH2RDMWY5WGJ3Y.scan
PrecompileModule /Users/admin/builder/spi-builder-workspace/.derivedData/Build/Intermediates.noindex/ExplicitPrecompiledModules/sys_select-EGFKC323HVYWDMAICJ108QRTG.scan
cd /Users/admin/builder/spi-builder-workspace/.swiftpm/xcode
builtin-precompileModule /Users/admin/builder/spi-builder-workspace/.derivedData/Build/Intermediates.noindex/ExplicitPrecompiledModules/sys_select-EGFKC323HVYWDMAICJ108QRTG.scan
PrecompileModule /Users/admin/builder/spi-builder-workspace/.derivedData/Build/Intermediates.noindex/ExplicitPrecompiledModules/_wchar-BPSKBAU6I7WI6DSLYWBRDKJJL.scan
cd /Users/admin/builder/spi-builder-workspace/.swiftpm/xcode
builtin-precompileModule /Users/admin/builder/spi-builder-workspace/.derivedData/Build/Intermediates.noindex/ExplicitPrecompiledModules/_wchar-BPSKBAU6I7WI6DSLYWBRDKJJL.scan
PrecompileModule /Users/admin/builder/spi-builder-workspace/.derivedData/Build/Intermediates.noindex/ExplicitPrecompiledModules/os_workgroup-7M0FN8SFKNHLTJCSZKSO5WTRD.scan
cd /Users/admin/builder/spi-builder-workspace/.swiftpm/xcode
builtin-precompileModule /Users/admin/builder/spi-builder-workspace/.derivedData/Build/Intermediates.noindex/ExplicitPrecompiledModules/os_workgroup-7M0FN8SFKNHLTJCSZKSO5WTRD.scan
PrecompileModule /Users/admin/builder/spi-builder-workspace/.derivedData/Build/Intermediates.noindex/ExplicitPrecompiledModules/_stdlib-EWEIIFSYJ9GIT1FFYF7BBCPHN.scan
cd /Users/admin/builder/spi-builder-workspace/.swiftpm/xcode
builtin-precompileModule /Users/admin/builder/spi-builder-workspace/.derivedData/Build/Intermediates.noindex/ExplicitPrecompiledModules/_stdlib-EWEIIFSYJ9GIT1FFYF7BBCPHN.scan
PrecompileModule /Users/admin/builder/spi-builder-workspace/.derivedData/Build/Intermediates.noindex/ExplicitPrecompiledModules/Foundation-1NWJ1OEYCWGUMQ35N781E699Q.scan
cd /Users/admin/builder/spi-builder-workspace/.swiftpm/xcode
builtin-precompileModule /Users/admin/builder/spi-builder-workspace/.derivedData/Build/Intermediates.noindex/ExplicitPrecompiledModules/Foundation-1NWJ1OEYCWGUMQ35N781E699Q.scan
PrecompileModule /Users/admin/builder/spi-builder-workspace/.derivedData/Build/Intermediates.noindex/ExplicitPrecompiledModules/gethostuuid-5N6NZLE51OT0YTF9IDL0RC0J9.scan
cd /Users/admin/builder/spi-builder-workspace/.swiftpm/xcode
builtin-precompileModule /Users/admin/builder/spi-builder-workspace/.derivedData/Build/Intermediates.noindex/ExplicitPrecompiledModules/gethostuuid-5N6NZLE51OT0YTF9IDL0RC0J9.scan
PrecompileModule /Users/admin/builder/spi-builder-workspace/.derivedData/Build/Intermediates.noindex/ExplicitPrecompiledModules/_Builtin_limits-17NGMBSBA7M087AX2M1BG057Z.scan
cd /Users/admin/builder/spi-builder-workspace/.swiftpm/xcode
builtin-precompileModule /Users/admin/builder/spi-builder-workspace/.derivedData/Build/Intermediates.noindex/ExplicitPrecompiledModules/_Builtin_limits-17NGMBSBA7M087AX2M1BG057Z.scan
PrecompileModule /Users/admin/builder/spi-builder-workspace/.derivedData/Build/Intermediates.noindex/ExplicitPrecompiledModules/Dispatch-7P67RTEGWD6FI934RUB6CHRW9.scan
cd /Users/admin/builder/spi-builder-workspace/.swiftpm/xcode
builtin-precompileModule /Users/admin/builder/spi-builder-workspace/.derivedData/Build/Intermediates.noindex/ExplicitPrecompiledModules/Dispatch-7P67RTEGWD6FI934RUB6CHRW9.scan
PrecompileModule /Users/admin/builder/spi-builder-workspace/.derivedData/Build/Intermediates.noindex/ExplicitPrecompiledModules/_strings-8A217SEQG82ZYETVG735Q3CQF.scan
cd /Users/admin/builder/spi-builder-workspace/.swiftpm/xcode
builtin-precompileModule /Users/admin/builder/spi-builder-workspace/.derivedData/Build/Intermediates.noindex/ExplicitPrecompiledModules/_strings-8A217SEQG82ZYETVG735Q3CQF.scan
PrecompileModule /Users/admin/builder/spi-builder-workspace/.derivedData/Build/Intermediates.noindex/ExplicitPrecompiledModules/unistd-3NXNRF74LODT3TGTH37GIRR5T.scan
cd /Users/admin/builder/spi-builder-workspace/.swiftpm/xcode
builtin-precompileModule /Users/admin/builder/spi-builder-workspace/.derivedData/Build/Intermediates.noindex/ExplicitPrecompiledModules/unistd-3NXNRF74LODT3TGTH37GIRR5T.scan
PrecompileModule /Users/admin/builder/spi-builder-workspace/.derivedData/Build/Intermediates.noindex/ExplicitPrecompiledModules/pthread-239OWFIXOR1P4Q0HEK8U00BM0.scan
cd /Users/admin/builder/spi-builder-workspace/.swiftpm/xcode
builtin-precompileModule /Users/admin/builder/spi-builder-workspace/.derivedData/Build/Intermediates.noindex/ExplicitPrecompiledModules/pthread-239OWFIXOR1P4Q0HEK8U00BM0.scan
PrecompileModule /Users/admin/builder/spi-builder-workspace/.derivedData/Build/Intermediates.noindex/ExplicitPrecompiledModules/_string-6KETQVW16RVDH0NOL59BZP48F.scan
cd /Users/admin/builder/spi-builder-workspace/.swiftpm/xcode
builtin-precompileModule /Users/admin/builder/spi-builder-workspace/.derivedData/Build/Intermediates.noindex/ExplicitPrecompiledModules/_string-6KETQVW16RVDH0NOL59BZP48F.scan
PrecompileModule /Users/admin/builder/spi-builder-workspace/.derivedData/Build/Intermediates.noindex/ExplicitPrecompiledModules/_assert-9AN4J1YDBR68J69ALFNS2Z390.scan
cd /Users/admin/builder/spi-builder-workspace/.swiftpm/xcode
builtin-precompileModule /Users/admin/builder/spi-builder-workspace/.derivedData/Build/Intermediates.noindex/ExplicitPrecompiledModules/_assert-9AN4J1YDBR68J69ALFNS2Z390.scan
PrecompileModule /Users/admin/builder/spi-builder-workspace/.derivedData/Build/Intermediates.noindex/ExplicitPrecompiledModules/CoreFoundation-4305P3DFJAC962ZOMFDYXEHEJ.scan
cd /Users/admin/builder/spi-builder-workspace/.swiftpm/xcode
builtin-precompileModule /Users/admin/builder/spi-builder-workspace/.derivedData/Build/Intermediates.noindex/ExplicitPrecompiledModules/CoreFoundation-4305P3DFJAC962ZOMFDYXEHEJ.scan
PrecompileModule /Users/admin/builder/spi-builder-workspace/.derivedData/Build/Intermediates.noindex/ExplicitPrecompiledModules/Darwin-2E0K7EROO5CID52PBH4ICDJU6.scan
cd /Users/admin/builder/spi-builder-workspace/.swiftpm/xcode
builtin-precompileModule /Users/admin/builder/spi-builder-workspace/.derivedData/Build/Intermediates.noindex/ExplicitPrecompiledModules/Darwin-2E0K7EROO5CID52PBH4ICDJU6.scan
PrecompileModule /Users/admin/builder/spi-builder-workspace/.derivedData/Build/Intermediates.noindex/ExplicitPrecompiledModules/Security-E1YAXHXKGE1DEI3WM9ZFKM9KK.scan
cd /Users/admin/builder/spi-builder-workspace/.swiftpm/xcode
builtin-precompileModule /Users/admin/builder/spi-builder-workspace/.derivedData/Build/Intermediates.noindex/ExplicitPrecompiledModules/Security-E1YAXHXKGE1DEI3WM9ZFKM9KK.scan
PrecompileModule /Users/admin/builder/spi-builder-workspace/.derivedData/Build/Intermediates.noindex/ExplicitPrecompiledModules/CoreGraphics-C8LD9J0X52P10HT8BRP1VM475.scan
cd /Users/admin/builder/spi-builder-workspace/.swiftpm/xcode
builtin-precompileModule /Users/admin/builder/spi-builder-workspace/.derivedData/Build/Intermediates.noindex/ExplicitPrecompiledModules/CoreGraphics-C8LD9J0X52P10HT8BRP1VM475.scan
PrecompileModule /Users/admin/builder/spi-builder-workspace/.derivedData/Build/Intermediates.noindex/ExplicitPrecompiledModules/Foundation-4NE8F56E7D2DEWFA6V5NSX65S.scan
cd /Users/admin/builder/spi-builder-workspace/.swiftpm/xcode
builtin-precompileModule /Users/admin/builder/spi-builder-workspace/.derivedData/Build/Intermediates.noindex/ExplicitPrecompiledModules/Foundation-4NE8F56E7D2DEWFA6V5NSX65S.scan
PrecompileModule /Users/admin/builder/spi-builder-workspace/.derivedData/Build/Intermediates.noindex/ExplicitPrecompiledModules/CoreText-9N1BEW5F7LG2L6N5GHMWRL2JD.scan
cd /Users/admin/builder/spi-builder-workspace/.swiftpm/xcode
builtin-precompileModule /Users/admin/builder/spi-builder-workspace/.derivedData/Build/Intermediates.noindex/ExplicitPrecompiledModules/CoreText-9N1BEW5F7LG2L6N5GHMWRL2JD.scan
PrecompileModule /Users/admin/builder/spi-builder-workspace/.derivedData/Build/Intermediates.noindex/ExplicitPrecompiledModules/CoreVideo-CU0W0B7JWVEV51CIQM9V16HZ.scan
cd /Users/admin/builder/spi-builder-workspace/.swiftpm/xcode
builtin-precompileModule /Users/admin/builder/spi-builder-workspace/.derivedData/Build/Intermediates.noindex/ExplicitPrecompiledModules/CoreVideo-CU0W0B7JWVEV51CIQM9V16HZ.scan
PrecompileModule /Users/admin/builder/spi-builder-workspace/.derivedData/Build/Intermediates.noindex/ExplicitPrecompiledModules/UIKit-BDGDM3KB5QWPE5PPENQCG4CJN.scan
cd /Users/admin/builder/spi-builder-workspace/.swiftpm/xcode
builtin-precompileModule /Users/admin/builder/spi-builder-workspace/.derivedData/Build/Intermediates.noindex/ExplicitPrecompiledModules/UIKit-BDGDM3KB5QWPE5PPENQCG4CJN.scan
PrecompileModule /Users/admin/builder/spi-builder-workspace/.derivedData/Build/Intermediates.noindex/ExplicitPrecompiledModules/QuartzCore-78IF0PPU343CLT28LQC3U0BGF.scan
cd /Users/admin/builder/spi-builder-workspace/.swiftpm/xcode
builtin-precompileModule /Users/admin/builder/spi-builder-workspace/.derivedData/Build/Intermediates.noindex/ExplicitPrecompiledModules/QuartzCore-78IF0PPU343CLT28LQC3U0BGF.scan
PrecompileModule /Users/admin/builder/spi-builder-workspace/.derivedData/Build/Intermediates.noindex/ExplicitPrecompiledModules/ObjectiveC-7UZI8EOM7TJ9CDMRRA9AAFJH3.scan
cd /Users/admin/builder/spi-builder-workspace/.swiftpm/xcode
builtin-precompileModule /Users/admin/builder/spi-builder-workspace/.derivedData/Build/Intermediates.noindex/ExplicitPrecompiledModules/ObjectiveC-7UZI8EOM7TJ9CDMRRA9AAFJH3.scan
PrecompileModule /Users/admin/builder/spi-builder-workspace/.derivedData/Build/Intermediates.noindex/ExplicitPrecompiledModules/os_object-2BGPT3SOB3LSC7S4KAGJEG6RE.scan
cd /Users/admin/builder/spi-builder-workspace/.swiftpm/xcode
builtin-precompileModule /Users/admin/builder/spi-builder-workspace/.derivedData/Build/Intermediates.noindex/ExplicitPrecompiledModules/os_object-2BGPT3SOB3LSC7S4KAGJEG6RE.scan
CompileC /Users/admin/builder/spi-builder-workspace/.derivedData/Build/Intermediates.noindex/iOSSnapshotTestCase.build/Debug-watchos/iOSSnapshotTestCaseCore.build/Objects-normal/armv7k/UIImage+Diff.o /Users/admin/builder/spi-builder-workspace/src/iOSSnapshotTestCaseCore/Categories/UIImage+Diff.m normal armv7k objective-c com.apple.compilers.llvm.clang.1_0.compiler (in target 'iOSSnapshotTestCaseCore' from project 'iOSSnapshotTestCase')
cd /Users/admin/builder/spi-builder-workspace/.swiftpm/xcode
Using response file: /Users/admin/builder/spi-builder-workspace/.derivedData/Build/Intermediates.noindex/iOSSnapshotTestCase.build/Debug-watchos/iOSSnapshotTestCaseCore.build/Objects-normal/armv7k/e6072d4f65d7061329687fe24e3d63a7-common-args.resp
/Applications/Xcode-16.3.0.app/Contents/Developer/Toolchains/XcodeDefault.xctoolchain/usr/bin/clang -x objective-c -ivfsstatcache /Users/admin/builder/spi-builder-workspace/.derivedData/SDKStatCaches.noindex/watchos11.4-22T246-43efb940ff07ba2497b70ec94253f576.sdkstatcache -fmessage-length\=0 -fdiagnostics-show-note-include-stack -fmacro-backtrace-limit\=0 -fno-color-diagnostics -fmodules-prune-interval\=86400 -fmodules-prune-after\=345600 -fbuild-session-file\=/Users/admin/builder/spi-builder-workspace/.derivedData/ModuleCache.noindex/Session.modulevalidation -fmodules-validate-once-per-build-session -Wnon-modular-include-in-framework-module -Werror\=non-modular-include-in-framework-module -Wno-trigraphs -Wno-missing-field-initializers -Wno-missing-prototypes -Wno-return-type -Wno-implicit-atomic-properties -Wno-objc-interface-ivars -Wno-arc-repeated-use-of-weak -Wno-missing-braces -Wparentheses -Wswitch -Wno-unused-function -Wno-unused-label -Wno-unused-parameter -Wno-unused-variable -Wunused-value -Wno-empty-body -Wno-uninitialized -Wno-unknown-pragmas -Wno-shadow -Wno-four-char-constants -Wno-conversion -Wno-constant-conversion -Wno-int-conversion -Wno-bool-conversion -Wno-enum-conversion -Wno-float-conversion -Wno-non-literal-null-conversion -Wno-objc-literal-conversion -Wno-shorten-64-to-32 -Wpointer-sign -Wno-newline-eof -Wno-selector -Wno-strict-selector-match -Wno-undeclared-selector -Wno-deprecated-implementations -Wno-implicit-fallthrough -fstrict-aliasing -Wprotocol -Wdeprecated-declarations -Wno-sign-conversion -Wno-infinite-recursion -Wno-comma -Wno-block-capture-autoreleasing -Wno-strict-prototypes -Wno-semicolon-before-method-body -index-store-path /Users/admin/builder/spi-builder-workspace/.derivedData/Index.noindex/DataStore @/Users/admin/builder/spi-builder-workspace/.derivedData/Build/Intermediates.noindex/iOSSnapshotTestCase.build/Debug-watchos/iOSSnapshotTestCaseCore.build/Objects-normal/armv7k/e6072d4f65d7061329687fe24e3d63a7-common-args.resp -MMD -MT dependencies -MF /Users/admin/builder/spi-builder-workspace/.derivedData/Build/Intermediates.noindex/iOSSnapshotTestCase.build/Debug-watchos/iOSSnapshotTestCaseCore.build/Objects-normal/armv7k/UIImage+Diff.d --serialize-diagnostics /Users/admin/builder/spi-builder-workspace/.derivedData/Build/Intermediates.noindex/iOSSnapshotTestCase.build/Debug-watchos/iOSSnapshotTestCaseCore.build/Objects-normal/armv7k/UIImage+Diff.dia -c /Users/admin/builder/spi-builder-workspace/src/iOSSnapshotTestCaseCore/Categories/UIImage+Diff.m -o /Users/admin/builder/spi-builder-workspace/.derivedData/Build/Intermediates.noindex/iOSSnapshotTestCase.build/Debug-watchos/iOSSnapshotTestCaseCore.build/Objects-normal/armv7k/UIImage+Diff.o -index-unit-output-path /iOSSnapshotTestCase.build/Debug-watchos/iOSSnapshotTestCaseCore.build/Objects-normal/armv7k/UIImage+Diff.o
Failed frontend command:
/Applications/Xcode-16.3.0.app/Contents/Developer/Toolchains/XcodeDefault.xctoolchain/usr/bin/clang -cc1 -Wundef-prefix\=TARGET_OS_ -fdiagnostics-show-note-include-stack -fmacro-backtrace-limit\=0 -ferror-limit 19 -serialize-diagnostic-file /Users/admin/builder/spi-builder-workspace/.derivedData/Build/Intermediates.noindex/iOSSnapshotTestCase.build/Debug-watchos/iOSSnapshotTestCaseCore.build/Objects-normal/armv7k/UIImage+Diff.dia -Wdeprecated-objc-isa-usage -Werror\=deprecated-objc-isa-usage -Werror\=implicit-function-declaration -Wnon-modular-include-in-framework-module -Werror\=non-modular-include-in-framework-module -Wno-trigraphs -Wno-missing-field-initializers -Wno-missing-prototypes -Wno-return-type -Wno-implicit-atomic-properties -Wno-objc-interface-ivars -Wno-arc-repeated-use-of-weak -Wno-missing-braces -Wparentheses -Wswitch -Wno-unused-function -Wno-unused-label -Wno-unused-parameter -Wno-unused-variable -Wunused-value -Wno-empty-body -Wno-uninitialized -Wno-unknown-pragmas -Wno-shadow -Wno-four-char-constants -Wno-conversion -Wno-constant-conversion -Wno-int-conversion -Wno-bool-conversion -Wno-enum-conversion -Wno-float-conversion -Wno-non-literal-null-conversion -Wno-objc-literal-conversion -Wno-shorten-64-to-32 -Wpointer-sign -Wno-newline-eof -Wno-selector -Wno-strict-selector-match -Wno-undeclared-selector -Wno-deprecated-implementations -Wno-implicit-fallthrough -Wprotocol -Wdeprecated-declarations -Wno-sign-conversion -Wno-infinite-recursion -Wno-comma -Wno-block-capture-autoreleasing -Wno-strict-prototypes -Wno-semicolon-before-method-body -Wno-reorder-init-list -Wno-implicit-int-float-conversion -Wno-c99-designator -Wno-final-dtor-non-final-class -Wno-extra-semi-stmt -Wno-misleading-indentation -Wno-quoted-include-in-framework-header -Wno-implicit-fallthrough -Wno-enum-enum-conversion -Wno-enum-float-conversion -Wno-elaborated-enum-base -Wno-reserved-identifier -Wno-gnu-folding-constant -index-store-path /Users/admin/builder/spi-builder-workspace/.derivedData/Index.noindex/DataStore -index-unit-output-path /iOSSnapshotTestCase.build/Debug-watchos/iOSSnapshotTestCaseCore.build/Objects-normal/armv7k/UIImage+Diff.o -fmodule-map-file\=/Applications/Xcode-16.3.0.app/Contents/Developer/Platforms/WatchOS.platform/Developer/SDKs/WatchOS.sdk/System/Library/Frameworks/UIKit.framework/Modules/module.modulemap -o /Users/admin/builder/spi-builder-workspace/.derivedData/Build/Intermediates.noindex/iOSSnapshotTestCase.build/Debug-watchos/iOSSnapshotTestCaseCore.build/Objects-normal/armv7k/UIImage+Diff.o -disable-free -emit-obj -x objective-c /Users/admin/builder/spi-builder-workspace/src/iOSSnapshotTestCaseCore/Categories/UIImage+Diff.m -target-abi aapcs16 -target-cpu cortex-a7 -target-feature +vfp2 -target-feature +vfp2sp -target-feature +vfp3 -target-feature +vfp3d16 -target-feature +vfp3d16sp -target-feature +vfp3sp -target-feature +fp16 -target-feature +vfp4 -target-feature +vfp4d16 -target-feature +vfp4d16sp -target-feature +vfp4sp -target-feature -fp-armv8 -target-feature -fp-armv8d16 -target-feature -fp-armv8d16sp -target-feature -fp-armv8sp -target-feature -fullfp16 -target-feature +fp64 -target-feature +d32 -target-feature +neon -target-feature -sha2 -target-feature -aes -target-feature -fp16fml -triple thumbv7k-apple-watchos5.0.0 -target-linker-version 1167.4.1 -target-sdk-version\=11.4 -fmodules-validate-system-headers -fno-modulemap-allow-subdirectory-search -isysroot /Applications/Xcode-16.3.0.app/Contents/Developer/Platforms/WatchOS.platform/Developer/SDKs/WatchOS11.4.sdk -resource-dir /Applications/Xcode-16.3.0.app/Contents/Developer/Toolchains/XcodeDefault.xctoolchain/usr/lib/clang/17 -fmodule-format\=obj -fmodule-file\=UIKit\=/Users/admin/builder/spi-builder-workspace/.derivedData/Build/Intermediates.noindex/ExplicitPrecompiledModules/UIKit-BDGDM3KB5QWPE5PPENQCG4CJN.pcm -I /Users/admin/builder/spi-builder-workspace/.derivedData/Build/Products/Debug-watchos/include -I /Users/admin/builder/spi-builder-workspace/src/iOSSnapshotTestCaseCore/Public -I /Users/admin/builder/spi-builder-workspace/.derivedData/Build/Intermediates.noindex/iOSSnapshotTestCase.build/Debug-watchos/iOSSnapshotTestCaseCore.build/DerivedSources-normal/armv7k -I /Users/admin/builder/spi-builder-workspace/.derivedData/Build/Intermediates.noindex/iOSSnapshotTestCase.build/Debug-watchos/iOSSnapshotTestCaseCore.build/DerivedSources/armv7k -I /Users/admin/builder/spi-builder-workspace/.derivedData/Build/Intermediates.noindex/iOSSnapshotTestCase.build/Debug-watchos/iOSSnapshotTestCaseCore.build/DerivedSources -F /Users/admin/builder/spi-builder-workspace/.derivedData/Build/Products/Debug-watchos -iframework /Applications/Xcode-16.3.0.app/Contents/Developer/Platforms/WatchOS.platform/Developer/Library/Frameworks -iframework /Applications/Xcode-16.3.0.app/Contents/Developer/Platforms/WatchOS.platform/Developer/SDKs/WatchOS11.4.sdk/Developer/Library/Frameworks -internal-isystem /Applications/Xcode-16.3.0.app/Contents/Developer/Platforms/WatchOS.platform/Developer/SDKs/WatchOS11.4.sdk/usr/local/include -internal-isystem /Applications/Xcode-16.3.0.app/Contents/Developer/Toolchains/XcodeDefault.xctoolchain/usr/lib/clang/17/include -internal-externc-isystem /Applications/Xcode-16.3.0.app/Contents/Developer/Platforms/WatchOS.platform/Developer/SDKs/WatchOS11.4.sdk/usr/include -internal-externc-isystem /Applications/Xcode-16.3.0.app/Contents/Developer/Toolchains/XcodeDefault.xctoolchain/usr/include -ivfsstatcache /Users/admin/builder/spi-builder-workspace/.derivedData/SDKStatCaches.noindex/watchos11.4-22T246-43efb940ff07ba2497b70ec94253f576.sdkstatcache -std\=gnu11 -fexceptions -exception-model dwarf -fskip-odr-check-in-gmf -fmodules -fmodule-name\=iOSSnapshotTestCaseCore -fno-implicit-modules -fobjc-exceptions -fmax-type-align\=16 -fpascal-strings -fvisibility-inlines-hidden-static-local-var -mdarwin-stkchk-strong-link -fno-odr-hash-protocols -pic-level 2 -fencode-extended-block-signature -stack-protector 1 -fobjc-runtime\=watchos-5.0.0 -fobjc-arc -fobjc-runtime-has-weak -fobjc-weak -fgnuc-version\=4.2.1 -fblocks -ffp-contract\=on -fclang-abi-compat\=4.0 -fno-experimental-relative-c++-abi-vtables -fno-file-reproducible -clang-vendor-feature\=+disableNonDependentMemberExprInCurrentInstantiation -clang-vendor-feature\=+enableAggressiveVLAFolding -clang-vendor-feature\=+revert09abecef7bbf -clang-vendor-feature\=+thisNoAlignAttr -clang-vendor-feature\=+thisNoNullAttr -clang-vendor-feature\=+disableAtImportPrivateFrameworkInImplementationError -O0 -fno-assume-unique-vtables -fdebug-compilation-dir\=/Users/admin/builder/spi-builder-workspace/.swiftpm/xcode -fcoverage-compilation-dir\=/Users/admin/builder/spi-builder-workspace/.swiftpm/xcode -fcoverage-mapping -fcommon -fregister-global-dtors-with-atexit -fno-strict-return -dwarf-version\=4 -debugger-tuning\=lldb -disable-llvm-verifier -dwarf-ext-refs -mfloat-abi hard -funwind-tables\=2 -fprofile-instrument\=clang -clear-ast-before-backend -discard-value-names -main-file-name UIImage+Diff.m -mframe-pointer\=all -debug-info-kind\=standalone -fdiagnostics-hotness-threshold\=0 -fdiagnostics-misexpect-tolerance\=0 -D DEBUG\=1 -D OBJC_OLD_DISPATCH_PROTOTYPES\=1 -D SWIFT_PACKAGE -D Xcode -D __GCC_HAVE_DWARF2_CFI_ASM\=1 -fdefine-target-os-macros -MT dependencies -dependency-file /Users/admin/builder/spi-builder-workspace/.derivedData/Build/Intermediates.noindex/iOSSnapshotTestCase.build/Debug-watchos/iOSSnapshotTestCaseCore.build/Objects-normal/armv7k/UIImage+Diff.d -skip-unused-modulemap-deps
CompileC /Users/admin/builder/spi-builder-workspace/.derivedData/Build/Intermediates.noindex/iOSSnapshotTestCase.build/Debug-watchos/iOSSnapshotTestCaseCore.build/Objects-normal/armv7k/UIImage+Snapshot.o /Users/admin/builder/spi-builder-workspace/src/iOSSnapshotTestCaseCore/Categories/UIImage+Snapshot.m normal armv7k objective-c com.apple.compilers.llvm.clang.1_0.compiler (in target 'iOSSnapshotTestCaseCore' from project 'iOSSnapshotTestCase')
cd /Users/admin/builder/spi-builder-workspace/.swiftpm/xcode
Using response file: /Users/admin/builder/spi-builder-workspace/.derivedData/Build/Intermediates.noindex/iOSSnapshotTestCase.build/Debug-watchos/iOSSnapshotTestCaseCore.build/Objects-normal/armv7k/e6072d4f65d7061329687fe24e3d63a7-common-args.resp
/Applications/Xcode-16.3.0.app/Contents/Developer/Toolchains/XcodeDefault.xctoolchain/usr/bin/clang -x objective-c -ivfsstatcache /Users/admin/builder/spi-builder-workspace/.derivedData/SDKStatCaches.noindex/watchos11.4-22T246-43efb940ff07ba2497b70ec94253f576.sdkstatcache -fmessage-length\=0 -fdiagnostics-show-note-include-stack -fmacro-backtrace-limit\=0 -fno-color-diagnostics -fmodules-prune-interval\=86400 -fmodules-prune-after\=345600 -fbuild-session-file\=/Users/admin/builder/spi-builder-workspace/.derivedData/ModuleCache.noindex/Session.modulevalidation -fmodules-validate-once-per-build-session -Wnon-modular-include-in-framework-module -Werror\=non-modular-include-in-framework-module -Wno-trigraphs -Wno-missing-field-initializers -Wno-missing-prototypes -Wno-return-type -Wno-implicit-atomic-properties -Wno-objc-interface-ivars -Wno-arc-repeated-use-of-weak -Wno-missing-braces -Wparentheses -Wswitch -Wno-unused-function -Wno-unused-label -Wno-unused-parameter -Wno-unused-variable -Wunused-value -Wno-empty-body -Wno-uninitialized -Wno-unknown-pragmas -Wno-shadow -Wno-four-char-constants -Wno-conversion -Wno-constant-conversion -Wno-int-conversion -Wno-bool-conversion -Wno-enum-conversion -Wno-float-conversion -Wno-non-literal-null-conversion -Wno-objc-literal-conversion -Wno-shorten-64-to-32 -Wpointer-sign -Wno-newline-eof -Wno-selector -Wno-strict-selector-match -Wno-undeclared-selector -Wno-deprecated-implementations -Wno-implicit-fallthrough -fstrict-aliasing -Wprotocol -Wdeprecated-declarations -Wno-sign-conversion -Wno-infinite-recursion -Wno-comma -Wno-block-capture-autoreleasing -Wno-strict-prototypes -Wno-semicolon-before-method-body -index-store-path /Users/admin/builder/spi-builder-workspace/.derivedData/Index.noindex/DataStore @/Users/admin/builder/spi-builder-workspace/.derivedData/Build/Intermediates.noindex/iOSSnapshotTestCase.build/Debug-watchos/iOSSnapshotTestCaseCore.build/Objects-normal/armv7k/e6072d4f65d7061329687fe24e3d63a7-common-args.resp -MMD -MT dependencies -MF /Users/admin/builder/spi-builder-workspace/.derivedData/Build/Intermediates.noindex/iOSSnapshotTestCase.build/Debug-watchos/iOSSnapshotTestCaseCore.build/Objects-normal/armv7k/UIImage+Snapshot.d --serialize-diagnostics /Users/admin/builder/spi-builder-workspace/.derivedData/Build/Intermediates.noindex/iOSSnapshotTestCase.build/Debug-watchos/iOSSnapshotTestCaseCore.build/Objects-normal/armv7k/UIImage+Snapshot.dia -c /Users/admin/builder/spi-builder-workspace/src/iOSSnapshotTestCaseCore/Categories/UIImage+Snapshot.m -o /Users/admin/builder/spi-builder-workspace/.derivedData/Build/Intermediates.noindex/iOSSnapshotTestCase.build/Debug-watchos/iOSSnapshotTestCaseCore.build/Objects-normal/armv7k/UIImage+Snapshot.o -index-unit-output-path /iOSSnapshotTestCase.build/Debug-watchos/iOSSnapshotTestCaseCore.build/Objects-normal/armv7k/UIImage+Snapshot.o
In file included from /Users/admin/builder/spi-builder-workspace/src/iOSSnapshotTestCaseCore/Categories/UIImage+Snapshot.m:11:
/Users/admin/builder/spi-builder-workspace/src/iOSSnapshotTestCaseCore/Categories/UIImage+Snapshot.h:17:41: error: expected a type
17 | + (nullable UIImage *)fb_imageForLayer:(CALayer *)layer;
| ^
In file included from /Users/admin/builder/spi-builder-workspace/src/iOSSnapshotTestCaseCore/Categories/UIImage+Snapshot.m:12:
/Users/admin/builder/spi-builder-workspace/src/iOSSnapshotTestCaseCore/Categories/UIApplication+KeyWindow.h:14:12: error: cannot find interface declaration for 'UIApplication'
14 | @interface UIApplication (KeyWindow)
| ^
/Users/admin/builder/spi-builder-workspace/src/iOSSnapshotTestCaseCore/Categories/UIApplication+KeyWindow.h:16:13: error: expected a type
16 | - (nullable UIWindow *)ub_keyWindow;
| ^
/Users/admin/builder/spi-builder-workspace/src/iOSSnapshotTestCaseCore/Categories/UIImage+Snapshot.m:20:32: error: expected a type
20 | + (UIImage *)fb_imageForLayer:(CALayer *)layer
| ^
/Users/admin/builder/spi-builder-workspace/src/iOSSnapshotTestCaseCore/Categories/UIImage+Snapshot.m:22:27: error: property 'bounds' not found on object of type '__strong id'
22 | CGRect bounds = layer.bounds;
| ^
/Users/admin/builder/spi-builder-workspace/src/iOSSnapshotTestCaseCore/Categories/UIImage+Snapshot.m:30:12: error: no known instance method for selector 'layoutIfNeeded'
30 | [layer layoutIfNeeded];
| ^~~~~~~~~~~~~~
/Users/admin/builder/spi-builder-workspace/src/iOSSnapshotTestCaseCore/Categories/UIImage+Snapshot.m:31:12: error: no known instance method for selector 'renderInContext:'
31 | [layer renderInContext:context];
| ^~~~~~~~~~~~~~~
/Users/admin/builder/spi-builder-workspace/src/iOSSnapshotTestCaseCore/Categories/UIImage+Snapshot.m:41:6: error: receiver type 'UIView' for instance message is a forward declaration
41 | [view layoutIfNeeded];
| ^~~~
In module 'UIKit' imported from /Users/admin/builder/spi-builder-workspace/src/iOSSnapshotTestCaseCore/Categories/UIImage+Snapshot.h:10:
/Applications/Xcode-16.3.0.app/Contents/Developer/Platforms/WatchOS.platform/Developer/SDKs/WatchOS11.4.sdk/System/Library/Frameworks/UIKit.framework/Headers/NSTextAttachment.h:23:8: note: forward declaration of class here
23 | @class UIView;
| ^
/Users/admin/builder/spi-builder-workspace/src/iOSSnapshotTestCaseCore/Categories/UIImage+Snapshot.m:42:40: error: property 'layer' cannot be found in forward class object 'UIView'
42 | return [self fb_imageForLayer:view.layer];
| ~~~~ ^
In module 'UIKit' imported from /Users/admin/builder/spi-builder-workspace/src/iOSSnapshotTestCaseCore/Categories/UIImage+Snapshot.h:10:
/Applications/Xcode-16.3.0.app/Contents/Developer/Platforms/WatchOS.platform/Developer/SDKs/WatchOS11.4.sdk/System/Library/Frameworks/UIKit.framework/Headers/NSTextAttachment.h:23:8: note: forward declaration of class here
23 | @class UIView;
| ^
/Users/admin/builder/spi-builder-workspace/src/iOSSnapshotTestCaseCore/Categories/UIImage+Snapshot.m:48:5: error: use of undeclared identifier 'UIWindow'
48 | UIWindow *window = [view isKindOfClass:[UIWindow class]] ? (UIWindow *)view : view.window;
| ^
/Users/admin/builder/spi-builder-workspace/src/iOSSnapshotTestCaseCore/Categories/UIImage+Snapshot.m:48:15: error: use of undeclared identifier 'window'
48 | UIWindow *window = [view isKindOfClass:[UIWindow class]] ? (UIWindow *)view : view.window;
| ^
/Users/admin/builder/spi-builder-workspace/src/iOSSnapshotTestCaseCore/Categories/UIImage+Snapshot.m:48:45: error: use of undeclared identifier 'UIWindow'
48 | UIWindow *window = [view isKindOfClass:[UIWindow class]] ? (UIWindow *)view : view.window;
| ^
/Users/admin/builder/spi-builder-workspace/src/iOSSnapshotTestCaseCore/Categories/UIImage+Snapshot.m:48:75: error: expected expression
48 | UIWindow *window = [view isKindOfClass:[UIWindow class]] ? (UIWindow *)view : view.window;
| ^
/Users/admin/builder/spi-builder-workspace/src/iOSSnapshotTestCaseCore/Categories/UIImage+Snapshot.m:48:65: error: use of undeclared identifier 'UIWindow'
48 | UIWindow *window = [view isKindOfClass:[UIWindow class]] ? (UIWindow *)view : view.window;
| ^
/Users/admin/builder/spi-builder-workspace/src/iOSSnapshotTestCaseCore/Categories/UIImage+Snapshot.m:48:88: error: property 'window' cannot be found in forward class object 'UIView'
48 | UIWindow *window = [view isKindOfClass:[UIWindow class]] ? (UIWindow *)view : view.window;
| ~~~~ ^
In module 'UIKit' imported from /Users/admin/builder/spi-builder-workspace/src/iOSSnapshotTestCaseCore/Categories/UIImage+Snapshot.h:10:
/Applications/Xcode-16.3.0.app/Contents/Developer/Platforms/WatchOS.platform/Developer/SDKs/WatchOS11.4.sdk/System/Library/Frameworks/UIKit.framework/Headers/NSTextAttachment.h:23:8: note: forward declaration of class here
23 | @class UIView;
| ^
/Users/admin/builder/spi-builder-workspace/src/iOSSnapshotTestCaseCore/Categories/UIImage+Snapshot.m:48:94: error: expected ']'
48 | UIWindow *window = [view isKindOfClass:[UIWindow class]] ? (UIWindow *)view : view.window;
| ^
/Users/admin/builder/spi-builder-workspace/src/iOSSnapshotTestCaseCore/Categories/UIImage+Snapshot.m:48:94: error: expected ':'
48 | UIWindow *window = [view isKindOfClass:[UIWindow class]] ? (UIWindow *)view : view.window;
| ^
| :
/Users/admin/builder/spi-builder-workspace/src/iOSSnapshotTestCaseCore/Categories/UIImage+Snapshot.m:48:62: note: to match this '?'
48 | UIWindow *window = [view isKindOfClass:[UIWindow class]] ? (UIWindow *)view : view.window;
| ^
/Users/admin/builder/spi-builder-workspace/src/iOSSnapshotTestCaseCore/Categories/UIImage+Snapshot.m:48:94: error: expected expression
48 | UIWindow *window = [view isKindOfClass:[UIWindow class]] ? (UIWindow *)view : view.window;
| ^
/Users/admin/builder/spi-builder-workspace/src/iOSSnapshotTestCaseCore/Categories/UIImage+Snapshot.m:50:10: error: use of undeclared identifier 'window'
50 | if (!window) {
| ^
fatal error: too many errors emitted, stopping now [-ferror-limit=]
20 errors generated.
Failed frontend command:
/Applications/Xcode-16.3.0.app/Contents/Developer/Toolchains/XcodeDefault.xctoolchain/usr/bin/clang -cc1 -Wundef-prefix\=TARGET_OS_ -fdiagnostics-show-note-include-stack -fmacro-backtrace-limit\=0 -ferror-limit 19 -serialize-diagnostic-file /Users/admin/builder/spi-builder-workspace/.derivedData/Build/Intermediates.noindex/iOSSnapshotTestCase.build/Debug-watchos/iOSSnapshotTestCaseCore.build/Objects-normal/armv7k/UIImage+Snapshot.dia -Wdeprecated-objc-isa-usage -Werror\=deprecated-objc-isa-usage -Werror\=implicit-function-declaration -Wnon-modular-include-in-framework-module -Werror\=non-modular-include-in-framework-module -Wno-trigraphs -Wno-missing-field-initializers -Wno-missing-prototypes -Wno-return-type -Wno-implicit-atomic-properties -Wno-objc-interface-ivars -Wno-arc-repeated-use-of-weak -Wno-missing-braces -Wparentheses -Wswitch -Wno-unused-function -Wno-unused-label -Wno-unused-parameter -Wno-unused-variable -Wunused-value -Wno-empty-body -Wno-uninitialized -Wno-unknown-pragmas -Wno-shadow -Wno-four-char-constants -Wno-conversion -Wno-constant-conversion -Wno-int-conversion -Wno-bool-conversion -Wno-enum-conversion -Wno-float-conversion -Wno-non-literal-null-conversion -Wno-objc-literal-conversion -Wno-shorten-64-to-32 -Wpointer-sign -Wno-newline-eof -Wno-selector -Wno-strict-selector-match -Wno-undeclared-selector -Wno-deprecated-implementations -Wno-implicit-fallthrough -Wprotocol -Wdeprecated-declarations -Wno-sign-conversion -Wno-infinite-recursion -Wno-comma -Wno-block-capture-autoreleasing -Wno-strict-prototypes -Wno-semicolon-before-method-body -Wno-reorder-init-list -Wno-implicit-int-float-conversion -Wno-c99-designator -Wno-final-dtor-non-final-class -Wno-extra-semi-stmt -Wno-misleading-indentation -Wno-quoted-include-in-framework-header -Wno-implicit-fallthrough -Wno-enum-enum-conversion -Wno-enum-float-conversion -Wno-elaborated-enum-base -Wno-reserved-identifier -Wno-gnu-folding-constant -index-store-path /Users/admin/builder/spi-builder-workspace/.derivedData/Index.noindex/DataStore -index-unit-output-path /iOSSnapshotTestCase.build/Debug-watchos/iOSSnapshotTestCaseCore.build/Objects-normal/armv7k/UIImage+Snapshot.o -fmodule-map-file\=/Applications/Xcode-16.3.0.app/Contents/Developer/Platforms/WatchOS.platform/Developer/SDKs/WatchOS.sdk/System/Library/Frameworks/UIKit.framework/Modules/module.modulemap -o /Users/admin/builder/spi-builder-workspace/.derivedData/Build/Intermediates.noindex/iOSSnapshotTestCase.build/Debug-watchos/iOSSnapshotTestCaseCore.build/Objects-normal/armv7k/UIImage+Snapshot.o -disable-free -emit-obj -x objective-c /Users/admin/builder/spi-builder-workspace/src/iOSSnapshotTestCaseCore/Categories/UIImage+Snapshot.m -target-abi aapcs16 -target-cpu cortex-a7 -target-feature +vfp2 -target-feature +vfp2sp -target-feature +vfp3 -target-feature +vfp3d16 -target-feature +vfp3d16sp -target-feature +vfp3sp -target-feature +fp16 -target-feature +vfp4 -target-feature +vfp4d16 -target-feature +vfp4d16sp -target-feature +vfp4sp -target-feature -fp-armv8 -target-feature -fp-armv8d16 -target-feature -fp-armv8d16sp -target-feature -fp-armv8sp -target-feature -fullfp16 -target-feature +fp64 -target-feature +d32 -target-feature +neon -target-feature -sha2 -target-feature -aes -target-feature -fp16fml -triple thumbv7k-apple-watchos5.0.0 -target-linker-version 1167.4.1 -target-sdk-version\=11.4 -fmodules-validate-system-headers -fno-modulemap-allow-subdirectory-search -isysroot /Applications/Xcode-16.3.0.app/Contents/Developer/Platforms/WatchOS.platform/Developer/SDKs/WatchOS11.4.sdk -resource-dir /Applications/Xcode-16.3.0.app/Contents/Developer/Toolchains/XcodeDefault.xctoolchain/usr/lib/clang/17 -fmodule-format\=obj -fmodule-file\=UIKit\=/Users/admin/builder/spi-builder-workspace/.derivedData/Build/Intermediates.noindex/ExplicitPrecompiledModules/UIKit-BDGDM3KB5QWPE5PPENQCG4CJN.pcm -I /Users/admin/builder/spi-builder-workspace/.derivedData/Build/Products/Debug-watchos/include -I /Users/admin/builder/spi-builder-workspace/src/iOSSnapshotTestCaseCore/Public -I /Users/admin/builder/spi-builder-workspace/.derivedData/Build/Intermediates.noindex/iOSSnapshotTestCase.build/Debug-watchos/iOSSnapshotTestCaseCore.build/DerivedSources-normal/armv7k -I /Users/admin/builder/spi-builder-workspace/.derivedData/Build/Intermediates.noindex/iOSSnapshotTestCase.build/Debug-watchos/iOSSnapshotTestCaseCore.build/DerivedSources/armv7k -I /Users/admin/builder/spi-builder-workspace/.derivedData/Build/Intermediates.noindex/iOSSnapshotTestCase.build/Debug-watchos/iOSSnapshotTestCaseCore.build/DerivedSources -F /Users/admin/builder/spi-builder-workspace/.derivedData/Build/Products/Debug-watchos -iframework /Applications/Xcode-16.3.0.app/Contents/Developer/Platforms/WatchOS.platform/Developer/Library/Frameworks -iframework /Applications/Xcode-16.3.0.app/Contents/Developer/Platforms/WatchOS.platform/Developer/SDKs/WatchOS11.4.sdk/Developer/Library/Frameworks -internal-isystem /Applications/Xcode-16.3.0.app/Contents/Developer/Platforms/WatchOS.platform/Developer/SDKs/WatchOS11.4.sdk/usr/local/include -internal-isystem /Applications/Xcode-16.3.0.app/Contents/Developer/Toolchains/XcodeDefault.xctoolchain/usr/lib/clang/17/include -internal-externc-isystem /Applications/Xcode-16.3.0.app/Contents/Developer/Platforms/WatchOS.platform/Developer/SDKs/WatchOS11.4.sdk/usr/include -internal-externc-isystem /Applications/Xcode-16.3.0.app/Contents/Developer/Toolchains/XcodeDefault.xctoolchain/usr/include -ivfsstatcache /Users/admin/builder/spi-builder-workspace/.derivedData/SDKStatCaches.noindex/watchos11.4-22T246-43efb940ff07ba2497b70ec94253f576.sdkstatcache -std\=gnu11 -fexceptions -exception-model dwarf -fskip-odr-check-in-gmf -fmodules -fmodule-name\=iOSSnapshotTestCaseCore -fno-implicit-modules -fobjc-exceptions -fmax-type-align\=16 -fpascal-strings -fvisibility-inlines-hidden-static-local-var -mdarwin-stkchk-strong-link -fno-odr-hash-protocols -pic-level 2 -fencode-extended-block-signature -stack-protector 1 -fobjc-runtime\=watchos-5.0.0 -fobjc-arc -fobjc-runtime-has-weak -fobjc-weak -fgnuc-version\=4.2.1 -fblocks -ffp-contract\=on -fclang-abi-compat\=4.0 -fno-experimental-relative-c++-abi-vtables -fno-file-reproducible -clang-vendor-feature\=+disableNonDependentMemberExprInCurrentInstantiation -clang-vendor-feature\=+enableAggressiveVLAFolding -clang-vendor-feature\=+revert09abecef7bbf -clang-vendor-feature\=+thisNoAlignAttr -clang-vendor-feature\=+thisNoNullAttr -clang-vendor-feature\=+disableAtImportPrivateFrameworkInImplementationError -O0 -fno-assume-unique-vtables -fdebug-compilation-dir\=/Users/admin/builder/spi-builder-workspace/.swiftpm/xcode -fcoverage-compilation-dir\=/Users/admin/builder/spi-builder-workspace/.swiftpm/xcode -fcoverage-mapping -fcommon -fregister-global-dtors-with-atexit -fno-strict-return -dwarf-version\=4 -debugger-tuning\=lldb -disable-llvm-verifier -dwarf-ext-refs -mfloat-abi hard -funwind-tables\=2 -fprofile-instrument\=clang -clear-ast-before-backend -discard-value-names -main-file-name UIImage+Snapshot.m -mframe-pointer\=all -debug-info-kind\=standalone -fdiagnostics-hotness-threshold\=0 -fdiagnostics-misexpect-tolerance\=0 -D DEBUG\=1 -D OBJC_OLD_DISPATCH_PROTOTYPES\=1 -D SWIFT_PACKAGE -D Xcode -D __GCC_HAVE_DWARF2_CFI_ASM\=1 -fdefine-target-os-macros -MT dependencies -dependency-file /Users/admin/builder/spi-builder-workspace/.derivedData/Build/Intermediates.noindex/iOSSnapshotTestCase.build/Debug-watchos/iOSSnapshotTestCaseCore.build/Objects-normal/armv7k/UIImage+Snapshot.d -skip-unused-modulemap-deps
CompileC /Users/admin/builder/spi-builder-workspace/.derivedData/Build/Intermediates.noindex/iOSSnapshotTestCase.build/Debug-watchos/iOSSnapshotTestCaseCore.build/Objects-normal/armv7k/UIImage+Compare.o /Users/admin/builder/spi-builder-workspace/src/iOSSnapshotTestCaseCore/Categories/UIImage+Compare.m normal armv7k objective-c com.apple.compilers.llvm.clang.1_0.compiler (in target 'iOSSnapshotTestCaseCore' from project 'iOSSnapshotTestCase')
cd /Users/admin/builder/spi-builder-workspace/.swiftpm/xcode
Using response file: /Users/admin/builder/spi-builder-workspace/.derivedData/Build/Intermediates.noindex/iOSSnapshotTestCase.build/Debug-watchos/iOSSnapshotTestCaseCore.build/Objects-normal/armv7k/e6072d4f65d7061329687fe24e3d63a7-common-args.resp
/Applications/Xcode-16.3.0.app/Contents/Developer/Toolchains/XcodeDefault.xctoolchain/usr/bin/clang -x objective-c -ivfsstatcache /Users/admin/builder/spi-builder-workspace/.derivedData/SDKStatCaches.noindex/watchos11.4-22T246-43efb940ff07ba2497b70ec94253f576.sdkstatcache -fmessage-length\=0 -fdiagnostics-show-note-include-stack -fmacro-backtrace-limit\=0 -fno-color-diagnostics -fmodules-prune-interval\=86400 -fmodules-prune-after\=345600 -fbuild-session-file\=/Users/admin/builder/spi-builder-workspace/.derivedData/ModuleCache.noindex/Session.modulevalidation -fmodules-validate-once-per-build-session -Wnon-modular-include-in-framework-module -Werror\=non-modular-include-in-framework-module -Wno-trigraphs -Wno-missing-field-initializers -Wno-missing-prototypes -Wno-return-type -Wno-implicit-atomic-properties -Wno-objc-interface-ivars -Wno-arc-repeated-use-of-weak -Wno-missing-braces -Wparentheses -Wswitch -Wno-unused-function -Wno-unused-label -Wno-unused-parameter -Wno-unused-variable -Wunused-value -Wno-empty-body -Wno-uninitialized -Wno-unknown-pragmas -Wno-shadow -Wno-four-char-constants -Wno-conversion -Wno-constant-conversion -Wno-int-conversion -Wno-bool-conversion -Wno-enum-conversion -Wno-float-conversion -Wno-non-literal-null-conversion -Wno-objc-literal-conversion -Wno-shorten-64-to-32 -Wpointer-sign -Wno-newline-eof -Wno-selector -Wno-strict-selector-match -Wno-undeclared-selector -Wno-deprecated-implementations -Wno-implicit-fallthrough -fstrict-aliasing -Wprotocol -Wdeprecated-declarations -Wno-sign-conversion -Wno-infinite-recursion -Wno-comma -Wno-block-capture-autoreleasing -Wno-strict-prototypes -Wno-semicolon-before-method-body -index-store-path /Users/admin/builder/spi-builder-workspace/.derivedData/Index.noindex/DataStore @/Users/admin/builder/spi-builder-workspace/.derivedData/Build/Intermediates.noindex/iOSSnapshotTestCase.build/Debug-watchos/iOSSnapshotTestCaseCore.build/Objects-normal/armv7k/e6072d4f65d7061329687fe24e3d63a7-common-args.resp -MMD -MT dependencies -MF /Users/admin/builder/spi-builder-workspace/.derivedData/Build/Intermediates.noindex/iOSSnapshotTestCase.build/Debug-watchos/iOSSnapshotTestCaseCore.build/Objects-normal/armv7k/UIImage+Compare.d --serialize-diagnostics /Users/admin/builder/spi-builder-workspace/.derivedData/Build/Intermediates.noindex/iOSSnapshotTestCase.build/Debug-watchos/iOSSnapshotTestCaseCore.build/Objects-normal/armv7k/UIImage+Compare.dia -c /Users/admin/builder/spi-builder-workspace/src/iOSSnapshotTestCaseCore/Categories/UIImage+Compare.m -o /Users/admin/builder/spi-builder-workspace/.derivedData/Build/Intermediates.noindex/iOSSnapshotTestCase.build/Debug-watchos/iOSSnapshotTestCaseCore.build/Objects-normal/armv7k/UIImage+Compare.o -index-unit-output-path /iOSSnapshotTestCase.build/Debug-watchos/iOSSnapshotTestCaseCore.build/Objects-normal/armv7k/UIImage+Compare.o
Failed frontend command:
/Applications/Xcode-16.3.0.app/Contents/Developer/Toolchains/XcodeDefault.xctoolchain/usr/bin/clang -cc1 -Wundef-prefix\=TARGET_OS_ -fdiagnostics-show-note-include-stack -fmacro-backtrace-limit\=0 -ferror-limit 19 -serialize-diagnostic-file /Users/admin/builder/spi-builder-workspace/.derivedData/Build/Intermediates.noindex/iOSSnapshotTestCase.build/Debug-watchos/iOSSnapshotTestCaseCore.build/Objects-normal/armv7k/UIImage+Compare.dia -Wdeprecated-objc-isa-usage -Werror\=deprecated-objc-isa-usage -Werror\=implicit-function-declaration -Wnon-modular-include-in-framework-module -Werror\=non-modular-include-in-framework-module -Wno-trigraphs -Wno-missing-field-initializers -Wno-missing-prototypes -Wno-return-type -Wno-implicit-atomic-properties -Wno-objc-interface-ivars -Wno-arc-repeated-use-of-weak -Wno-missing-braces -Wparentheses -Wswitch -Wno-unused-function -Wno-unused-label -Wno-unused-parameter -Wno-unused-variable -Wunused-value -Wno-empty-body -Wno-uninitialized -Wno-unknown-pragmas -Wno-shadow -Wno-four-char-constants -Wno-conversion -Wno-constant-conversion -Wno-int-conversion -Wno-bool-conversion -Wno-enum-conversion -Wno-float-conversion -Wno-non-literal-null-conversion -Wno-objc-literal-conversion -Wno-shorten-64-to-32 -Wpointer-sign -Wno-newline-eof -Wno-selector -Wno-strict-selector-match -Wno-undeclared-selector -Wno-deprecated-implementations -Wno-implicit-fallthrough -Wprotocol -Wdeprecated-declarations -Wno-sign-conversion -Wno-infinite-recursion -Wno-comma -Wno-block-capture-autoreleasing -Wno-strict-prototypes -Wno-semicolon-before-method-body -Wno-reorder-init-list -Wno-implicit-int-float-conversion -Wno-c99-designator -Wno-final-dtor-non-final-class -Wno-extra-semi-stmt -Wno-misleading-indentation -Wno-quoted-include-in-framework-header -Wno-implicit-fallthrough -Wno-enum-enum-conversion -Wno-enum-float-conversion -Wno-elaborated-enum-base -Wno-reserved-identifier -Wno-gnu-folding-constant -index-store-path /Users/admin/builder/spi-builder-workspace/.derivedData/Index.noindex/DataStore -index-unit-output-path /iOSSnapshotTestCase.build/Debug-watchos/iOSSnapshotTestCaseCore.build/Objects-normal/armv7k/UIImage+Compare.o -fmodule-map-file\=/Applications/Xcode-16.3.0.app/Contents/Developer/Platforms/WatchOS.platform/Developer/SDKs/WatchOS.sdk/System/Library/Frameworks/UIKit.framework/Modules/module.modulemap -o /Users/admin/builder/spi-builder-workspace/.derivedData/Build/Intermediates.noindex/iOSSnapshotTestCase.build/Debug-watchos/iOSSnapshotTestCaseCore.build/Objects-normal/armv7k/UIImage+Compare.o -disable-free -emit-obj -x objective-c /Users/admin/builder/spi-builder-workspace/src/iOSSnapshotTestCaseCore/Categories/UIImage+Compare.m -target-abi aapcs16 -target-cpu cortex-a7 -target-feature +vfp2 -target-feature +vfp2sp -target-feature +vfp3 -target-feature +vfp3d16 -target-feature +vfp3d16sp -target-feature +vfp3sp -target-feature +fp16 -target-feature +vfp4 -target-feature +vfp4d16 -target-feature +vfp4d16sp -target-feature +vfp4sp -target-feature -fp-armv8 -target-feature -fp-armv8d16 -target-feature -fp-armv8d16sp -target-feature -fp-armv8sp -target-feature -fullfp16 -target-feature +fp64 -target-feature +d32 -target-feature +neon -target-feature -sha2 -target-feature -aes -target-feature -fp16fml -triple thumbv7k-apple-watchos5.0.0 -target-linker-version 1167.4.1 -target-sdk-version\=11.4 -fmodules-validate-system-headers -fno-modulemap-allow-subdirectory-search -isysroot /Applications/Xcode-16.3.0.app/Contents/Developer/Platforms/WatchOS.platform/Developer/SDKs/WatchOS11.4.sdk -resource-dir /Applications/Xcode-16.3.0.app/Contents/Developer/Toolchains/XcodeDefault.xctoolchain/usr/lib/clang/17 -fmodule-format\=obj -fmodule-file\=UIKit\=/Users/admin/builder/spi-builder-workspace/.derivedData/Build/Intermediates.noindex/ExplicitPrecompiledModules/UIKit-BDGDM3KB5QWPE5PPENQCG4CJN.pcm -I /Users/admin/builder/spi-builder-workspace/.derivedData/Build/Products/Debug-watchos/include -I /Users/admin/builder/spi-builder-workspace/src/iOSSnapshotTestCaseCore/Public -I /Users/admin/builder/spi-builder-workspace/.derivedData/Build/Intermediates.noindex/iOSSnapshotTestCase.build/Debug-watchos/iOSSnapshotTestCaseCore.build/DerivedSources-normal/armv7k -I /Users/admin/builder/spi-builder-workspace/.derivedData/Build/Intermediates.noindex/iOSSnapshotTestCase.build/Debug-watchos/iOSSnapshotTestCaseCore.build/DerivedSources/armv7k -I /Users/admin/builder/spi-builder-workspace/.derivedData/Build/Intermediates.noindex/iOSSnapshotTestCase.build/Debug-watchos/iOSSnapshotTestCaseCore.build/DerivedSources -F /Users/admin/builder/spi-builder-workspace/.derivedData/Build/Products/Debug-watchos -iframework /Applications/Xcode-16.3.0.app/Contents/Developer/Platforms/WatchOS.platform/Developer/Library/Frameworks -iframework /Applications/Xcode-16.3.0.app/Contents/Developer/Platforms/WatchOS.platform/Developer/SDKs/WatchOS11.4.sdk/Developer/Library/Frameworks -internal-isystem /Applications/Xcode-16.3.0.app/Contents/Developer/Platforms/WatchOS.platform/Developer/SDKs/WatchOS11.4.sdk/usr/local/include -internal-isystem /Applications/Xcode-16.3.0.app/Contents/Developer/Toolchains/XcodeDefault.xctoolchain/usr/lib/clang/17/include -internal-externc-isystem /Applications/Xcode-16.3.0.app/Contents/Developer/Platforms/WatchOS.platform/Developer/SDKs/WatchOS11.4.sdk/usr/include -internal-externc-isystem /Applications/Xcode-16.3.0.app/Contents/Developer/Toolchains/XcodeDefault.xctoolchain/usr/include -ivfsstatcache /Users/admin/builder/spi-builder-workspace/.derivedData/SDKStatCaches.noindex/watchos11.4-22T246-43efb940ff07ba2497b70ec94253f576.sdkstatcache -std\=gnu11 -fexceptions -exception-model dwarf -fskip-odr-check-in-gmf -fmodules -fmodule-name\=iOSSnapshotTestCaseCore -fno-implicit-modules -fobjc-exceptions -fmax-type-align\=16 -fpascal-strings -fvisibility-inlines-hidden-static-local-var -mdarwin-stkchk-strong-link -fno-odr-hash-protocols -pic-level 2 -fencode-extended-block-signature -stack-protector 1 -fobjc-runtime\=watchos-5.0.0 -fobjc-arc -fobjc-runtime-has-weak -fobjc-weak -fgnuc-version\=4.2.1 -fblocks -ffp-contract\=on -fclang-abi-compat\=4.0 -fno-experimental-relative-c++-abi-vtables -fno-file-reproducible -clang-vendor-feature\=+disableNonDependentMemberExprInCurrentInstantiation -clang-vendor-feature\=+enableAggressiveVLAFolding -clang-vendor-feature\=+revert09abecef7bbf -clang-vendor-feature\=+thisNoAlignAttr -clang-vendor-feature\=+thisNoNullAttr -clang-vendor-feature\=+disableAtImportPrivateFrameworkInImplementationError -O0 -fno-assume-unique-vtables -fdebug-compilation-dir\=/Users/admin/builder/spi-builder-workspace/.swiftpm/xcode -fcoverage-compilation-dir\=/Users/admin/builder/spi-builder-workspace/.swiftpm/xcode -fcoverage-mapping -fcommon -fregister-global-dtors-with-atexit -fno-strict-return -dwarf-version\=4 -debugger-tuning\=lldb -disable-llvm-verifier -dwarf-ext-refs -mfloat-abi hard -funwind-tables\=2 -fprofile-instrument\=clang -clear-ast-before-backend -discard-value-names -main-file-name UIImage+Compare.m -mframe-pointer\=all -debug-info-kind\=standalone -fdiagnostics-hotness-threshold\=0 -fdiagnostics-misexpect-tolerance\=0 -D DEBUG\=1 -D OBJC_OLD_DISPATCH_PROTOTYPES\=1 -D SWIFT_PACKAGE -D Xcode -D __GCC_HAVE_DWARF2_CFI_ASM\=1 -fdefine-target-os-macros -MT dependencies -dependency-file /Users/admin/builder/spi-builder-workspace/.derivedData/Build/Intermediates.noindex/iOSSnapshotTestCase.build/Debug-watchos/iOSSnapshotTestCaseCore.build/Objects-normal/armv7k/UIImage+Compare.d -skip-unused-modulemap-deps
CompileC /Users/admin/builder/spi-builder-workspace/.derivedData/Build/Intermediates.noindex/iOSSnapshotTestCase.build/Debug-watchos/iOSSnapshotTestCaseCore.build/Objects-normal/armv7k/UIApplication+KeyWindow.o /Users/admin/builder/spi-builder-workspace/src/iOSSnapshotTestCaseCore/Categories/UIApplication+KeyWindow.m normal armv7k objective-c com.apple.compilers.llvm.clang.1_0.compiler (in target 'iOSSnapshotTestCaseCore' from project 'iOSSnapshotTestCase')
cd /Users/admin/builder/spi-builder-workspace/.swiftpm/xcode
Using response file: /Users/admin/builder/spi-builder-workspace/.derivedData/Build/Intermediates.noindex/iOSSnapshotTestCase.build/Debug-watchos/iOSSnapshotTestCaseCore.build/Objects-normal/armv7k/e6072d4f65d7061329687fe24e3d63a7-common-args.resp
/Applications/Xcode-16.3.0.app/Contents/Developer/Toolchains/XcodeDefault.xctoolchain/usr/bin/clang -x objective-c -ivfsstatcache /Users/admin/builder/spi-builder-workspace/.derivedData/SDKStatCaches.noindex/watchos11.4-22T246-43efb940ff07ba2497b70ec94253f576.sdkstatcache -fmessage-length\=0 -fdiagnostics-show-note-include-stack -fmacro-backtrace-limit\=0 -fno-color-diagnostics -fmodules-prune-interval\=86400 -fmodules-prune-after\=345600 -fbuild-session-file\=/Users/admin/builder/spi-builder-workspace/.derivedData/ModuleCache.noindex/Session.modulevalidation -fmodules-validate-once-per-build-session -Wnon-modular-include-in-framework-module -Werror\=non-modular-include-in-framework-module -Wno-trigraphs -Wno-missing-field-initializers -Wno-missing-prototypes -Wno-return-type -Wno-implicit-atomic-properties -Wno-objc-interface-ivars -Wno-arc-repeated-use-of-weak -Wno-missing-braces -Wparentheses -Wswitch -Wno-unused-function -Wno-unused-label -Wno-unused-parameter -Wno-unused-variable -Wunused-value -Wno-empty-body -Wno-uninitialized -Wno-unknown-pragmas -Wno-shadow -Wno-four-char-constants -Wno-conversion -Wno-constant-conversion -Wno-int-conversion -Wno-bool-conversion -Wno-enum-conversion -Wno-float-conversion -Wno-non-literal-null-conversion -Wno-objc-literal-conversion -Wno-shorten-64-to-32 -Wpointer-sign -Wno-newline-eof -Wno-selector -Wno-strict-selector-match -Wno-undeclared-selector -Wno-deprecated-implementations -Wno-implicit-fallthrough -fstrict-aliasing -Wprotocol -Wdeprecated-declarations -Wno-sign-conversion -Wno-infinite-recursion -Wno-comma -Wno-block-capture-autoreleasing -Wno-strict-prototypes -Wno-semicolon-before-method-body -index-store-path /Users/admin/builder/spi-builder-workspace/.derivedData/Index.noindex/DataStore @/Users/admin/builder/spi-builder-workspace/.derivedData/Build/Intermediates.noindex/iOSSnapshotTestCase.build/Debug-watchos/iOSSnapshotTestCaseCore.build/Objects-normal/armv7k/e6072d4f65d7061329687fe24e3d63a7-common-args.resp -MMD -MT dependencies -MF /Users/admin/builder/spi-builder-workspace/.derivedData/Build/Intermediates.noindex/iOSSnapshotTestCase.build/Debug-watchos/iOSSnapshotTestCaseCore.build/Objects-normal/armv7k/UIApplication+KeyWindow.d --serialize-diagnostics /Users/admin/builder/spi-builder-workspace/.derivedData/Build/Intermediates.noindex/iOSSnapshotTestCase.build/Debug-watchos/iOSSnapshotTestCaseCore.build/Objects-normal/armv7k/UIApplication+KeyWindow.dia -c /Users/admin/builder/spi-builder-workspace/src/iOSSnapshotTestCaseCore/Categories/UIApplication+KeyWindow.m -o /Users/admin/builder/spi-builder-workspace/.derivedData/Build/Intermediates.noindex/iOSSnapshotTestCase.build/Debug-watchos/iOSSnapshotTestCaseCore.build/Objects-normal/armv7k/UIApplication+KeyWindow.o -index-unit-output-path /iOSSnapshotTestCase.build/Debug-watchos/iOSSnapshotTestCaseCore.build/Objects-normal/armv7k/UIApplication+KeyWindow.o
Failed frontend command:
/Applications/Xcode-16.3.0.app/Contents/Developer/Toolchains/XcodeDefault.xctoolchain/usr/bin/clang -cc1 -Wundef-prefix\=TARGET_OS_ -fdiagnostics-show-note-include-stack -fmacro-backtrace-limit\=0 -ferror-limit 19 -serialize-diagnostic-file /Users/admin/builder/spi-builder-workspace/.derivedData/Build/Intermediates.noindex/iOSSnapshotTestCase.build/Debug-watchos/iOSSnapshotTestCaseCore.build/Objects-normal/armv7k/UIApplication+KeyWindow.dia -Wdeprecated-objc-isa-usage -Werror\=deprecated-objc-isa-usage -Werror\=implicit-function-declaration -Wnon-modular-include-in-framework-module -Werror\=non-modular-include-in-framework-module -Wno-trigraphs -Wno-missing-field-initializers -Wno-missing-prototypes -Wno-return-type -Wno-implicit-atomic-properties -Wno-objc-interface-ivars -Wno-arc-repeated-use-of-weak -Wno-missing-braces -Wparentheses -Wswitch -Wno-unused-function -Wno-unused-label -Wno-unused-parameter -Wno-unused-variable -Wunused-value -Wno-empty-body -Wno-uninitialized -Wno-unknown-pragmas -Wno-shadow -Wno-four-char-constants -Wno-conversion -Wno-constant-conversion -Wno-int-conversion -Wno-bool-conversion -Wno-enum-conversion -Wno-float-conversion -Wno-non-literal-null-conversion -Wno-objc-literal-conversion -Wno-shorten-64-to-32 -Wpointer-sign -Wno-newline-eof -Wno-selector -Wno-strict-selector-match -Wno-undeclared-selector -Wno-deprecated-implementations -Wno-implicit-fallthrough -Wprotocol -Wdeprecated-declarations -Wno-sign-conversion -Wno-infinite-recursion -Wno-comma -Wno-block-capture-autoreleasing -Wno-strict-prototypes -Wno-semicolon-before-method-body -Wno-reorder-init-list -Wno-implicit-int-float-conversion -Wno-c99-designator -Wno-final-dtor-non-final-class -Wno-extra-semi-stmt -Wno-misleading-indentation -Wno-quoted-include-in-framework-header -Wno-implicit-fallthrough -Wno-enum-enum-conversion -Wno-enum-float-conversion -Wno-elaborated-enum-base -Wno-reserved-identifier -Wno-gnu-folding-constant -index-store-path /Users/admin/builder/spi-builder-workspace/.derivedData/Index.noindex/DataStore -index-unit-output-path /iOSSnapshotTestCase.build/Debug-watchos/iOSSnapshotTestCaseCore.build/Objects-normal/armv7k/UIApplication+KeyWindow.o -fmodule-map-file\=/Applications/Xcode-16.3.0.app/Contents/Developer/Platforms/WatchOS.platform/Developer/SDKs/WatchOS.sdk/System/Library/Frameworks/UIKit.framework/Modules/module.modulemap -o /Users/admin/builder/spi-builder-workspace/.derivedData/Build/Intermediates.noindex/iOSSnapshotTestCase.build/Debug-watchos/iOSSnapshotTestCaseCore.build/Objects-normal/armv7k/UIApplication+KeyWindow.o -disable-free -emit-obj -x objective-c /Users/admin/builder/spi-builder-workspace/src/iOSSnapshotTestCaseCore/Categories/UIApplication+KeyWindow.m -target-abi aapcs16 -target-cpu cortex-a7 -target-feature +vfp2 -target-feature +vfp2sp -target-feature +vfp3 -target-feature +vfp3d16 -target-feature +vfp3d16sp -target-feature +vfp3sp -target-feature +fp16 -target-feature +vfp4 -target-feature +vfp4d16 -target-feature +vfp4d16sp -target-feature +vfp4sp -target-feature -fp-armv8 -target-feature -fp-armv8d16 -target-feature -fp-armv8d16sp -target-feature -fp-armv8sp -target-feature -fullfp16 -target-feature +fp64 -target-feature +d32 -target-feature +neon -target-feature -sha2 -target-feature -aes -target-feature -fp16fml -triple thumbv7k-apple-watchos5.0.0 -target-linker-version 1167.4.1 -target-sdk-version\=11.4 -fmodules-validate-system-headers -fno-modulemap-allow-subdirectory-search -isysroot /Applications/Xcode-16.3.0.app/Contents/Developer/Platforms/WatchOS.platform/Developer/SDKs/WatchOS11.4.sdk -resource-dir /Applications/Xcode-16.3.0.app/Contents/Developer/Toolchains/XcodeDefault.xctoolchain/usr/lib/clang/17 -fmodule-format\=obj -fmodule-file\=UIKit\=/Users/admin/builder/spi-builder-workspace/.derivedData/Build/Intermediates.noindex/ExplicitPrecompiledModules/UIKit-BDGDM3KB5QWPE5PPENQCG4CJN.pcm -I /Users/admin/builder/spi-builder-workspace/.derivedData/Build/Products/Debug-watchos/include -I /Users/admin/builder/spi-builder-workspace/src/iOSSnapshotTestCaseCore/Public -I /Users/admin/builder/spi-builder-workspace/.derivedData/Build/Intermediates.noindex/iOSSnapshotTestCase.build/Debug-watchos/iOSSnapshotTestCaseCore.build/DerivedSources-normal/armv7k -I /Users/admin/builder/spi-builder-workspace/.derivedData/Build/Intermediates.noindex/iOSSnapshotTestCase.build/Debug-watchos/iOSSnapshotTestCaseCore.build/DerivedSources/armv7k -I /Users/admin/builder/spi-builder-workspace/.derivedData/Build/Intermediates.noindex/iOSSnapshotTestCase.build/Debug-watchos/iOSSnapshotTestCaseCore.build/DerivedSources -F /Users/admin/builder/spi-builder-workspace/.derivedData/Build/Products/Debug-watchos -iframework /Applications/Xcode-16.3.0.app/Contents/Developer/Platforms/WatchOS.platform/Developer/Library/Frameworks -iframework /Applications/Xcode-16.3.0.app/Contents/Developer/Platforms/WatchOS.platform/Developer/SDKs/WatchOS11.4.sdk/Developer/Library/Frameworks -internal-isystem /Applications/Xcode-16.3.0.app/Contents/Developer/Platforms/WatchOS.platform/Developer/SDKs/WatchOS11.4.sdk/usr/local/include -internal-isystem /Applications/Xcode-16.3.0.app/Contents/Developer/Toolchains/XcodeDefault.xctoolchain/usr/lib/clang/17/include -internal-externc-isystem /Applications/Xcode-16.3.0.app/Contents/Developer/Platforms/WatchOS.platform/Developer/SDKs/WatchOS11.4.sdk/usr/include -internal-externc-isystem /Applications/Xcode-16.3.0.app/Contents/Developer/Toolchains/XcodeDefault.xctoolchain/usr/include -ivfsstatcache /Users/admin/builder/spi-builder-workspace/.derivedData/SDKStatCaches.noindex/watchos11.4-22T246-43efb940ff07ba2497b70ec94253f576.sdkstatcache -std\=gnu11 -fexceptions -exception-model dwarf -fskip-odr-check-in-gmf -fmodules -fmodule-name\=iOSSnapshotTestCaseCore -fno-implicit-modules -fobjc-exceptions -fmax-type-align\=16 -fpascal-strings -fvisibility-inlines-hidden-static-local-var -mdarwin-stkchk-strong-link -fno-odr-hash-protocols -pic-level 2 -fencode-extended-block-signature -stack-protector 1 -fobjc-runtime\=watchos-5.0.0 -fobjc-arc -fobjc-runtime-has-weak -fobjc-weak -fgnuc-version\=4.2.1 -fblocks -ffp-contract\=on -fclang-abi-compat\=4.0 -fno-experimental-relative-c++-abi-vtables -fno-file-reproducible -clang-vendor-feature\=+disableNonDependentMemberExprInCurrentInstantiation -clang-vendor-feature\=+enableAggressiveVLAFolding -clang-vendor-feature\=+revert09abecef7bbf -clang-vendor-feature\=+thisNoAlignAttr -clang-vendor-feature\=+thisNoNullAttr -clang-vendor-feature\=+disableAtImportPrivateFrameworkInImplementationError -O0 -fno-assume-unique-vtables -fdebug-compilation-dir\=/Users/admin/builder/spi-builder-workspace/.swiftpm/xcode -fcoverage-compilation-dir\=/Users/admin/builder/spi-builder-workspace/.swiftpm/xcode -fcoverage-mapping -fcommon -fregister-global-dtors-with-atexit -fno-strict-return -dwarf-version\=4 -debugger-tuning\=lldb -disable-llvm-verifier -dwarf-ext-refs -mfloat-abi hard -funwind-tables\=2 -fprofile-instrument\=clang -clear-ast-before-backend -discard-value-names -main-file-name UIApplication+KeyWindow.m -mframe-pointer\=all -debug-info-kind\=standalone -fdiagnostics-hotness-threshold\=0 -fdiagnostics-misexpect-tolerance\=0 -D DEBUG\=1 -D OBJC_OLD_DISPATCH_PROTOTYPES\=1 -D SWIFT_PACKAGE -D Xcode -D __GCC_HAVE_DWARF2_CFI_ASM\=1 -fdefine-target-os-macros -MT dependencies -dependency-file /Users/admin/builder/spi-builder-workspace/.derivedData/Build/Intermediates.noindex/iOSSnapshotTestCase.build/Debug-watchos/iOSSnapshotTestCaseCore.build/Objects-normal/armv7k/UIApplication+KeyWindow.d -skip-unused-modulemap-deps
** BUILD FAILED **
The following build commands failed:
CompileC /Users/admin/builder/spi-builder-workspace/.derivedData/Build/Intermediates.noindex/iOSSnapshotTestCase.build/Debug-watchos/iOSSnapshotTestCaseCore.build/Objects-normal/armv7k/UIImage+Snapshot.o /Users/admin/builder/spi-builder-workspace/src/iOSSnapshotTestCaseCore/Categories/UIImage+Snapshot.m normal armv7k objective-c com.apple.compilers.llvm.clang.1_0.compiler (in target 'iOSSnapshotTestCaseCore' from project 'iOSSnapshotTestCase')
Building workspace spi-builder-workspace with scheme iOSSnapshotTestCase
(2 failures)
Command line invocation:
/Applications/Xcode-16.3.0.app/Contents/Developer/usr/bin/xcodebuild -IDEClonedSourcePackagesDirPathOverride=/Users/admin/builder/spi-builder-workspace/.dependencies -resolvePackageDependencies
Resolve Package Graph
Resolved source packages:
iOSSnapshotTestCase: /Users/admin/builder/spi-builder-workspace
resolved source packages: iOSSnapshotTestCase
{
"dependencies" : [
],
"manifest_display_name" : "iOSSnapshotTestCase",
"name" : "iOSSnapshotTestCase",
"path" : "/Users/admin/builder/spi-builder-workspace",
"platforms" : [
{
"name" : "ios",
"version" : "10.0"
},
{
"name" : "tvos",
"version" : "10.0"
}
],
"products" : [
{
"name" : "iOSSnapshotTestCase",
"targets" : [
"iOSSnapshotTestCase",
"iOSSnapshotTestCaseCore"
],
"type" : {
"library" : [
"dynamic"
]
}
}
],
"targets" : [
{
"c99name" : "iOSSnapshotTestCaseTests",
"module_type" : "ClangTarget",
"name" : "iOSSnapshotTestCaseTests",
"path" : "src/iOSSnapshotTestCaseTests",
"resources" : [
{
"path" : "/Users/admin/builder/spi-builder-workspace/src/iOSSnapshotTestCaseTests/Resources/FBSnapshotTestCaseTests-Info.plist",
"rule" : {
"process" : {
}
}
},
{
"path" : "/Users/admin/builder/spi-builder-workspace/src/iOSSnapshotTestCaseTests/Resources/rect.png",
"rule" : {
"process" : {
}
}
},
{
"path" : "/Users/admin/builder/spi-builder-workspace/src/iOSSnapshotTestCaseTests/Resources/rect_shade.png",
"rule" : {
"process" : {
}
}
},
{
"path" : "/Users/admin/builder/spi-builder-workspace/src/iOSSnapshotTestCaseTests/Resources/square-copy.png",
"rule" : {
"process" : {
}
}
},
{
"path" : "/Users/admin/builder/spi-builder-workspace/src/iOSSnapshotTestCaseTests/Resources/square.png",
"rule" : {
"process" : {
}
}
},
{
"path" : "/Users/admin/builder/spi-builder-workspace/src/iOSSnapshotTestCaseTests/Resources/square_with_pixel.png",
"rule" : {
"process" : {
}
}
},
{
"path" : "/Users/admin/builder/spi-builder-workspace/src/iOSSnapshotTestCaseTests/Resources/square_with_text.png",
"rule" : {
"process" : {
}
}
}
],
"sources" : [
"FBSnapshotControllerTests.m"
],
"target_dependencies" : [
"iOSSnapshotTestCase"
],
"type" : "test"
},
{
"c99name" : "iOSSnapshotTestCaseCore",
"module_type" : "ClangTarget",
"name" : "iOSSnapshotTestCaseCore",
"path" : "src/iOSSnapshotTestCaseCore",
"product_memberships" : [
"iOSSnapshotTestCase"
],
"sources" : [
"Categories/UIApplication+KeyWindow.m",
"Categories/UIImage+Compare.m",
"Categories/UIImage+Diff.m",
"Categories/UIImage+Snapshot.m",
"FBSnapshotTestCase.m",
"FBSnapshotTestCasePlatform.m",
"FBSnapshotTestController.m"
],
"type" : "library"
},
{
"c99name" : "iOSSnapshotTestCase",
"module_type" : "SwiftTarget",
"name" : "iOSSnapshotTestCase",
"path" : "src/iOSSnapshotTestCase",
"product_memberships" : [
"iOSSnapshotTestCase"
],
"sources" : [
"SwiftSupport.swift"
],
"target_dependencies" : [
"iOSSnapshotTestCaseCore"
],
"type" : "library"
}
],
"tools_version" : "5.3"
}
{
"workspace" : {
"name" : "spi-builder-workspace",
"schemes" : [
"iOSSnapshotTestCase"
]
}
}
Running build ...
env DEVELOPER_DIR=/Applications/Xcode-16.3.0.app xcrun xcodebuild -IDEClonedSourcePackagesDirPathOverride=$PWD/.dependencies -skipMacroValidation -skipPackagePluginValidation -derivedDataPath $PWD/.derivedData build -scheme iOSSnapshotTestCase -destination generic/platform=watchOS
Command line invocation:
/Applications/Xcode-16.3.0.app/Contents/Developer/usr/bin/xcodebuild -IDEClonedSourcePackagesDirPathOverride=/Users/admin/builder/spi-builder-workspace/.dependencies -skipMacroValidation -skipPackagePluginValidation -derivedDataPath /Users/admin/builder/spi-builder-workspace/.derivedData build -scheme iOSSnapshotTestCase -destination generic/platform=watchOS
Resolve Package Graph
Resolved source packages:
iOSSnapshotTestCase: /Users/admin/builder/spi-builder-workspace
ComputePackagePrebuildTargetDependencyGraph
Prepare packages
CreateBuildRequest
SendProjectDescription
CreateBuildOperation
ComputeTargetDependencyGraph
note: Building targets in dependency order
note: Target dependency graph (3 targets)
Target 'iOSSnapshotTestCase' in project 'iOSSnapshotTestCase'
➜ Explicit dependency on target 'iOSSnapshotTestCase' in project 'iOSSnapshotTestCase'
➜ Explicit dependency on target 'iOSSnapshotTestCaseCore' in project 'iOSSnapshotTestCase'
Target 'iOSSnapshotTestCase' in project 'iOSSnapshotTestCase'
➜ Explicit dependency on target 'iOSSnapshotTestCaseCore' in project 'iOSSnapshotTestCase'
Target 'iOSSnapshotTestCaseCore' in project 'iOSSnapshotTestCase' (no dependencies)
GatherProvisioningInputs
CreateBuildDescription
ExecuteExternalTool /Applications/Xcode-16.3.0.app/Contents/Developer/Toolchains/XcodeDefault.xctoolchain/usr/bin/swiftc --version
ExecuteExternalTool /Applications/Xcode-16.3.0.app/Contents/Developer/Toolchains/XcodeDefault.xctoolchain/usr/bin/clang -v -E -dM -arch arm64 -isysroot /Applications/Xcode-16.3.0.app/Contents/Developer/Platforms/WatchOS.platform/Developer/SDKs/WatchOS11.4.sdk -x objective-c -c /dev/null
ExecuteExternalTool /Applications/Xcode-16.3.0.app/Contents/Developer/Toolchains/XcodeDefault.xctoolchain/usr/bin/clang -v -E -dM -isysroot /Applications/Xcode-16.3.0.app/Contents/Developer/Platforms/WatchOS.platform/Developer/SDKs/WatchOS11.4.sdk -x c -c /dev/null
ExecuteExternalTool /Applications/Xcode-16.3.0.app/Contents/Developer/Toolchains/XcodeDefault.xctoolchain/usr/bin/ld -version_details
ExecuteExternalTool /Applications/Xcode-16.3.0.app/Contents/Developer/Toolchains/XcodeDefault.xctoolchain/usr/bin/clang -v -E -dM -arch arm64 -isysroot /Applications/Xcode-16.3.0.app/Contents/Developer/Platforms/WatchOS.platform/Developer/SDKs/WatchOS11.4.sdk -x c -c /dev/null
ExecuteExternalTool /Applications/Xcode-16.3.0.app/Contents/Developer/Toolchains/XcodeDefault.xctoolchain/usr/bin/clang -v -E -dM -arch armv7k -isysroot /Applications/Xcode-16.3.0.app/Contents/Developer/Platforms/WatchOS.platform/Developer/SDKs/WatchOS11.4.sdk -x objective-c -c /dev/null
ExecuteExternalTool /Applications/Xcode-16.3.0.app/Contents/Developer/Toolchains/XcodeDefault.xctoolchain/usr/bin/clang -v -E -dM -arch armv7k -isysroot /Applications/Xcode-16.3.0.app/Contents/Developer/Platforms/WatchOS.platform/Developer/SDKs/WatchOS11.4.sdk -x c -c /dev/null
ExecuteExternalTool /Applications/Xcode-16.3.0.app/Contents/Developer/Toolchains/XcodeDefault.xctoolchain/usr/bin/clang -v -E -dM -arch arm64_32 -isysroot /Applications/Xcode-16.3.0.app/Contents/Developer/Platforms/WatchOS.platform/Developer/SDKs/WatchOS11.4.sdk -x objective-c -c /dev/null
ExecuteExternalTool /Applications/Xcode-16.3.0.app/Contents/Developer/Toolchains/XcodeDefault.xctoolchain/usr/bin/clang -v -E -dM -arch arm64_32 -isysroot /Applications/Xcode-16.3.0.app/Contents/Developer/Platforms/WatchOS.platform/Developer/SDKs/WatchOS11.4.sdk -x c -c /dev/null
Build description signature: d713aaf8f1a20ffc998b0313abf4d449
Build description path: /Users/admin/builder/spi-builder-workspace/.derivedData/Build/Intermediates.noindex/XCBuildData/d713aaf8f1a20ffc998b0313abf4d449.xcbuilddata
ClangStatCache /Applications/Xcode-16.3.0.app/Contents/Developer/Toolchains/XcodeDefault.xctoolchain/usr/bin/clang-stat-cache /Applications/Xcode-16.3.0.app/Contents/Developer/Platforms/WatchOS.platform/Developer/SDKs/WatchOS11.4.sdk /Users/admin/builder/spi-builder-workspace/.derivedData/SDKStatCaches.noindex/watchos11.4-22T246-43efb940ff07ba2497b70ec94253f576.sdkstatcache
cd /Users/admin/builder/spi-builder-workspace/.swiftpm/xcode
/Applications/Xcode-16.3.0.app/Contents/Developer/Toolchains/XcodeDefault.xctoolchain/usr/bin/clang-stat-cache /Applications/Xcode-16.3.0.app/Contents/Developer/Platforms/WatchOS.platform/Developer/SDKs/WatchOS11.4.sdk -o /Users/admin/builder/spi-builder-workspace/.derivedData/SDKStatCaches.noindex/watchos11.4-22T246-43efb940ff07ba2497b70ec94253f576.sdkstatcache
SwiftDriver iOSSnapshotTestCase normal arm64_32 com.apple.xcode.tools.swift.compiler (in target 'iOSSnapshotTestCase' from project 'iOSSnapshotTestCase')
cd /Users/admin/builder/spi-builder-workspace/.swiftpm/xcode
builtin-SwiftDriver -- /Applications/Xcode-16.3.0.app/Contents/Developer/Toolchains/XcodeDefault.xctoolchain/usr/bin/swiftc -module-name iOSSnapshotTestCase -Onone -enforce-exclusivity\=checked @/Users/admin/builder/spi-builder-workspace/.derivedData/Build/Intermediates.noindex/iOSSnapshotTestCase.build/Debug-watchos/iOSSnapshotTestCase.build/Objects-normal/arm64_32/iOSSnapshotTestCase.SwiftFileList -DSWIFT_PACKAGE -DDEBUG -Xcc -fmodule-map-file\=/Users/admin/builder/spi-builder-workspace/.derivedData/Build/Intermediates.noindex/GeneratedModuleMaps-watchos/iOSSnapshotTestCaseCore.modulemap -DXcode -plugin-path /Applications/Xcode-16.3.0.app/Contents/Developer/Toolchains/XcodeDefault.xctoolchain/usr/lib/swift/host/plugins/testing -enable-experimental-feature DebugDescriptionMacro -sdk /Applications/Xcode-16.3.0.app/Contents/Developer/Platforms/WatchOS.platform/Developer/SDKs/WatchOS11.4.sdk -target arm64_32-apple-watchos5.0 -g -module-cache-path /Users/admin/builder/spi-builder-workspace/.derivedData/ModuleCache.noindex -Xfrontend -serialize-debugging-options -profile-coverage-mapping -profile-generate -enable-testing -index-store-path /Users/admin/builder/spi-builder-workspace/.derivedData/Index.noindex/DataStore -swift-version 5 -I /Users/admin/builder/spi-builder-workspace/.derivedData/Build/Products/Debug-watchos -I /Applications/Xcode-16.3.0.app/Contents/Developer/Platforms/WatchOS.platform/Developer/usr/lib -F /Users/admin/builder/spi-builder-workspace/.derivedData/Build/Products/Debug-watchos/PackageFrameworks -F /Users/admin/builder/spi-builder-workspace/.derivedData/Build/Products/Debug-watchos -F /Applications/Xcode-16.3.0.app/Contents/Developer/Platforms/WatchOS.platform/Developer/Library/Frameworks -F /Applications/Xcode-16.3.0.app/Contents/Developer/Platforms/WatchOS.platform/Developer/SDKs/WatchOS11.4.sdk/Developer/Library/Frameworks -parse-as-library -c -j10 -enable-batch-mode -incremental -Xcc -ivfsstatcache -Xcc /Users/admin/builder/spi-builder-workspace/.derivedData/SDKStatCaches.noindex/watchos11.4-22T246-43efb940ff07ba2497b70ec94253f576.sdkstatcache -output-file-map /Users/admin/builder/spi-builder-workspace/.derivedData/Build/Intermediates.noindex/iOSSnapshotTestCase.build/Debug-watchos/iOSSnapshotTestCase.build/Objects-normal/arm64_32/iOSSnapshotTestCase-OutputFileMap.json -use-frontend-parseable-output -save-temps -no-color-diagnostics -serialize-diagnostics -emit-dependencies -emit-module -emit-module-path /Users/admin/builder/spi-builder-workspace/.derivedData/Build/Intermediates.noindex/iOSSnapshotTestCase.build/Debug-watchos/iOSSnapshotTestCase.build/Objects-normal/arm64_32/iOSSnapshotTestCase.swiftmodule -validate-clang-modules-once -clang-build-session-file /Users/admin/builder/spi-builder-workspace/.derivedData/ModuleCache.noindex/Session.modulevalidation -Xcc -I/Users/admin/builder/spi-builder-workspace/.derivedData/Build/Intermediates.noindex/iOSSnapshotTestCase.build/Debug-watchos/iOSSnapshotTestCase.build/swift-overrides.hmap -emit-const-values -Xfrontend -const-gather-protocols-file -Xfrontend /Users/admin/builder/spi-builder-workspace/.derivedData/Build/Intermediates.noindex/iOSSnapshotTestCase.build/Debug-watchos/iOSSnapshotTestCase.build/Objects-normal/arm64_32/iOSSnapshotTestCase_const_extract_protocols.json -Xcc -I/Users/admin/builder/spi-builder-workspace/src/iOSSnapshotTestCaseCore/Public -Xcc -I/Users/admin/builder/spi-builder-workspace/.derivedData/Build/Products/Debug-watchos/include -Xcc -I/Users/admin/builder/spi-builder-workspace/.derivedData/Build/Intermediates.noindex/iOSSnapshotTestCase.build/Debug-watchos/iOSSnapshotTestCase.build/DerivedSources-normal/arm64_32 -Xcc -I/Users/admin/builder/spi-builder-workspace/.derivedData/Build/Intermediates.noindex/iOSSnapshotTestCase.build/Debug-watchos/iOSSnapshotTestCase.build/DerivedSources/arm64_32 -Xcc -I/Users/admin/builder/spi-builder-workspace/.derivedData/Build/Intermediates.noindex/iOSSnapshotTestCase.build/Debug-watchos/iOSSnapshotTestCase.build/DerivedSources -Xcc -DSWIFT_PACKAGE -Xcc -DDEBUG\=1 -emit-objc-header -emit-objc-header-path /Users/admin/builder/spi-builder-workspace/.derivedData/Build/Intermediates.noindex/iOSSnapshotTestCase.build/Debug-watchos/iOSSnapshotTestCase.build/Objects-normal/arm64_32/iOSSnapshotTestCase-Swift.h -working-directory /Users/admin/builder/spi-builder-workspace/.swiftpm/xcode -experimental-emit-module-separately -disable-cmo
SwiftDriver iOSSnapshotTestCase normal arm64 com.apple.xcode.tools.swift.compiler (in target 'iOSSnapshotTestCase' from project 'iOSSnapshotTestCase')
cd /Users/admin/builder/spi-builder-workspace/.swiftpm/xcode
builtin-SwiftDriver -- /Applications/Xcode-16.3.0.app/Contents/Developer/Toolchains/XcodeDefault.xctoolchain/usr/bin/swiftc -module-name iOSSnapshotTestCase -Onone -enforce-exclusivity\=checked @/Users/admin/builder/spi-builder-workspace/.derivedData/Build/Intermediates.noindex/iOSSnapshotTestCase.build/Debug-watchos/iOSSnapshotTestCase.build/Objects-normal/arm64/iOSSnapshotTestCase.SwiftFileList -DSWIFT_PACKAGE -DDEBUG -Xcc -fmodule-map-file\=/Users/admin/builder/spi-builder-workspace/.derivedData/Build/Intermediates.noindex/GeneratedModuleMaps-watchos/iOSSnapshotTestCaseCore.modulemap -DXcode -plugin-path /Applications/Xcode-16.3.0.app/Contents/Developer/Toolchains/XcodeDefault.xctoolchain/usr/lib/swift/host/plugins/testing -enable-experimental-feature DebugDescriptionMacro -sdk /Applications/Xcode-16.3.0.app/Contents/Developer/Platforms/WatchOS.platform/Developer/SDKs/WatchOS11.4.sdk -target arm64-apple-watchos5.0 -g -module-cache-path /Users/admin/builder/spi-builder-workspace/.derivedData/ModuleCache.noindex -Xfrontend -serialize-debugging-options -profile-coverage-mapping -profile-generate -enable-testing -index-store-path /Users/admin/builder/spi-builder-workspace/.derivedData/Index.noindex/DataStore -swift-version 5 -I /Users/admin/builder/spi-builder-workspace/.derivedData/Build/Products/Debug-watchos -I /Applications/Xcode-16.3.0.app/Contents/Developer/Platforms/WatchOS.platform/Developer/usr/lib -F /Users/admin/builder/spi-builder-workspace/.derivedData/Build/Products/Debug-watchos/PackageFrameworks -F /Users/admin/builder/spi-builder-workspace/.derivedData/Build/Products/Debug-watchos -F /Applications/Xcode-16.3.0.app/Contents/Developer/Platforms/WatchOS.platform/Developer/Library/Frameworks -F /Applications/Xcode-16.3.0.app/Contents/Developer/Platforms/WatchOS.platform/Developer/SDKs/WatchOS11.4.sdk/Developer/Library/Frameworks -parse-as-library -c -j10 -enable-batch-mode -incremental -Xcc -ivfsstatcache -Xcc /Users/admin/builder/spi-builder-workspace/.derivedData/SDKStatCaches.noindex/watchos11.4-22T246-43efb940ff07ba2497b70ec94253f576.sdkstatcache -output-file-map /Users/admin/builder/spi-builder-workspace/.derivedData/Build/Intermediates.noindex/iOSSnapshotTestCase.build/Debug-watchos/iOSSnapshotTestCase.build/Objects-normal/arm64/iOSSnapshotTestCase-OutputFileMap.json -use-frontend-parseable-output -save-temps -no-color-diagnostics -serialize-diagnostics -emit-dependencies -emit-module -emit-module-path /Users/admin/builder/spi-builder-workspace/.derivedData/Build/Intermediates.noindex/iOSSnapshotTestCase.build/Debug-watchos/iOSSnapshotTestCase.build/Objects-normal/arm64/iOSSnapshotTestCase.swiftmodule -validate-clang-modules-once -clang-build-session-file /Users/admin/builder/spi-builder-workspace/.derivedData/ModuleCache.noindex/Session.modulevalidation -Xcc -I/Users/admin/builder/spi-builder-workspace/.derivedData/Build/Intermediates.noindex/iOSSnapshotTestCase.build/Debug-watchos/iOSSnapshotTestCase.build/swift-overrides.hmap -emit-const-values -Xfrontend -const-gather-protocols-file -Xfrontend /Users/admin/builder/spi-builder-workspace/.derivedData/Build/Intermediates.noindex/iOSSnapshotTestCase.build/Debug-watchos/iOSSnapshotTestCase.build/Objects-normal/arm64/iOSSnapshotTestCase_const_extract_protocols.json -Xcc -I/Users/admin/builder/spi-builder-workspace/src/iOSSnapshotTestCaseCore/Public -Xcc -I/Users/admin/builder/spi-builder-workspace/.derivedData/Build/Products/Debug-watchos/include -Xcc -I/Users/admin/builder/spi-builder-workspace/.derivedData/Build/Intermediates.noindex/iOSSnapshotTestCase.build/Debug-watchos/iOSSnapshotTestCase.build/DerivedSources-normal/arm64 -Xcc -I/Users/admin/builder/spi-builder-workspace/.derivedData/Build/Intermediates.noindex/iOSSnapshotTestCase.build/Debug-watchos/iOSSnapshotTestCase.build/DerivedSources/arm64 -Xcc -I/Users/admin/builder/spi-builder-workspace/.derivedData/Build/Intermediates.noindex/iOSSnapshotTestCase.build/Debug-watchos/iOSSnapshotTestCase.build/DerivedSources -Xcc -DSWIFT_PACKAGE -Xcc -DDEBUG\=1 -emit-objc-header -emit-objc-header-path /Users/admin/builder/spi-builder-workspace/.derivedData/Build/Intermediates.noindex/iOSSnapshotTestCase.build/Debug-watchos/iOSSnapshotTestCase.build/Objects-normal/arm64/iOSSnapshotTestCase-Swift.h -working-directory /Users/admin/builder/spi-builder-workspace/.swiftpm/xcode -experimental-emit-module-separately -disable-cmo
SwiftDriver iOSSnapshotTestCase normal armv7k com.apple.xcode.tools.swift.compiler (in target 'iOSSnapshotTestCase' from project 'iOSSnapshotTestCase')
cd /Users/admin/builder/spi-builder-workspace/.swiftpm/xcode
builtin-SwiftDriver -- /Applications/Xcode-16.3.0.app/Contents/Developer/Toolchains/XcodeDefault.xctoolchain/usr/bin/swiftc -module-name iOSSnapshotTestCase -Onone -enforce-exclusivity\=checked @/Users/admin/builder/spi-builder-workspace/.derivedData/Build/Intermediates.noindex/iOSSnapshotTestCase.build/Debug-watchos/iOSSnapshotTestCase.build/Objects-normal/armv7k/iOSSnapshotTestCase.SwiftFileList -DSWIFT_PACKAGE -DDEBUG -Xcc -fmodule-map-file\=/Users/admin/builder/spi-builder-workspace/.derivedData/Build/Intermediates.noindex/GeneratedModuleMaps-watchos/iOSSnapshotTestCaseCore.modulemap -DXcode -plugin-path /Applications/Xcode-16.3.0.app/Contents/Developer/Toolchains/XcodeDefault.xctoolchain/usr/lib/swift/host/plugins/testing -enable-experimental-feature DebugDescriptionMacro -sdk /Applications/Xcode-16.3.0.app/Contents/Developer/Platforms/WatchOS.platform/Developer/SDKs/WatchOS11.4.sdk -target armv7k-apple-watchos5.0 -g -module-cache-path /Users/admin/builder/spi-builder-workspace/.derivedData/ModuleCache.noindex -Xfrontend -serialize-debugging-options -profile-coverage-mapping -profile-generate -enable-testing -index-store-path /Users/admin/builder/spi-builder-workspace/.derivedData/Index.noindex/DataStore -swift-version 5 -I /Users/admin/builder/spi-builder-workspace/.derivedData/Build/Products/Debug-watchos -I /Applications/Xcode-16.3.0.app/Contents/Developer/Platforms/WatchOS.platform/Developer/usr/lib -F /Users/admin/builder/spi-builder-workspace/.derivedData/Build/Products/Debug-watchos/PackageFrameworks -F /Users/admin/builder/spi-builder-workspace/.derivedData/Build/Products/Debug-watchos -F /Applications/Xcode-16.3.0.app/Contents/Developer/Platforms/WatchOS.platform/Developer/Library/Frameworks -F /Applications/Xcode-16.3.0.app/Contents/Developer/Platforms/WatchOS.platform/Developer/SDKs/WatchOS11.4.sdk/Developer/Library/Frameworks -parse-as-library -c -j10 -enable-batch-mode -incremental -Xcc -ivfsstatcache -Xcc /Users/admin/builder/spi-builder-workspace/.derivedData/SDKStatCaches.noindex/watchos11.4-22T246-43efb940ff07ba2497b70ec94253f576.sdkstatcache -output-file-map /Users/admin/builder/spi-builder-workspace/.derivedData/Build/Intermediates.noindex/iOSSnapshotTestCase.build/Debug-watchos/iOSSnapshotTestCase.build/Objects-normal/armv7k/iOSSnapshotTestCase-OutputFileMap.json -use-frontend-parseable-output -save-temps -no-color-diagnostics -serialize-diagnostics -emit-dependencies -emit-module -emit-module-path /Users/admin/builder/spi-builder-workspace/.derivedData/Build/Intermediates.noindex/iOSSnapshotTestCase.build/Debug-watchos/iOSSnapshotTestCase.build/Objects-normal/armv7k/iOSSnapshotTestCase.swiftmodule -validate-clang-modules-once -clang-build-session-file /Users/admin/builder/spi-builder-workspace/.derivedData/ModuleCache.noindex/Session.modulevalidation -Xcc -I/Users/admin/builder/spi-builder-workspace/.derivedData/Build/Intermediates.noindex/iOSSnapshotTestCase.build/Debug-watchos/iOSSnapshotTestCase.build/swift-overrides.hmap -emit-const-values -Xfrontend -const-gather-protocols-file -Xfrontend /Users/admin/builder/spi-builder-workspace/.derivedData/Build/Intermediates.noindex/iOSSnapshotTestCase.build/Debug-watchos/iOSSnapshotTestCase.build/Objects-normal/armv7k/iOSSnapshotTestCase_const_extract_protocols.json -Xcc -I/Users/admin/builder/spi-builder-workspace/src/iOSSnapshotTestCaseCore/Public -Xcc -I/Users/admin/builder/spi-builder-workspace/.derivedData/Build/Products/Debug-watchos/include -Xcc -I/Users/admin/builder/spi-builder-workspace/.derivedData/Build/Intermediates.noindex/iOSSnapshotTestCase.build/Debug-watchos/iOSSnapshotTestCase.build/DerivedSources-normal/armv7k -Xcc -I/Users/admin/builder/spi-builder-workspace/.derivedData/Build/Intermediates.noindex/iOSSnapshotTestCase.build/Debug-watchos/iOSSnapshotTestCase.build/DerivedSources/armv7k -Xcc -I/Users/admin/builder/spi-builder-workspace/.derivedData/Build/Intermediates.noindex/iOSSnapshotTestCase.build/Debug-watchos/iOSSnapshotTestCase.build/DerivedSources -Xcc -DSWIFT_PACKAGE -Xcc -DDEBUG\=1 -emit-objc-header -emit-objc-header-path /Users/admin/builder/spi-builder-workspace/.derivedData/Build/Intermediates.noindex/iOSSnapshotTestCase.build/Debug-watchos/iOSSnapshotTestCase.build/Objects-normal/armv7k/iOSSnapshotTestCase-Swift.h -working-directory /Users/admin/builder/spi-builder-workspace/.swiftpm/xcode -experimental-emit-module-separately -disable-cmo
CompileC /Users/admin/builder/spi-builder-workspace/.derivedData/Build/Intermediates.noindex/iOSSnapshotTestCase.build/Debug-watchos/iOSSnapshotTestCaseCore.build/Objects-normal/armv7k/UIImage+Compare.o /Users/admin/builder/spi-builder-workspace/src/iOSSnapshotTestCaseCore/Categories/UIImage+Compare.m normal armv7k objective-c com.apple.compilers.llvm.clang.1_0.compiler (in target 'iOSSnapshotTestCaseCore' from project 'iOSSnapshotTestCase')
cd /Users/admin/builder/spi-builder-workspace/.swiftpm/xcode
Using response file: /Users/admin/builder/spi-builder-workspace/.derivedData/Build/Intermediates.noindex/iOSSnapshotTestCase.build/Debug-watchos/iOSSnapshotTestCaseCore.build/Objects-normal/armv7k/e6072d4f65d7061329687fe24e3d63a7-common-args.resp
/Applications/Xcode-16.3.0.app/Contents/Developer/Toolchains/XcodeDefault.xctoolchain/usr/bin/clang -x objective-c -ivfsstatcache /Users/admin/builder/spi-builder-workspace/.derivedData/SDKStatCaches.noindex/watchos11.4-22T246-43efb940ff07ba2497b70ec94253f576.sdkstatcache -fmessage-length\=0 -fdiagnostics-show-note-include-stack -fmacro-backtrace-limit\=0 -fno-color-diagnostics -fmodules-prune-interval\=86400 -fmodules-prune-after\=345600 -fbuild-session-file\=/Users/admin/builder/spi-builder-workspace/.derivedData/ModuleCache.noindex/Session.modulevalidation -fmodules-validate-once-per-build-session -Wnon-modular-include-in-framework-module -Werror\=non-modular-include-in-framework-module -Wno-trigraphs -Wno-missing-field-initializers -Wno-missing-prototypes -Wno-return-type -Wno-implicit-atomic-properties -Wno-objc-interface-ivars -Wno-arc-repeated-use-of-weak -Wno-missing-braces -Wparentheses -Wswitch -Wno-unused-function -Wno-unused-label -Wno-unused-parameter -Wno-unused-variable -Wunused-value -Wno-empty-body -Wno-uninitialized -Wno-unknown-pragmas -Wno-shadow -Wno-four-char-constants -Wno-conversion -Wno-constant-conversion -Wno-int-conversion -Wno-bool-conversion -Wno-enum-conversion -Wno-float-conversion -Wno-non-literal-null-conversion -Wno-objc-literal-conversion -Wno-shorten-64-to-32 -Wpointer-sign -Wno-newline-eof -Wno-selector -Wno-strict-selector-match -Wno-undeclared-selector -Wno-deprecated-implementations -Wno-implicit-fallthrough -fstrict-aliasing -Wprotocol -Wdeprecated-declarations -Wno-sign-conversion -Wno-infinite-recursion -Wno-comma -Wno-block-capture-autoreleasing -Wno-strict-prototypes -Wno-semicolon-before-method-body -index-store-path /Users/admin/builder/spi-builder-workspace/.derivedData/Index.noindex/DataStore @/Users/admin/builder/spi-builder-workspace/.derivedData/Build/Intermediates.noindex/iOSSnapshotTestCase.build/Debug-watchos/iOSSnapshotTestCaseCore.build/Objects-normal/armv7k/e6072d4f65d7061329687fe24e3d63a7-common-args.resp -MMD -MT dependencies -MF /Users/admin/builder/spi-builder-workspace/.derivedData/Build/Intermediates.noindex/iOSSnapshotTestCase.build/Debug-watchos/iOSSnapshotTestCaseCore.build/Objects-normal/armv7k/UIImage+Compare.d --serialize-diagnostics /Users/admin/builder/spi-builder-workspace/.derivedData/Build/Intermediates.noindex/iOSSnapshotTestCase.build/Debug-watchos/iOSSnapshotTestCaseCore.build/Objects-normal/armv7k/UIImage+Compare.dia -c /Users/admin/builder/spi-builder-workspace/src/iOSSnapshotTestCaseCore/Categories/UIImage+Compare.m -o /Users/admin/builder/spi-builder-workspace/.derivedData/Build/Intermediates.noindex/iOSSnapshotTestCase.build/Debug-watchos/iOSSnapshotTestCaseCore.build/Objects-normal/armv7k/UIImage+Compare.o -index-unit-output-path /iOSSnapshotTestCase.build/Debug-watchos/iOSSnapshotTestCaseCore.build/Objects-normal/armv7k/UIImage+Compare.o
CompileC /Users/admin/builder/spi-builder-workspace/.derivedData/Build/Intermediates.noindex/iOSSnapshotTestCase.build/Debug-watchos/iOSSnapshotTestCaseCore.build/Objects-normal/armv7k/UIImage+Snapshot.o /Users/admin/builder/spi-builder-workspace/src/iOSSnapshotTestCaseCore/Categories/UIImage+Snapshot.m normal armv7k objective-c com.apple.compilers.llvm.clang.1_0.compiler (in target 'iOSSnapshotTestCaseCore' from project 'iOSSnapshotTestCase')
cd /Users/admin/builder/spi-builder-workspace/.swiftpm/xcode
Using response file: /Users/admin/builder/spi-builder-workspace/.derivedData/Build/Intermediates.noindex/iOSSnapshotTestCase.build/Debug-watchos/iOSSnapshotTestCaseCore.build/Objects-normal/armv7k/e6072d4f65d7061329687fe24e3d63a7-common-args.resp
/Applications/Xcode-16.3.0.app/Contents/Developer/Toolchains/XcodeDefault.xctoolchain/usr/bin/clang -x objective-c -ivfsstatcache /Users/admin/builder/spi-builder-workspace/.derivedData/SDKStatCaches.noindex/watchos11.4-22T246-43efb940ff07ba2497b70ec94253f576.sdkstatcache -fmessage-length\=0 -fdiagnostics-show-note-include-stack -fmacro-backtrace-limit\=0 -fno-color-diagnostics -fmodules-prune-interval\=86400 -fmodules-prune-after\=345600 -fbuild-session-file\=/Users/admin/builder/spi-builder-workspace/.derivedData/ModuleCache.noindex/Session.modulevalidation -fmodules-validate-once-per-build-session -Wnon-modular-include-in-framework-module -Werror\=non-modular-include-in-framework-module -Wno-trigraphs -Wno-missing-field-initializers -Wno-missing-prototypes -Wno-return-type -Wno-implicit-atomic-properties -Wno-objc-interface-ivars -Wno-arc-repeated-use-of-weak -Wno-missing-braces -Wparentheses -Wswitch -Wno-unused-function -Wno-unused-label -Wno-unused-parameter -Wno-unused-variable -Wunused-value -Wno-empty-body -Wno-uninitialized -Wno-unknown-pragmas -Wno-shadow -Wno-four-char-constants -Wno-conversion -Wno-constant-conversion -Wno-int-conversion -Wno-bool-conversion -Wno-enum-conversion -Wno-float-conversion -Wno-non-literal-null-conversion -Wno-objc-literal-conversion -Wno-shorten-64-to-32 -Wpointer-sign -Wno-newline-eof -Wno-selector -Wno-strict-selector-match -Wno-undeclared-selector -Wno-deprecated-implementations -Wno-implicit-fallthrough -fstrict-aliasing -Wprotocol -Wdeprecated-declarations -Wno-sign-conversion -Wno-infinite-recursion -Wno-comma -Wno-block-capture-autoreleasing -Wno-strict-prototypes -Wno-semicolon-before-method-body -index-store-path /Users/admin/builder/spi-builder-workspace/.derivedData/Index.noindex/DataStore @/Users/admin/builder/spi-builder-workspace/.derivedData/Build/Intermediates.noindex/iOSSnapshotTestCase.build/Debug-watchos/iOSSnapshotTestCaseCore.build/Objects-normal/armv7k/e6072d4f65d7061329687fe24e3d63a7-common-args.resp -MMD -MT dependencies -MF /Users/admin/builder/spi-builder-workspace/.derivedData/Build/Intermediates.noindex/iOSSnapshotTestCase.build/Debug-watchos/iOSSnapshotTestCaseCore.build/Objects-normal/armv7k/UIImage+Snapshot.d --serialize-diagnostics /Users/admin/builder/spi-builder-workspace/.derivedData/Build/Intermediates.noindex/iOSSnapshotTestCase.build/Debug-watchos/iOSSnapshotTestCaseCore.build/Objects-normal/armv7k/UIImage+Snapshot.dia -c /Users/admin/builder/spi-builder-workspace/src/iOSSnapshotTestCaseCore/Categories/UIImage+Snapshot.m -o /Users/admin/builder/spi-builder-workspace/.derivedData/Build/Intermediates.noindex/iOSSnapshotTestCase.build/Debug-watchos/iOSSnapshotTestCaseCore.build/Objects-normal/armv7k/UIImage+Snapshot.o -index-unit-output-path /iOSSnapshotTestCase.build/Debug-watchos/iOSSnapshotTestCaseCore.build/Objects-normal/armv7k/UIImage+Snapshot.o
In file included from /Users/admin/builder/spi-builder-workspace/src/iOSSnapshotTestCaseCore/Categories/UIImage+Snapshot.m:11:
/Users/admin/builder/spi-builder-workspace/src/iOSSnapshotTestCaseCore/Categories/UIImage+Snapshot.h:17:41: error: expected a type
17 | + (nullable UIImage *)fb_imageForLayer:(CALayer *)layer;
| ^
In file included from /Users/admin/builder/spi-builder-workspace/src/iOSSnapshotTestCaseCore/Categories/UIImage+Snapshot.m:12:
/Users/admin/builder/spi-builder-workspace/src/iOSSnapshotTestCaseCore/Categories/UIApplication+KeyWindow.h:14:12: error: cannot find interface declaration for 'UIApplication'
14 | @interface UIApplication (KeyWindow)
| ^
/Users/admin/builder/spi-builder-workspace/src/iOSSnapshotTestCaseCore/Categories/UIApplication+KeyWindow.h:16:13: error: expected a type
16 | - (nullable UIWindow *)ub_keyWindow;
| ^
/Users/admin/builder/spi-builder-workspace/src/iOSSnapshotTestCaseCore/Categories/UIImage+Snapshot.m:20:32: error: expected a type
20 | + (UIImage *)fb_imageForLayer:(CALayer *)layer
| ^
/Users/admin/builder/spi-builder-workspace/src/iOSSnapshotTestCaseCore/Categories/UIImage+Snapshot.m:22:27: error: property 'bounds' not found on object of type '__strong id'
22 | CGRect bounds = layer.bounds;
| ^
/Users/admin/builder/spi-builder-workspace/src/iOSSnapshotTestCaseCore/Categories/UIImage+Snapshot.m:30:12: error: no known instance method for selector 'layoutIfNeeded'
30 | [layer layoutIfNeeded];
| ^~~~~~~~~~~~~~
/Users/admin/builder/spi-builder-workspace/src/iOSSnapshotTestCaseCore/Categories/UIImage+Snapshot.m:31:12: error: no known instance method for selector 'renderInContext:'
31 | [layer renderInContext:context];
| ^~~~~~~~~~~~~~~
/Users/admin/builder/spi-builder-workspace/src/iOSSnapshotTestCaseCore/Categories/UIImage+Snapshot.m:41:6: error: receiver type 'UIView' for instance message is a forward declaration
41 | [view layoutIfNeeded];
| ^~~~
In module 'UIKit' imported from /Users/admin/builder/spi-builder-workspace/src/iOSSnapshotTestCaseCore/Categories/UIImage+Snapshot.h:10:
/Applications/Xcode-16.3.0.app/Contents/Developer/Platforms/WatchOS.platform/Developer/SDKs/WatchOS11.4.sdk/System/Library/Frameworks/UIKit.framework/Headers/NSTextAttachment.h:23:8: note: forward declaration of class here
23 | @class UIView;
| ^
/Users/admin/builder/spi-builder-workspace/src/iOSSnapshotTestCaseCore/Categories/UIImage+Snapshot.m:42:40: error: property 'layer' cannot be found in forward class object 'UIView'
42 | return [self fb_imageForLayer:view.layer];
| ~~~~ ^
In module 'UIKit' imported from /Users/admin/builder/spi-builder-workspace/src/iOSSnapshotTestCaseCore/Categories/UIImage+Snapshot.h:10:
/Applications/Xcode-16.3.0.app/Contents/Developer/Platforms/WatchOS.platform/Developer/SDKs/WatchOS11.4.sdk/System/Library/Frameworks/UIKit.framework/Headers/NSTextAttachment.h:23:8: note: forward declaration of class here
23 | @class UIView;
| ^
/Users/admin/builder/spi-builder-workspace/src/iOSSnapshotTestCaseCore/Categories/UIImage+Snapshot.m:48:5: error: use of undeclared identifier 'UIWindow'
48 | UIWindow *window = [view isKindOfClass:[UIWindow class]] ? (UIWindow *)view : view.window;
| ^
/Users/admin/builder/spi-builder-workspace/src/iOSSnapshotTestCaseCore/Categories/UIImage+Snapshot.m:48:15: error: use of undeclared identifier 'window'
48 | UIWindow *window = [view isKindOfClass:[UIWindow class]] ? (UIWindow *)view : view.window;
| ^
/Users/admin/builder/spi-builder-workspace/src/iOSSnapshotTestCaseCore/Categories/UIImage+Snapshot.m:48:45: error: use of undeclared identifier 'UIWindow'
48 | UIWindow *window = [view isKindOfClass:[UIWindow class]] ? (UIWindow *)view : view.window;
| ^
/Users/admin/builder/spi-builder-workspace/src/iOSSnapshotTestCaseCore/Categories/UIImage+Snapshot.m:48:75: error: expected expression
48 | UIWindow *window = [view isKindOfClass:[UIWindow class]] ? (UIWindow *)view : view.window;
| ^
/Users/admin/builder/spi-builder-workspace/src/iOSSnapshotTestCaseCore/Categories/UIImage+Snapshot.m:48:65: error: use of undeclared identifier 'UIWindow'
48 | UIWindow *window = [view isKindOfClass:[UIWindow class]] ? (UIWindow *)view : view.window;
| ^
/Users/admin/builder/spi-builder-workspace/src/iOSSnapshotTestCaseCore/Categories/UIImage+Snapshot.m:48:88: error: property 'window' cannot be found in forward class object 'UIView'
48 | UIWindow *window = [view isKindOfClass:[UIWindow class]] ? (UIWindow *)view : view.window;
| ~~~~ ^
In module 'UIKit' imported from /Users/admin/builder/spi-builder-workspace/src/iOSSnapshotTestCaseCore/Categories/UIImage+Snapshot.h:10:
/Applications/Xcode-16.3.0.app/Contents/Developer/Platforms/WatchOS.platform/Developer/SDKs/WatchOS11.4.sdk/System/Library/Frameworks/UIKit.framework/Headers/NSTextAttachment.h:23:8: note: forward declaration of class here
23 | @class UIView;
| ^
/Users/admin/builder/spi-builder-workspace/src/iOSSnapshotTestCaseCore/Categories/UIImage+Snapshot.m:48:94: error: expected ']'
48 | UIWindow *window = [view isKindOfClass:[UIWindow class]] ? (UIWindow *)view : view.window;
| ^
/Users/admin/builder/spi-builder-workspace/src/iOSSnapshotTestCaseCore/Categories/UIImage+Snapshot.m:48:94: error: expected ':'
48 | UIWindow *window = [view isKindOfClass:[UIWindow class]] ? (UIWindow *)view : view.window;
| ^
| :
/Users/admin/builder/spi-builder-workspace/src/iOSSnapshotTestCaseCore/Categories/UIImage+Snapshot.m:48:62: note: to match this '?'
48 | UIWindow *window = [view isKindOfClass:[UIWindow class]] ? (UIWindow *)view : view.window;
| ^
/Users/admin/builder/spi-builder-workspace/src/iOSSnapshotTestCaseCore/Categories/UIImage+Snapshot.m:48:94: error: expected expression
48 | UIWindow *window = [view isKindOfClass:[UIWindow class]] ? (UIWindow *)view : view.window;
| ^
/Users/admin/builder/spi-builder-workspace/src/iOSSnapshotTestCaseCore/Categories/UIImage+Snapshot.m:50:10: error: use of undeclared identifier 'window'
50 | if (!window) {
| ^
fatal error: too many errors emitted, stopping now [-ferror-limit=]
Failed frontend command:
/Applications/Xcode-16.3.0.app/Contents/Developer/Toolchains/XcodeDefault.xctoolchain/usr/bin/clang -cc1 -Wundef-prefix\=TARGET_OS_ -fdiagnostics-show-note-include-stack -fmacro-backtrace-limit\=0 -ferror-limit 19 -serialize-diagnostic-file /Users/admin/builder/spi-builder-workspace/.derivedData/Build/Intermediates.noindex/iOSSnapshotTestCase.build/Debug-watchos/iOSSnapshotTestCaseCore.build/Objects-normal/armv7k/UIImage+Snapshot.dia -Wdeprecated-objc-isa-usage -Werror\=deprecated-objc-isa-usage -Werror\=implicit-function-declaration -Wnon-modular-include-in-framework-module -Werror\=non-modular-include-in-framework-module -Wno-trigraphs -Wno-missing-field-initializers -Wno-missing-prototypes -Wno-return-type -Wno-implicit-atomic-properties -Wno-objc-interface-ivars -Wno-arc-repeated-use-of-weak -Wno-missing-braces -Wparentheses -Wswitch -Wno-unused-function -Wno-unused-label -Wno-unused-parameter -Wno-unused-variable -Wunused-value -Wno-empty-body -Wno-uninitialized -Wno-unknown-pragmas -Wno-shadow -Wno-four-char-constants -Wno-conversion -Wno-constant-conversion -Wno-int-conversion -Wno-bool-conversion -Wno-enum-conversion -Wno-float-conversion -Wno-non-literal-null-conversion -Wno-objc-literal-conversion -Wno-shorten-64-to-32 -Wpointer-sign -Wno-newline-eof -Wno-selector -Wno-strict-selector-match -Wno-undeclared-selector -Wno-deprecated-implementations -Wno-implicit-fallthrough -Wprotocol -Wdeprecated-declarations -Wno-sign-conversion -Wno-infinite-recursion -Wno-comma -Wno-block-capture-autoreleasing -Wno-strict-prototypes -Wno-semicolon-before-method-body -Wno-reorder-init-list -Wno-implicit-int-float-conversion -Wno-c99-designator -Wno-final-dtor-non-final-class -Wno-extra-semi-stmt -Wno-misleading-indentation -Wno-quoted-include-in-framework-header -Wno-implicit-fallthrough -Wno-enum-enum-conversion -Wno-enum-float-conversion -Wno-elaborated-enum-base -Wno-reserved-identifier -Wno-gnu-folding-constant -index-store-path /Users/admin/builder/spi-builder-workspace/.derivedData/Index.noindex/DataStore -index-unit-output-path /iOSSnapshotTestCase.build/Debug-watchos/iOSSnapshotTestCaseCore.build/Objects-normal/armv7k/UIImage+Snapshot.o -fmodule-map-file\=/Applications/Xcode-16.3.0.app/Contents/Developer/Platforms/WatchOS.platform/Developer/SDKs/WatchOS.sdk/System/Library/Frameworks/UIKit.framework/Modules/module.modulemap -o /Users/admin/builder/spi-builder-workspace/.derivedData/Build/Intermediates.noindex/iOSSnapshotTestCase.build/Debug-watchos/iOSSnapshotTestCaseCore.build/Objects-normal/armv7k/UIImage+Snapshot.o -disable-free -emit-obj -x objective-c /Users/admin/builder/spi-builder-workspace/src/iOSSnapshotTestCaseCore/Categories/UIImage+Snapshot.m -target-abi aapcs16 -target-cpu cortex-a7 -target-feature +vfp2 -target-feature +vfp2sp -target-feature +vfp3 -target-feature +vfp3d16 -target-feature +vfp3d16sp -target-feature +vfp3sp -target-feature +fp16 -target-feature +vfp4 -target-feature +vfp4d16 -target-feature +vfp4d16sp -target-feature +vfp4sp -target-feature -fp-armv8 -target-feature -fp-armv8d16 -target-feature -fp-armv8d16sp -target-feature -fp-armv8sp -target-feature -fullfp16 -target-feature +fp64 -target-feature +d32 -target-feature +neon -target-feature -sha2 -target-feature -aes -target-feature -fp16fml -triple thumbv7k-apple-watchos5.0.0 -target-linker-version 1167.4.1 -target-sdk-version\=11.4 -fmodules-validate-system-headers -fno-modulemap-allow-subdirectory-search -isysroot /Applications/Xcode-16.3.0.app/Contents/Developer/Platforms/WatchOS.platform/Developer/SDKs/WatchOS11.4.sdk -resource-dir /Applications/Xcode-16.3.0.app/Contents/Developer/Toolchains/XcodeDefault.xctoolchain/usr/lib/clang/17 -fmodule-format\=obj -fmodule-file\=UIKit\=/Users/admin/builder/spi-builder-workspace/.derivedData/Build/Intermediates.noindex/ExplicitPrecompiledModules/UIKit-BDGDM3KB5QWPE5PPENQCG4CJN.pcm -I /Users/admin/builder/spi-builder-workspace/.derivedData/Build/Products/Debug-watchos/include -I /Users/admin/builder/spi-builder-workspace/src/iOSSnapshotTestCaseCore/Public -I /Users/admin/builder/spi-builder-workspace/.derivedData/Build/Intermediates.noindex/iOSSnapshotTestCase.build/Debug-watchos/iOSSnapshotTestCaseCore.build/DerivedSources-normal/armv7k -I /Users/admin/builder/spi-builder-workspace/.derivedData/Build/Intermediates.noindex/iOSSnapshotTestCase.build/Debug-watchos/iOSSnapshotTestCaseCore.build/DerivedSources/armv7k -I /Users/admin/builder/spi-builder-workspace/.derivedData/Build/Intermediates.noindex/iOSSnapshotTestCase.build/Debug-watchos/iOSSnapshotTestCaseCore.build/DerivedSources -F /Users/admin/builder/spi-builder-workspace/.derivedData/Build/Products/Debug-watchos -iframework /Applications/Xcode-16.3.0.app/Contents/Developer/Platforms/WatchOS.platform/Developer/Library/Frameworks -iframework /Applications/Xcode-16.3.0.app/Contents/Developer/Platforms/WatchOS.platform/Developer/SDKs/WatchOS11.4.sdk/Developer/Library/Frameworks -internal-isystem /Applications/Xcode-16.3.0.app/Contents/Developer/Platforms/WatchOS.platform/Developer/SDKs/WatchOS11.4.sdk/usr/local/include -internal-isystem /Applications/Xcode-16.3.0.app/Contents/Developer/Toolchains/XcodeDefault.xctoolchain/usr/lib/clang/17/include -internal-externc-isystem /Applications/Xcode-16.3.0.app/Contents/Developer/Platforms/WatchOS.platform/Developer/SDKs/WatchOS11.4.sdk/usr/include -internal-externc-isystem /Applications/Xcode-16.3.0.app/Contents/Developer/Toolchains/XcodeDefault.xctoolchain/usr/include -ivfsstatcache /Users/admin/builder/spi-builder-workspace/.derivedData/SDKStatCaches.noindex/watchos11.4-22T246-43efb940ff07ba2497b70ec94253f576.sdkstatcache -std\=gnu11 -fexceptions -exception-model dwarf -fskip-odr-check-in-gmf -fmodules -fmodule-name\=iOSSnapshotTestCaseCore -fno-implicit-modules -fobjc-exceptions -fmax-type-align\=16 -fpascal-strings -fvisibility-inlines-hidden-static-local-var -mdarwin-stkchk-strong-link -fno-odr-hash-protocols -pic-level 2 -fencode-extended-block-signature -stack-protector 1 -fobjc-runtime\=watchos-5.0.0 -fobjc-arc -fobjc-runtime-has-weak -fobjc-weak -fgnuc-version\=4.2.1 -fblocks -ffp-contract\=on -fclang-abi-compat\=4.0 -fno-experimental-relative-c++-abi-vtables -fno-file-reproducible -clang-vendor-feature\=+disableNonDependentMemberExprInCurrentInstantiation -clang-vendor-feature\=+enableAggressiveVLAFolding -clang-vendor-feature\=+revert09abecef7bbf -clang-vendor-feature\=+thisNoAlignAttr -clang-vendor-feature\=+thisNoNullAttr -clang-vendor-feature\=+disableAtImportPrivateFrameworkInImplementationError -O0 -fno-assume-unique-vtables -fdebug-compilation-dir\=/Users/admin/builder/spi-builder-workspace/.swiftpm/xcode -fcoverage-compilation-dir\=/Users/admin/builder/spi-builder-workspace/.swiftpm/xcode -fcoverage-mapping -fcommon -fregister-global-dtors-with-atexit -fno-strict-return -dwarf-version\=4 -debugger-tuning\=lldb -disable-llvm-verifier -dwarf-ext-refs -mfloat-abi hard -funwind-tables\=2 -fprofile-instrument\=clang -clear-ast-before-backend -discard-value-names -main-file-name UIImage+Snapshot.m -mframe-pointer\=all -debug-info-kind\=standalone -fdiagnostics-hotness-threshold\=0 -fdiagnostics-misexpect-tolerance\=0 -D DEBUG\=1 -D OBJC_OLD_DISPATCH_PROTOTYPES\=1 -D SWIFT_PACKAGE -D Xcode -D __GCC_HAVE_DWARF2_CFI_ASM\=1 -fdefine-target-os-macros -MT dependencies -dependency-file /Users/admin/builder/spi-builder-workspace/.derivedData/Build/Intermediates.noindex/iOSSnapshotTestCase.build/Debug-watchos/iOSSnapshotTestCaseCore.build/Objects-normal/armv7k/UIImage+Snapshot.d -skip-unused-modulemap-deps
CompileC /Users/admin/builder/spi-builder-workspace/.derivedData/Build/Intermediates.noindex/iOSSnapshotTestCase.build/Debug-watchos/iOSSnapshotTestCaseCore.build/Objects-normal/armv7k/UIImage+Diff.o /Users/admin/builder/spi-builder-workspace/src/iOSSnapshotTestCaseCore/Categories/UIImage+Diff.m normal armv7k objective-c com.apple.compilers.llvm.clang.1_0.compiler (in target 'iOSSnapshotTestCaseCore' from project 'iOSSnapshotTestCase')
cd /Users/admin/builder/spi-builder-workspace/.swiftpm/xcode
Using response file: /Users/admin/builder/spi-builder-workspace/.derivedData/Build/Intermediates.noindex/iOSSnapshotTestCase.build/Debug-watchos/iOSSnapshotTestCaseCore.build/Objects-normal/armv7k/e6072d4f65d7061329687fe24e3d63a7-common-args.resp
/Applications/Xcode-16.3.0.app/Contents/Developer/Toolchains/XcodeDefault.xctoolchain/usr/bin/clang -x objective-c -ivfsstatcache /Users/admin/builder/spi-builder-workspace/.derivedData/SDKStatCaches.noindex/watchos11.4-22T246-43efb940ff07ba2497b70ec94253f576.sdkstatcache -fmessage-length\=0 -fdiagnostics-show-note-include-stack -fmacro-backtrace-limit\=0 -fno-color-diagnostics -fmodules-prune-interval\=86400 -fmodules-prune-after\=345600 -fbuild-session-file\=/Users/admin/builder/spi-builder-workspace/.derivedData/ModuleCache.noindex/Session.modulevalidation -fmodules-validate-once-per-build-session -Wnon-modular-include-in-framework-module -Werror\=non-modular-include-in-framework-module -Wno-trigraphs -Wno-missing-field-initializers -Wno-missing-prototypes -Wno-return-type -Wno-implicit-atomic-properties -Wno-objc-interface-ivars -Wno-arc-repeated-use-of-weak -Wno-missing-braces -Wparentheses -Wswitch -Wno-unused-function -Wno-unused-label -Wno-unused-parameter -Wno-unused-variable -Wunused-value -Wno-empty-body -Wno-uninitialized -Wno-unknown-pragmas -Wno-shadow -Wno-four-char-constants -Wno-conversion -Wno-constant-conversion -Wno-int-conversion -Wno-bool-conversion -Wno-enum-conversion -Wno-float-conversion -Wno-non-literal-null-conversion -Wno-objc-literal-conversion -Wno-shorten-64-to-32 -Wpointer-sign -Wno-newline-eof -Wno-selector -Wno-strict-selector-match -Wno-undeclared-selector -Wno-deprecated-implementations -Wno-implicit-fallthrough -fstrict-aliasing -Wprotocol -Wdeprecated-declarations -Wno-sign-conversion -Wno-infinite-recursion -Wno-comma -Wno-block-capture-autoreleasing -Wno-strict-prototypes -Wno-semicolon-before-method-body -index-store-path /Users/admin/builder/spi-builder-workspace/.derivedData/Index.noindex/DataStore @/Users/admin/builder/spi-builder-workspace/.derivedData/Build/Intermediates.noindex/iOSSnapshotTestCase.build/Debug-watchos/iOSSnapshotTestCaseCore.build/Objects-normal/armv7k/e6072d4f65d7061329687fe24e3d63a7-common-args.resp -MMD -MT dependencies -MF /Users/admin/builder/spi-builder-workspace/.derivedData/Build/Intermediates.noindex/iOSSnapshotTestCase.build/Debug-watchos/iOSSnapshotTestCaseCore.build/Objects-normal/armv7k/UIImage+Diff.d --serialize-diagnostics /Users/admin/builder/spi-builder-workspace/.derivedData/Build/Intermediates.noindex/iOSSnapshotTestCase.build/Debug-watchos/iOSSnapshotTestCaseCore.build/Objects-normal/armv7k/UIImage+Diff.dia -c /Users/admin/builder/spi-builder-workspace/src/iOSSnapshotTestCaseCore/Categories/UIImage+Diff.m -o /Users/admin/builder/spi-builder-workspace/.derivedData/Build/Intermediates.noindex/iOSSnapshotTestCase.build/Debug-watchos/iOSSnapshotTestCaseCore.build/Objects-normal/armv7k/UIImage+Diff.o -index-unit-output-path /iOSSnapshotTestCase.build/Debug-watchos/iOSSnapshotTestCaseCore.build/Objects-normal/armv7k/UIImage+Diff.o
CompileC /Users/admin/builder/spi-builder-workspace/.derivedData/Build/Intermediates.noindex/iOSSnapshotTestCase.build/Debug-watchos/iOSSnapshotTestCaseCore.build/Objects-normal/armv7k/UIApplication+KeyWindow.o /Users/admin/builder/spi-builder-workspace/src/iOSSnapshotTestCaseCore/Categories/UIApplication+KeyWindow.m normal armv7k objective-c com.apple.compilers.llvm.clang.1_0.compiler (in target 'iOSSnapshotTestCaseCore' from project 'iOSSnapshotTestCase')
cd /Users/admin/builder/spi-builder-workspace/.swiftpm/xcode
Using response file: /Users/admin/builder/spi-builder-workspace/.derivedData/Build/Intermediates.noindex/iOSSnapshotTestCase.build/Debug-watchos/iOSSnapshotTestCaseCore.build/Objects-normal/armv7k/e6072d4f65d7061329687fe24e3d63a7-common-args.resp
/Applications/Xcode-16.3.0.app/Contents/Developer/Toolchains/XcodeDefault.xctoolchain/usr/bin/clang -x objective-c -ivfsstatcache /Users/admin/builder/spi-builder-workspace/.derivedData/SDKStatCaches.noindex/watchos11.4-22T246-43efb940ff07ba2497b70ec94253f576.sdkstatcache -fmessage-length\=0 -fdiagnostics-show-note-include-stack -fmacro-backtrace-limit\=0 -fno-color-diagnostics -fmodules-prune-interval\=86400 -fmodules-prune-after\=345600 -fbuild-session-file\=/Users/admin/builder/spi-builder-workspace/.derivedData/ModuleCache.noindex/Session.modulevalidation -fmodules-validate-once-per-build-session -Wnon-modular-include-in-framework-module -Werror\=non-modular-include-in-framework-module -Wno-trigraphs -Wno-missing-field-initializers -Wno-missing-prototypes -Wno-return-type -Wno-implicit-atomic-properties -Wno-objc-interface-ivars -Wno-arc-repeated-use-of-weak -Wno-missing-braces -Wparentheses -Wswitch -Wno-unused-function -Wno-unused-label -Wno-unused-parameter -Wno-unused-variable -Wunused-value -Wno-empty-body -Wno-uninitialized -Wno-unknown-pragmas -Wno-shadow -Wno-four-char-constants -Wno-conversion -Wno-constant-conversion -Wno-int-conversion -Wno-bool-conversion -Wno-enum-conversion -Wno-float-conversion -Wno-non-literal-null-conversion -Wno-objc-literal-conversion -Wno-shorten-64-to-32 -Wpointer-sign -Wno-newline-eof -Wno-selector -Wno-strict-selector-match -Wno-undeclared-selector -Wno-deprecated-implementations -Wno-implicit-fallthrough -fstrict-aliasing -Wprotocol -Wdeprecated-declarations -Wno-sign-conversion -Wno-infinite-recursion -Wno-comma -Wno-block-capture-autoreleasing -Wno-strict-prototypes -Wno-semicolon-before-method-body -index-store-path /Users/admin/builder/spi-builder-workspace/.derivedData/Index.noindex/DataStore @/Users/admin/builder/spi-builder-workspace/.derivedData/Build/Intermediates.noindex/iOSSnapshotTestCase.build/Debug-watchos/iOSSnapshotTestCaseCore.build/Objects-normal/armv7k/e6072d4f65d7061329687fe24e3d63a7-common-args.resp -MMD -MT dependencies -MF /Users/admin/builder/spi-builder-workspace/.derivedData/Build/Intermediates.noindex/iOSSnapshotTestCase.build/Debug-watchos/iOSSnapshotTestCaseCore.build/Objects-normal/armv7k/UIApplication+KeyWindow.d --serialize-diagnostics /Users/admin/builder/spi-builder-workspace/.derivedData/Build/Intermediates.noindex/iOSSnapshotTestCase.build/Debug-watchos/iOSSnapshotTestCaseCore.build/Objects-normal/armv7k/UIApplication+KeyWindow.dia -c /Users/admin/builder/spi-builder-workspace/src/iOSSnapshotTestCaseCore/Categories/UIApplication+KeyWindow.m -o /Users/admin/builder/spi-builder-workspace/.derivedData/Build/Intermediates.noindex/iOSSnapshotTestCase.build/Debug-watchos/iOSSnapshotTestCaseCore.build/Objects-normal/armv7k/UIApplication+KeyWindow.o -index-unit-output-path /iOSSnapshotTestCase.build/Debug-watchos/iOSSnapshotTestCaseCore.build/Objects-normal/armv7k/UIApplication+KeyWindow.o
In file included from /Users/admin/builder/spi-builder-workspace/src/iOSSnapshotTestCaseCore/Categories/UIApplication+KeyWindow.m:11:
/Users/admin/builder/spi-builder-workspace/src/iOSSnapshotTestCaseCore/Categories/UIApplication+KeyWindow.h:14:12: error: cannot find interface declaration for 'UIApplication'
14 | @interface UIApplication (KeyWindow)
| ^
/Users/admin/builder/spi-builder-workspace/src/iOSSnapshotTestCaseCore/Categories/UIApplication+KeyWindow.h:16:13: error: expected a type
16 | - (nullable UIWindow *)ub_keyWindow;
| ^
/Users/admin/builder/spi-builder-workspace/src/iOSSnapshotTestCaseCore/Categories/UIApplication+KeyWindow.m:16:17: error: cannot find interface declaration for 'UIApplication'
16 | @implementation UIApplication (KeyWindow)
| ^
/Users/admin/builder/spi-builder-workspace/src/iOSSnapshotTestCaseCore/Categories/UIApplication+KeyWindow.m:18:13: error: expected a type
18 | - (nullable UIWindow *)ub_keyWindow
| ^
/Users/admin/builder/spi-builder-workspace/src/iOSSnapshotTestCaseCore/Categories/UIApplication+KeyWindow.m:22:16: error: use of undeclared identifier 'UIApplication'
22 | return UIApplication.sharedApplication.keyWindow;
| ^
5 errors generated.
Failed frontend command:
/Applications/Xcode-16.3.0.app/Contents/Developer/Toolchains/XcodeDefault.xctoolchain/usr/bin/clang -cc1 -Wundef-prefix\=TARGET_OS_ -fdiagnostics-show-note-include-stack -fmacro-backtrace-limit\=0 -ferror-limit 19 -serialize-diagnostic-file /Users/admin/builder/spi-builder-workspace/.derivedData/Build/Intermediates.noindex/iOSSnapshotTestCase.build/Debug-watchos/iOSSnapshotTestCaseCore.build/Objects-normal/armv7k/UIApplication+KeyWindow.dia -Wdeprecated-objc-isa-usage -Werror\=deprecated-objc-isa-usage -Werror\=implicit-function-declaration -Wnon-modular-include-in-framework-module -Werror\=non-modular-include-in-framework-module -Wno-trigraphs -Wno-missing-field-initializers -Wno-missing-prototypes -Wno-return-type -Wno-implicit-atomic-properties -Wno-objc-interface-ivars -Wno-arc-repeated-use-of-weak -Wno-missing-braces -Wparentheses -Wswitch -Wno-unused-function -Wno-unused-label -Wno-unused-parameter -Wno-unused-variable -Wunused-value -Wno-empty-body -Wno-uninitialized -Wno-unknown-pragmas -Wno-shadow -Wno-four-char-constants -Wno-conversion -Wno-constant-conversion -Wno-int-conversion -Wno-bool-conversion -Wno-enum-conversion -Wno-float-conversion -Wno-non-literal-null-conversion -Wno-objc-literal-conversion -Wno-shorten-64-to-32 -Wpointer-sign -Wno-newline-eof -Wno-selector -Wno-strict-selector-match -Wno-undeclared-selector -Wno-deprecated-implementations -Wno-implicit-fallthrough -Wprotocol -Wdeprecated-declarations -Wno-sign-conversion -Wno-infinite-recursion -Wno-comma -Wno-block-capture-autoreleasing -Wno-strict-prototypes -Wno-semicolon-before-method-body -Wno-reorder-init-list -Wno-implicit-int-float-conversion -Wno-c99-designator -Wno-final-dtor-non-final-class -Wno-extra-semi-stmt -Wno-misleading-indentation -Wno-quoted-include-in-framework-header -Wno-implicit-fallthrough -Wno-enum-enum-conversion -Wno-enum-float-conversion -Wno-elaborated-enum-base -Wno-reserved-identifier -Wno-gnu-folding-constant -index-store-path /Users/admin/builder/spi-builder-workspace/.derivedData/Index.noindex/DataStore -index-unit-output-path /iOSSnapshotTestCase.build/Debug-watchos/iOSSnapshotTestCaseCore.build/Objects-normal/armv7k/UIApplication+KeyWindow.o -fmodule-map-file\=/Applications/Xcode-16.3.0.app/Contents/Developer/Platforms/WatchOS.platform/Developer/SDKs/WatchOS.sdk/System/Library/Frameworks/UIKit.framework/Modules/module.modulemap -o /Users/admin/builder/spi-builder-workspace/.derivedData/Build/Intermediates.noindex/iOSSnapshotTestCase.build/Debug-watchos/iOSSnapshotTestCaseCore.build/Objects-normal/armv7k/UIApplication+KeyWindow.o -disable-free -emit-obj -x objective-c /Users/admin/builder/spi-builder-workspace/src/iOSSnapshotTestCaseCore/Categories/UIApplication+KeyWindow.m -target-abi aapcs16 -target-cpu cortex-a7 -target-feature +vfp2 -target-feature +vfp2sp -target-feature +vfp3 -target-feature +vfp3d16 -target-feature +vfp3d16sp -target-feature +vfp3sp -target-feature +fp16 -target-feature +vfp4 -target-feature +vfp4d16 -target-feature +vfp4d16sp -target-feature +vfp4sp -target-feature -fp-armv8 -target-feature -fp-armv8d16 -target-feature -fp-armv8d16sp -target-feature -fp-armv8sp -target-feature -fullfp16 -target-feature +fp64 -target-feature +d32 -target-feature +neon -target-feature -sha2 -target-feature -aes -target-feature -fp16fml -triple thumbv7k-apple-watchos5.0.0 -target-linker-version 1167.4.1 -target-sdk-version\=11.4 -fmodules-validate-system-headers -fno-modulemap-allow-subdirectory-search -isysroot /Applications/Xcode-16.3.0.app/Contents/Developer/Platforms/WatchOS.platform/Developer/SDKs/WatchOS11.4.sdk -resource-dir /Applications/Xcode-16.3.0.app/Contents/Developer/Toolchains/XcodeDefault.xctoolchain/usr/lib/clang/17 -fmodule-format\=obj -fmodule-file\=UIKit\=/Users/admin/builder/spi-builder-workspace/.derivedData/Build/Intermediates.noindex/ExplicitPrecompiledModules/UIKit-BDGDM3KB5QWPE5PPENQCG4CJN.pcm -I /Users/admin/builder/spi-builder-workspace/.derivedData/Build/Products/Debug-watchos/include -I /Users/admin/builder/spi-builder-workspace/src/iOSSnapshotTestCaseCore/Public -I /Users/admin/builder/spi-builder-workspace/.derivedData/Build/Intermediates.noindex/iOSSnapshotTestCase.build/Debug-watchos/iOSSnapshotTestCaseCore.build/DerivedSources-normal/armv7k -I /Users/admin/builder/spi-builder-workspace/.derivedData/Build/Intermediates.noindex/iOSSnapshotTestCase.build/Debug-watchos/iOSSnapshotTestCaseCore.build/DerivedSources/armv7k -I /Users/admin/builder/spi-builder-workspace/.derivedData/Build/Intermediates.noindex/iOSSnapshotTestCase.build/Debug-watchos/iOSSnapshotTestCaseCore.build/DerivedSources -F /Users/admin/builder/spi-builder-workspace/.derivedData/Build/Products/Debug-watchos -iframework /Applications/Xcode-16.3.0.app/Contents/Developer/Platforms/WatchOS.platform/Developer/Library/Frameworks -iframework /Applications/Xcode-16.3.0.app/Contents/Developer/Platforms/WatchOS.platform/Developer/SDKs/WatchOS11.4.sdk/Developer/Library/Frameworks -internal-isystem /Applications/Xcode-16.3.0.app/Contents/Developer/Platforms/WatchOS.platform/Developer/SDKs/WatchOS11.4.sdk/usr/local/include -internal-isystem /Applications/Xcode-16.3.0.app/Contents/Developer/Toolchains/XcodeDefault.xctoolchain/usr/lib/clang/17/include -internal-externc-isystem /Applications/Xcode-16.3.0.app/Contents/Developer/Platforms/WatchOS.platform/Developer/SDKs/WatchOS11.4.sdk/usr/include -internal-externc-isystem /Applications/Xcode-16.3.0.app/Contents/Developer/Toolchains/XcodeDefault.xctoolchain/usr/include -ivfsstatcache /Users/admin/builder/spi-builder-workspace/.derivedData/SDKStatCaches.noindex/watchos11.4-22T246-43efb940ff07ba2497b70ec94253f576.sdkstatcache -std\=gnu11 -fexceptions -exception-model dwarf -fskip-odr-check-in-gmf -fmodules -fmodule-name\=iOSSnapshotTestCaseCore -fno-implicit-modules -fobjc-exceptions -fmax-type-align\=16 -fpascal-strings -fvisibility-inlines-hidden-static-local-var -mdarwin-stkchk-strong-link -fno-odr-hash-protocols -pic-level 2 -fencode-extended-block-signature -stack-protector 1 -fobjc-runtime\=watchos-5.0.0 -fobjc-arc -fobjc-runtime-has-weak -fobjc-weak -fgnuc-version\=4.2.1 -fblocks -ffp-contract\=on -fclang-abi-compat\=4.0 -fno-experimental-relative-c++-abi-vtables -fno-file-reproducible -clang-vendor-feature\=+disableNonDependentMemberExprInCurrentInstantiation -clang-vendor-feature\=+enableAggressiveVLAFolding -clang-vendor-feature\=+revert09abecef7bbf -clang-vendor-feature\=+thisNoAlignAttr -clang-vendor-feature\=+thisNoNullAttr -clang-vendor-feature\=+disableAtImportPrivateFrameworkInImplementationError -O0 -fno-assume-unique-vtables -fdebug-compilation-dir\=/Users/admin/builder/spi-builder-workspace/.swiftpm/xcode -fcoverage-compilation-dir\=/Users/admin/builder/spi-builder-workspace/.swiftpm/xcode -fcoverage-mapping -fcommon -fregister-global-dtors-with-atexit -fno-strict-return -dwarf-version\=4 -debugger-tuning\=lldb -disable-llvm-verifier -dwarf-ext-refs -mfloat-abi hard -funwind-tables\=2 -fprofile-instrument\=clang -clear-ast-before-backend -discard-value-names -main-file-name UIApplication+KeyWindow.m -mframe-pointer\=all -debug-info-kind\=standalone -fdiagnostics-hotness-threshold\=0 -fdiagnostics-misexpect-tolerance\=0 -D DEBUG\=1 -D OBJC_OLD_DISPATCH_PROTOTYPES\=1 -D SWIFT_PACKAGE -D Xcode -D __GCC_HAVE_DWARF2_CFI_ASM\=1 -fdefine-target-os-macros -MT dependencies -dependency-file /Users/admin/builder/spi-builder-workspace/.derivedData/Build/Intermediates.noindex/iOSSnapshotTestCase.build/Debug-watchos/iOSSnapshotTestCaseCore.build/Objects-normal/armv7k/UIApplication+KeyWindow.d -skip-unused-modulemap-deps
PrecompileModule /Users/admin/builder/spi-builder-workspace/.derivedData/Build/Intermediates.noindex/ExplicitPrecompiledModules/XCUIAutomation-535TZ4ZY49UYD4AI5FYG9877P.scan
cd /Users/admin/builder/spi-builder-workspace/.swiftpm/xcode
builtin-precompileModule /Users/admin/builder/spi-builder-workspace/.derivedData/Build/Intermediates.noindex/ExplicitPrecompiledModules/XCUIAutomation-535TZ4ZY49UYD4AI5FYG9877P.scan
PrecompileModule /Users/admin/builder/spi-builder-workspace/.derivedData/Build/Intermediates.noindex/ExplicitPrecompiledModules/Foundation-4NE8F56E7D2DEWFA6V5NSX65S.scan
cd /Users/admin/builder/spi-builder-workspace/.swiftpm/xcode
builtin-precompileModule /Users/admin/builder/spi-builder-workspace/.derivedData/Build/Intermediates.noindex/ExplicitPrecompiledModules/Foundation-4NE8F56E7D2DEWFA6V5NSX65S.scan
CompileC /Users/admin/builder/spi-builder-workspace/.derivedData/Build/Intermediates.noindex/iOSSnapshotTestCase.build/Debug-watchos/iOSSnapshotTestCaseCore.build/Objects-normal/armv7k/FBSnapshotTestCasePlatform.o /Users/admin/builder/spi-builder-workspace/src/iOSSnapshotTestCaseCore/FBSnapshotTestCasePlatform.m normal armv7k objective-c com.apple.compilers.llvm.clang.1_0.compiler (in target 'iOSSnapshotTestCaseCore' from project 'iOSSnapshotTestCase')
cd /Users/admin/builder/spi-builder-workspace/.swiftpm/xcode
Using response file: /Users/admin/builder/spi-builder-workspace/.derivedData/Build/Intermediates.noindex/iOSSnapshotTestCase.build/Debug-watchos/iOSSnapshotTestCaseCore.build/Objects-normal/armv7k/e6072d4f65d7061329687fe24e3d63a7-common-args.resp
/Applications/Xcode-16.3.0.app/Contents/Developer/Toolchains/XcodeDefault.xctoolchain/usr/bin/clang -x objective-c -ivfsstatcache /Users/admin/builder/spi-builder-workspace/.derivedData/SDKStatCaches.noindex/watchos11.4-22T246-43efb940ff07ba2497b70ec94253f576.sdkstatcache -fmessage-length\=0 -fdiagnostics-show-note-include-stack -fmacro-backtrace-limit\=0 -fno-color-diagnostics -fmodules-prune-interval\=86400 -fmodules-prune-after\=345600 -fbuild-session-file\=/Users/admin/builder/spi-builder-workspace/.derivedData/ModuleCache.noindex/Session.modulevalidation -fmodules-validate-once-per-build-session -Wnon-modular-include-in-framework-module -Werror\=non-modular-include-in-framework-module -Wno-trigraphs -Wno-missing-field-initializers -Wno-missing-prototypes -Wno-return-type -Wno-implicit-atomic-properties -Wno-objc-interface-ivars -Wno-arc-repeated-use-of-weak -Wno-missing-braces -Wparentheses -Wswitch -Wno-unused-function -Wno-unused-label -Wno-unused-parameter -Wno-unused-variable -Wunused-value -Wno-empty-body -Wno-uninitialized -Wno-unknown-pragmas -Wno-shadow -Wno-four-char-constants -Wno-conversion -Wno-constant-conversion -Wno-int-conversion -Wno-bool-conversion -Wno-enum-conversion -Wno-float-conversion -Wno-non-literal-null-conversion -Wno-objc-literal-conversion -Wno-shorten-64-to-32 -Wpointer-sign -Wno-newline-eof -Wno-selector -Wno-strict-selector-match -Wno-undeclared-selector -Wno-deprecated-implementations -Wno-implicit-fallthrough -fstrict-aliasing -Wprotocol -Wdeprecated-declarations -Wno-sign-conversion -Wno-infinite-recursion -Wno-comma -Wno-block-capture-autoreleasing -Wno-strict-prototypes -Wno-semicolon-before-method-body -index-store-path /Users/admin/builder/spi-builder-workspace/.derivedData/Index.noindex/DataStore @/Users/admin/builder/spi-builder-workspace/.derivedData/Build/Intermediates.noindex/iOSSnapshotTestCase.build/Debug-watchos/iOSSnapshotTestCaseCore.build/Objects-normal/armv7k/e6072d4f65d7061329687fe24e3d63a7-common-args.resp -MMD -MT dependencies -MF /Users/admin/builder/spi-builder-workspace/.derivedData/Build/Intermediates.noindex/iOSSnapshotTestCase.build/Debug-watchos/iOSSnapshotTestCaseCore.build/Objects-normal/armv7k/FBSnapshotTestCasePlatform.d --serialize-diagnostics /Users/admin/builder/spi-builder-workspace/.derivedData/Build/Intermediates.noindex/iOSSnapshotTestCase.build/Debug-watchos/iOSSnapshotTestCaseCore.build/Objects-normal/armv7k/FBSnapshotTestCasePlatform.dia -c /Users/admin/builder/spi-builder-workspace/src/iOSSnapshotTestCaseCore/FBSnapshotTestCasePlatform.m -o /Users/admin/builder/spi-builder-workspace/.derivedData/Build/Intermediates.noindex/iOSSnapshotTestCase.build/Debug-watchos/iOSSnapshotTestCaseCore.build/Objects-normal/armv7k/FBSnapshotTestCasePlatform.o -index-unit-output-path /iOSSnapshotTestCase.build/Debug-watchos/iOSSnapshotTestCaseCore.build/Objects-normal/armv7k/FBSnapshotTestCasePlatform.o
/Users/admin/builder/spi-builder-workspace/src/iOSSnapshotTestCaseCore/FBSnapshotTestCasePlatform.m:34:9: error: use of undeclared identifier 'UIDevice'
34 | UIDevice *device = [UIDevice currentDevice];
| ^
/Users/admin/builder/spi-builder-workspace/src/iOSSnapshotTestCaseCore/FBSnapshotTestCasePlatform.m:34:19: error: use of undeclared identifier 'device'
34 | UIDevice *device = [UIDevice currentDevice];
| ^
/Users/admin/builder/spi-builder-workspace/src/iOSSnapshotTestCaseCore/FBSnapshotTestCasePlatform.m:34:29: error: use of undeclared identifier 'UIDevice'
34 | UIDevice *device = [UIDevice currentDevice];
| ^
/Users/admin/builder/spi-builder-workspace/src/iOSSnapshotTestCaseCore/FBSnapshotTestCasePlatform.m:35:62: warning: format specifies type 'id' but the argument has type '<dependent type>' [-Wformat]
35 | fileName = [fileName stringByAppendingFormat:@"_%@", device.model];
| ~~ ^~~~~~~~~~~~
/Users/admin/builder/spi-builder-workspace/src/iOSSnapshotTestCaseCore/FBSnapshotTestCasePlatform.m:35:62: error: use of undeclared identifier 'device'
/Users/admin/builder/spi-builder-workspace/src/iOSSnapshotTestCaseCore/FBSnapshotTestCasePlatform.m:35:62: warning: format specifies type 'id' but the argument has type '<dependent type>' [-Wformat]
35 | fileName = [fileName stringByAppendingFormat:@"_%@", device.model];
| ~~ ^~~~~~~~~~~~
/Users/admin/builder/spi-builder-workspace/src/iOSSnapshotTestCaseCore/FBSnapshotTestCasePlatform.m:39:9: error: use of undeclared identifier 'UIDevice'
39 | UIDevice *device = [UIDevice currentDevice];
| ^
/Users/admin/builder/spi-builder-workspace/src/iOSSnapshotTestCaseCore/FBSnapshotTestCasePlatform.m:39:19: error: use of undeclared identifier 'device'
39 | UIDevice *device = [UIDevice currentDevice];
| ^
Failed frontend command:
/Applications/Xcode-16.3.0.app/Contents/Developer/Toolchains/XcodeDefault.xctoolchain/usr/bin/clang -cc1 -Wundef-prefix\=TARGET_OS_ -fdiagnostics-show-note-include-stack -fmacro-backtrace-limit\=0 -ferror-limit 19 -serialize-diagnostic-file /Users/admin/builder/spi-builder-workspace/.derivedData/Build/Intermediates.noindex/iOSSnapshotTestCase.build/Debug-watchos/iOSSnapshotTestCaseCore.build/Objects-normal/armv7k/FBSnapshotTestCasePlatform.dia -Wdeprecated-objc-isa-usage -Werror\=deprecated-objc-isa-usage -Werror\=implicit-function-declaration -Wnon-modular-include-in-framework-module -Werror\=non-modular-include-in-framework-module -Wno-trigraphs -Wno-missing-field-initializers -Wno-missing-prototypes -Wno-return-type -Wno-implicit-atomic-properties -Wno-objc-interface-ivars -Wno-arc-repeated-use-of-weak -Wno-missing-braces -Wparentheses -Wswitch -Wno-unused-function -Wno-unused-label -Wno-unused-parameter -Wno-unused-variable -Wunused-value -Wno-empty-body -Wno-uninitialized -Wno-unknown-pragmas -Wno-shadow -Wno-four-char-constants -Wno-conversion -Wno-constant-conversion -Wno-int-conversion -Wno-bool-conversion -Wno-enum-conversion -Wno-float-conversion -Wno-non-literal-null-conversion -Wno-objc-literal-conversion -Wno-shorten-64-to-32 -Wpointer-sign -Wno-newline-eof -Wno-selector -Wno-strict-selector-match -Wno-undeclared-selector -Wno-deprecated-implementations -Wno-implicit-fallthrough -Wprotocol -Wdeprecated-declarations -Wno-sign-conversion -Wno-infinite-recursion -Wno-comma -Wno-block-capture-autoreleasing -Wno-strict-prototypes -Wno-semicolon-before-method-body -Wno-reorder-init-list -Wno-implicit-int-float-conversion -Wno-c99-designator -Wno-final-dtor-non-final-class -Wno-extra-semi-stmt -Wno-misleading-indentation -Wno-quoted-include-in-framework-header -Wno-implicit-fallthrough -Wno-enum-enum-conversion -Wno-enum-float-conversion -Wno-elaborated-enum-base -Wno-reserved-identifier -Wno-gnu-folding-constant -index-store-path /Users/admin/builder/spi-builder-workspace/.derivedData/Index.noindex/DataStore -index-unit-output-path /iOSSnapshotTestCase.build/Debug-watchos/iOSSnapshotTestCaseCore.build/Objects-normal/armv7k/FBSnapshotTestCasePlatform.o -fmodule-map-file\=/Applications/Xcode-16.3.0.app/Contents/Developer/Platforms/WatchOS.platform/Developer/SDKs/WatchOS.sdk/System/Library/Frameworks/Foundation.framework/Modules/module.modulemap -fmodule-map-file\=/Applications/Xcode-16.3.0.app/Contents/Developer/Platforms/WatchOS.platform/Developer/SDKs/WatchOS.sdk/System/Library/Frameworks/UIKit.framework/Modules/module.modulemap -o /Users/admin/builder/spi-builder-workspace/.derivedData/Build/Intermediates.noindex/iOSSnapshotTestCase.build/Debug-watchos/iOSSnapshotTestCaseCore.build/Objects-normal/armv7k/FBSnapshotTestCasePlatform.o -disable-free -emit-obj -x objective-c /Users/admin/builder/spi-builder-workspace/src/iOSSnapshotTestCaseCore/FBSnapshotTestCasePlatform.m -target-abi aapcs16 -target-cpu cortex-a7 -target-feature +vfp2 -target-feature +vfp2sp -target-feature +vfp3 -target-feature +vfp3d16 -target-feature +vfp3d16sp -target-feature +vfp3sp -target-feature +fp16 -target-feature +vfp4 -target-feature +vfp4d16 -target-feature +vfp4d16sp -target-feature +vfp4sp -target-feature -fp-armv8 -target-feature -fp-armv8d16 -target-feature -fp-armv8d16sp -target-feature -fp-armv8sp -target-feature -fullfp16 -target-feature +fp64 -target-feature +d32 -target-feature +neon -target-feature -sha2 -target-feature -aes -target-feature -fp16fml -triple thumbv7k-apple-watchos5.0.0 -target-linker-version 1167.4.1 -target-sdk-version\=11.4 -fmodules-validate-system-headers -fno-modulemap-allow-subdirectory-search -isysroot /Applications/Xcode-16.3.0.app/Contents/Developer/Platforms/WatchOS.platform/Developer/SDKs/WatchOS11.4.sdk -resource-dir /Applications/Xcode-16.3.0.app/Contents/Developer/Toolchains/XcodeDefault.xctoolchain/usr/lib/clang/17 -fmodule-format\=obj -fmodule-file\=Foundation\=/Users/admin/builder/spi-builder-workspace/.derivedData/Build/Intermediates.noindex/ExplicitPrecompiledModules/Foundation-1NWJ1OEYCWGUMQ35N781E699Q.pcm -fmodule-file\=UIKit\=/Users/admin/builder/spi-builder-workspace/.derivedData/Build/Intermediates.noindex/ExplicitPrecompiledModules/UIKit-BDGDM3KB5QWPE5PPENQCG4CJN.pcm -I /Users/admin/builder/spi-builder-workspace/.derivedData/Build/Products/Debug-watchos/include -I /Users/admin/builder/spi-builder-workspace/src/iOSSnapshotTestCaseCore/Public -I /Users/admin/builder/spi-builder-workspace/.derivedData/Build/Intermediates.noindex/iOSSnapshotTestCase.build/Debug-watchos/iOSSnapshotTestCaseCore.build/DerivedSources-normal/armv7k -I /Users/admin/builder/spi-builder-workspace/.derivedData/Build/Intermediates.noindex/iOSSnapshotTestCase.build/Debug-watchos/iOSSnapshotTestCaseCore.build/DerivedSources/armv7k -I /Users/admin/builder/spi-builder-workspace/.derivedData/Build/Intermediates.noindex/iOSSnapshotTestCase.build/Debug-watchos/iOSSnapshotTestCaseCore.build/DerivedSources -F /Users/admin/builder/spi-builder-workspace/.derivedData/Build/Products/Debug-watchos -iframework /Applications/Xcode-16.3.0.app/Contents/Developer/Platforms/WatchOS.platform/Developer/Library/Frameworks -iframework /Applications/Xcode-16.3.0.app/Contents/Developer/Platforms/WatchOS.platform/Developer/SDKs/WatchOS11.4.sdk/Developer/Library/Frameworks -internal-isystem /Applications/Xcode-16.3.0.app/Contents/Developer/Platforms/WatchOS.platform/Developer/SDKs/WatchOS11.4.sdk/usr/local/include -internal-isystem /Applications/Xcode-16.3.0.app/Contents/Developer/Toolchains/XcodeDefault.xctoolchain/usr/lib/clang/17/include -internal-externc-isystem /Applications/Xcode-16.3.0.app/Contents/Developer/Platforms/WatchOS.platform/Developer/SDKs/WatchOS11.4.sdk/usr/include -internal-externc-isystem /Applications/Xcode-16.3.0.app/Contents/Developer/Toolchains/XcodeDefault.xctoolchain/usr/include -ivfsstatcache /Users/admin/builder/spi-builder-workspace/.derivedData/SDKStatCaches.noindex/watchos11.4-22T246-43efb940ff07ba2497b70ec94253f576.sdkstatcache -std\=gnu11 -fexceptions -exception-model dwarf -fskip-odr-check-in-gmf -fmodules -fmodule-name\=iOSSnapshotTestCaseCore -fno-implicit-modules -fobjc-exceptions -fmax-type-align\=16 -fpascal-strings -fvisibility-inlines-hidden-static-local-var -mdarwin-stkchk-strong-link -fno-odr-hash-protocols -pic-level 2 -fencode-extended-block-signature -stack-protector 1 -fobjc-runtime\=watchos-5.0.0 -fobjc-arc -fobjc-runtime-has-weak -fobjc-weak -fgnuc-version\=4.2.1 -fblocks -ffp-contract\=on -fclang-abi-compat\=4.0 -fno-experimental-relative-c++-abi-vtables -fno-file-reproducible -clang-vendor-feature\=+disableNonDependentMemberExprInCurrentInstantiation -clang-vendor-feature\=+enableAggressiveVLAFolding -clang-vendor-feature\=+revert09abecef7bbf -clang-vendor-feature\=+thisNoAlignAttr -clang-vendor-feature\=+thisNoNullAttr -clang-vendor-feature\=+disableAtImportPrivateFrameworkInImplementationError -O0 -fno-assume-unique-vtables -fdebug-compilation-dir\=/Users/admin/builder/spi-builder-workspace/.swiftpm/xcode -fcoverage-compilation-dir\=/Users/admin/builder/spi-builder-workspace/.swiftpm/xcode -fcoverage-mapping -fcommon -fregister-global-dtors-with-atexit -fno-strict-return -dwarf-version\=4 -debugger-tuning\=lldb -disable-llvm-verifier -dwarf-ext-refs -mfloat-abi hard -funwind-tables\=2 -fprofile-instrument\=clang -clear-ast-before-backend -discard-value-names -main-file-name FBSnapshotTestCasePlatform.m -mframe-pointer\=all -debug-info-kind\=standalone -fdiagnostics-hotness-threshold\=0 -fdiagnostics-misexpect-tolerance\=0 -D DEBUG\=1 -D OBJC_OLD_DISPATCH_PROTOTYPES\=1 -D SWIFT_PACKAGE -D Xcode -D __GCC_HAVE_DWARF2_CFI_ASM\=1 -fdefine-target-os-macros -MT dependencies -dependency-file /Users/admin/builder/spi-builder-workspace/.derivedData/Build/Intermediates.noindex/iOSSnapshotTestCase.build/Debug-watchos/iOSSnapshotTestCaseCore.build/Objects-normal/armv7k/FBSnapshotTestCasePlatform.d -skip-unused-modulemap-deps
PrecompileModule /Users/admin/builder/spi-builder-workspace/.derivedData/Build/Intermediates.noindex/ExplicitPrecompiledModules/os_workgroup-2KB99I9X6WWRJ1JVAN771EMFP.scan
cd /Users/admin/builder/spi-builder-workspace/.swiftpm/xcode
builtin-precompileModule /Users/admin/builder/spi-builder-workspace/.derivedData/Build/Intermediates.noindex/ExplicitPrecompiledModules/os_workgroup-2KB99I9X6WWRJ1JVAN771EMFP.scan
** BUILD FAILED **
The following build commands failed:
CompileC /Users/admin/builder/spi-builder-workspace/.derivedData/Build/Intermediates.noindex/iOSSnapshotTestCase.build/Debug-watchos/iOSSnapshotTestCaseCore.build/Objects-normal/armv7k/UIApplication+KeyWindow.o /Users/admin/builder/spi-builder-workspace/src/iOSSnapshotTestCaseCore/Categories/UIApplication+KeyWindow.m normal armv7k objective-c com.apple.compilers.llvm.clang.1_0.compiler (in target 'iOSSnapshotTestCaseCore' from project 'iOSSnapshotTestCase')
Building workspace spi-builder-workspace with scheme iOSSnapshotTestCase
(2 failures)
BUILD FAILURE 6.1 watchOS