Build Information
Failed to build Appetizer, reference 1.0.1 (a65eb0
), with Swift 6.1 for macOS (Xcode) using Xcode 16.3 on 26 Apr 2025 07:07:02 UTC.
Build Command
env DEVELOPER_DIR=/Applications/Xcode-16.3.0.app xcrun xcodebuild -IDEClonedSourcePackagesDirPathOverride=$PWD/.dependencies -skipMacroValidation -skipPackagePluginValidation -derivedDataPath $PWD/.derivedData build -scheme Appetizer -destination platform=macOS,arch=arm64
Build Log
WriteAuxiliaryFile /Users/admin/builder/spi-builder-workspace/.derivedData/Build/Intermediates.noindex/SwiftPM.build/Debug/clibc.build/Objects-normal/arm64/clibc.LinkFileList (in target 'clibc' from project 'SwiftPM')
cd /Users/admin/builder/spi-builder-workspace/.dependencies/checkouts/swift-package-manager
write-file /Users/admin/builder/spi-builder-workspace/.derivedData/Build/Intermediates.noindex/SwiftPM.build/Debug/clibc.build/Objects-normal/arm64/clibc.LinkFileList
WriteAuxiliaryFile /Users/admin/builder/spi-builder-workspace/.derivedData/Build/Intermediates.noindex/Appetizer.build/Debug/appetizer.build/appetizer.DependencyStaticMetadataFileList (in target 'appetizer' from project 'Appetizer')
cd /Users/admin/builder/spi-builder-workspace
write-file /Users/admin/builder/spi-builder-workspace/.derivedData/Build/Intermediates.noindex/Appetizer.build/Debug/appetizer.build/appetizer.DependencyStaticMetadataFileList
WriteAuxiliaryFile /Users/admin/builder/spi-builder-workspace/.derivedData/Build/Intermediates.noindex/Appetizer.build/Debug/appetizer.build/appetizer.DependencyMetadataFileList (in target 'appetizer' from project 'Appetizer')
cd /Users/admin/builder/spi-builder-workspace
write-file /Users/admin/builder/spi-builder-workspace/.derivedData/Build/Intermediates.noindex/Appetizer.build/Debug/appetizer.build/appetizer.DependencyMetadataFileList
WriteAuxiliaryFile /Users/admin/builder/spi-builder-workspace/.derivedData/Build/Intermediates.noindex/Appetizer.build/Debug/appetizer.build/Objects-normal/arm64/appetizer.SwiftFileList (in target 'appetizer' from project 'Appetizer')
cd /Users/admin/builder/spi-builder-workspace
write-file /Users/admin/builder/spi-builder-workspace/.derivedData/Build/Intermediates.noindex/Appetizer.build/Debug/appetizer.build/Objects-normal/arm64/appetizer.SwiftFileList
WriteAuxiliaryFile /Users/admin/builder/spi-builder-workspace/.derivedData/Build/Intermediates.noindex/Appetizer.build/Debug/appetizer.build/Objects-normal/arm64/appetizer_const_extract_protocols.json (in target 'appetizer' from project 'Appetizer')
cd /Users/admin/builder/spi-builder-workspace
write-file /Users/admin/builder/spi-builder-workspace/.derivedData/Build/Intermediates.noindex/Appetizer.build/Debug/appetizer.build/Objects-normal/arm64/appetizer_const_extract_protocols.json
WriteAuxiliaryFile /Users/admin/builder/spi-builder-workspace/.derivedData/Build/Intermediates.noindex/Appetizer.build/Debug/appetizer.build/Objects-normal/arm64/appetizer.LinkFileList (in target 'appetizer' from project 'Appetizer')
cd /Users/admin/builder/spi-builder-workspace
write-file /Users/admin/builder/spi-builder-workspace/.derivedData/Build/Intermediates.noindex/Appetizer.build/Debug/appetizer.build/Objects-normal/arm64/appetizer.LinkFileList
WriteAuxiliaryFile /Users/admin/builder/spi-builder-workspace/.derivedData/Build/Intermediates.noindex/Appetizer.build/Debug/appetizer.build/Objects-normal/arm64/appetizer-OutputFileMap.json (in target 'appetizer' from project 'Appetizer')
cd /Users/admin/builder/spi-builder-workspace
write-file /Users/admin/builder/spi-builder-workspace/.derivedData/Build/Intermediates.noindex/Appetizer.build/Debug/appetizer.build/Objects-normal/arm64/appetizer-OutputFileMap.json
WriteAuxiliaryFile /Users/admin/builder/spi-builder-workspace/.derivedData/Build/Intermediates.noindex/SwiftPM.build/Debug/SPMUtility.build/SPMUtility.DependencyStaticMetadataFileList (in target 'SPMUtility' from project 'SwiftPM')
cd /Users/admin/builder/spi-builder-workspace/.dependencies/checkouts/swift-package-manager
write-file /Users/admin/builder/spi-builder-workspace/.derivedData/Build/Intermediates.noindex/SwiftPM.build/Debug/SPMUtility.build/SPMUtility.DependencyStaticMetadataFileList
WriteAuxiliaryFile /Users/admin/builder/spi-builder-workspace/.derivedData/Build/Intermediates.noindex/SwiftPM.build/Debug/SPMUtility.build/SPMUtility.DependencyMetadataFileList (in target 'SPMUtility' from project 'SwiftPM')
cd /Users/admin/builder/spi-builder-workspace/.dependencies/checkouts/swift-package-manager
write-file /Users/admin/builder/spi-builder-workspace/.derivedData/Build/Intermediates.noindex/SwiftPM.build/Debug/SPMUtility.build/SPMUtility.DependencyMetadataFileList
WriteAuxiliaryFile /Users/admin/builder/spi-builder-workspace/.derivedData/Build/Intermediates.noindex/SwiftPM.build/Debug/SPMUtility.build/Objects-normal/arm64/SPMUtility_const_extract_protocols.json (in target 'SPMUtility' from project 'SwiftPM')
cd /Users/admin/builder/spi-builder-workspace/.dependencies/checkouts/swift-package-manager
write-file /Users/admin/builder/spi-builder-workspace/.derivedData/Build/Intermediates.noindex/SwiftPM.build/Debug/SPMUtility.build/Objects-normal/arm64/SPMUtility_const_extract_protocols.json
WriteAuxiliaryFile /Users/admin/builder/spi-builder-workspace/.derivedData/Build/Intermediates.noindex/SwiftPM.build/Debug/SPMUtility.build/Objects-normal/arm64/SPMUtility.SwiftFileList (in target 'SPMUtility' from project 'SwiftPM')
cd /Users/admin/builder/spi-builder-workspace/.dependencies/checkouts/swift-package-manager
write-file /Users/admin/builder/spi-builder-workspace/.derivedData/Build/Intermediates.noindex/SwiftPM.build/Debug/SPMUtility.build/Objects-normal/arm64/SPMUtility.SwiftFileList
WriteAuxiliaryFile /Users/admin/builder/spi-builder-workspace/.derivedData/Build/Intermediates.noindex/SwiftPM.build/Debug/SPMUtility.build/Objects-normal/arm64/SPMUtility.SwiftConstValuesFileList (in target 'SPMUtility' from project 'SwiftPM')
cd /Users/admin/builder/spi-builder-workspace/.dependencies/checkouts/swift-package-manager
write-file /Users/admin/builder/spi-builder-workspace/.derivedData/Build/Intermediates.noindex/SwiftPM.build/Debug/SPMUtility.build/Objects-normal/arm64/SPMUtility.SwiftConstValuesFileList
WriteAuxiliaryFile /Users/admin/builder/spi-builder-workspace/.derivedData/Build/Intermediates.noindex/SwiftPM.build/Debug/SPMUtility.build/Objects-normal/arm64/SPMUtility.LinkFileList (in target 'SPMUtility' from project 'SwiftPM')
cd /Users/admin/builder/spi-builder-workspace/.dependencies/checkouts/swift-package-manager
write-file /Users/admin/builder/spi-builder-workspace/.derivedData/Build/Intermediates.noindex/SwiftPM.build/Debug/SPMUtility.build/Objects-normal/arm64/SPMUtility.LinkFileList
WriteAuxiliaryFile /Users/admin/builder/spi-builder-workspace/.derivedData/Build/Intermediates.noindex/SwiftPM.build/Debug/SPMUtility.build/Objects-normal/arm64/SPMUtility-OutputFileMap.json (in target 'SPMUtility' from project 'SwiftPM')
cd /Users/admin/builder/spi-builder-workspace/.dependencies/checkouts/swift-package-manager
write-file /Users/admin/builder/spi-builder-workspace/.derivedData/Build/Intermediates.noindex/SwiftPM.build/Debug/SPMUtility.build/Objects-normal/arm64/SPMUtility-OutputFileMap.json
Copy /Users/admin/builder/spi-builder-workspace/.derivedData/Build/Intermediates.noindex/GeneratedModuleMaps/SPMUtility.modulemap /Users/admin/builder/spi-builder-workspace/.derivedData/Build/Intermediates.noindex/SwiftPM.build/Debug/SPMUtility.build/SPMUtility.modulemap (in target 'SPMUtility' from project 'SwiftPM')
cd /Users/admin/builder/spi-builder-workspace/.dependencies/checkouts/swift-package-manager
builtin-copy -exclude .DS_Store -exclude CVS -exclude .svn -exclude .git -exclude .hg -resolve-src-symlinks /Users/admin/builder/spi-builder-workspace/.derivedData/Build/Intermediates.noindex/SwiftPM.build/Debug/SPMUtility.build/SPMUtility.modulemap /Users/admin/builder/spi-builder-workspace/.derivedData/Build/Intermediates.noindex/GeneratedModuleMaps
WriteAuxiliaryFile /Users/admin/builder/spi-builder-workspace/.derivedData/Build/Intermediates.noindex/SwiftPM.build/Debug/SPMLibc.build/SPMLibc.modulemap (in target 'SPMLibc' from project 'SwiftPM')
cd /Users/admin/builder/spi-builder-workspace/.dependencies/checkouts/swift-package-manager
write-file /Users/admin/builder/spi-builder-workspace/.derivedData/Build/Intermediates.noindex/SwiftPM.build/Debug/SPMLibc.build/SPMLibc.modulemap
WriteAuxiliaryFile /Users/admin/builder/spi-builder-workspace/.derivedData/Build/Intermediates.noindex/SwiftPM.build/Debug/SPMLibc.build/SPMLibc.DependencyStaticMetadataFileList (in target 'SPMLibc' from project 'SwiftPM')
cd /Users/admin/builder/spi-builder-workspace/.dependencies/checkouts/swift-package-manager
write-file /Users/admin/builder/spi-builder-workspace/.derivedData/Build/Intermediates.noindex/SwiftPM.build/Debug/SPMLibc.build/SPMLibc.DependencyStaticMetadataFileList
WriteAuxiliaryFile /Users/admin/builder/spi-builder-workspace/.derivedData/Build/Intermediates.noindex/SwiftPM.build/Debug/SPMLibc.build/SPMLibc.DependencyMetadataFileList (in target 'SPMLibc' from project 'SwiftPM')
cd /Users/admin/builder/spi-builder-workspace/.dependencies/checkouts/swift-package-manager
write-file /Users/admin/builder/spi-builder-workspace/.derivedData/Build/Intermediates.noindex/SwiftPM.build/Debug/SPMLibc.build/SPMLibc.DependencyMetadataFileList
WriteAuxiliaryFile /Users/admin/builder/spi-builder-workspace/.derivedData/Build/Intermediates.noindex/SwiftPM.build/Debug/SPMLibc.build/Objects-normal/arm64/SPMLibc_const_extract_protocols.json (in target 'SPMLibc' from project 'SwiftPM')
cd /Users/admin/builder/spi-builder-workspace/.dependencies/checkouts/swift-package-manager
write-file /Users/admin/builder/spi-builder-workspace/.derivedData/Build/Intermediates.noindex/SwiftPM.build/Debug/SPMLibc.build/Objects-normal/arm64/SPMLibc_const_extract_protocols.json
WriteAuxiliaryFile /Users/admin/builder/spi-builder-workspace/.derivedData/Build/Intermediates.noindex/SwiftPM.build/Debug/SPMLibc.build/Objects-normal/arm64/SPMLibc.SwiftFileList (in target 'SPMLibc' from project 'SwiftPM')
cd /Users/admin/builder/spi-builder-workspace/.dependencies/checkouts/swift-package-manager
write-file /Users/admin/builder/spi-builder-workspace/.derivedData/Build/Intermediates.noindex/SwiftPM.build/Debug/SPMLibc.build/Objects-normal/arm64/SPMLibc.SwiftFileList
WriteAuxiliaryFile /Users/admin/builder/spi-builder-workspace/.derivedData/Build/Intermediates.noindex/SwiftPM.build/Debug/SPMLibc.build/Objects-normal/arm64/SPMLibc.SwiftConstValuesFileList (in target 'SPMLibc' from project 'SwiftPM')
cd /Users/admin/builder/spi-builder-workspace/.dependencies/checkouts/swift-package-manager
write-file /Users/admin/builder/spi-builder-workspace/.derivedData/Build/Intermediates.noindex/SwiftPM.build/Debug/SPMLibc.build/Objects-normal/arm64/SPMLibc.SwiftConstValuesFileList
WriteAuxiliaryFile /Users/admin/builder/spi-builder-workspace/.derivedData/Build/Intermediates.noindex/SwiftPM.build/Debug/SPMLibc.build/Objects-normal/arm64/SPMLibc.LinkFileList (in target 'SPMLibc' from project 'SwiftPM')
cd /Users/admin/builder/spi-builder-workspace/.dependencies/checkouts/swift-package-manager
write-file /Users/admin/builder/spi-builder-workspace/.derivedData/Build/Intermediates.noindex/SwiftPM.build/Debug/SPMLibc.build/Objects-normal/arm64/SPMLibc.LinkFileList
WriteAuxiliaryFile /Users/admin/builder/spi-builder-workspace/.derivedData/Build/Intermediates.noindex/SwiftPM.build/Debug/SPMLibc.build/Objects-normal/arm64/SPMLibc-OutputFileMap.json (in target 'SPMLibc' from project 'SwiftPM')
cd /Users/admin/builder/spi-builder-workspace/.dependencies/checkouts/swift-package-manager
write-file /Users/admin/builder/spi-builder-workspace/.derivedData/Build/Intermediates.noindex/SwiftPM.build/Debug/SPMLibc.build/Objects-normal/arm64/SPMLibc-OutputFileMap.json
WriteAuxiliaryFile /Users/admin/builder/spi-builder-workspace/.derivedData/Build/Intermediates.noindex/SwiftPM.build/Debug/POSIX.build/POSIX.modulemap (in target 'POSIX' from project 'SwiftPM')
cd /Users/admin/builder/spi-builder-workspace/.dependencies/checkouts/swift-package-manager
write-file /Users/admin/builder/spi-builder-workspace/.derivedData/Build/Intermediates.noindex/SwiftPM.build/Debug/POSIX.build/POSIX.modulemap
Copy /Users/admin/builder/spi-builder-workspace/.derivedData/Build/Intermediates.noindex/GeneratedModuleMaps/SPMLibc.modulemap /Users/admin/builder/spi-builder-workspace/.derivedData/Build/Intermediates.noindex/SwiftPM.build/Debug/SPMLibc.build/SPMLibc.modulemap (in target 'SPMLibc' from project 'SwiftPM')
cd /Users/admin/builder/spi-builder-workspace/.dependencies/checkouts/swift-package-manager
builtin-copy -exclude .DS_Store -exclude CVS -exclude .svn -exclude .git -exclude .hg -resolve-src-symlinks /Users/admin/builder/spi-builder-workspace/.derivedData/Build/Intermediates.noindex/SwiftPM.build/Debug/SPMLibc.build/SPMLibc.modulemap /Users/admin/builder/spi-builder-workspace/.derivedData/Build/Intermediates.noindex/GeneratedModuleMaps
WriteAuxiliaryFile /Users/admin/builder/spi-builder-workspace/.derivedData/Build/Intermediates.noindex/SwiftPM.build/Debug/POSIX.build/POSIX.DependencyStaticMetadataFileList (in target 'POSIX' from project 'SwiftPM')
cd /Users/admin/builder/spi-builder-workspace/.dependencies/checkouts/swift-package-manager
write-file /Users/admin/builder/spi-builder-workspace/.derivedData/Build/Intermediates.noindex/SwiftPM.build/Debug/POSIX.build/POSIX.DependencyStaticMetadataFileList
WriteAuxiliaryFile /Users/admin/builder/spi-builder-workspace/.derivedData/Build/Intermediates.noindex/SwiftPM.build/Debug/POSIX.build/POSIX.DependencyMetadataFileList (in target 'POSIX' from project 'SwiftPM')
cd /Users/admin/builder/spi-builder-workspace/.dependencies/checkouts/swift-package-manager
write-file /Users/admin/builder/spi-builder-workspace/.derivedData/Build/Intermediates.noindex/SwiftPM.build/Debug/POSIX.build/POSIX.DependencyMetadataFileList
WriteAuxiliaryFile /Users/admin/builder/spi-builder-workspace/.derivedData/Build/Intermediates.noindex/SwiftPM.build/Debug/POSIX.build/Objects-normal/arm64/POSIX.LinkFileList (in target 'POSIX' from project 'SwiftPM')
cd /Users/admin/builder/spi-builder-workspace/.dependencies/checkouts/swift-package-manager
write-file /Users/admin/builder/spi-builder-workspace/.derivedData/Build/Intermediates.noindex/SwiftPM.build/Debug/POSIX.build/Objects-normal/arm64/POSIX.LinkFileList
WriteAuxiliaryFile /Users/admin/builder/spi-builder-workspace/.derivedData/Build/Intermediates.noindex/SwiftPM.build/Debug/POSIX.build/Objects-normal/arm64/POSIX.SwiftConstValuesFileList (in target 'POSIX' from project 'SwiftPM')
cd /Users/admin/builder/spi-builder-workspace/.dependencies/checkouts/swift-package-manager
write-file /Users/admin/builder/spi-builder-workspace/.derivedData/Build/Intermediates.noindex/SwiftPM.build/Debug/POSIX.build/Objects-normal/arm64/POSIX.SwiftConstValuesFileList
WriteAuxiliaryFile /Users/admin/builder/spi-builder-workspace/.derivedData/Build/Intermediates.noindex/SwiftPM.build/Debug/POSIX.build/Objects-normal/arm64/POSIX_const_extract_protocols.json (in target 'POSIX' from project 'SwiftPM')
cd /Users/admin/builder/spi-builder-workspace/.dependencies/checkouts/swift-package-manager
write-file /Users/admin/builder/spi-builder-workspace/.derivedData/Build/Intermediates.noindex/SwiftPM.build/Debug/POSIX.build/Objects-normal/arm64/POSIX_const_extract_protocols.json
WriteAuxiliaryFile /Users/admin/builder/spi-builder-workspace/.derivedData/Build/Intermediates.noindex/SwiftPM.build/Debug/POSIX.build/Objects-normal/arm64/POSIX.SwiftFileList (in target 'POSIX' from project 'SwiftPM')
cd /Users/admin/builder/spi-builder-workspace/.dependencies/checkouts/swift-package-manager
write-file /Users/admin/builder/spi-builder-workspace/.derivedData/Build/Intermediates.noindex/SwiftPM.build/Debug/POSIX.build/Objects-normal/arm64/POSIX.SwiftFileList
WriteAuxiliaryFile /Users/admin/builder/spi-builder-workspace/.derivedData/Build/Intermediates.noindex/SwiftPM.build/Debug/POSIX.build/Objects-normal/arm64/POSIX-OutputFileMap.json (in target 'POSIX' from project 'SwiftPM')
cd /Users/admin/builder/spi-builder-workspace/.dependencies/checkouts/swift-package-manager
write-file /Users/admin/builder/spi-builder-workspace/.derivedData/Build/Intermediates.noindex/SwiftPM.build/Debug/POSIX.build/Objects-normal/arm64/POSIX-OutputFileMap.json
WriteAuxiliaryFile /Users/admin/builder/spi-builder-workspace/.derivedData/Build/Intermediates.noindex/HexColor.build/Debug/HexNSColor.build/Objects-normal/arm64/HexNSColor_const_extract_protocols.json (in target 'HexNSColor' from project 'HexColor')
cd /Users/admin/builder/spi-builder-workspace/.dependencies/checkouts/HexColor
write-file /Users/admin/builder/spi-builder-workspace/.derivedData/Build/Intermediates.noindex/HexColor.build/Debug/HexNSColor.build/Objects-normal/arm64/HexNSColor_const_extract_protocols.json
Copy /Users/admin/builder/spi-builder-workspace/.derivedData/Build/Intermediates.noindex/GeneratedModuleMaps/POSIX.modulemap /Users/admin/builder/spi-builder-workspace/.derivedData/Build/Intermediates.noindex/SwiftPM.build/Debug/POSIX.build/POSIX.modulemap (in target 'POSIX' from project 'SwiftPM')
cd /Users/admin/builder/spi-builder-workspace/.dependencies/checkouts/swift-package-manager
builtin-copy -exclude .DS_Store -exclude CVS -exclude .svn -exclude .git -exclude .hg -resolve-src-symlinks /Users/admin/builder/spi-builder-workspace/.derivedData/Build/Intermediates.noindex/SwiftPM.build/Debug/POSIX.build/POSIX.modulemap /Users/admin/builder/spi-builder-workspace/.derivedData/Build/Intermediates.noindex/GeneratedModuleMaps
WriteAuxiliaryFile /Users/admin/builder/spi-builder-workspace/.derivedData/Build/Intermediates.noindex/HexColor.build/Debug/HexNSColor.build/Objects-normal/arm64/HexNSColor.SwiftFileList (in target 'HexNSColor' from project 'HexColor')
cd /Users/admin/builder/spi-builder-workspace/.dependencies/checkouts/HexColor
write-file /Users/admin/builder/spi-builder-workspace/.derivedData/Build/Intermediates.noindex/HexColor.build/Debug/HexNSColor.build/Objects-normal/arm64/HexNSColor.SwiftFileList
WriteAuxiliaryFile /Users/admin/builder/spi-builder-workspace/.derivedData/Build/Intermediates.noindex/HexColor.build/Debug/HexNSColor.build/Objects-normal/arm64/HexNSColor.SwiftConstValuesFileList (in target 'HexNSColor' from project 'HexColor')
cd /Users/admin/builder/spi-builder-workspace/.dependencies/checkouts/HexColor
write-file /Users/admin/builder/spi-builder-workspace/.derivedData/Build/Intermediates.noindex/HexColor.build/Debug/HexNSColor.build/Objects-normal/arm64/HexNSColor.SwiftConstValuesFileList
WriteAuxiliaryFile /Users/admin/builder/spi-builder-workspace/.derivedData/Build/Intermediates.noindex/HexColor.build/Debug/HexNSColor.build/Objects-normal/arm64/HexNSColor.LinkFileList (in target 'HexNSColor' from project 'HexColor')
cd /Users/admin/builder/spi-builder-workspace/.dependencies/checkouts/HexColor
write-file /Users/admin/builder/spi-builder-workspace/.derivedData/Build/Intermediates.noindex/HexColor.build/Debug/HexNSColor.build/Objects-normal/arm64/HexNSColor.LinkFileList
WriteAuxiliaryFile /Users/admin/builder/spi-builder-workspace/.derivedData/Build/Intermediates.noindex/HexColor.build/Debug/HexNSColor.build/Objects-normal/arm64/HexNSColor-OutputFileMap.json (in target 'HexNSColor' from project 'HexColor')
cd /Users/admin/builder/spi-builder-workspace/.dependencies/checkouts/HexColor
write-file /Users/admin/builder/spi-builder-workspace/.derivedData/Build/Intermediates.noindex/HexColor.build/Debug/HexNSColor.build/Objects-normal/arm64/HexNSColor-OutputFileMap.json
WriteAuxiliaryFile /Users/admin/builder/spi-builder-workspace/.derivedData/Build/Intermediates.noindex/HexColor.build/Debug/HexNSColor.build/HexNSColor.modulemap (in target 'HexNSColor' from project 'HexColor')
cd /Users/admin/builder/spi-builder-workspace/.dependencies/checkouts/HexColor
write-file /Users/admin/builder/spi-builder-workspace/.derivedData/Build/Intermediates.noindex/HexColor.build/Debug/HexNSColor.build/HexNSColor.modulemap
WriteAuxiliaryFile /Users/admin/builder/spi-builder-workspace/.derivedData/Build/Intermediates.noindex/HexColor.build/Debug/HexNSColor.build/HexNSColor.DependencyStaticMetadataFileList (in target 'HexNSColor' from project 'HexColor')
cd /Users/admin/builder/spi-builder-workspace/.dependencies/checkouts/HexColor
write-file /Users/admin/builder/spi-builder-workspace/.derivedData/Build/Intermediates.noindex/HexColor.build/Debug/HexNSColor.build/HexNSColor.DependencyStaticMetadataFileList
WriteAuxiliaryFile /Users/admin/builder/spi-builder-workspace/.derivedData/Build/Intermediates.noindex/HexColor.build/Debug/HexNSColor.build/HexNSColor.DependencyMetadataFileList (in target 'HexNSColor' from project 'HexColor')
cd /Users/admin/builder/spi-builder-workspace/.dependencies/checkouts/HexColor
write-file /Users/admin/builder/spi-builder-workspace/.derivedData/Build/Intermediates.noindex/HexColor.build/Debug/HexNSColor.build/HexNSColor.DependencyMetadataFileList
WriteAuxiliaryFile /Users/admin/builder/spi-builder-workspace/.derivedData/Build/Intermediates.noindex/HexColor.build/Debug/HexColor.build/Objects-normal/arm64/HexColor_const_extract_protocols.json (in target 'HexColor' from project 'HexColor')
cd /Users/admin/builder/spi-builder-workspace/.dependencies/checkouts/HexColor
write-file /Users/admin/builder/spi-builder-workspace/.derivedData/Build/Intermediates.noindex/HexColor.build/Debug/HexColor.build/Objects-normal/arm64/HexColor_const_extract_protocols.json
WriteAuxiliaryFile /Users/admin/builder/spi-builder-workspace/.derivedData/Build/Intermediates.noindex/HexColor.build/Debug/HexColor.build/Objects-normal/arm64/HexColor.SwiftFileList (in target 'HexColor' from project 'HexColor')
cd /Users/admin/builder/spi-builder-workspace/.dependencies/checkouts/HexColor
write-file /Users/admin/builder/spi-builder-workspace/.derivedData/Build/Intermediates.noindex/HexColor.build/Debug/HexColor.build/Objects-normal/arm64/HexColor.SwiftFileList
WriteAuxiliaryFile /Users/admin/builder/spi-builder-workspace/.derivedData/Build/Intermediates.noindex/HexColor.build/Debug/HexColor.build/Objects-normal/arm64/HexColor.SwiftConstValuesFileList (in target 'HexColor' from project 'HexColor')
cd /Users/admin/builder/spi-builder-workspace/.dependencies/checkouts/HexColor
write-file /Users/admin/builder/spi-builder-workspace/.derivedData/Build/Intermediates.noindex/HexColor.build/Debug/HexColor.build/Objects-normal/arm64/HexColor.SwiftConstValuesFileList
WriteAuxiliaryFile /Users/admin/builder/spi-builder-workspace/.derivedData/Build/Intermediates.noindex/HexColor.build/Debug/HexColor.build/Objects-normal/arm64/HexColor.LinkFileList (in target 'HexColor' from project 'HexColor')
cd /Users/admin/builder/spi-builder-workspace/.dependencies/checkouts/HexColor
write-file /Users/admin/builder/spi-builder-workspace/.derivedData/Build/Intermediates.noindex/HexColor.build/Debug/HexColor.build/Objects-normal/arm64/HexColor.LinkFileList
WriteAuxiliaryFile /Users/admin/builder/spi-builder-workspace/.derivedData/Build/Intermediates.noindex/HexColor.build/Debug/HexColor.build/Objects-normal/arm64/HexColor-OutputFileMap.json (in target 'HexColor' from project 'HexColor')
cd /Users/admin/builder/spi-builder-workspace/.dependencies/checkouts/HexColor
write-file /Users/admin/builder/spi-builder-workspace/.derivedData/Build/Intermediates.noindex/HexColor.build/Debug/HexColor.build/Objects-normal/arm64/HexColor-OutputFileMap.json
WriteAuxiliaryFile /Users/admin/builder/spi-builder-workspace/.derivedData/Build/Intermediates.noindex/HexColor.build/Debug/HexColor.build/HexColor.modulemap (in target 'HexColor' from project 'HexColor')
cd /Users/admin/builder/spi-builder-workspace/.dependencies/checkouts/HexColor
write-file /Users/admin/builder/spi-builder-workspace/.derivedData/Build/Intermediates.noindex/HexColor.build/Debug/HexColor.build/HexColor.modulemap
WriteAuxiliaryFile /Users/admin/builder/spi-builder-workspace/.derivedData/Build/Intermediates.noindex/HexColor.build/Debug/HexColor.build/HexColor.DependencyStaticMetadataFileList (in target 'HexColor' from project 'HexColor')
cd /Users/admin/builder/spi-builder-workspace/.dependencies/checkouts/HexColor
write-file /Users/admin/builder/spi-builder-workspace/.derivedData/Build/Intermediates.noindex/HexColor.build/Debug/HexColor.build/HexColor.DependencyStaticMetadataFileList
Copy /Users/admin/builder/spi-builder-workspace/.derivedData/Build/Intermediates.noindex/GeneratedModuleMaps/HexNSColor.modulemap /Users/admin/builder/spi-builder-workspace/.derivedData/Build/Intermediates.noindex/HexColor.build/Debug/HexNSColor.build/HexNSColor.modulemap (in target 'HexNSColor' from project 'HexColor')
cd /Users/admin/builder/spi-builder-workspace/.dependencies/checkouts/HexColor
builtin-copy -exclude .DS_Store -exclude CVS -exclude .svn -exclude .git -exclude .hg -resolve-src-symlinks /Users/admin/builder/spi-builder-workspace/.derivedData/Build/Intermediates.noindex/HexColor.build/Debug/HexNSColor.build/HexNSColor.modulemap /Users/admin/builder/spi-builder-workspace/.derivedData/Build/Intermediates.noindex/GeneratedModuleMaps
WriteAuxiliaryFile /Users/admin/builder/spi-builder-workspace/.derivedData/Build/Intermediates.noindex/HexColor.build/Debug/HexColor.build/HexColor.DependencyMetadataFileList (in target 'HexColor' from project 'HexColor')
cd /Users/admin/builder/spi-builder-workspace/.dependencies/checkouts/HexColor
write-file /Users/admin/builder/spi-builder-workspace/.derivedData/Build/Intermediates.noindex/HexColor.build/Debug/HexColor.build/HexColor.DependencyMetadataFileList
WriteAuxiliaryFile /Users/admin/builder/spi-builder-workspace/.derivedData/Build/Intermediates.noindex/SwiftPM.build/Debug/Basic.build/Objects-normal/arm64/Basic_const_extract_protocols.json (in target 'Basic' from project 'SwiftPM')
cd /Users/admin/builder/spi-builder-workspace/.dependencies/checkouts/swift-package-manager
write-file /Users/admin/builder/spi-builder-workspace/.derivedData/Build/Intermediates.noindex/SwiftPM.build/Debug/Basic.build/Objects-normal/arm64/Basic_const_extract_protocols.json
WriteAuxiliaryFile /Users/admin/builder/spi-builder-workspace/.derivedData/Build/Intermediates.noindex/SwiftPM.build/Debug/Basic.build/Objects-normal/arm64/Basic.SwiftFileList (in target 'Basic' from project 'SwiftPM')
cd /Users/admin/builder/spi-builder-workspace/.dependencies/checkouts/swift-package-manager
write-file /Users/admin/builder/spi-builder-workspace/.derivedData/Build/Intermediates.noindex/SwiftPM.build/Debug/Basic.build/Objects-normal/arm64/Basic.SwiftFileList
WriteAuxiliaryFile /Users/admin/builder/spi-builder-workspace/.derivedData/Build/Intermediates.noindex/SwiftPM.build/Debug/Basic.build/Objects-normal/arm64/Basic.SwiftConstValuesFileList (in target 'Basic' from project 'SwiftPM')
cd /Users/admin/builder/spi-builder-workspace/.dependencies/checkouts/swift-package-manager
write-file /Users/admin/builder/spi-builder-workspace/.derivedData/Build/Intermediates.noindex/SwiftPM.build/Debug/Basic.build/Objects-normal/arm64/Basic.SwiftConstValuesFileList
WriteAuxiliaryFile /Users/admin/builder/spi-builder-workspace/.derivedData/Build/Intermediates.noindex/SwiftPM.build/Debug/Basic.build/Objects-normal/arm64/Basic.LinkFileList (in target 'Basic' from project 'SwiftPM')
cd /Users/admin/builder/spi-builder-workspace/.dependencies/checkouts/swift-package-manager
write-file /Users/admin/builder/spi-builder-workspace/.derivedData/Build/Intermediates.noindex/SwiftPM.build/Debug/Basic.build/Objects-normal/arm64/Basic.LinkFileList
WriteAuxiliaryFile /Users/admin/builder/spi-builder-workspace/.derivedData/Build/Intermediates.noindex/SwiftPM.build/Debug/Basic.build/Objects-normal/arm64/Basic-OutputFileMap.json (in target 'Basic' from project 'SwiftPM')
cd /Users/admin/builder/spi-builder-workspace/.dependencies/checkouts/swift-package-manager
write-file /Users/admin/builder/spi-builder-workspace/.derivedData/Build/Intermediates.noindex/SwiftPM.build/Debug/Basic.build/Objects-normal/arm64/Basic-OutputFileMap.json
WriteAuxiliaryFile /Users/admin/builder/spi-builder-workspace/.derivedData/Build/Intermediates.noindex/SwiftPM.build/Debug/Basic.build/Basic.modulemap (in target 'Basic' from project 'SwiftPM')
cd /Users/admin/builder/spi-builder-workspace/.dependencies/checkouts/swift-package-manager
write-file /Users/admin/builder/spi-builder-workspace/.derivedData/Build/Intermediates.noindex/SwiftPM.build/Debug/Basic.build/Basic.modulemap
Copy /Users/admin/builder/spi-builder-workspace/.derivedData/Build/Intermediates.noindex/GeneratedModuleMaps/HexColor.modulemap /Users/admin/builder/spi-builder-workspace/.derivedData/Build/Intermediates.noindex/HexColor.build/Debug/HexColor.build/HexColor.modulemap (in target 'HexColor' from project 'HexColor')
cd /Users/admin/builder/spi-builder-workspace/.dependencies/checkouts/HexColor
builtin-copy -exclude .DS_Store -exclude CVS -exclude .svn -exclude .git -exclude .hg -resolve-src-symlinks /Users/admin/builder/spi-builder-workspace/.derivedData/Build/Intermediates.noindex/HexColor.build/Debug/HexColor.build/HexColor.modulemap /Users/admin/builder/spi-builder-workspace/.derivedData/Build/Intermediates.noindex/GeneratedModuleMaps
WriteAuxiliaryFile /Users/admin/builder/spi-builder-workspace/.derivedData/Build/Intermediates.noindex/SwiftPM.build/Debug/Basic.build/Basic.DependencyStaticMetadataFileList (in target 'Basic' from project 'SwiftPM')
cd /Users/admin/builder/spi-builder-workspace/.dependencies/checkouts/swift-package-manager
write-file /Users/admin/builder/spi-builder-workspace/.derivedData/Build/Intermediates.noindex/SwiftPM.build/Debug/Basic.build/Basic.DependencyStaticMetadataFileList
WriteAuxiliaryFile /Users/admin/builder/spi-builder-workspace/.derivedData/Build/Intermediates.noindex/SwiftPM.build/Debug/Basic.build/Basic.DependencyMetadataFileList (in target 'Basic' from project 'SwiftPM')
cd /Users/admin/builder/spi-builder-workspace/.dependencies/checkouts/swift-package-manager
write-file /Users/admin/builder/spi-builder-workspace/.derivedData/Build/Intermediates.noindex/SwiftPM.build/Debug/Basic.build/Basic.DependencyMetadataFileList
WriteAuxiliaryFile /Users/admin/builder/spi-builder-workspace/.derivedData/Build/Intermediates.noindex/Appetizer.build/Debug/AppetizerCore.build/Objects-normal/arm64/AppetizerCore.SwiftFileList (in target 'AppetizerCore' from project 'Appetizer')
cd /Users/admin/builder/spi-builder-workspace
write-file /Users/admin/builder/spi-builder-workspace/.derivedData/Build/Intermediates.noindex/Appetizer.build/Debug/AppetizerCore.build/Objects-normal/arm64/AppetizerCore.SwiftFileList
WriteAuxiliaryFile /Users/admin/builder/spi-builder-workspace/.derivedData/Build/Intermediates.noindex/Appetizer.build/Debug/AppetizerCore.build/Objects-normal/arm64/AppetizerCore.SwiftConstValuesFileList (in target 'AppetizerCore' from project 'Appetizer')
cd /Users/admin/builder/spi-builder-workspace
write-file /Users/admin/builder/spi-builder-workspace/.derivedData/Build/Intermediates.noindex/Appetizer.build/Debug/AppetizerCore.build/Objects-normal/arm64/AppetizerCore.SwiftConstValuesFileList
WriteAuxiliaryFile /Users/admin/builder/spi-builder-workspace/.derivedData/Build/Intermediates.noindex/Appetizer.build/Debug/AppetizerCore.build/Objects-normal/arm64/AppetizerCore_const_extract_protocols.json (in target 'AppetizerCore' from project 'Appetizer')
cd /Users/admin/builder/spi-builder-workspace
write-file /Users/admin/builder/spi-builder-workspace/.derivedData/Build/Intermediates.noindex/Appetizer.build/Debug/AppetizerCore.build/Objects-normal/arm64/AppetizerCore_const_extract_protocols.json
WriteAuxiliaryFile /Users/admin/builder/spi-builder-workspace/.derivedData/Build/Intermediates.noindex/Appetizer.build/Debug/AppetizerCore.build/Objects-normal/arm64/AppetizerCore.LinkFileList (in target 'AppetizerCore' from project 'Appetizer')
cd /Users/admin/builder/spi-builder-workspace
write-file /Users/admin/builder/spi-builder-workspace/.derivedData/Build/Intermediates.noindex/Appetizer.build/Debug/AppetizerCore.build/Objects-normal/arm64/AppetizerCore.LinkFileList
WriteAuxiliaryFile /Users/admin/builder/spi-builder-workspace/.derivedData/Build/Intermediates.noindex/Appetizer.build/Debug/AppetizerCore.build/Objects-normal/arm64/AppetizerCore-OutputFileMap.json (in target 'AppetizerCore' from project 'Appetizer')
cd /Users/admin/builder/spi-builder-workspace
write-file /Users/admin/builder/spi-builder-workspace/.derivedData/Build/Intermediates.noindex/Appetizer.build/Debug/AppetizerCore.build/Objects-normal/arm64/AppetizerCore-OutputFileMap.json
WriteAuxiliaryFile /Users/admin/builder/spi-builder-workspace/.derivedData/Build/Intermediates.noindex/Appetizer.build/Debug/AppetizerCore.build/AppetizerCore.modulemap (in target 'AppetizerCore' from project 'Appetizer')
cd /Users/admin/builder/spi-builder-workspace
write-file /Users/admin/builder/spi-builder-workspace/.derivedData/Build/Intermediates.noindex/Appetizer.build/Debug/AppetizerCore.build/AppetizerCore.modulemap
Copy /Users/admin/builder/spi-builder-workspace/.derivedData/Build/Intermediates.noindex/GeneratedModuleMaps/Basic.modulemap /Users/admin/builder/spi-builder-workspace/.derivedData/Build/Intermediates.noindex/SwiftPM.build/Debug/Basic.build/Basic.modulemap (in target 'Basic' from project 'SwiftPM')
cd /Users/admin/builder/spi-builder-workspace/.dependencies/checkouts/swift-package-manager
builtin-copy -exclude .DS_Store -exclude CVS -exclude .svn -exclude .git -exclude .hg -resolve-src-symlinks /Users/admin/builder/spi-builder-workspace/.derivedData/Build/Intermediates.noindex/SwiftPM.build/Debug/Basic.build/Basic.modulemap /Users/admin/builder/spi-builder-workspace/.derivedData/Build/Intermediates.noindex/GeneratedModuleMaps
WriteAuxiliaryFile /Users/admin/builder/spi-builder-workspace/.derivedData/Build/Intermediates.noindex/Appetizer.build/Debug/AppetizerCore.build/AppetizerCore.DependencyStaticMetadataFileList (in target 'AppetizerCore' from project 'Appetizer')
cd /Users/admin/builder/spi-builder-workspace
write-file /Users/admin/builder/spi-builder-workspace/.derivedData/Build/Intermediates.noindex/Appetizer.build/Debug/AppetizerCore.build/AppetizerCore.DependencyStaticMetadataFileList
WriteAuxiliaryFile /Users/admin/builder/spi-builder-workspace/.derivedData/Build/Intermediates.noindex/Appetizer.build/Debug/AppetizerCore.build/AppetizerCore.DependencyMetadataFileList (in target 'AppetizerCore' from project 'Appetizer')
cd /Users/admin/builder/spi-builder-workspace
write-file /Users/admin/builder/spi-builder-workspace/.derivedData/Build/Intermediates.noindex/Appetizer.build/Debug/AppetizerCore.build/AppetizerCore.DependencyMetadataFileList
Copy /Users/admin/builder/spi-builder-workspace/.derivedData/Build/Intermediates.noindex/GeneratedModuleMaps/AppetizerCore.modulemap /Users/admin/builder/spi-builder-workspace/.derivedData/Build/Intermediates.noindex/Appetizer.build/Debug/AppetizerCore.build/AppetizerCore.modulemap (in target 'AppetizerCore' from project 'Appetizer')
cd /Users/admin/builder/spi-builder-workspace
builtin-copy -exclude .DS_Store -exclude CVS -exclude .svn -exclude .git -exclude .hg -resolve-src-symlinks /Users/admin/builder/spi-builder-workspace/.derivedData/Build/Intermediates.noindex/Appetizer.build/Debug/AppetizerCore.build/AppetizerCore.modulemap /Users/admin/builder/spi-builder-workspace/.derivedData/Build/Intermediates.noindex/GeneratedModuleMaps
SwiftDriver SPMLibc normal arm64 com.apple.xcode.tools.swift.compiler (in target 'SPMLibc' from project 'SwiftPM')
cd /Users/admin/builder/spi-builder-workspace/.swiftpm/xcode
builtin-SwiftDriver -- /Applications/Xcode-16.3.0.app/Contents/Developer/Toolchains/XcodeDefault.xctoolchain/usr/bin/swiftc -module-name SPMLibc -Onone -enforce-exclusivity\=checked @/Users/admin/builder/spi-builder-workspace/.derivedData/Build/Intermediates.noindex/SwiftPM.build/Debug/SPMLibc.build/Objects-normal/arm64/SPMLibc.SwiftFileList -DSWIFT_PACKAGE -DDEBUG -stats-output-dir .stats -strict-concurrency\=complete -enable-upcoming-feature StrictConcurrency -enable-upcoming-feature DisableOutwardActorInference -enable-upcoming-feature GlobalActorIsolatedTypesUsability -enable-upcoming-feature InferSendableFromCaptures -plugin-path /Applications/Xcode-16.3.0.app/Contents/Developer/Toolchains/XcodeDefault.xctoolchain/usr/lib/swift/host/plugins/testing -enable-experimental-feature DebugDescriptionMacro -sdk /Applications/Xcode-16.3.0.app/Contents/Developer/Platforms/MacOSX.platform/Developer/SDKs/MacOSX15.4.sdk -target arm64-apple-macos10.13 -g -module-cache-path /Users/admin/builder/spi-builder-workspace/.derivedData/ModuleCache.noindex -Xfrontend -serialize-debugging-options -profile-coverage-mapping -profile-generate -enable-testing -suppress-warnings -index-store-path /Users/admin/builder/spi-builder-workspace/.derivedData/Index.noindex/DataStore -swift-version 4.2 -I /Users/admin/builder/spi-builder-workspace/.derivedData/Build/Products/Debug -I /Applications/Xcode-16.3.0.app/Contents/Developer/Platforms/MacOSX.platform/Developer/usr/lib -F /Users/admin/builder/spi-builder-workspace/.derivedData/Build/Products/Debug/PackageFrameworks -F /Users/admin/builder/spi-builder-workspace/.derivedData/Build/Products/Debug -F /Applications/Xcode-16.3.0.app/Contents/Developer/Platforms/MacOSX.platform/Developer/Library/Frameworks -parse-as-library -c -j10 -enable-batch-mode -incremental -Xcc -ivfsstatcache -Xcc /Users/admin/builder/spi-builder-workspace/.derivedData/SDKStatCaches.noindex/macosx15.4-24E241-8287b8f5db97e746a1562fbca0c9d29b.sdkstatcache -output-file-map /Users/admin/builder/spi-builder-workspace/.derivedData/Build/Intermediates.noindex/SwiftPM.build/Debug/SPMLibc.build/Objects-normal/arm64/SPMLibc-OutputFileMap.json -use-frontend-parseable-output -save-temps -no-color-diagnostics -serialize-diagnostics -emit-dependencies -emit-module -emit-module-path /Users/admin/builder/spi-builder-workspace/.derivedData/Build/Intermediates.noindex/SwiftPM.build/Debug/SPMLibc.build/Objects-normal/arm64/SPMLibc.swiftmodule -validate-clang-modules-once -clang-build-session-file /Users/admin/builder/spi-builder-workspace/.derivedData/ModuleCache.noindex/Session.modulevalidation -Xcc -I/Users/admin/builder/spi-builder-workspace/.derivedData/Build/Intermediates.noindex/SwiftPM.build/Debug/SPMLibc.build/swift-overrides.hmap -emit-const-values -Xfrontend -const-gather-protocols-file -Xfrontend /Users/admin/builder/spi-builder-workspace/.derivedData/Build/Intermediates.noindex/SwiftPM.build/Debug/SPMLibc.build/Objects-normal/arm64/SPMLibc_const_extract_protocols.json -Xcc -I/Users/admin/builder/spi-builder-workspace/.dependencies/checkouts/swift-package-manager/Sources/clibc/include -Xcc -I/Users/admin/builder/spi-builder-workspace/.derivedData/Build/Products/Debug/include -Xcc -I/Users/admin/builder/spi-builder-workspace/.derivedData/Build/Intermediates.noindex/SwiftPM.build/Debug/SPMLibc.build/DerivedSources-normal/arm64 -Xcc -I/Users/admin/builder/spi-builder-workspace/.derivedData/Build/Intermediates.noindex/SwiftPM.build/Debug/SPMLibc.build/DerivedSources/arm64 -Xcc -I/Users/admin/builder/spi-builder-workspace/.derivedData/Build/Intermediates.noindex/SwiftPM.build/Debug/SPMLibc.build/DerivedSources -Xcc -DSWIFT_PACKAGE -Xcc -DDEBUG\=1 -emit-objc-header -emit-objc-header-path /Users/admin/builder/spi-builder-workspace/.derivedData/Build/Intermediates.noindex/SwiftPM.build/Debug/SPMLibc.build/Objects-normal/arm64/SPMLibc-Swift.h -working-directory /Users/admin/builder/spi-builder-workspace/.swiftpm/xcode -experimental-emit-module-separately -disable-cmo
SwiftDriver HexColor normal arm64 com.apple.xcode.tools.swift.compiler (in target 'HexColor' from project 'HexColor')
cd /Users/admin/builder/spi-builder-workspace/.swiftpm/xcode
builtin-SwiftDriver -- /Applications/Xcode-16.3.0.app/Contents/Developer/Toolchains/XcodeDefault.xctoolchain/usr/bin/swiftc -module-name HexColor -Onone -enforce-exclusivity\=checked @/Users/admin/builder/spi-builder-workspace/.derivedData/Build/Intermediates.noindex/HexColor.build/Debug/HexColor.build/Objects-normal/arm64/HexColor.SwiftFileList -DSWIFT_PACKAGE -DDEBUG -stats-output-dir .stats -strict-concurrency\=complete -enable-upcoming-feature StrictConcurrency -enable-upcoming-feature DisableOutwardActorInference -enable-upcoming-feature GlobalActorIsolatedTypesUsability -enable-upcoming-feature InferSendableFromCaptures -plugin-path /Applications/Xcode-16.3.0.app/Contents/Developer/Toolchains/XcodeDefault.xctoolchain/usr/lib/swift/host/plugins/testing -enable-experimental-feature DebugDescriptionMacro -sdk /Applications/Xcode-16.3.0.app/Contents/Developer/Platforms/MacOSX.platform/Developer/SDKs/MacOSX15.4.sdk -target arm64-apple-macos10.13 -g -module-cache-path /Users/admin/builder/spi-builder-workspace/.derivedData/ModuleCache.noindex -Xfrontend -serialize-debugging-options -profile-coverage-mapping -profile-generate -enable-testing -suppress-warnings -index-store-path /Users/admin/builder/spi-builder-workspace/.derivedData/Index.noindex/DataStore -swift-version 5 -I /Users/admin/builder/spi-builder-workspace/.derivedData/Build/Products/Debug -I /Applications/Xcode-16.3.0.app/Contents/Developer/Platforms/MacOSX.platform/Developer/usr/lib -F /Users/admin/builder/spi-builder-workspace/.derivedData/Build/Products/Debug -F /Applications/Xcode-16.3.0.app/Contents/Developer/Platforms/MacOSX.platform/Developer/Library/Frameworks -parse-as-library -c -j10 -enable-batch-mode -incremental -Xcc -ivfsstatcache -Xcc /Users/admin/builder/spi-builder-workspace/.derivedData/SDKStatCaches.noindex/macosx15.4-24E241-8287b8f5db97e746a1562fbca0c9d29b.sdkstatcache -output-file-map /Users/admin/builder/spi-builder-workspace/.derivedData/Build/Intermediates.noindex/HexColor.build/Debug/HexColor.build/Objects-normal/arm64/HexColor-OutputFileMap.json -use-frontend-parseable-output -save-temps -no-color-diagnostics -serialize-diagnostics -emit-dependencies -emit-module -emit-module-path /Users/admin/builder/spi-builder-workspace/.derivedData/Build/Intermediates.noindex/HexColor.build/Debug/HexColor.build/Objects-normal/arm64/HexColor.swiftmodule -validate-clang-modules-once -clang-build-session-file /Users/admin/builder/spi-builder-workspace/.derivedData/ModuleCache.noindex/Session.modulevalidation -Xcc -I/Users/admin/builder/spi-builder-workspace/.derivedData/Build/Intermediates.noindex/HexColor.build/Debug/HexColor.build/swift-overrides.hmap -emit-const-values -Xfrontend -const-gather-protocols-file -Xfrontend /Users/admin/builder/spi-builder-workspace/.derivedData/Build/Intermediates.noindex/HexColor.build/Debug/HexColor.build/Objects-normal/arm64/HexColor_const_extract_protocols.json -Xcc -I/Users/admin/builder/spi-builder-workspace/.derivedData/Build/Products/Debug/include -Xcc -I/Users/admin/builder/spi-builder-workspace/.derivedData/Build/Intermediates.noindex/HexColor.build/Debug/HexColor.build/DerivedSources-normal/arm64 -Xcc -I/Users/admin/builder/spi-builder-workspace/.derivedData/Build/Intermediates.noindex/HexColor.build/Debug/HexColor.build/DerivedSources/arm64 -Xcc -I/Users/admin/builder/spi-builder-workspace/.derivedData/Build/Intermediates.noindex/HexColor.build/Debug/HexColor.build/DerivedSources -Xcc -DSWIFT_PACKAGE -Xcc -DDEBUG\=1 -emit-objc-header -emit-objc-header-path /Users/admin/builder/spi-builder-workspace/.derivedData/Build/Intermediates.noindex/HexColor.build/Debug/HexColor.build/Objects-normal/arm64/HexColor-Swift.h -working-directory /Users/admin/builder/spi-builder-workspace/.swiftpm/xcode -experimental-emit-module-separately -disable-cmo
SwiftDriver AppetizerCore normal arm64 com.apple.xcode.tools.swift.compiler (in target 'AppetizerCore' from project 'Appetizer')
cd /Users/admin/builder/spi-builder-workspace/.swiftpm/xcode
builtin-SwiftDriver -- /Applications/Xcode-16.3.0.app/Contents/Developer/Toolchains/XcodeDefault.xctoolchain/usr/bin/swiftc -module-name AppetizerCore -Onone -enforce-exclusivity\=checked @/Users/admin/builder/spi-builder-workspace/.derivedData/Build/Intermediates.noindex/Appetizer.build/Debug/AppetizerCore.build/Objects-normal/arm64/AppetizerCore.SwiftFileList -DSWIFT_PACKAGE -DDEBUG -stats-output-dir .stats -strict-concurrency\=complete -enable-upcoming-feature StrictConcurrency -enable-upcoming-feature DisableOutwardActorInference -enable-upcoming-feature GlobalActorIsolatedTypesUsability -enable-upcoming-feature InferSendableFromCaptures -plugin-path /Applications/Xcode-16.3.0.app/Contents/Developer/Toolchains/XcodeDefault.xctoolchain/usr/lib/swift/host/plugins/testing -enable-experimental-feature DebugDescriptionMacro -sdk /Applications/Xcode-16.3.0.app/Contents/Developer/Platforms/MacOSX.platform/Developer/SDKs/MacOSX15.4.sdk -target arm64-apple-macos10.13 -g -module-cache-path /Users/admin/builder/spi-builder-workspace/.derivedData/ModuleCache.noindex -Xfrontend -serialize-debugging-options -profile-coverage-mapping -profile-generate -enable-testing -index-store-path /Users/admin/builder/spi-builder-workspace/.derivedData/Index.noindex/DataStore -swift-version 5 -I /Users/admin/builder/spi-builder-workspace/.derivedData/Build/Products/Debug -I /Applications/Xcode-16.3.0.app/Contents/Developer/Platforms/MacOSX.platform/Developer/usr/lib -F /Users/admin/builder/spi-builder-workspace/.derivedData/Build/Products/Debug -F /Applications/Xcode-16.3.0.app/Contents/Developer/Platforms/MacOSX.platform/Developer/Library/Frameworks -parse-as-library -c -j10 -enable-batch-mode -incremental -Xcc -ivfsstatcache -Xcc /Users/admin/builder/spi-builder-workspace/.derivedData/SDKStatCaches.noindex/macosx15.4-24E241-8287b8f5db97e746a1562fbca0c9d29b.sdkstatcache -output-file-map /Users/admin/builder/spi-builder-workspace/.derivedData/Build/Intermediates.noindex/Appetizer.build/Debug/AppetizerCore.build/Objects-normal/arm64/AppetizerCore-OutputFileMap.json -use-frontend-parseable-output -save-temps -no-color-diagnostics -serialize-diagnostics -emit-dependencies -emit-module -emit-module-path /Users/admin/builder/spi-builder-workspace/.derivedData/Build/Intermediates.noindex/Appetizer.build/Debug/AppetizerCore.build/Objects-normal/arm64/AppetizerCore.swiftmodule -validate-clang-modules-once -clang-build-session-file /Users/admin/builder/spi-builder-workspace/.derivedData/ModuleCache.noindex/Session.modulevalidation -Xcc -I/Users/admin/builder/spi-builder-workspace/.derivedData/Build/Intermediates.noindex/Appetizer.build/Debug/AppetizerCore.build/swift-overrides.hmap -emit-const-values -Xfrontend -const-gather-protocols-file -Xfrontend /Users/admin/builder/spi-builder-workspace/.derivedData/Build/Intermediates.noindex/Appetizer.build/Debug/AppetizerCore.build/Objects-normal/arm64/AppetizerCore_const_extract_protocols.json -Xcc -I/Users/admin/builder/spi-builder-workspace/.derivedData/Build/Products/Debug/include -Xcc -I/Users/admin/builder/spi-builder-workspace/.derivedData/Build/Intermediates.noindex/Appetizer.build/Debug/AppetizerCore.build/DerivedSources-normal/arm64 -Xcc -I/Users/admin/builder/spi-builder-workspace/.derivedData/Build/Intermediates.noindex/Appetizer.build/Debug/AppetizerCore.build/DerivedSources/arm64 -Xcc -I/Users/admin/builder/spi-builder-workspace/.derivedData/Build/Intermediates.noindex/Appetizer.build/Debug/AppetizerCore.build/DerivedSources -Xcc -DSWIFT_PACKAGE -Xcc -DDEBUG\=1 -emit-objc-header -emit-objc-header-path /Users/admin/builder/spi-builder-workspace/.derivedData/Build/Intermediates.noindex/Appetizer.build/Debug/AppetizerCore.build/Objects-normal/arm64/AppetizerCore-Swift.h -working-directory /Users/admin/builder/spi-builder-workspace/.swiftpm/xcode -experimental-emit-module-separately -disable-cmo
ScanDependencies /Users/admin/builder/spi-builder-workspace/.derivedData/Build/Intermediates.noindex/SwiftPM.build/Debug/clibc.build/Objects-normal/arm64/libc.o /Users/admin/builder/spi-builder-workspace/.dependencies/checkouts/swift-package-manager/Sources/clibc/libc.c normal arm64 c com.apple.compilers.llvm.clang.1_0.compiler (in target 'clibc' from project 'SwiftPM')
cd /Users/admin/builder/spi-builder-workspace/.swiftpm/xcode
Using response file: /Users/admin/builder/spi-builder-workspace/.derivedData/Build/Intermediates.noindex/SwiftPM.build/Debug/clibc.build/Objects-normal/arm64/7187679823f38a2a940e0043cdf9d637-common-args.resp
builtin-ScanDependencies -o /Users/admin/builder/spi-builder-workspace/.derivedData/Build/Intermediates.noindex/SwiftPM.build/Debug/clibc.build/Objects-normal/arm64/libc.o.scan -- /Applications/Xcode-16.3.0.app/Contents/Developer/Toolchains/XcodeDefault.xctoolchain/usr/bin/clang -x c -ivfsstatcache /Users/admin/builder/spi-builder-workspace/.derivedData/SDKStatCaches.noindex/macosx15.4-24E241-8287b8f5db97e746a1562fbca0c9d29b.sdkstatcache -fmessage-length\=0 -fdiagnostics-show-note-include-stack -fmacro-backtrace-limit\=0 -fno-color-diagnostics -fmodules-prune-interval\=86400 -fmodules-prune-after\=345600 -fbuild-session-file\=/Users/admin/builder/spi-builder-workspace/.derivedData/ModuleCache.noindex/Session.modulevalidation -fmodules-validate-once-per-build-session -Wnon-modular-include-in-framework-module -Werror\=non-modular-include-in-framework-module -Wno-trigraphs -Wno-missing-field-initializers -Wno-missing-prototypes -Wno-return-type -Wno-missing-braces -Wparentheses -Wswitch -Wno-unused-function -Wno-unused-label -Wno-unused-parameter -Wno-unused-variable -Wunused-value -Wno-empty-body -Wno-uninitialized -Wno-unknown-pragmas -w -Wno-shadow -Wno-four-char-constants -Wno-conversion -Wno-constant-conversion -Wno-int-conversion -Wno-bool-conversion -Wno-enum-conversion -Wno-float-conversion -Wno-non-literal-null-conversion -Wno-objc-literal-conversion -Wshorten-64-to-32 -Wpointer-sign -Wno-newline-eof -Wno-implicit-fallthrough -fstrict-aliasing -Wdeprecated-declarations -Wno-sign-conversion -Wno-infinite-recursion -Wno-comma -Wno-block-capture-autoreleasing -Wno-strict-prototypes -Wno-semicolon-before-method-body -index-store-path /Users/admin/builder/spi-builder-workspace/.derivedData/Index.noindex/DataStore @/Users/admin/builder/spi-builder-workspace/.derivedData/Build/Intermediates.noindex/SwiftPM.build/Debug/clibc.build/Objects-normal/arm64/7187679823f38a2a940e0043cdf9d637-common-args.resp -MMD -MT dependencies -MF /Users/admin/builder/spi-builder-workspace/.derivedData/Build/Intermediates.noindex/SwiftPM.build/Debug/clibc.build/Objects-normal/arm64/libc.d --serialize-diagnostics /Users/admin/builder/spi-builder-workspace/.derivedData/Build/Intermediates.noindex/SwiftPM.build/Debug/clibc.build/Objects-normal/arm64/libc.dia -c /Users/admin/builder/spi-builder-workspace/.dependencies/checkouts/swift-package-manager/Sources/clibc/libc.c -o /Users/admin/builder/spi-builder-workspace/.derivedData/Build/Intermediates.noindex/SwiftPM.build/Debug/clibc.build/Objects-normal/arm64/libc.o -index-unit-output-path /SwiftPM.build/Debug/clibc.build/Objects-normal/arm64/libc.o
CompileC /Users/admin/builder/spi-builder-workspace/.derivedData/Build/Intermediates.noindex/SwiftPM.build/Debug/clibc.build/Objects-normal/arm64/libc.o /Users/admin/builder/spi-builder-workspace/.dependencies/checkouts/swift-package-manager/Sources/clibc/libc.c normal arm64 c com.apple.compilers.llvm.clang.1_0.compiler (in target 'clibc' from project 'SwiftPM')
cd /Users/admin/builder/spi-builder-workspace/.swiftpm/xcode
Using response file: /Users/admin/builder/spi-builder-workspace/.derivedData/Build/Intermediates.noindex/SwiftPM.build/Debug/clibc.build/Objects-normal/arm64/7187679823f38a2a940e0043cdf9d637-common-args.resp
/Applications/Xcode-16.3.0.app/Contents/Developer/Toolchains/XcodeDefault.xctoolchain/usr/bin/clang -x c -ivfsstatcache /Users/admin/builder/spi-builder-workspace/.derivedData/SDKStatCaches.noindex/macosx15.4-24E241-8287b8f5db97e746a1562fbca0c9d29b.sdkstatcache -fmessage-length\=0 -fdiagnostics-show-note-include-stack -fmacro-backtrace-limit\=0 -fno-color-diagnostics -fmodules-prune-interval\=86400 -fmodules-prune-after\=345600 -fbuild-session-file\=/Users/admin/builder/spi-builder-workspace/.derivedData/ModuleCache.noindex/Session.modulevalidation -fmodules-validate-once-per-build-session -Wnon-modular-include-in-framework-module -Werror\=non-modular-include-in-framework-module -Wno-trigraphs -Wno-missing-field-initializers -Wno-missing-prototypes -Wno-return-type -Wno-missing-braces -Wparentheses -Wswitch -Wno-unused-function -Wno-unused-label -Wno-unused-parameter -Wno-unused-variable -Wunused-value -Wno-empty-body -Wno-uninitialized -Wno-unknown-pragmas -w -Wno-shadow -Wno-four-char-constants -Wno-conversion -Wno-constant-conversion -Wno-int-conversion -Wno-bool-conversion -Wno-enum-conversion -Wno-float-conversion -Wno-non-literal-null-conversion -Wno-objc-literal-conversion -Wshorten-64-to-32 -Wpointer-sign -Wno-newline-eof -Wno-implicit-fallthrough -fstrict-aliasing -Wdeprecated-declarations -Wno-sign-conversion -Wno-infinite-recursion -Wno-comma -Wno-block-capture-autoreleasing -Wno-strict-prototypes -Wno-semicolon-before-method-body -index-store-path /Users/admin/builder/spi-builder-workspace/.derivedData/Index.noindex/DataStore @/Users/admin/builder/spi-builder-workspace/.derivedData/Build/Intermediates.noindex/SwiftPM.build/Debug/clibc.build/Objects-normal/arm64/7187679823f38a2a940e0043cdf9d637-common-args.resp -MMD -MT dependencies -MF /Users/admin/builder/spi-builder-workspace/.derivedData/Build/Intermediates.noindex/SwiftPM.build/Debug/clibc.build/Objects-normal/arm64/libc.d --serialize-diagnostics /Users/admin/builder/spi-builder-workspace/.derivedData/Build/Intermediates.noindex/SwiftPM.build/Debug/clibc.build/Objects-normal/arm64/libc.dia -c /Users/admin/builder/spi-builder-workspace/.dependencies/checkouts/swift-package-manager/Sources/clibc/libc.c -o /Users/admin/builder/spi-builder-workspace/.derivedData/Build/Intermediates.noindex/SwiftPM.build/Debug/clibc.build/Objects-normal/arm64/libc.o -index-unit-output-path /SwiftPM.build/Debug/clibc.build/Objects-normal/arm64/libc.o
SwiftEmitModule normal arm64 Emitting\ module\ for\ SPMLibc (in target 'SPMLibc' from project 'SwiftPM')
SwiftCompile normal arm64 /Users/admin/builder/spi-builder-workspace/.dependencies/checkouts/swift-package-manager/Sources/SPMLibc/libc.swift (in target 'SPMLibc' from project 'SwiftPM')
cd /Users/admin/builder/spi-builder-workspace/.swiftpm/xcode
SwiftEmitModule normal arm64 Emitting\ module\ for\ AppetizerCore (in target 'AppetizerCore' from project 'Appetizer')
SwiftCompile normal arm64 /Users/admin/builder/spi-builder-workspace/Sources/AppetizerCore/NSImageExtension.swift (in target 'AppetizerCore' from project 'Appetizer')
cd /Users/admin/builder/spi-builder-workspace/.swiftpm/xcode
SwiftEmitModule normal arm64 Emitting\ module\ for\ HexColor (in target 'HexColor' from project 'HexColor')
SwiftCompile normal arm64 /Users/admin/builder/spi-builder-workspace/.dependencies/checkouts/HexColor/Sources/HexColor/HexColor.swift (in target 'HexColor' from project 'HexColor')
cd /Users/admin/builder/spi-builder-workspace/.swiftpm/xcode
SwiftCompile normal arm64 Compiling\ libc.swift /Users/admin/builder/spi-builder-workspace/.dependencies/checkouts/swift-package-manager/Sources/SPMLibc/libc.swift (in target 'SPMLibc' from project 'SwiftPM')
SwiftCompile normal arm64 /Users/admin/builder/spi-builder-workspace/.dependencies/checkouts/swift-package-manager/Sources/SPMLibc/libc.swift (in target 'SPMLibc' from project 'SwiftPM')
cd /Users/admin/builder/spi-builder-workspace/.swiftpm/xcode
SwiftCompile normal arm64 Compiling\ HexColor.swift /Users/admin/builder/spi-builder-workspace/.dependencies/checkouts/HexColor/Sources/HexColor/HexColor.swift (in target 'HexColor' from project 'HexColor')
SwiftCompile normal arm64 /Users/admin/builder/spi-builder-workspace/.dependencies/checkouts/HexColor/Sources/HexColor/HexColor.swift (in target 'HexColor' from project 'HexColor')
cd /Users/admin/builder/spi-builder-workspace/.swiftpm/xcode
SwiftCompile normal arm64 Compiling\ NSImageExtension.swift /Users/admin/builder/spi-builder-workspace/Sources/AppetizerCore/NSImageExtension.swift (in target 'AppetizerCore' from project 'Appetizer')
SwiftCompile normal arm64 /Users/admin/builder/spi-builder-workspace/Sources/AppetizerCore/NSImageExtension.swift (in target 'AppetizerCore' from project 'Appetizer')
cd /Users/admin/builder/spi-builder-workspace/.swiftpm/xcode
Ld /Users/admin/builder/spi-builder-workspace/.derivedData/Build/Products/Debug/clibc.o normal (in target 'clibc' from project 'SwiftPM')
cd /Users/admin/builder/spi-builder-workspace/.dependencies/checkouts/swift-package-manager
/Applications/Xcode-16.3.0.app/Contents/Developer/Toolchains/XcodeDefault.xctoolchain/usr/bin/clang -Xlinker -reproducible -target arm64-apple-macos10.13 -r -isysroot /Applications/Xcode-16.3.0.app/Contents/Developer/Platforms/MacOSX.platform/Developer/SDKs/MacOSX15.4.sdk -O0 -w -L/Users/admin/builder/spi-builder-workspace/.derivedData/Build/Intermediates.noindex/EagerLinkingTBDs/Debug -L/Users/admin/builder/spi-builder-workspace/.derivedData/Build/Products/Debug -L/Applications/Xcode-16.3.0.app/Contents/Developer/Platforms/MacOSX.platform/Developer/usr/lib -F/Users/admin/builder/spi-builder-workspace/.derivedData/Build/Intermediates.noindex/EagerLinkingTBDs/Debug -F/Users/admin/builder/spi-builder-workspace/.derivedData/Build/Products/Debug -iframework /Applications/Xcode-16.3.0.app/Contents/Developer/Platforms/MacOSX.platform/Developer/Library/Frameworks -filelist /Users/admin/builder/spi-builder-workspace/.derivedData/Build/Intermediates.noindex/SwiftPM.build/Debug/clibc.build/Objects-normal/arm64/clibc.LinkFileList -nostdlib -Xlinker -object_path_lto -Xlinker /Users/admin/builder/spi-builder-workspace/.derivedData/Build/Intermediates.noindex/SwiftPM.build/Debug/clibc.build/Objects-normal/arm64/clibc_lto.o -rdynamic -Xlinker -no_deduplicate -Xlinker -debug_variant -Xlinker -dependency_info -Xlinker /Users/admin/builder/spi-builder-workspace/.derivedData/Build/Intermediates.noindex/SwiftPM.build/Debug/clibc.build/Objects-normal/arm64/clibc_dependency_info.dat -o /Users/admin/builder/spi-builder-workspace/.derivedData/Build/Products/Debug/clibc.o
RegisterExecutionPolicyException /Users/admin/builder/spi-builder-workspace/.derivedData/Build/Products/Debug/clibc.o (in target 'clibc' from project 'SwiftPM')
cd /Users/admin/builder/spi-builder-workspace/.dependencies/checkouts/swift-package-manager
builtin-RegisterExecutionPolicyException /Users/admin/builder/spi-builder-workspace/.derivedData/Build/Products/Debug/clibc.o
SwiftDriverJobDiscovery normal arm64 Emitting module for SPMLibc (in target 'SPMLibc' from project 'SwiftPM')
SwiftDriver\ Compilation\ Requirements SPMLibc normal arm64 com.apple.xcode.tools.swift.compiler (in target 'SPMLibc' from project 'SwiftPM')
cd /Users/admin/builder/spi-builder-workspace/.swiftpm/xcode
builtin-Swift-Compilation-Requirements -- /Applications/Xcode-16.3.0.app/Contents/Developer/Toolchains/XcodeDefault.xctoolchain/usr/bin/swiftc -module-name SPMLibc -Onone -enforce-exclusivity\=checked @/Users/admin/builder/spi-builder-workspace/.derivedData/Build/Intermediates.noindex/SwiftPM.build/Debug/SPMLibc.build/Objects-normal/arm64/SPMLibc.SwiftFileList -DSWIFT_PACKAGE -DDEBUG -stats-output-dir .stats -strict-concurrency\=complete -enable-upcoming-feature StrictConcurrency -enable-upcoming-feature DisableOutwardActorInference -enable-upcoming-feature GlobalActorIsolatedTypesUsability -enable-upcoming-feature InferSendableFromCaptures -plugin-path /Applications/Xcode-16.3.0.app/Contents/Developer/Toolchains/XcodeDefault.xctoolchain/usr/lib/swift/host/plugins/testing -enable-experimental-feature DebugDescriptionMacro -sdk /Applications/Xcode-16.3.0.app/Contents/Developer/Platforms/MacOSX.platform/Developer/SDKs/MacOSX15.4.sdk -target arm64-apple-macos10.13 -g -module-cache-path /Users/admin/builder/spi-builder-workspace/.derivedData/ModuleCache.noindex -Xfrontend -serialize-debugging-options -profile-coverage-mapping -profile-generate -enable-testing -suppress-warnings -index-store-path /Users/admin/builder/spi-builder-workspace/.derivedData/Index.noindex/DataStore -swift-version 4.2 -I /Users/admin/builder/spi-builder-workspace/.derivedData/Build/Products/Debug -I /Applications/Xcode-16.3.0.app/Contents/Developer/Platforms/MacOSX.platform/Developer/usr/lib -F /Users/admin/builder/spi-builder-workspace/.derivedData/Build/Products/Debug/PackageFrameworks -F /Users/admin/builder/spi-builder-workspace/.derivedData/Build/Products/Debug -F /Applications/Xcode-16.3.0.app/Contents/Developer/Platforms/MacOSX.platform/Developer/Library/Frameworks -parse-as-library -c -j10 -enable-batch-mode -incremental -Xcc -ivfsstatcache -Xcc /Users/admin/builder/spi-builder-workspace/.derivedData/SDKStatCaches.noindex/macosx15.4-24E241-8287b8f5db97e746a1562fbca0c9d29b.sdkstatcache -output-file-map /Users/admin/builder/spi-builder-workspace/.derivedData/Build/Intermediates.noindex/SwiftPM.build/Debug/SPMLibc.build/Objects-normal/arm64/SPMLibc-OutputFileMap.json -use-frontend-parseable-output -save-temps -no-color-diagnostics -serialize-diagnostics -emit-dependencies -emit-module -emit-module-path /Users/admin/builder/spi-builder-workspace/.derivedData/Build/Intermediates.noindex/SwiftPM.build/Debug/SPMLibc.build/Objects-normal/arm64/SPMLibc.swiftmodule -validate-clang-modules-once -clang-build-session-file /Users/admin/builder/spi-builder-workspace/.derivedData/ModuleCache.noindex/Session.modulevalidation -Xcc -I/Users/admin/builder/spi-builder-workspace/.derivedData/Build/Intermediates.noindex/SwiftPM.build/Debug/SPMLibc.build/swift-overrides.hmap -emit-const-values -Xfrontend -const-gather-protocols-file -Xfrontend /Users/admin/builder/spi-builder-workspace/.derivedData/Build/Intermediates.noindex/SwiftPM.build/Debug/SPMLibc.build/Objects-normal/arm64/SPMLibc_const_extract_protocols.json -Xcc -I/Users/admin/builder/spi-builder-workspace/.dependencies/checkouts/swift-package-manager/Sources/clibc/include -Xcc -I/Users/admin/builder/spi-builder-workspace/.derivedData/Build/Products/Debug/include -Xcc -I/Users/admin/builder/spi-builder-workspace/.derivedData/Build/Intermediates.noindex/SwiftPM.build/Debug/SPMLibc.build/DerivedSources-normal/arm64 -Xcc -I/Users/admin/builder/spi-builder-workspace/.derivedData/Build/Intermediates.noindex/SwiftPM.build/Debug/SPMLibc.build/DerivedSources/arm64 -Xcc -I/Users/admin/builder/spi-builder-workspace/.derivedData/Build/Intermediates.noindex/SwiftPM.build/Debug/SPMLibc.build/DerivedSources -Xcc -DSWIFT_PACKAGE -Xcc -DDEBUG\=1 -emit-objc-header -emit-objc-header-path /Users/admin/builder/spi-builder-workspace/.derivedData/Build/Intermediates.noindex/SwiftPM.build/Debug/SPMLibc.build/Objects-normal/arm64/SPMLibc-Swift.h -working-directory /Users/admin/builder/spi-builder-workspace/.swiftpm/xcode -experimental-emit-module-separately -disable-cmo
SwiftMergeGeneratedHeaders /Users/admin/builder/spi-builder-workspace/.derivedData/Build/Intermediates.noindex/GeneratedModuleMaps/SPMLibc-Swift.h /Users/admin/builder/spi-builder-workspace/.derivedData/Build/Intermediates.noindex/SwiftPM.build/Debug/SPMLibc.build/Objects-normal/arm64/SPMLibc-Swift.h (in target 'SPMLibc' from project 'SwiftPM')
cd /Users/admin/builder/spi-builder-workspace/.dependencies/checkouts/swift-package-manager
builtin-swiftHeaderTool -arch arm64 /Users/admin/builder/spi-builder-workspace/.derivedData/Build/Intermediates.noindex/SwiftPM.build/Debug/SPMLibc.build/Objects-normal/arm64/SPMLibc-Swift.h -o /Users/admin/builder/spi-builder-workspace/.derivedData/Build/Intermediates.noindex/GeneratedModuleMaps/SPMLibc-Swift.h
Copy /Users/admin/builder/spi-builder-workspace/.derivedData/Build/Products/Debug/SPMLibc.swiftmodule/arm64-apple-macos.abi.json /Users/admin/builder/spi-builder-workspace/.derivedData/Build/Intermediates.noindex/SwiftPM.build/Debug/SPMLibc.build/Objects-normal/arm64/SPMLibc.abi.json (in target 'SPMLibc' from project 'SwiftPM')
cd /Users/admin/builder/spi-builder-workspace/.dependencies/checkouts/swift-package-manager
builtin-copy -exclude .DS_Store -exclude CVS -exclude .svn -exclude .git -exclude .hg -resolve-src-symlinks -rename /Users/admin/builder/spi-builder-workspace/.derivedData/Build/Intermediates.noindex/SwiftPM.build/Debug/SPMLibc.build/Objects-normal/arm64/SPMLibc.abi.json /Users/admin/builder/spi-builder-workspace/.derivedData/Build/Products/Debug/SPMLibc.swiftmodule/arm64-apple-macos.abi.json
Copy /Users/admin/builder/spi-builder-workspace/.derivedData/Build/Products/Debug/SPMLibc.swiftmodule/arm64-apple-macos.swiftmodule /Users/admin/builder/spi-builder-workspace/.derivedData/Build/Intermediates.noindex/SwiftPM.build/Debug/SPMLibc.build/Objects-normal/arm64/SPMLibc.swiftmodule (in target 'SPMLibc' from project 'SwiftPM')
cd /Users/admin/builder/spi-builder-workspace/.dependencies/checkouts/swift-package-manager
builtin-copy -exclude .DS_Store -exclude CVS -exclude .svn -exclude .git -exclude .hg -resolve-src-symlinks -rename /Users/admin/builder/spi-builder-workspace/.derivedData/Build/Intermediates.noindex/SwiftPM.build/Debug/SPMLibc.build/Objects-normal/arm64/SPMLibc.swiftmodule /Users/admin/builder/spi-builder-workspace/.derivedData/Build/Products/Debug/SPMLibc.swiftmodule/arm64-apple-macos.swiftmodule
Copy /Users/admin/builder/spi-builder-workspace/.derivedData/Build/Products/Debug/SPMLibc.swiftmodule/arm64-apple-macos.swiftdoc /Users/admin/builder/spi-builder-workspace/.derivedData/Build/Intermediates.noindex/SwiftPM.build/Debug/SPMLibc.build/Objects-normal/arm64/SPMLibc.swiftdoc (in target 'SPMLibc' from project 'SwiftPM')
cd /Users/admin/builder/spi-builder-workspace/.dependencies/checkouts/swift-package-manager
builtin-copy -exclude .DS_Store -exclude CVS -exclude .svn -exclude .git -exclude .hg -resolve-src-symlinks -rename /Users/admin/builder/spi-builder-workspace/.derivedData/Build/Intermediates.noindex/SwiftPM.build/Debug/SPMLibc.build/Objects-normal/arm64/SPMLibc.swiftdoc /Users/admin/builder/spi-builder-workspace/.derivedData/Build/Products/Debug/SPMLibc.swiftmodule/arm64-apple-macos.swiftdoc
Copy /Users/admin/builder/spi-builder-workspace/.derivedData/Build/Products/Debug/SPMLibc.swiftmodule/Project/arm64-apple-macos.swiftsourceinfo /Users/admin/builder/spi-builder-workspace/.derivedData/Build/Intermediates.noindex/SwiftPM.build/Debug/SPMLibc.build/Objects-normal/arm64/SPMLibc.swiftsourceinfo (in target 'SPMLibc' from project 'SwiftPM')
cd /Users/admin/builder/spi-builder-workspace/.dependencies/checkouts/swift-package-manager
builtin-copy -exclude .DS_Store -exclude CVS -exclude .svn -exclude .git -exclude .hg -resolve-src-symlinks -rename /Users/admin/builder/spi-builder-workspace/.derivedData/Build/Intermediates.noindex/SwiftPM.build/Debug/SPMLibc.build/Objects-normal/arm64/SPMLibc.swiftsourceinfo /Users/admin/builder/spi-builder-workspace/.derivedData/Build/Products/Debug/SPMLibc.swiftmodule/Project/arm64-apple-macos.swiftsourceinfo
SwiftDriver POSIX normal arm64 com.apple.xcode.tools.swift.compiler (in target 'POSIX' from project 'SwiftPM')
cd /Users/admin/builder/spi-builder-workspace/.swiftpm/xcode
builtin-SwiftDriver -- /Applications/Xcode-16.3.0.app/Contents/Developer/Toolchains/XcodeDefault.xctoolchain/usr/bin/swiftc -module-name POSIX -Onone -enforce-exclusivity\=checked @/Users/admin/builder/spi-builder-workspace/.derivedData/Build/Intermediates.noindex/SwiftPM.build/Debug/POSIX.build/Objects-normal/arm64/POSIX.SwiftFileList -DSWIFT_PACKAGE -DDEBUG -stats-output-dir .stats -strict-concurrency\=complete -enable-upcoming-feature StrictConcurrency -enable-upcoming-feature DisableOutwardActorInference -enable-upcoming-feature GlobalActorIsolatedTypesUsability -enable-upcoming-feature InferSendableFromCaptures -plugin-path /Applications/Xcode-16.3.0.app/Contents/Developer/Toolchains/XcodeDefault.xctoolchain/usr/lib/swift/host/plugins/testing -enable-experimental-feature DebugDescriptionMacro -sdk /Applications/Xcode-16.3.0.app/Contents/Developer/Platforms/MacOSX.platform/Developer/SDKs/MacOSX15.4.sdk -target arm64-apple-macos10.13 -g -module-cache-path /Users/admin/builder/spi-builder-workspace/.derivedData/ModuleCache.noindex -Xfrontend -serialize-debugging-options -profile-coverage-mapping -profile-generate -enable-testing -suppress-warnings -index-store-path /Users/admin/builder/spi-builder-workspace/.derivedData/Index.noindex/DataStore -swift-version 4.2 -I /Users/admin/builder/spi-builder-workspace/.derivedData/Build/Products/Debug -I /Applications/Xcode-16.3.0.app/Contents/Developer/Platforms/MacOSX.platform/Developer/usr/lib -F /Users/admin/builder/spi-builder-workspace/.derivedData/Build/Products/Debug/PackageFrameworks -F /Users/admin/builder/spi-builder-workspace/.derivedData/Build/Products/Debug/PackageFrameworks -F /Users/admin/builder/spi-builder-workspace/.derivedData/Build/Products/Debug -F /Applications/Xcode-16.3.0.app/Contents/Developer/Platforms/MacOSX.platform/Developer/Library/Frameworks -c -j10 -enable-batch-mode -incremental -Xcc -ivfsstatcache -Xcc /Users/admin/builder/spi-builder-workspace/.derivedData/SDKStatCaches.noindex/macosx15.4-24E241-8287b8f5db97e746a1562fbca0c9d29b.sdkstatcache -output-file-map /Users/admin/builder/spi-builder-workspace/.derivedData/Build/Intermediates.noindex/SwiftPM.build/Debug/POSIX.build/Objects-normal/arm64/POSIX-OutputFileMap.json -use-frontend-parseable-output -save-temps -no-color-diagnostics -serialize-diagnostics -emit-dependencies -emit-module -emit-module-path /Users/admin/builder/spi-builder-workspace/.derivedData/Build/Intermediates.noindex/SwiftPM.build/Debug/POSIX.build/Objects-normal/arm64/POSIX.swiftmodule -validate-clang-modules-once -clang-build-session-file /Users/admin/builder/spi-builder-workspace/.derivedData/ModuleCache.noindex/Session.modulevalidation -Xcc -I/Users/admin/builder/spi-builder-workspace/.derivedData/Build/Intermediates.noindex/SwiftPM.build/Debug/POSIX.build/swift-overrides.hmap -emit-const-values -Xfrontend -const-gather-protocols-file -Xfrontend /Users/admin/builder/spi-builder-workspace/.derivedData/Build/Intermediates.noindex/SwiftPM.build/Debug/POSIX.build/Objects-normal/arm64/POSIX_const_extract_protocols.json -Xcc -I/Users/admin/builder/spi-builder-workspace/.dependencies/checkouts/swift-package-manager/Sources/clibc/include -Xcc -I/Users/admin/builder/spi-builder-workspace/.derivedData/Build/Products/Debug/include -Xcc -I/Users/admin/builder/spi-builder-workspace/.derivedData/Build/Intermediates.noindex/SwiftPM.build/Debug/POSIX.build/DerivedSources-normal/arm64 -Xcc -I/Users/admin/builder/spi-builder-workspace/.derivedData/Build/Intermediates.noindex/SwiftPM.build/Debug/POSIX.build/DerivedSources/arm64 -Xcc -I/Users/admin/builder/spi-builder-workspace/.derivedData/Build/Intermediates.noindex/SwiftPM.build/Debug/POSIX.build/DerivedSources -Xcc -DSWIFT_PACKAGE -Xcc -DDEBUG\=1 -emit-objc-header -emit-objc-header-path /Users/admin/builder/spi-builder-workspace/.derivedData/Build/Intermediates.noindex/SwiftPM.build/Debug/POSIX.build/Objects-normal/arm64/POSIX-Swift.h -working-directory /Users/admin/builder/spi-builder-workspace/.swiftpm/xcode -experimental-emit-module-separately -disable-cmo
SwiftCompile normal arm64 Compiling\ exit.swift /Users/admin/builder/spi-builder-workspace/.dependencies/checkouts/swift-package-manager/Sources/POSIX/exit.swift (in target 'POSIX' from project 'SwiftPM')
SwiftCompile normal arm64 /Users/admin/builder/spi-builder-workspace/.dependencies/checkouts/swift-package-manager/Sources/POSIX/exit.swift (in target 'POSIX' from project 'SwiftPM')
cd /Users/admin/builder/spi-builder-workspace/.swiftpm/xcode
SwiftCompile normal arm64 Compiling\ getcwd.swift /Users/admin/builder/spi-builder-workspace/.dependencies/checkouts/swift-package-manager/Sources/POSIX/getcwd.swift (in target 'POSIX' from project 'SwiftPM')
SwiftCompile normal arm64 /Users/admin/builder/spi-builder-workspace/.dependencies/checkouts/swift-package-manager/Sources/POSIX/getcwd.swift (in target 'POSIX' from project 'SwiftPM')
cd /Users/admin/builder/spi-builder-workspace/.swiftpm/xcode
SwiftCompile normal arm64 Compiling\ isatty.swift /Users/admin/builder/spi-builder-workspace/.dependencies/checkouts/swift-package-manager/Sources/POSIX/isatty.swift (in target 'POSIX' from project 'SwiftPM')
SwiftCompile normal arm64 /Users/admin/builder/spi-builder-workspace/.dependencies/checkouts/swift-package-manager/Sources/POSIX/isatty.swift (in target 'POSIX' from project 'SwiftPM')
cd /Users/admin/builder/spi-builder-workspace/.swiftpm/xcode
SwiftCompile normal arm64 Compiling\ Error.swift,\ chdir.swift /Users/admin/builder/spi-builder-workspace/.dependencies/checkouts/swift-package-manager/Sources/POSIX/Error.swift /Users/admin/builder/spi-builder-workspace/.dependencies/checkouts/swift-package-manager/Sources/POSIX/chdir.swift (in target 'POSIX' from project 'SwiftPM')
SwiftCompile normal arm64 /Users/admin/builder/spi-builder-workspace/.dependencies/checkouts/swift-package-manager/Sources/POSIX/Error.swift (in target 'POSIX' from project 'SwiftPM')
cd /Users/admin/builder/spi-builder-workspace/.swiftpm/xcode
SwiftCompile normal arm64 /Users/admin/builder/spi-builder-workspace/.dependencies/checkouts/swift-package-manager/Sources/POSIX/chdir.swift (in target 'POSIX' from project 'SwiftPM')
cd /Users/admin/builder/spi-builder-workspace/.swiftpm/xcode
SwiftCompile normal arm64 Compiling\ env.swift /Users/admin/builder/spi-builder-workspace/.dependencies/checkouts/swift-package-manager/Sources/POSIX/env.swift (in target 'POSIX' from project 'SwiftPM')
SwiftCompile normal arm64 /Users/admin/builder/spi-builder-workspace/.dependencies/checkouts/swift-package-manager/Sources/POSIX/env.swift (in target 'POSIX' from project 'SwiftPM')
cd /Users/admin/builder/spi-builder-workspace/.swiftpm/xcode
SwiftEmitModule normal arm64 Emitting\ module\ for\ POSIX (in target 'POSIX' from project 'SwiftPM')
EmitSwiftModule normal arm64 (in target 'POSIX' from project 'SwiftPM')
cd /Users/admin/builder/spi-builder-workspace/.swiftpm/xcode
SwiftDriverJobDiscovery normal arm64 Compiling exit.swift (in target 'POSIX' from project 'SwiftPM')
SwiftCompile normal arm64 Compiling\ realpath.swift /Users/admin/builder/spi-builder-workspace/.dependencies/checkouts/swift-package-manager/Sources/POSIX/realpath.swift (in target 'POSIX' from project 'SwiftPM')
SwiftCompile normal arm64 /Users/admin/builder/spi-builder-workspace/.dependencies/checkouts/swift-package-manager/Sources/POSIX/realpath.swift (in target 'POSIX' from project 'SwiftPM')
cd /Users/admin/builder/spi-builder-workspace/.swiftpm/xcode
SwiftDriverJobDiscovery normal arm64 Compiling getcwd.swift (in target 'POSIX' from project 'SwiftPM')
SwiftCompile normal arm64 Compiling\ usleep.swift /Users/admin/builder/spi-builder-workspace/.dependencies/checkouts/swift-package-manager/Sources/POSIX/usleep.swift (in target 'POSIX' from project 'SwiftPM')
SwiftCompile normal arm64 /Users/admin/builder/spi-builder-workspace/.dependencies/checkouts/swift-package-manager/Sources/POSIX/usleep.swift (in target 'POSIX' from project 'SwiftPM')
cd /Users/admin/builder/spi-builder-workspace/.swiftpm/xcode
SwiftDriverJobDiscovery normal arm64 Compiling isatty.swift (in target 'POSIX' from project 'SwiftPM')
SwiftCompile normal arm64 Compiling\ readdir.swift /Users/admin/builder/spi-builder-workspace/.dependencies/checkouts/swift-package-manager/Sources/POSIX/readdir.swift (in target 'POSIX' from project 'SwiftPM')
SwiftCompile normal arm64 /Users/admin/builder/spi-builder-workspace/.dependencies/checkouts/swift-package-manager/Sources/POSIX/readdir.swift (in target 'POSIX' from project 'SwiftPM')
cd /Users/admin/builder/spi-builder-workspace/.swiftpm/xcode
SwiftDriverJobDiscovery normal arm64 Compiling env.swift (in target 'POSIX' from project 'SwiftPM')
SwiftCompile normal arm64 Compiling\ rename.swift /Users/admin/builder/spi-builder-workspace/.dependencies/checkouts/swift-package-manager/Sources/POSIX/rename.swift (in target 'POSIX' from project 'SwiftPM')
SwiftCompile normal arm64 /Users/admin/builder/spi-builder-workspace/.dependencies/checkouts/swift-package-manager/Sources/POSIX/rename.swift (in target 'POSIX' from project 'SwiftPM')
cd /Users/admin/builder/spi-builder-workspace/.swiftpm/xcode
SwiftDriverJobDiscovery normal arm64 Compiling Error.swift, chdir.swift (in target 'POSIX' from project 'SwiftPM')
SwiftCompile normal arm64 Compiling\ stat.swift /Users/admin/builder/spi-builder-workspace/.dependencies/checkouts/swift-package-manager/Sources/POSIX/stat.swift (in target 'POSIX' from project 'SwiftPM')
SwiftCompile normal arm64 /Users/admin/builder/spi-builder-workspace/.dependencies/checkouts/swift-package-manager/Sources/POSIX/stat.swift (in target 'POSIX' from project 'SwiftPM')
cd /Users/admin/builder/spi-builder-workspace/.swiftpm/xcode
SwiftDriverJobDiscovery normal arm64 Emitting module for POSIX (in target 'POSIX' from project 'SwiftPM')
SwiftDriver\ Compilation\ Requirements POSIX normal arm64 com.apple.xcode.tools.swift.compiler (in target 'POSIX' from project 'SwiftPM')
cd /Users/admin/builder/spi-builder-workspace/.swiftpm/xcode
builtin-Swift-Compilation-Requirements -- /Applications/Xcode-16.3.0.app/Contents/Developer/Toolchains/XcodeDefault.xctoolchain/usr/bin/swiftc -module-name POSIX -Onone -enforce-exclusivity\=checked @/Users/admin/builder/spi-builder-workspace/.derivedData/Build/Intermediates.noindex/SwiftPM.build/Debug/POSIX.build/Objects-normal/arm64/POSIX.SwiftFileList -DSWIFT_PACKAGE -DDEBUG -stats-output-dir .stats -strict-concurrency\=complete -enable-upcoming-feature StrictConcurrency -enable-upcoming-feature DisableOutwardActorInference -enable-upcoming-feature GlobalActorIsolatedTypesUsability -enable-upcoming-feature InferSendableFromCaptures -plugin-path /Applications/Xcode-16.3.0.app/Contents/Developer/Toolchains/XcodeDefault.xctoolchain/usr/lib/swift/host/plugins/testing -enable-experimental-feature DebugDescriptionMacro -sdk /Applications/Xcode-16.3.0.app/Contents/Developer/Platforms/MacOSX.platform/Developer/SDKs/MacOSX15.4.sdk -target arm64-apple-macos10.13 -g -module-cache-path /Users/admin/builder/spi-builder-workspace/.derivedData/ModuleCache.noindex -Xfrontend -serialize-debugging-options -profile-coverage-mapping -profile-generate -enable-testing -suppress-warnings -index-store-path /Users/admin/builder/spi-builder-workspace/.derivedData/Index.noindex/DataStore -swift-version 4.2 -I /Users/admin/builder/spi-builder-workspace/.derivedData/Build/Products/Debug -I /Applications/Xcode-16.3.0.app/Contents/Developer/Platforms/MacOSX.platform/Developer/usr/lib -F /Users/admin/builder/spi-builder-workspace/.derivedData/Build/Products/Debug/PackageFrameworks -F /Users/admin/builder/spi-builder-workspace/.derivedData/Build/Products/Debug/PackageFrameworks -F /Users/admin/builder/spi-builder-workspace/.derivedData/Build/Products/Debug -F /Applications/Xcode-16.3.0.app/Contents/Developer/Platforms/MacOSX.platform/Developer/Library/Frameworks -c -j10 -enable-batch-mode -incremental -Xcc -ivfsstatcache -Xcc /Users/admin/builder/spi-builder-workspace/.derivedData/SDKStatCaches.noindex/macosx15.4-24E241-8287b8f5db97e746a1562fbca0c9d29b.sdkstatcache -output-file-map /Users/admin/builder/spi-builder-workspace/.derivedData/Build/Intermediates.noindex/SwiftPM.build/Debug/POSIX.build/Objects-normal/arm64/POSIX-OutputFileMap.json -use-frontend-parseable-output -save-temps -no-color-diagnostics -serialize-diagnostics -emit-dependencies -emit-module -emit-module-path /Users/admin/builder/spi-builder-workspace/.derivedData/Build/Intermediates.noindex/SwiftPM.build/Debug/POSIX.build/Objects-normal/arm64/POSIX.swiftmodule -validate-clang-modules-once -clang-build-session-file /Users/admin/builder/spi-builder-workspace/.derivedData/ModuleCache.noindex/Session.modulevalidation -Xcc -I/Users/admin/builder/spi-builder-workspace/.derivedData/Build/Intermediates.noindex/SwiftPM.build/Debug/POSIX.build/swift-overrides.hmap -emit-const-values -Xfrontend -const-gather-protocols-file -Xfrontend /Users/admin/builder/spi-builder-workspace/.derivedData/Build/Intermediates.noindex/SwiftPM.build/Debug/POSIX.build/Objects-normal/arm64/POSIX_const_extract_protocols.json -Xcc -I/Users/admin/builder/spi-builder-workspace/.dependencies/checkouts/swift-package-manager/Sources/clibc/include -Xcc -I/Users/admin/builder/spi-builder-workspace/.derivedData/Build/Products/Debug/include -Xcc -I/Users/admin/builder/spi-builder-workspace/.derivedData/Build/Intermediates.noindex/SwiftPM.build/Debug/POSIX.build/DerivedSources-normal/arm64 -Xcc -I/Users/admin/builder/spi-builder-workspace/.derivedData/Build/Intermediates.noindex/SwiftPM.build/Debug/POSIX.build/DerivedSources/arm64 -Xcc -I/Users/admin/builder/spi-builder-workspace/.derivedData/Build/Intermediates.noindex/SwiftPM.build/Debug/POSIX.build/DerivedSources -Xcc -DSWIFT_PACKAGE -Xcc -DDEBUG\=1 -emit-objc-header -emit-objc-header-path /Users/admin/builder/spi-builder-workspace/.derivedData/Build/Intermediates.noindex/SwiftPM.build/Debug/POSIX.build/Objects-normal/arm64/POSIX-Swift.h -working-directory /Users/admin/builder/spi-builder-workspace/.swiftpm/xcode -experimental-emit-module-separately -disable-cmo
SwiftDriverJobDiscovery normal arm64 Compiling usleep.swift (in target 'POSIX' from project 'SwiftPM')
SwiftMergeGeneratedHeaders /Users/admin/builder/spi-builder-workspace/.derivedData/Build/Intermediates.noindex/GeneratedModuleMaps/POSIX-Swift.h /Users/admin/builder/spi-builder-workspace/.derivedData/Build/Intermediates.noindex/SwiftPM.build/Debug/POSIX.build/Objects-normal/arm64/POSIX-Swift.h (in target 'POSIX' from project 'SwiftPM')
cd /Users/admin/builder/spi-builder-workspace/.dependencies/checkouts/swift-package-manager
builtin-swiftHeaderTool -arch arm64 /Users/admin/builder/spi-builder-workspace/.derivedData/Build/Intermediates.noindex/SwiftPM.build/Debug/POSIX.build/Objects-normal/arm64/POSIX-Swift.h -o /Users/admin/builder/spi-builder-workspace/.derivedData/Build/Intermediates.noindex/GeneratedModuleMaps/POSIX-Swift.h
Copy /Users/admin/builder/spi-builder-workspace/.derivedData/Build/Products/Debug/POSIX.swiftmodule/arm64-apple-macos.swiftmodule /Users/admin/builder/spi-builder-workspace/.derivedData/Build/Intermediates.noindex/SwiftPM.build/Debug/POSIX.build/Objects-normal/arm64/POSIX.swiftmodule (in target 'POSIX' from project 'SwiftPM')
cd /Users/admin/builder/spi-builder-workspace/.dependencies/checkouts/swift-package-manager
builtin-copy -exclude .DS_Store -exclude CVS -exclude .svn -exclude .git -exclude .hg -resolve-src-symlinks -rename /Users/admin/builder/spi-builder-workspace/.derivedData/Build/Intermediates.noindex/SwiftPM.build/Debug/POSIX.build/Objects-normal/arm64/POSIX.swiftmodule /Users/admin/builder/spi-builder-workspace/.derivedData/Build/Products/Debug/POSIX.swiftmodule/arm64-apple-macos.swiftmodule
Copy /Users/admin/builder/spi-builder-workspace/.derivedData/Build/Products/Debug/POSIX.swiftmodule/arm64-apple-macos.swiftdoc /Users/admin/builder/spi-builder-workspace/.derivedData/Build/Intermediates.noindex/SwiftPM.build/Debug/POSIX.build/Objects-normal/arm64/POSIX.swiftdoc (in target 'POSIX' from project 'SwiftPM')
cd /Users/admin/builder/spi-builder-workspace/.dependencies/checkouts/swift-package-manager
builtin-copy -exclude .DS_Store -exclude CVS -exclude .svn -exclude .git -exclude .hg -resolve-src-symlinks -rename /Users/admin/builder/spi-builder-workspace/.derivedData/Build/Intermediates.noindex/SwiftPM.build/Debug/POSIX.build/Objects-normal/arm64/POSIX.swiftdoc /Users/admin/builder/spi-builder-workspace/.derivedData/Build/Products/Debug/POSIX.swiftmodule/arm64-apple-macos.swiftdoc
Copy /Users/admin/builder/spi-builder-workspace/.derivedData/Build/Products/Debug/POSIX.swiftmodule/arm64-apple-macos.abi.json /Users/admin/builder/spi-builder-workspace/.derivedData/Build/Intermediates.noindex/SwiftPM.build/Debug/POSIX.build/Objects-normal/arm64/POSIX.abi.json (in target 'POSIX' from project 'SwiftPM')
cd /Users/admin/builder/spi-builder-workspace/.dependencies/checkouts/swift-package-manager
builtin-copy -exclude .DS_Store -exclude CVS -exclude .svn -exclude .git -exclude .hg -resolve-src-symlinks -rename /Users/admin/builder/spi-builder-workspace/.derivedData/Build/Intermediates.noindex/SwiftPM.build/Debug/POSIX.build/Objects-normal/arm64/POSIX.abi.json /Users/admin/builder/spi-builder-workspace/.derivedData/Build/Products/Debug/POSIX.swiftmodule/arm64-apple-macos.abi.json
Copy /Users/admin/builder/spi-builder-workspace/.derivedData/Build/Products/Debug/POSIX.swiftmodule/Project/arm64-apple-macos.swiftsourceinfo /Users/admin/builder/spi-builder-workspace/.derivedData/Build/Intermediates.noindex/SwiftPM.build/Debug/POSIX.build/Objects-normal/arm64/POSIX.swiftsourceinfo (in target 'POSIX' from project 'SwiftPM')
cd /Users/admin/builder/spi-builder-workspace/.dependencies/checkouts/swift-package-manager
builtin-copy -exclude .DS_Store -exclude CVS -exclude .svn -exclude .git -exclude .hg -resolve-src-symlinks -rename /Users/admin/builder/spi-builder-workspace/.derivedData/Build/Intermediates.noindex/SwiftPM.build/Debug/POSIX.build/Objects-normal/arm64/POSIX.swiftsourceinfo /Users/admin/builder/spi-builder-workspace/.derivedData/Build/Products/Debug/POSIX.swiftmodule/Project/arm64-apple-macos.swiftsourceinfo
SwiftDriver Basic normal arm64 com.apple.xcode.tools.swift.compiler (in target 'Basic' from project 'SwiftPM')
cd /Users/admin/builder/spi-builder-workspace/.swiftpm/xcode
builtin-SwiftDriver -- /Applications/Xcode-16.3.0.app/Contents/Developer/Toolchains/XcodeDefault.xctoolchain/usr/bin/swiftc -module-name Basic -Onone -enforce-exclusivity\=checked @/Users/admin/builder/spi-builder-workspace/.derivedData/Build/Intermediates.noindex/SwiftPM.build/Debug/Basic.build/Objects-normal/arm64/Basic.SwiftFileList -DSWIFT_PACKAGE -DDEBUG -stats-output-dir .stats -strict-concurrency\=complete -enable-upcoming-feature StrictConcurrency -enable-upcoming-feature DisableOutwardActorInference -enable-upcoming-feature GlobalActorIsolatedTypesUsability -enable-upcoming-feature InferSendableFromCaptures -plugin-path /Applications/Xcode-16.3.0.app/Contents/Developer/Toolchains/XcodeDefault.xctoolchain/usr/lib/swift/host/plugins/testing -enable-experimental-feature DebugDescriptionMacro -sdk /Applications/Xcode-16.3.0.app/Contents/Developer/Platforms/MacOSX.platform/Developer/SDKs/MacOSX15.4.sdk -target arm64-apple-macos10.13 -g -module-cache-path /Users/admin/builder/spi-builder-workspace/.derivedData/ModuleCache.noindex -Xfrontend -serialize-debugging-options -profile-coverage-mapping -profile-generate -enable-testing -suppress-warnings -index-store-path /Users/admin/builder/spi-builder-workspace/.derivedData/Index.noindex/DataStore -swift-version 4.2 -I /Users/admin/builder/spi-builder-workspace/.derivedData/Build/Products/Debug -I /Applications/Xcode-16.3.0.app/Contents/Developer/Platforms/MacOSX.platform/Developer/usr/lib -F /Users/admin/builder/spi-builder-workspace/.derivedData/Build/Products/Debug/PackageFrameworks -F /Users/admin/builder/spi-builder-workspace/.derivedData/Build/Products/Debug/PackageFrameworks -F /Users/admin/builder/spi-builder-workspace/.derivedData/Build/Products/Debug/PackageFrameworks -F /Users/admin/builder/spi-builder-workspace/.derivedData/Build/Products/Debug -F /Applications/Xcode-16.3.0.app/Contents/Developer/Platforms/MacOSX.platform/Developer/Library/Frameworks -c -j10 -enable-batch-mode -incremental -Xcc -ivfsstatcache -Xcc /Users/admin/builder/spi-builder-workspace/.derivedData/SDKStatCaches.noindex/macosx15.4-24E241-8287b8f5db97e746a1562fbca0c9d29b.sdkstatcache -output-file-map /Users/admin/builder/spi-builder-workspace/.derivedData/Build/Intermediates.noindex/SwiftPM.build/Debug/Basic.build/Objects-normal/arm64/Basic-OutputFileMap.json -use-frontend-parseable-output -save-temps -no-color-diagnostics -serialize-diagnostics -emit-dependencies -emit-module -emit-module-path /Users/admin/builder/spi-builder-workspace/.derivedData/Build/Intermediates.noindex/SwiftPM.build/Debug/Basic.build/Objects-normal/arm64/Basic.swiftmodule -validate-clang-modules-once -clang-build-session-file /Users/admin/builder/spi-builder-workspace/.derivedData/ModuleCache.noindex/Session.modulevalidation -Xcc -I/Users/admin/builder/spi-builder-workspace/.derivedData/Build/Intermediates.noindex/SwiftPM.build/Debug/Basic.build/swift-overrides.hmap -emit-const-values -Xfrontend -const-gather-protocols-file -Xfrontend /Users/admin/builder/spi-builder-workspace/.derivedData/Build/Intermediates.noindex/SwiftPM.build/Debug/Basic.build/Objects-normal/arm64/Basic_const_extract_protocols.json -Xcc -I/Users/admin/builder/spi-builder-workspace/.dependencies/checkouts/swift-package-manager/Sources/clibc/include -Xcc -I/Users/admin/builder/spi-builder-workspace/.derivedData/Build/Products/Debug/include -Xcc -I/Users/admin/builder/spi-builder-workspace/.derivedData/Build/Intermediates.noindex/SwiftPM.build/Debug/Basic.build/DerivedSources-normal/arm64 -Xcc -I/Users/admin/builder/spi-builder-workspace/.derivedData/Build/Intermediates.noindex/SwiftPM.build/Debug/Basic.build/DerivedSources/arm64 -Xcc -I/Users/admin/builder/spi-builder-workspace/.derivedData/Build/Intermediates.noindex/SwiftPM.build/Debug/Basic.build/DerivedSources -Xcc -DSWIFT_PACKAGE -Xcc -DDEBUG\=1 -emit-objc-header -emit-objc-header-path /Users/admin/builder/spi-builder-workspace/.derivedData/Build/Intermediates.noindex/SwiftPM.build/Debug/Basic.build/Objects-normal/arm64/Basic-Swift.h -working-directory /Users/admin/builder/spi-builder-workspace/.swiftpm/xcode -experimental-emit-module-separately -disable-cmo
SwiftDriverJobDiscovery normal arm64 Compiling realpath.swift (in target 'POSIX' from project 'SwiftPM')
SwiftDriverJobDiscovery normal arm64 Compiling rename.swift (in target 'POSIX' from project 'SwiftPM')
SwiftEmitModule normal arm64 Emitting\ module\ for\ Basic (in target 'Basic' from project 'SwiftPM')
EmitSwiftModule normal arm64 (in target 'Basic' from project 'SwiftPM')
cd /Users/admin/builder/spi-builder-workspace/.swiftpm/xcode
SwiftCompile normal arm64 Compiling\ PathShims.swift,\ Process.swift,\ ProcessSet.swift,\ RegEx.swift /Users/admin/builder/spi-builder-workspace/.dependencies/checkouts/swift-package-manager/Sources/Basic/PathShims.swift /Users/admin/builder/spi-builder-workspace/.dependencies/checkouts/swift-package-manager/Sources/Basic/Process.swift /Users/admin/builder/spi-builder-workspace/.dependencies/checkouts/swift-package-manager/Sources/Basic/ProcessSet.swift /Users/admin/builder/spi-builder-workspace/.dependencies/checkouts/swift-package-manager/Sources/Basic/RegEx.swift (in target 'Basic' from project 'SwiftPM')
SwiftCompile normal arm64 /Users/admin/builder/spi-builder-workspace/.dependencies/checkouts/swift-package-manager/Sources/Basic/PathShims.swift (in target 'Basic' from project 'SwiftPM')
cd /Users/admin/builder/spi-builder-workspace/.swiftpm/xcode
SwiftCompile normal arm64 /Users/admin/builder/spi-builder-workspace/.dependencies/checkouts/swift-package-manager/Sources/Basic/Process.swift (in target 'Basic' from project 'SwiftPM')
cd /Users/admin/builder/spi-builder-workspace/.swiftpm/xcode
SwiftCompile normal arm64 /Users/admin/builder/spi-builder-workspace/.dependencies/checkouts/swift-package-manager/Sources/Basic/ProcessSet.swift (in target 'Basic' from project 'SwiftPM')
cd /Users/admin/builder/spi-builder-workspace/.swiftpm/xcode
SwiftCompile normal arm64 /Users/admin/builder/spi-builder-workspace/.dependencies/checkouts/swift-package-manager/Sources/Basic/RegEx.swift (in target 'Basic' from project 'SwiftPM')
cd /Users/admin/builder/spi-builder-workspace/.swiftpm/xcode
SwiftCompile normal arm64 Compiling\ Result.swift,\ SHA256.swift,\ SortedArray.swift,\ StringConversions.swift /Users/admin/builder/spi-builder-workspace/.dependencies/checkouts/swift-package-manager/Sources/Basic/Result.swift /Users/admin/builder/spi-builder-workspace/.dependencies/checkouts/swift-package-manager/Sources/Basic/SHA256.swift /Users/admin/builder/spi-builder-workspace/.dependencies/checkouts/swift-package-manager/Sources/Basic/SortedArray.swift /Users/admin/builder/spi-builder-workspace/.dependencies/checkouts/swift-package-manager/Sources/Basic/StringConversions.swift (in target 'Basic' from project 'SwiftPM')
SwiftCompile normal arm64 /Users/admin/builder/spi-builder-workspace/.dependencies/checkouts/swift-package-manager/Sources/Basic/Result.swift (in target 'Basic' from project 'SwiftPM')
cd /Users/admin/builder/spi-builder-workspace/.swiftpm/xcode
SwiftCompile normal arm64 /Users/admin/builder/spi-builder-workspace/.dependencies/checkouts/swift-package-manager/Sources/Basic/SHA256.swift (in target 'Basic' from project 'SwiftPM')
cd /Users/admin/builder/spi-builder-workspace/.swiftpm/xcode
SwiftCompile normal arm64 /Users/admin/builder/spi-builder-workspace/.dependencies/checkouts/swift-package-manager/Sources/Basic/SortedArray.swift (in target 'Basic' from project 'SwiftPM')
cd /Users/admin/builder/spi-builder-workspace/.swiftpm/xcode
SwiftCompile normal arm64 /Users/admin/builder/spi-builder-workspace/.dependencies/checkouts/swift-package-manager/Sources/Basic/StringConversions.swift (in target 'Basic' from project 'SwiftPM')
cd /Users/admin/builder/spi-builder-workspace/.swiftpm/xcode
SwiftCompile normal arm64 Compiling\ OrderedDictionary.swift,\ OrderedSet.swift,\ OutputByteStream.swift,\ Path.swift /Users/admin/builder/spi-builder-workspace/.dependencies/checkouts/swift-package-manager/Sources/Basic/OrderedDictionary.swift /Users/admin/builder/spi-builder-workspace/.dependencies/checkouts/swift-package-manager/Sources/Basic/OrderedSet.swift /Users/admin/builder/spi-builder-workspace/.dependencies/checkouts/swift-package-manager/Sources/Basic/OutputByteStream.swift /Users/admin/builder/spi-builder-workspace/.dependencies/checkouts/swift-package-manager/Sources/Basic/Path.swift (in target 'Basic' from project 'SwiftPM')
SwiftCompile normal arm64 /Users/admin/builder/spi-builder-workspace/.dependencies/checkouts/swift-package-manager/Sources/Basic/OrderedDictionary.swift (in target 'Basic' from project 'SwiftPM')
cd /Users/admin/builder/spi-builder-workspace/.swiftpm/xcode
SwiftCompile normal arm64 /Users/admin/builder/spi-builder-workspace/.dependencies/checkouts/swift-package-manager/Sources/Basic/OrderedSet.swift (in target 'Basic' from project 'SwiftPM')
cd /Users/admin/builder/spi-builder-workspace/.swiftpm/xcode
SwiftCompile normal arm64 /Users/admin/builder/spi-builder-workspace/.dependencies/checkouts/swift-package-manager/Sources/Basic/OutputByteStream.swift (in target 'Basic' from project 'SwiftPM')
cd /Users/admin/builder/spi-builder-workspace/.swiftpm/xcode
SwiftCompile normal arm64 /Users/admin/builder/spi-builder-workspace/.dependencies/checkouts/swift-package-manager/Sources/Basic/Path.swift (in target 'Basic' from project 'SwiftPM')
cd /Users/admin/builder/spi-builder-workspace/.swiftpm/xcode
SwiftDriverJobDiscovery normal arm64 Compiling stat.swift (in target 'POSIX' from project 'SwiftPM')
SwiftCompile normal arm64 Compiling\ KeyedPair.swift,\ LazyCache.swift,\ Lock.swift,\ ObjectIdentifierProtocol.swift /Users/admin/builder/spi-builder-workspace/.dependencies/checkouts/swift-package-manager/Sources/Basic/KeyedPair.swift /Users/admin/builder/spi-builder-workspace/.dependencies/checkouts/swift-package-manager/Sources/Basic/LazyCache.swift /Users/admin/builder/spi-builder-workspace/.dependencies/checkouts/swift-package-manager/Sources/Basic/Lock.swift /Users/admin/builder/spi-builder-workspace/.dependencies/checkouts/swift-package-manager/Sources/Basic/ObjectIdentifierProtocol.swift (in target 'Basic' from project 'SwiftPM')
SwiftCompile normal arm64 /Users/admin/builder/spi-builder-workspace/.dependencies/checkouts/swift-package-manager/Sources/Basic/KeyedPair.swift (in target 'Basic' from project 'SwiftPM')
cd /Users/admin/builder/spi-builder-workspace/.swiftpm/xcode
SwiftCompile normal arm64 /Users/admin/builder/spi-builder-workspace/.dependencies/checkouts/swift-package-manager/Sources/Basic/LazyCache.swift (in target 'Basic' from project 'SwiftPM')
cd /Users/admin/builder/spi-builder-workspace/.swiftpm/xcode
SwiftCompile normal arm64 /Users/admin/builder/spi-builder-workspace/.dependencies/checkouts/swift-package-manager/Sources/Basic/Lock.swift (in target 'Basic' from project 'SwiftPM')
cd /Users/admin/builder/spi-builder-workspace/.swiftpm/xcode
SwiftCompile normal arm64 /Users/admin/builder/spi-builder-workspace/.dependencies/checkouts/swift-package-manager/Sources/Basic/ObjectIdentifierProtocol.swift (in target 'Basic' from project 'SwiftPM')
cd /Users/admin/builder/spi-builder-workspace/.swiftpm/xcode
SwiftDriverJobDiscovery normal arm64 Compiling libc.swift (in target 'SPMLibc' from project 'SwiftPM')
SwiftDriver\ Compilation SPMLibc normal arm64 com.apple.xcode.tools.swift.compiler (in target 'SPMLibc' from project 'SwiftPM')
cd /Users/admin/builder/spi-builder-workspace/.swiftpm/xcode
builtin-Swift-Compilation -- /Applications/Xcode-16.3.0.app/Contents/Developer/Toolchains/XcodeDefault.xctoolchain/usr/bin/swiftc -module-name SPMLibc -Onone -enforce-exclusivity\=checked @/Users/admin/builder/spi-builder-workspace/.derivedData/Build/Intermediates.noindex/SwiftPM.build/Debug/SPMLibc.build/Objects-normal/arm64/SPMLibc.SwiftFileList -DSWIFT_PACKAGE -DDEBUG -stats-output-dir .stats -strict-concurrency\=complete -enable-upcoming-feature StrictConcurrency -enable-upcoming-feature DisableOutwardActorInference -enable-upcoming-feature GlobalActorIsolatedTypesUsability -enable-upcoming-feature InferSendableFromCaptures -plugin-path /Applications/Xcode-16.3.0.app/Contents/Developer/Toolchains/XcodeDefault.xctoolchain/usr/lib/swift/host/plugins/testing -enable-experimental-feature DebugDescriptionMacro -sdk /Applications/Xcode-16.3.0.app/Contents/Developer/Platforms/MacOSX.platform/Developer/SDKs/MacOSX15.4.sdk -target arm64-apple-macos10.13 -g -module-cache-path /Users/admin/builder/spi-builder-workspace/.derivedData/ModuleCache.noindex -Xfrontend -serialize-debugging-options -profile-coverage-mapping -profile-generate -enable-testing -suppress-warnings -index-store-path /Users/admin/builder/spi-builder-workspace/.derivedData/Index.noindex/DataStore -swift-version 4.2 -I /Users/admin/builder/spi-builder-workspace/.derivedData/Build/Products/Debug -I /Applications/Xcode-16.3.0.app/Contents/Developer/Platforms/MacOSX.platform/Developer/usr/lib -F /Users/admin/builder/spi-builder-workspace/.derivedData/Build/Products/Debug/PackageFrameworks -F /Users/admin/builder/spi-builder-workspace/.derivedData/Build/Products/Debug -F /Applications/Xcode-16.3.0.app/Contents/Developer/Platforms/MacOSX.platform/Developer/Library/Frameworks -parse-as-library -c -j10 -enable-batch-mode -incremental -Xcc -ivfsstatcache -Xcc /Users/admin/builder/spi-builder-workspace/.derivedData/SDKStatCaches.noindex/macosx15.4-24E241-8287b8f5db97e746a1562fbca0c9d29b.sdkstatcache -output-file-map /Users/admin/builder/spi-builder-workspace/.derivedData/Build/Intermediates.noindex/SwiftPM.build/Debug/SPMLibc.build/Objects-normal/arm64/SPMLibc-OutputFileMap.json -use-frontend-parseable-output -save-temps -no-color-diagnostics -serialize-diagnostics -emit-dependencies -emit-module -emit-module-path /Users/admin/builder/spi-builder-workspace/.derivedData/Build/Intermediates.noindex/SwiftPM.build/Debug/SPMLibc.build/Objects-normal/arm64/SPMLibc.swiftmodule -validate-clang-modules-once -clang-build-session-file /Users/admin/builder/spi-builder-workspace/.derivedData/ModuleCache.noindex/Session.modulevalidation -Xcc -I/Users/admin/builder/spi-builder-workspace/.derivedData/Build/Intermediates.noindex/SwiftPM.build/Debug/SPMLibc.build/swift-overrides.hmap -emit-const-values -Xfrontend -const-gather-protocols-file -Xfrontend /Users/admin/builder/spi-builder-workspace/.derivedData/Build/Intermediates.noindex/SwiftPM.build/Debug/SPMLibc.build/Objects-normal/arm64/SPMLibc_const_extract_protocols.json -Xcc -I/Users/admin/builder/spi-builder-workspace/.dependencies/checkouts/swift-package-manager/Sources/clibc/include -Xcc -I/Users/admin/builder/spi-builder-workspace/.derivedData/Build/Products/Debug/include -Xcc -I/Users/admin/builder/spi-builder-workspace/.derivedData/Build/Intermediates.noindex/SwiftPM.build/Debug/SPMLibc.build/DerivedSources-normal/arm64 -Xcc -I/Users/admin/builder/spi-builder-workspace/.derivedData/Build/Intermediates.noindex/SwiftPM.build/Debug/SPMLibc.build/DerivedSources/arm64 -Xcc -I/Users/admin/builder/spi-builder-workspace/.derivedData/Build/Intermediates.noindex/SwiftPM.build/Debug/SPMLibc.build/DerivedSources -Xcc -DSWIFT_PACKAGE -Xcc -DDEBUG\=1 -emit-objc-header -emit-objc-header-path /Users/admin/builder/spi-builder-workspace/.derivedData/Build/Intermediates.noindex/SwiftPM.build/Debug/SPMLibc.build/Objects-normal/arm64/SPMLibc-Swift.h -working-directory /Users/admin/builder/spi-builder-workspace/.swiftpm/xcode -experimental-emit-module-separately -disable-cmo
SwiftDriverJobDiscovery normal arm64 Compiling readdir.swift (in target 'POSIX' from project 'SwiftPM')
SwiftCompile normal arm64 Compiling\ Await.swift,\ ByteString.swift,\ CStringArray.swift,\ CacheableSequence.swift /Users/admin/builder/spi-builder-workspace/.dependencies/checkouts/swift-package-manager/Sources/Basic/Await.swift /Users/admin/builder/spi-builder-workspace/.dependencies/checkouts/swift-package-manager/Sources/Basic/ByteString.swift /Users/admin/builder/spi-builder-workspace/.dependencies/checkouts/swift-package-manager/Sources/Basic/CStringArray.swift /Users/admin/builder/spi-builder-workspace/.dependencies/checkouts/swift-package-manager/Sources/Basic/CacheableSequence.swift (in target 'Basic' from project 'SwiftPM')
Failed frontend command:
/Applications/Xcode-16.3.0.app/Contents/Developer/Toolchains/XcodeDefault.xctoolchain/usr/bin/swift-frontend -frontend -c -primary-file /Users/admin/builder/spi-builder-workspace/.dependencies/checkouts/swift-package-manager/Sources/Basic/Await.swift -primary-file /Users/admin/builder/spi-builder-workspace/.dependencies/checkouts/swift-package-manager/Sources/Basic/ByteString.swift -primary-file /Users/admin/builder/spi-builder-workspace/.dependencies/checkouts/swift-package-manager/Sources/Basic/CStringArray.swift -primary-file /Users/admin/builder/spi-builder-workspace/.dependencies/checkouts/swift-package-manager/Sources/Basic/CacheableSequence.swift /Users/admin/builder/spi-builder-workspace/.dependencies/checkouts/swift-package-manager/Sources/Basic/CollectionAlgorithms.swift /Users/admin/builder/spi-builder-workspace/.dependencies/checkouts/swift-package-manager/Sources/Basic/CollectionExtensions.swift /Users/admin/builder/spi-builder-workspace/.dependencies/checkouts/swift-package-manager/Sources/Basic/Condition.swift /Users/admin/builder/spi-builder-workspace/.dependencies/checkouts/swift-package-manager/Sources/Basic/DeltaAlgorithm.swift /Users/admin/builder/spi-builder-workspace/.dependencies/checkouts/swift-package-manager/Sources/Basic/DiagnosticsEngine.swift /Users/admin/builder/spi-builder-workspace/.dependencies/checkouts/swift-package-manager/Sources/Basic/DictionaryExtensions.swift /Users/admin/builder/spi-builder-workspace/.dependencies/checkouts/swift-package-manager/Sources/Basic/DictionaryLiteralExtensions.swift /Users/admin/builder/spi-builder-workspace/.dependencies/checkouts/swift-package-manager/Sources/Basic/EditDistance.swift /Users/admin/builder/spi-builder-workspace/.dependencies/checkouts/swift-package-manager/Sources/Basic/FileSystem.swift /Users/admin/builder/spi-builder-workspace/.dependencies/checkouts/swift-package-manager/Sources/Basic/GraphAlgorithms.swift /Users/admin/builder/spi-builder-workspace/.dependencies/checkouts/swift-package-manager/Sources/Basic/JSON.swift /Users/admin/builder/spi-builder-workspace/.dependencies/checkouts/swift-package-manager/Sources/Basic/JSONMapper.swift /Users/admin/builder/spi-builder-workspace/.dependencies/checkouts/swift-package-manager/Sources/Basic/KeyedPair.swift /Users/admin/builder/spi-builder-workspace/.dependencies/checkouts/swift-package-manager/Sources/Basic/LazyCache.swift /Users/admin/builder/spi-builder-workspace/.dependencies/checkouts/swift-package-manager/Sources/Basic/Lock.swift /Users/admin/builder/spi-builder-workspace/.dependencies/checkouts/swift-package-manager/Sources/Basic/ObjectIdentifierProtocol.swift /Users/admin/builder/spi-builder-workspace/.dependencies/checkouts/swift-package-manager/Sources/Basic/OrderedDictionary.swift /Users/admin/builder/spi-builder-workspace/.dependencies/checkouts/swift-package-manager/Sources/Basic/OrderedSet.swift /Users/admin/builder/spi-builder-workspace/.dependencies/checkouts/swift-package-manager/Sources/Basic/OutputByteStream.swift /Users/admin/builder/spi-builder-workspace/.dependencies/checkouts/swift-package-manager/Sources/Basic/Path.swift /Users/admin/builder/spi-builder-workspace/.dependencies/checkouts/swift-package-manager/Sources/Basic/PathShims.swift /Users/admin/builder/spi-builder-workspace/.dependencies/checkouts/swift-package-manager/Sources/Basic/Process.swift /Users/admin/builder/spi-builder-workspace/.dependencies/checkouts/swift-package-manager/Sources/Basic/ProcessSet.swift /Users/admin/builder/spi-builder-workspace/.dependencies/checkouts/swift-package-manager/Sources/Basic/RegEx.swift /Users/admin/builder/spi-builder-workspace/.dependencies/checkouts/swift-package-manager/Sources/Basic/Result.swift /Users/admin/builder/spi-builder-workspace/.dependencies/checkouts/swift-package-manager/Sources/Basic/SHA256.swift /Users/admin/builder/spi-builder-workspace/.dependencies/checkouts/swift-package-manager/Sources/Basic/SortedArray.swift /Users/admin/builder/spi-builder-workspace/.dependencies/checkouts/swift-package-manager/Sources/Basic/StringConversions.swift /Users/admin/builder/spi-builder-workspace/.dependencies/checkouts/swift-package-manager/Sources/Basic/SynchronizedQueue.swift /Users/admin/builder/spi-builder-workspace/.dependencies/checkouts/swift-package-manager/Sources/Basic/TemporaryFile.swift /Users/admin/builder/spi-builder-workspace/.dependencies/checkouts/swift-package-manager/Sources/Basic/TerminalController.swift /Users/admin/builder/spi-builder-workspace/.dependencies/checkouts/swift-package-manager/Sources/Basic/Thread.swift /Users/admin/builder/spi-builder-workspace/.dependencies/checkouts/swift-package-manager/Sources/Basic/Tuple.swift /Users/admin/builder/spi-builder-workspace/.dependencies/checkouts/swift-package-manager/Sources/Basic/misc.swift -supplementary-output-file-map /Users/admin/builder/spi-builder-workspace/.derivedData/Build/Intermediates.noindex/SwiftPM.build/Debug/Basic.build/Objects-normal/arm64/supplementaryOutputs-1 -target arm64-apple-macos10.13 -Xllvm -aarch64-use-tbi -enable-objc-interop -sdk /Applications/Xcode-16.3.0.app/Contents/Developer/Platforms/MacOSX.platform/Developer/SDKs/MacOSX15.4.sdk -I /Users/admin/builder/spi-builder-workspace/.derivedData/Build/Products/Debug -I /Applications/Xcode-16.3.0.app/Contents/Developer/Platforms/MacOSX.platform/Developer/usr/lib -F /Users/admin/builder/spi-builder-workspace/.derivedData/Build/Products/Debug/PackageFrameworks -F /Users/admin/builder/spi-builder-workspace/.derivedData/Build/Products/Debug/PackageFrameworks -F /Users/admin/builder/spi-builder-workspace/.derivedData/Build/Products/Debug/PackageFrameworks -F /Users/admin/builder/spi-builder-workspace/.derivedData/Build/Products/Debug -F /Applications/Xcode-16.3.0.app/Contents/Developer/Platforms/MacOSX.platform/Developer/Library/Frameworks -no-color-diagnostics -enable-testing -g -debug-info-format\=dwarf -dwarf-version\=4 -module-cache-path /Users/admin/builder/spi-builder-workspace/.derivedData/ModuleCache.noindex -suppress-warnings -profile-generate -profile-coverage-mapping -swift-version 4.2 -enforce-exclusivity\=checked -stats-output-dir /Users/admin/builder/spi-builder-workspace/.swiftpm/xcode/.stats -Onone -D SWIFT_PACKAGE -D DEBUG -serialize-debugging-options -const-gather-protocols-file /Users/admin/builder/spi-builder-workspace/.derivedData/Build/Intermediates.noindex/SwiftPM.build/Debug/Basic.build/Objects-normal/arm64/Basic_const_extract_protocols.json -enable-upcoming-feature StrictConcurrency -enable-upcoming-feature DisableOutwardActorInference -enable-upcoming-feature GlobalActorIsolatedTypesUsability -enable-upcoming-feature InferSendableFromCaptures -enable-experimental-feature DebugDescriptionMacro -strict-concurrency\=complete -empty-abi-descriptor -plugin-path /Applications/Xcode-16.3.0.app/Contents/Developer/Toolchains/XcodeDefault.xctoolchain/usr/lib/swift/host/plugins/testing -validate-clang-modules-once -clang-build-session-file /Users/admin/builder/spi-builder-workspace/.derivedData/ModuleCache.noindex/Session.modulevalidation -Xcc -working-directory -Xcc /Users/admin/builder/spi-builder-workspace/.swiftpm/xcode -resource-dir /Applications/Xcode-16.3.0.app/Contents/Developer/Toolchains/XcodeDefault.xctoolchain/usr/lib/swift -enable-anonymous-context-mangled-names -file-compilation-dir /Users/admin/builder/spi-builder-workspace/.swiftpm/xcode -Xcc -ivfsstatcache -Xcc /Users/admin/builder/spi-builder-workspace/.derivedData/SDKStatCaches.noindex/macosx15.4-24E241-8287b8f5db97e746a1562fbca0c9d29b.sdkstatcache -Xcc -I/Users/admin/builder/spi-builder-workspace/.derivedData/Build/Intermediates.noindex/SwiftPM.build/Debug/Basic.build/swift-overrides.hmap -Xcc -I/Users/admin/builder/spi-builder-workspace/.dependencies/checkouts/swift-package-manager/Sources/clibc/include -Xcc -I/Users/admin/builder/spi-builder-workspace/.derivedData/Build/Products/Debug/include -Xcc -I/Users/admin/builder/spi-builder-workspace/.derivedData/Build/Intermediates.noindex/SwiftPM.build/Debug/Basic.build/DerivedSources-normal/arm64 -Xcc -I/Users/admin/builder/spi-builder-workspace/.derivedData/Build/Intermediates.noindex/SwiftPM.build/Debug/Basic.build/DerivedSources/arm64 -Xcc -I/Users/admin/builder/spi-builder-workspace/.derivedData/Build/Intermediates.noindex/SwiftPM.build/Debug/Basic.build/DerivedSources -Xcc -DSWIFT_PACKAGE -Xcc -DDEBUG\=1 -module-name Basic -frontend-parseable-output -disable-clang-spi -target-sdk-version 15.4 -target-sdk-name macosx15.4 -external-plugin-path /Applications/Xcode-16.3.0.app/Contents/Developer/Platforms/MacOSX.platform/Developer/usr/lib/swift/host/plugins\#/Applications/Xcode-16.3.0.app/Contents/Developer/Platforms/MacOSX.platform/Developer/usr/bin/swift-plugin-server -external-plugin-path /Applications/Xcode-16.3.0.app/Contents/Developer/Platforms/MacOSX.platform/Developer/usr/local/lib/swift/host/plugins\#/Applications/Xcode-16.3.0.app/Contents/Developer/Platforms/MacOSX.platform/Developer/usr/bin/swift-plugin-server -in-process-plugin-server-path /Applications/Xcode-16.3.0.app/Contents/Developer/Toolchains/XcodeDefault.xctoolchain/usr/lib/swift/host/libSwiftInProcPluginServer.dylib -plugin-path /Applications/Xcode-16.3.0.app/Contents/Developer/Toolchains/XcodeDefault.xctoolchain/usr/lib/swift/host/plugins -plugin-path /Applications/Xcode-16.3.0.app/Contents/Developer/Toolchains/XcodeDefault.xctoolchain/usr/local/lib/swift/host/plugins -o /Users/admin/builder/spi-builder-workspace/.derivedData/Build/Intermediates.noindex/SwiftPM.build/Debug/Basic.build/Objects-normal/arm64/Await.o -o /Users/admin/builder/spi-builder-workspace/.derivedData/Build/Intermediates.noindex/SwiftPM.build/Debug/Basic.build/Objects-normal/arm64/ByteString.o -o /Users/admin/builder/spi-builder-workspace/.derivedData/Build/Intermediates.noindex/SwiftPM.build/Debug/Basic.build/Objects-normal/arm64/CStringArray.o -o /Users/admin/builder/spi-builder-workspace/.derivedData/Build/Intermediates.noindex/SwiftPM.build/Debug/Basic.build/Objects-normal/arm64/CacheableSequence.o -index-unit-output-path /SwiftPM.build/Debug/Basic.build/Objects-normal/arm64/Await.o -index-unit-output-path /SwiftPM.build/Debug/Basic.build/Objects-normal/arm64/ByteString.o -index-unit-output-path /SwiftPM.build/Debug/Basic.build/Objects-normal/arm64/CStringArray.o -index-unit-output-path /SwiftPM.build/Debug/Basic.build/Objects-normal/arm64/CacheableSequence.o -index-store-path /Users/admin/builder/spi-builder-workspace/.derivedData/Index.noindex/DataStore -index-system-modules
SwiftCompile normal arm64 /Users/admin/builder/spi-builder-workspace/.dependencies/checkouts/swift-package-manager/Sources/Basic/Await.swift (in target 'Basic' from project 'SwiftPM')
cd /Users/admin/builder/spi-builder-workspace/.swiftpm/xcode
/Users/admin/builder/spi-builder-workspace/.dependencies/checkouts/swift-package-manager/Sources/Basic/Await.swift:18:28: error: value of type '(@escaping (Result<T, ErrorType>) -> Void) -> Void' has no member 'dematerialize'
return try await(body).dematerialize()
~~~~~~ ^~~~~~~~~~~~~
SwiftCompile normal arm64 /Users/admin/builder/spi-builder-workspace/.dependencies/checkouts/swift-package-manager/Sources/Basic/ByteString.swift (in target 'Basic' from project 'SwiftPM')
cd /Users/admin/builder/spi-builder-workspace/.swiftpm/xcode
SwiftCompile normal arm64 /Users/admin/builder/spi-builder-workspace/.dependencies/checkouts/swift-package-manager/Sources/Basic/CStringArray.swift (in target 'Basic' from project 'SwiftPM')
cd /Users/admin/builder/spi-builder-workspace/.swiftpm/xcode
SwiftCompile normal arm64 /Users/admin/builder/spi-builder-workspace/.dependencies/checkouts/swift-package-manager/Sources/Basic/CacheableSequence.swift (in target 'Basic' from project 'SwiftPM')
cd /Users/admin/builder/spi-builder-workspace/.swiftpm/xcode
Ld /Users/admin/builder/spi-builder-workspace/.derivedData/Build/Products/Debug/SPMLibc.o normal (in target 'SPMLibc' from project 'SwiftPM')
cd /Users/admin/builder/spi-builder-workspace/.dependencies/checkouts/swift-package-manager
/Applications/Xcode-16.3.0.app/Contents/Developer/Toolchains/XcodeDefault.xctoolchain/usr/bin/clang -Xlinker -reproducible -target arm64-apple-macos10.13 -r -isysroot /Applications/Xcode-16.3.0.app/Contents/Developer/Platforms/MacOSX.platform/Developer/SDKs/MacOSX15.4.sdk -O0 -w -L/Users/admin/builder/spi-builder-workspace/.derivedData/Build/Intermediates.noindex/EagerLinkingTBDs/Debug -L/Users/admin/builder/spi-builder-workspace/.derivedData/Build/Products/Debug -L/Applications/Xcode-16.3.0.app/Contents/Developer/Platforms/MacOSX.platform/Developer/usr/lib -F/Users/admin/builder/spi-builder-workspace/.derivedData/Build/Intermediates.noindex/EagerLinkingTBDs/Debug -F/Users/admin/builder/spi-builder-workspace/.derivedData/Build/Products/Debug/PackageFrameworks -F/Users/admin/builder/spi-builder-workspace/.derivedData/Build/Products/Debug -iframework /Applications/Xcode-16.3.0.app/Contents/Developer/Platforms/MacOSX.platform/Developer/Library/Frameworks -filelist /Users/admin/builder/spi-builder-workspace/.derivedData/Build/Intermediates.noindex/SwiftPM.build/Debug/SPMLibc.build/Objects-normal/arm64/SPMLibc.LinkFileList -nostdlib -Xlinker -object_path_lto -Xlinker /Users/admin/builder/spi-builder-workspace/.derivedData/Build/Intermediates.noindex/SwiftPM.build/Debug/SPMLibc.build/Objects-normal/arm64/SPMLibc_lto.o -rdynamic -Xlinker -no_deduplicate -Xlinker -debug_variant -Xlinker -dependency_info -Xlinker /Users/admin/builder/spi-builder-workspace/.derivedData/Build/Intermediates.noindex/SwiftPM.build/Debug/SPMLibc.build/Objects-normal/arm64/SPMLibc_dependency_info.dat -fobjc-link-runtime -L/Applications/Xcode-16.3.0.app/Contents/Developer/Toolchains/XcodeDefault.xctoolchain/usr/lib/swift/macosx -L/usr/lib/swift -Xlinker -add_ast_path -Xlinker /Users/admin/builder/spi-builder-workspace/.derivedData/Build/Intermediates.noindex/SwiftPM.build/Debug/SPMLibc.build/Objects-normal/arm64/SPMLibc.swiftmodule -o /Users/admin/builder/spi-builder-workspace/.derivedData/Build/Products/Debug/SPMLibc.o
--- xcodebuild: WARNING: Using the first of multiple matching destinations:
{ platform:macOS, arch:arm64, id:21308100d59bd65e64953bf456a8bd4698dc3a31, name:My Mac }
{ platform:macOS, arch:arm64, variant:Mac Catalyst, id:21308100d59bd65e64953bf456a8bd4698dc3a31, name:My Mac }
{ platform:macOS, arch:arm64, variant:DriverKit, id:21308100d59bd65e64953bf456a8bd4698dc3a31, name:My Mac }
{ platform:macOS, arch:arm64, variant:Designed for [iPad,iPhone], id:21308100d59bd65e64953bf456a8bd4698dc3a31, name:My Mac }
** BUILD FAILED **
The following build commands failed:
SwiftCompile normal arm64 Compiling\ Await.swift,\ ByteString.swift,\ CStringArray.swift,\ CacheableSequence.swift /Users/admin/builder/spi-builder-workspace/.dependencies/checkouts/swift-package-manager/Sources/Basic/Await.swift /Users/admin/builder/spi-builder-workspace/.dependencies/checkouts/swift-package-manager/Sources/Basic/ByteString.swift /Users/admin/builder/spi-builder-workspace/.dependencies/checkouts/swift-package-manager/Sources/Basic/CStringArray.swift /Users/admin/builder/spi-builder-workspace/.dependencies/checkouts/swift-package-manager/Sources/Basic/CacheableSequence.swift (in target 'Basic' from project 'SwiftPM')
SwiftCompile normal arm64 /Users/admin/builder/spi-builder-workspace/.dependencies/checkouts/swift-package-manager/Sources/Basic/Await.swift (in target 'Basic' from project 'SwiftPM')
Building workspace spi-builder-workspace with scheme Appetizer
(3 failures)
Command line invocation:
/Applications/Xcode-16.3.0.app/Contents/Developer/usr/bin/xcodebuild -IDEClonedSourcePackagesDirPathOverride=/Users/admin/builder/spi-builder-workspace/.dependencies -resolvePackageDependencies
Resolve Package Graph
Resolved source packages:
Appetizer: /Users/admin/builder/spi-builder-workspace
SwiftPM: https://github.com/apple/swift-package-manager.git @ 0.4.0
llbuild: https://github.com/apple/swift-llbuild.git @ 0.1.1
HexColor: https://github.com/WilhelmOks/HexColor.git @ 1.0.1
resolved source packages: Appetizer, SwiftPM, llbuild, HexColor
{
"dependencies" : [
{
"identity" : "swift-package-manager",
"requirement" : {
"exact" : [
"0.4.0"
]
},
"type" : "sourceControl",
"url" : "https://github.com/apple/swift-package-manager.git"
},
{
"identity" : "hexcolor",
"requirement" : {
"range" : [
{
"lower_bound" : "1.0.1",
"upper_bound" : "2.0.0"
}
]
},
"type" : "sourceControl",
"url" : "https://github.com/WilhelmOks/HexColor.git"
}
],
"manifest_display_name" : "Appetizer",
"name" : "Appetizer",
"path" : "/Users/admin/builder/spi-builder-workspace",
"platforms" : [
],
"products" : [
{
"name" : "appetizer",
"targets" : [
"AppetizerCL"
],
"type" : {
"executable" : null
}
}
],
"swift_languages_versions" : [
"5"
],
"targets" : [
{
"c99name" : "AppetizerTests",
"module_type" : "SwiftTarget",
"name" : "AppetizerTests",
"path" : "Tests/AppetizerTests",
"sources" : [
"SPM_ProjectTests.swift",
"XCTestManifests.swift"
],
"target_dependencies" : [
"AppetizerCore"
],
"type" : "test"
},
{
"c99name" : "AppetizerCore",
"module_type" : "SwiftTarget",
"name" : "AppetizerCore",
"path" : "Sources/AppetizerCore",
"product_memberships" : [
"appetizer"
],
"sources" : [
"NSImageExtension.swift"
],
"type" : "library"
},
{
"c99name" : "AppetizerCL",
"module_type" : "SwiftTarget",
"name" : "AppetizerCL",
"path" : "Sources/AppetizerCL",
"product_dependencies" : [
"SPMUtility",
"HexNSColor"
],
"product_memberships" : [
"appetizer"
],
"sources" : [
"main.swift"
],
"target_dependencies" : [
"AppetizerCore"
],
"type" : "executable"
}
],
"tools_version" : "5.1"
}
{
"workspace" : {
"name" : "spi-builder-workspace",
"schemes" : [
"Appetizer"
]
}
}
Running build ...
env DEVELOPER_DIR=/Applications/Xcode-16.3.0.app xcrun xcodebuild -IDEClonedSourcePackagesDirPathOverride=$PWD/.dependencies -skipMacroValidation -skipPackagePluginValidation -derivedDataPath $PWD/.derivedData build -scheme Appetizer -destination platform=macOS,arch=arm64
Command line invocation:
/Applications/Xcode-16.3.0.app/Contents/Developer/usr/bin/xcodebuild -IDEClonedSourcePackagesDirPathOverride=/Users/admin/builder/spi-builder-workspace/.dependencies -skipMacroValidation -skipPackagePluginValidation -derivedDataPath /Users/admin/builder/spi-builder-workspace/.derivedData build -scheme Appetizer -destination platform=macOS,arch=arm64
Resolve Package Graph
Resolved source packages:
Appetizer: /Users/admin/builder/spi-builder-workspace
llbuild: https://github.com/apple/swift-llbuild.git @ 0.1.1
HexColor: https://github.com/WilhelmOks/HexColor.git @ 1.0.1
SwiftPM: https://github.com/apple/swift-package-manager.git @ 0.4.0
ComputePackagePrebuildTargetDependencyGraph
Prepare packages
CreateBuildRequest
SendProjectDescription
CreateBuildOperation
ComputeTargetDependencyGraph
note: Building targets in dependency order
note: Target dependency graph (11 targets)
Target 'appetizer' in project 'Appetizer'
➜ Explicit dependency on target 'AppetizerCore' in project 'Appetizer'
➜ Explicit dependency on target 'SPMUtility' in project 'SwiftPM'
➜ Explicit dependency on target 'HexNSColor' in project 'HexColor'
Target 'HexNSColor' in project 'HexColor'
➜ Explicit dependency on target 'HexNSColor' in project 'HexColor'
➜ Explicit dependency on target 'HexColor' in project 'HexColor'
Target 'HexNSColor' in project 'HexColor'
➜ Explicit dependency on target 'HexColor' in project 'HexColor'
Target 'HexColor' in project 'HexColor' (no dependencies)
Target 'SPMUtility' in project 'SwiftPM'
➜ Explicit dependency on target 'clibc' in project 'SwiftPM'
➜ Explicit dependency on target 'SPMLibc' in project 'SwiftPM'
➜ Explicit dependency on target 'POSIX' in project 'SwiftPM'
➜ Explicit dependency on target 'Basic' in project 'SwiftPM'
➜ Explicit dependency on target 'SPMUtility' in project 'SwiftPM'
Target 'SPMUtility' in project 'SwiftPM'
➜ Explicit dependency on target 'clibc' in project 'SwiftPM'
➜ Explicit dependency on target 'SPMLibc' in project 'SwiftPM'
➜ Explicit dependency on target 'POSIX' in project 'SwiftPM'
➜ Explicit dependency on target 'Basic' in project 'SwiftPM'
Target 'Basic' in project 'SwiftPM'
➜ Explicit dependency on target 'clibc' in project 'SwiftPM'
➜ Explicit dependency on target 'SPMLibc' in project 'SwiftPM'
➜ Explicit dependency on target 'POSIX' in project 'SwiftPM'
Target 'POSIX' in project 'SwiftPM'
➜ Explicit dependency on target 'clibc' in project 'SwiftPM'
➜ Explicit dependency on target 'SPMLibc' in project 'SwiftPM'
Target 'SPMLibc' in project 'SwiftPM'
➜ Explicit dependency on target 'clibc' in project 'SwiftPM'
Target 'clibc' in project 'SwiftPM' (no dependencies)
Target 'AppetizerCore' in project 'Appetizer' (no dependencies)
GatherProvisioningInputs
CreateBuildDescription
ExecuteExternalTool /Applications/Xcode-16.3.0.app/Contents/Developer/Toolchains/XcodeDefault.xctoolchain/usr/bin/swiftc --version
ExecuteExternalTool /Applications/Xcode-16.3.0.app/Contents/Developer/Toolchains/XcodeDefault.xctoolchain/usr/bin/clang -v -E -dM -arch arm64 -isysroot /Applications/Xcode-16.3.0.app/Contents/Developer/Platforms/MacOSX.platform/Developer/SDKs/MacOSX15.4.sdk -x c -c /dev/null
ExecuteExternalTool /Applications/Xcode-16.3.0.app/Contents/Developer/Toolchains/XcodeDefault.xctoolchain/usr/bin/clang -v -E -dM -isysroot /Applications/Xcode-16.3.0.app/Contents/Developer/Platforms/MacOSX.platform/Developer/SDKs/MacOSX15.4.sdk -x c -c /dev/null
ExecuteExternalTool /Applications/Xcode-16.3.0.app/Contents/Developer/Toolchains/XcodeDefault.xctoolchain/usr/bin/ld -version_details
Build description signature: d9c32e8b32622dee480c53c4623e796c
Build description path: /Users/admin/builder/spi-builder-workspace/.derivedData/Build/Intermediates.noindex/XCBuildData/d9c32e8b32622dee480c53c4623e796c.xcbuilddata
ClangStatCache /Applications/Xcode-16.3.0.app/Contents/Developer/Toolchains/XcodeDefault.xctoolchain/usr/bin/clang-stat-cache /Applications/Xcode-16.3.0.app/Contents/Developer/Platforms/MacOSX.platform/Developer/SDKs/MacOSX15.4.sdk /Users/admin/builder/spi-builder-workspace/.derivedData/SDKStatCaches.noindex/macosx15.4-24E241-8287b8f5db97e746a1562fbca0c9d29b.sdkstatcache
cd /Users/admin/builder/spi-builder-workspace/.swiftpm/xcode
/Applications/Xcode-16.3.0.app/Contents/Developer/Toolchains/XcodeDefault.xctoolchain/usr/bin/clang-stat-cache /Applications/Xcode-16.3.0.app/Contents/Developer/Platforms/MacOSX.platform/Developer/SDKs/MacOSX15.4.sdk -o /Users/admin/builder/spi-builder-workspace/.derivedData/SDKStatCaches.noindex/macosx15.4-24E241-8287b8f5db97e746a1562fbca0c9d29b.sdkstatcache
SwiftDriver SPMLibc normal arm64 com.apple.xcode.tools.swift.compiler (in target 'SPMLibc' from project 'SwiftPM')
cd /Users/admin/builder/spi-builder-workspace/.swiftpm/xcode
builtin-SwiftDriver -- /Applications/Xcode-16.3.0.app/Contents/Developer/Toolchains/XcodeDefault.xctoolchain/usr/bin/swiftc -module-name SPMLibc -Onone -enforce-exclusivity\=checked @/Users/admin/builder/spi-builder-workspace/.derivedData/Build/Intermediates.noindex/SwiftPM.build/Debug/SPMLibc.build/Objects-normal/arm64/SPMLibc.SwiftFileList -DSWIFT_PACKAGE -DDEBUG -DXcode -plugin-path /Applications/Xcode-16.3.0.app/Contents/Developer/Toolchains/XcodeDefault.xctoolchain/usr/lib/swift/host/plugins/testing -enable-experimental-feature DebugDescriptionMacro -sdk /Applications/Xcode-16.3.0.app/Contents/Developer/Platforms/MacOSX.platform/Developer/SDKs/MacOSX15.4.sdk -target arm64-apple-macos10.13 -g -module-cache-path /Users/admin/builder/spi-builder-workspace/.derivedData/ModuleCache.noindex -Xfrontend -serialize-debugging-options -profile-coverage-mapping -profile-generate -enable-testing -suppress-warnings -index-store-path /Users/admin/builder/spi-builder-workspace/.derivedData/Index.noindex/DataStore -swift-version 4.2 -I /Users/admin/builder/spi-builder-workspace/.derivedData/Build/Products/Debug -I /Applications/Xcode-16.3.0.app/Contents/Developer/Platforms/MacOSX.platform/Developer/usr/lib -F /Users/admin/builder/spi-builder-workspace/.derivedData/Build/Products/Debug/PackageFrameworks -F /Users/admin/builder/spi-builder-workspace/.derivedData/Build/Products/Debug -F /Applications/Xcode-16.3.0.app/Contents/Developer/Platforms/MacOSX.platform/Developer/Library/Frameworks -parse-as-library -c -j10 -enable-batch-mode -incremental -Xcc -ivfsstatcache -Xcc /Users/admin/builder/spi-builder-workspace/.derivedData/SDKStatCaches.noindex/macosx15.4-24E241-8287b8f5db97e746a1562fbca0c9d29b.sdkstatcache -output-file-map /Users/admin/builder/spi-builder-workspace/.derivedData/Build/Intermediates.noindex/SwiftPM.build/Debug/SPMLibc.build/Objects-normal/arm64/SPMLibc-OutputFileMap.json -use-frontend-parseable-output -save-temps -no-color-diagnostics -serialize-diagnostics -emit-dependencies -emit-module -emit-module-path /Users/admin/builder/spi-builder-workspace/.derivedData/Build/Intermediates.noindex/SwiftPM.build/Debug/SPMLibc.build/Objects-normal/arm64/SPMLibc.swiftmodule -validate-clang-modules-once -clang-build-session-file /Users/admin/builder/spi-builder-workspace/.derivedData/ModuleCache.noindex/Session.modulevalidation -Xcc -I/Users/admin/builder/spi-builder-workspace/.derivedData/Build/Intermediates.noindex/SwiftPM.build/Debug/SPMLibc.build/swift-overrides.hmap -emit-const-values -Xfrontend -const-gather-protocols-file -Xfrontend /Users/admin/builder/spi-builder-workspace/.derivedData/Build/Intermediates.noindex/SwiftPM.build/Debug/SPMLibc.build/Objects-normal/arm64/SPMLibc_const_extract_protocols.json -Xcc -I/Users/admin/builder/spi-builder-workspace/.dependencies/checkouts/swift-package-manager/Sources/clibc/include -Xcc -I/Users/admin/builder/spi-builder-workspace/.derivedData/Build/Products/Debug/include -Xcc -I/Users/admin/builder/spi-builder-workspace/.derivedData/Build/Intermediates.noindex/SwiftPM.build/Debug/SPMLibc.build/DerivedSources-normal/arm64 -Xcc -I/Users/admin/builder/spi-builder-workspace/.derivedData/Build/Intermediates.noindex/SwiftPM.build/Debug/SPMLibc.build/DerivedSources/arm64 -Xcc -I/Users/admin/builder/spi-builder-workspace/.derivedData/Build/Intermediates.noindex/SwiftPM.build/Debug/SPMLibc.build/DerivedSources -Xcc -DSWIFT_PACKAGE -Xcc -DDEBUG\=1 -emit-objc-header -emit-objc-header-path /Users/admin/builder/spi-builder-workspace/.derivedData/Build/Intermediates.noindex/SwiftPM.build/Debug/SPMLibc.build/Objects-normal/arm64/SPMLibc-Swift.h -working-directory /Users/admin/builder/spi-builder-workspace/.swiftpm/xcode -experimental-emit-module-separately -disable-cmo
SwiftDriver HexColor normal arm64 com.apple.xcode.tools.swift.compiler (in target 'HexColor' from project 'HexColor')
cd /Users/admin/builder/spi-builder-workspace/.swiftpm/xcode
builtin-SwiftDriver -- /Applications/Xcode-16.3.0.app/Contents/Developer/Toolchains/XcodeDefault.xctoolchain/usr/bin/swiftc -module-name HexColor -Onone -enforce-exclusivity\=checked @/Users/admin/builder/spi-builder-workspace/.derivedData/Build/Intermediates.noindex/HexColor.build/Debug/HexColor.build/Objects-normal/arm64/HexColor.SwiftFileList -DSWIFT_PACKAGE -DDEBUG -DXcode -plugin-path /Applications/Xcode-16.3.0.app/Contents/Developer/Toolchains/XcodeDefault.xctoolchain/usr/lib/swift/host/plugins/testing -enable-experimental-feature DebugDescriptionMacro -sdk /Applications/Xcode-16.3.0.app/Contents/Developer/Platforms/MacOSX.platform/Developer/SDKs/MacOSX15.4.sdk -target arm64-apple-macos10.13 -g -module-cache-path /Users/admin/builder/spi-builder-workspace/.derivedData/ModuleCache.noindex -Xfrontend -serialize-debugging-options -profile-coverage-mapping -profile-generate -enable-testing -suppress-warnings -index-store-path /Users/admin/builder/spi-builder-workspace/.derivedData/Index.noindex/DataStore -swift-version 5 -I /Users/admin/builder/spi-builder-workspace/.derivedData/Build/Products/Debug -I /Applications/Xcode-16.3.0.app/Contents/Developer/Platforms/MacOSX.platform/Developer/usr/lib -F /Users/admin/builder/spi-builder-workspace/.derivedData/Build/Products/Debug -F /Applications/Xcode-16.3.0.app/Contents/Developer/Platforms/MacOSX.platform/Developer/Library/Frameworks -parse-as-library -c -j10 -enable-batch-mode -incremental -Xcc -ivfsstatcache -Xcc /Users/admin/builder/spi-builder-workspace/.derivedData/SDKStatCaches.noindex/macosx15.4-24E241-8287b8f5db97e746a1562fbca0c9d29b.sdkstatcache -output-file-map /Users/admin/builder/spi-builder-workspace/.derivedData/Build/Intermediates.noindex/HexColor.build/Debug/HexColor.build/Objects-normal/arm64/HexColor-OutputFileMap.json -use-frontend-parseable-output -save-temps -no-color-diagnostics -serialize-diagnostics -emit-dependencies -emit-module -emit-module-path /Users/admin/builder/spi-builder-workspace/.derivedData/Build/Intermediates.noindex/HexColor.build/Debug/HexColor.build/Objects-normal/arm64/HexColor.swiftmodule -validate-clang-modules-once -clang-build-session-file /Users/admin/builder/spi-builder-workspace/.derivedData/ModuleCache.noindex/Session.modulevalidation -Xcc -I/Users/admin/builder/spi-builder-workspace/.derivedData/Build/Intermediates.noindex/HexColor.build/Debug/HexColor.build/swift-overrides.hmap -emit-const-values -Xfrontend -const-gather-protocols-file -Xfrontend /Users/admin/builder/spi-builder-workspace/.derivedData/Build/Intermediates.noindex/HexColor.build/Debug/HexColor.build/Objects-normal/arm64/HexColor_const_extract_protocols.json -Xcc -I/Users/admin/builder/spi-builder-workspace/.derivedData/Build/Products/Debug/include -Xcc -I/Users/admin/builder/spi-builder-workspace/.derivedData/Build/Intermediates.noindex/HexColor.build/Debug/HexColor.build/DerivedSources-normal/arm64 -Xcc -I/Users/admin/builder/spi-builder-workspace/.derivedData/Build/Intermediates.noindex/HexColor.build/Debug/HexColor.build/DerivedSources/arm64 -Xcc -I/Users/admin/builder/spi-builder-workspace/.derivedData/Build/Intermediates.noindex/HexColor.build/Debug/HexColor.build/DerivedSources -Xcc -DSWIFT_PACKAGE -Xcc -DDEBUG\=1 -emit-objc-header -emit-objc-header-path /Users/admin/builder/spi-builder-workspace/.derivedData/Build/Intermediates.noindex/HexColor.build/Debug/HexColor.build/Objects-normal/arm64/HexColor-Swift.h -working-directory /Users/admin/builder/spi-builder-workspace/.swiftpm/xcode -experimental-emit-module-separately -disable-cmo
SwiftDriver AppetizerCore normal arm64 com.apple.xcode.tools.swift.compiler (in target 'AppetizerCore' from project 'Appetizer')
cd /Users/admin/builder/spi-builder-workspace/.swiftpm/xcode
builtin-SwiftDriver -- /Applications/Xcode-16.3.0.app/Contents/Developer/Toolchains/XcodeDefault.xctoolchain/usr/bin/swiftc -module-name AppetizerCore -Onone -enforce-exclusivity\=checked @/Users/admin/builder/spi-builder-workspace/.derivedData/Build/Intermediates.noindex/Appetizer.build/Debug/AppetizerCore.build/Objects-normal/arm64/AppetizerCore.SwiftFileList -DSWIFT_PACKAGE -DDEBUG -DXcode -plugin-path /Applications/Xcode-16.3.0.app/Contents/Developer/Toolchains/XcodeDefault.xctoolchain/usr/lib/swift/host/plugins/testing -enable-experimental-feature DebugDescriptionMacro -sdk /Applications/Xcode-16.3.0.app/Contents/Developer/Platforms/MacOSX.platform/Developer/SDKs/MacOSX15.4.sdk -target arm64-apple-macos10.13 -g -module-cache-path /Users/admin/builder/spi-builder-workspace/.derivedData/ModuleCache.noindex -Xfrontend -serialize-debugging-options -profile-coverage-mapping -profile-generate -enable-testing -index-store-path /Users/admin/builder/spi-builder-workspace/.derivedData/Index.noindex/DataStore -swift-version 5 -I /Users/admin/builder/spi-builder-workspace/.derivedData/Build/Products/Debug -I /Applications/Xcode-16.3.0.app/Contents/Developer/Platforms/MacOSX.platform/Developer/usr/lib -F /Users/admin/builder/spi-builder-workspace/.derivedData/Build/Products/Debug -F /Applications/Xcode-16.3.0.app/Contents/Developer/Platforms/MacOSX.platform/Developer/Library/Frameworks -parse-as-library -c -j10 -enable-batch-mode -incremental -Xcc -ivfsstatcache -Xcc /Users/admin/builder/spi-builder-workspace/.derivedData/SDKStatCaches.noindex/macosx15.4-24E241-8287b8f5db97e746a1562fbca0c9d29b.sdkstatcache -output-file-map /Users/admin/builder/spi-builder-workspace/.derivedData/Build/Intermediates.noindex/Appetizer.build/Debug/AppetizerCore.build/Objects-normal/arm64/AppetizerCore-OutputFileMap.json -use-frontend-parseable-output -save-temps -no-color-diagnostics -serialize-diagnostics -emit-dependencies -emit-module -emit-module-path /Users/admin/builder/spi-builder-workspace/.derivedData/Build/Intermediates.noindex/Appetizer.build/Debug/AppetizerCore.build/Objects-normal/arm64/AppetizerCore.swiftmodule -validate-clang-modules-once -clang-build-session-file /Users/admin/builder/spi-builder-workspace/.derivedData/ModuleCache.noindex/Session.modulevalidation -Xcc -I/Users/admin/builder/spi-builder-workspace/.derivedData/Build/Intermediates.noindex/Appetizer.build/Debug/AppetizerCore.build/swift-overrides.hmap -emit-const-values -Xfrontend -const-gather-protocols-file -Xfrontend /Users/admin/builder/spi-builder-workspace/.derivedData/Build/Intermediates.noindex/Appetizer.build/Debug/AppetizerCore.build/Objects-normal/arm64/AppetizerCore_const_extract_protocols.json -Xcc -I/Users/admin/builder/spi-builder-workspace/.derivedData/Build/Products/Debug/include -Xcc -I/Users/admin/builder/spi-builder-workspace/.derivedData/Build/Intermediates.noindex/Appetizer.build/Debug/AppetizerCore.build/DerivedSources-normal/arm64 -Xcc -I/Users/admin/builder/spi-builder-workspace/.derivedData/Build/Intermediates.noindex/Appetizer.build/Debug/AppetizerCore.build/DerivedSources/arm64 -Xcc -I/Users/admin/builder/spi-builder-workspace/.derivedData/Build/Intermediates.noindex/Appetizer.build/Debug/AppetizerCore.build/DerivedSources -Xcc -DSWIFT_PACKAGE -Xcc -DDEBUG\=1 -emit-objc-header -emit-objc-header-path /Users/admin/builder/spi-builder-workspace/.derivedData/Build/Intermediates.noindex/Appetizer.build/Debug/AppetizerCore.build/Objects-normal/arm64/AppetizerCore-Swift.h -working-directory /Users/admin/builder/spi-builder-workspace/.swiftpm/xcode -experimental-emit-module-separately -disable-cmo
SwiftEmitModule normal arm64 Emitting\ module\ for\ SPMLibc (in target 'SPMLibc' from project 'SwiftPM')
SwiftCompile normal arm64 /Users/admin/builder/spi-builder-workspace/.dependencies/checkouts/swift-package-manager/Sources/SPMLibc/libc.swift (in target 'SPMLibc' from project 'SwiftPM')
cd /Users/admin/builder/spi-builder-workspace/.swiftpm/xcode
SwiftEmitModule normal arm64 Emitting\ module\ for\ HexColor (in target 'HexColor' from project 'HexColor')
SwiftCompile normal arm64 /Users/admin/builder/spi-builder-workspace/.dependencies/checkouts/HexColor/Sources/HexColor/HexColor.swift (in target 'HexColor' from project 'HexColor')
cd /Users/admin/builder/spi-builder-workspace/.swiftpm/xcode
SwiftEmitModule normal arm64 Emitting\ module\ for\ AppetizerCore (in target 'AppetizerCore' from project 'Appetizer')
SwiftCompile normal arm64 /Users/admin/builder/spi-builder-workspace/Sources/AppetizerCore/NSImageExtension.swift (in target 'AppetizerCore' from project 'Appetizer')
cd /Users/admin/builder/spi-builder-workspace/.swiftpm/xcode
SwiftCompile normal arm64 Compiling\ HexColor.swift /Users/admin/builder/spi-builder-workspace/.dependencies/checkouts/HexColor/Sources/HexColor/HexColor.swift (in target 'HexColor' from project 'HexColor')
SwiftCompile normal arm64 /Users/admin/builder/spi-builder-workspace/.dependencies/checkouts/HexColor/Sources/HexColor/HexColor.swift (in target 'HexColor' from project 'HexColor')
cd /Users/admin/builder/spi-builder-workspace/.swiftpm/xcode
SwiftCompile normal arm64 Compiling\ NSImageExtension.swift /Users/admin/builder/spi-builder-workspace/Sources/AppetizerCore/NSImageExtension.swift (in target 'AppetizerCore' from project 'Appetizer')
SwiftCompile normal arm64 /Users/admin/builder/spi-builder-workspace/Sources/AppetizerCore/NSImageExtension.swift (in target 'AppetizerCore' from project 'Appetizer')
cd /Users/admin/builder/spi-builder-workspace/.swiftpm/xcode
SwiftCompile normal arm64 Compiling\ libc.swift /Users/admin/builder/spi-builder-workspace/.dependencies/checkouts/swift-package-manager/Sources/SPMLibc/libc.swift (in target 'SPMLibc' from project 'SwiftPM')
SwiftCompile normal arm64 /Users/admin/builder/spi-builder-workspace/.dependencies/checkouts/swift-package-manager/Sources/SPMLibc/libc.swift (in target 'SPMLibc' from project 'SwiftPM')
cd /Users/admin/builder/spi-builder-workspace/.swiftpm/xcode
SwiftDriverJobDiscovery normal arm64 Emitting module for SPMLibc (in target 'SPMLibc' from project 'SwiftPM')
SwiftDriver\ Compilation\ Requirements SPMLibc normal arm64 com.apple.xcode.tools.swift.compiler (in target 'SPMLibc' from project 'SwiftPM')
cd /Users/admin/builder/spi-builder-workspace/.swiftpm/xcode
builtin-Swift-Compilation-Requirements -- /Applications/Xcode-16.3.0.app/Contents/Developer/Toolchains/XcodeDefault.xctoolchain/usr/bin/swiftc -module-name SPMLibc -Onone -enforce-exclusivity\=checked @/Users/admin/builder/spi-builder-workspace/.derivedData/Build/Intermediates.noindex/SwiftPM.build/Debug/SPMLibc.build/Objects-normal/arm64/SPMLibc.SwiftFileList -DSWIFT_PACKAGE -DDEBUG -DXcode -plugin-path /Applications/Xcode-16.3.0.app/Contents/Developer/Toolchains/XcodeDefault.xctoolchain/usr/lib/swift/host/plugins/testing -enable-experimental-feature DebugDescriptionMacro -sdk /Applications/Xcode-16.3.0.app/Contents/Developer/Platforms/MacOSX.platform/Developer/SDKs/MacOSX15.4.sdk -target arm64-apple-macos10.13 -g -module-cache-path /Users/admin/builder/spi-builder-workspace/.derivedData/ModuleCache.noindex -Xfrontend -serialize-debugging-options -profile-coverage-mapping -profile-generate -enable-testing -suppress-warnings -index-store-path /Users/admin/builder/spi-builder-workspace/.derivedData/Index.noindex/DataStore -swift-version 4.2 -I /Users/admin/builder/spi-builder-workspace/.derivedData/Build/Products/Debug -I /Applications/Xcode-16.3.0.app/Contents/Developer/Platforms/MacOSX.platform/Developer/usr/lib -F /Users/admin/builder/spi-builder-workspace/.derivedData/Build/Products/Debug/PackageFrameworks -F /Users/admin/builder/spi-builder-workspace/.derivedData/Build/Products/Debug -F /Applications/Xcode-16.3.0.app/Contents/Developer/Platforms/MacOSX.platform/Developer/Library/Frameworks -parse-as-library -c -j10 -enable-batch-mode -incremental -Xcc -ivfsstatcache -Xcc /Users/admin/builder/spi-builder-workspace/.derivedData/SDKStatCaches.noindex/macosx15.4-24E241-8287b8f5db97e746a1562fbca0c9d29b.sdkstatcache -output-file-map /Users/admin/builder/spi-builder-workspace/.derivedData/Build/Intermediates.noindex/SwiftPM.build/Debug/SPMLibc.build/Objects-normal/arm64/SPMLibc-OutputFileMap.json -use-frontend-parseable-output -save-temps -no-color-diagnostics -serialize-diagnostics -emit-dependencies -emit-module -emit-module-path /Users/admin/builder/spi-builder-workspace/.derivedData/Build/Intermediates.noindex/SwiftPM.build/Debug/SPMLibc.build/Objects-normal/arm64/SPMLibc.swiftmodule -validate-clang-modules-once -clang-build-session-file /Users/admin/builder/spi-builder-workspace/.derivedData/ModuleCache.noindex/Session.modulevalidation -Xcc -I/Users/admin/builder/spi-builder-workspace/.derivedData/Build/Intermediates.noindex/SwiftPM.build/Debug/SPMLibc.build/swift-overrides.hmap -emit-const-values -Xfrontend -const-gather-protocols-file -Xfrontend /Users/admin/builder/spi-builder-workspace/.derivedData/Build/Intermediates.noindex/SwiftPM.build/Debug/SPMLibc.build/Objects-normal/arm64/SPMLibc_const_extract_protocols.json -Xcc -I/Users/admin/builder/spi-builder-workspace/.dependencies/checkouts/swift-package-manager/Sources/clibc/include -Xcc -I/Users/admin/builder/spi-builder-workspace/.derivedData/Build/Products/Debug/include -Xcc -I/Users/admin/builder/spi-builder-workspace/.derivedData/Build/Intermediates.noindex/SwiftPM.build/Debug/SPMLibc.build/DerivedSources-normal/arm64 -Xcc -I/Users/admin/builder/spi-builder-workspace/.derivedData/Build/Intermediates.noindex/SwiftPM.build/Debug/SPMLibc.build/DerivedSources/arm64 -Xcc -I/Users/admin/builder/spi-builder-workspace/.derivedData/Build/Intermediates.noindex/SwiftPM.build/Debug/SPMLibc.build/DerivedSources -Xcc -DSWIFT_PACKAGE -Xcc -DDEBUG\=1 -emit-objc-header -emit-objc-header-path /Users/admin/builder/spi-builder-workspace/.derivedData/Build/Intermediates.noindex/SwiftPM.build/Debug/SPMLibc.build/Objects-normal/arm64/SPMLibc-Swift.h -working-directory /Users/admin/builder/spi-builder-workspace/.swiftpm/xcode -experimental-emit-module-separately -disable-cmo
Copy /Users/admin/builder/spi-builder-workspace/.derivedData/Build/Products/Debug/SPMLibc.swiftmodule/arm64-apple-macos.abi.json /Users/admin/builder/spi-builder-workspace/.derivedData/Build/Intermediates.noindex/SwiftPM.build/Debug/SPMLibc.build/Objects-normal/arm64/SPMLibc.abi.json (in target 'SPMLibc' from project 'SwiftPM')
cd /Users/admin/builder/spi-builder-workspace/.dependencies/checkouts/swift-package-manager
builtin-copy -exclude .DS_Store -exclude CVS -exclude .svn -exclude .git -exclude .hg -resolve-src-symlinks -rename /Users/admin/builder/spi-builder-workspace/.derivedData/Build/Intermediates.noindex/SwiftPM.build/Debug/SPMLibc.build/Objects-normal/arm64/SPMLibc.abi.json /Users/admin/builder/spi-builder-workspace/.derivedData/Build/Products/Debug/SPMLibc.swiftmodule/arm64-apple-macos.abi.json
SwiftDriver POSIX normal arm64 com.apple.xcode.tools.swift.compiler (in target 'POSIX' from project 'SwiftPM')
cd /Users/admin/builder/spi-builder-workspace/.swiftpm/xcode
builtin-SwiftDriver -- /Applications/Xcode-16.3.0.app/Contents/Developer/Toolchains/XcodeDefault.xctoolchain/usr/bin/swiftc -module-name POSIX -Onone -enforce-exclusivity\=checked @/Users/admin/builder/spi-builder-workspace/.derivedData/Build/Intermediates.noindex/SwiftPM.build/Debug/POSIX.build/Objects-normal/arm64/POSIX.SwiftFileList -DSWIFT_PACKAGE -DDEBUG -DXcode -plugin-path /Applications/Xcode-16.3.0.app/Contents/Developer/Toolchains/XcodeDefault.xctoolchain/usr/lib/swift/host/plugins/testing -enable-experimental-feature DebugDescriptionMacro -sdk /Applications/Xcode-16.3.0.app/Contents/Developer/Platforms/MacOSX.platform/Developer/SDKs/MacOSX15.4.sdk -target arm64-apple-macos10.13 -g -module-cache-path /Users/admin/builder/spi-builder-workspace/.derivedData/ModuleCache.noindex -Xfrontend -serialize-debugging-options -profile-coverage-mapping -profile-generate -enable-testing -suppress-warnings -index-store-path /Users/admin/builder/spi-builder-workspace/.derivedData/Index.noindex/DataStore -swift-version 4.2 -I /Users/admin/builder/spi-builder-workspace/.derivedData/Build/Products/Debug -I /Applications/Xcode-16.3.0.app/Contents/Developer/Platforms/MacOSX.platform/Developer/usr/lib -F /Users/admin/builder/spi-builder-workspace/.derivedData/Build/Products/Debug/PackageFrameworks -F /Users/admin/builder/spi-builder-workspace/.derivedData/Build/Products/Debug/PackageFrameworks -F /Users/admin/builder/spi-builder-workspace/.derivedData/Build/Products/Debug -F /Applications/Xcode-16.3.0.app/Contents/Developer/Platforms/MacOSX.platform/Developer/Library/Frameworks -c -j10 -enable-batch-mode -incremental -Xcc -ivfsstatcache -Xcc /Users/admin/builder/spi-builder-workspace/.derivedData/SDKStatCaches.noindex/macosx15.4-24E241-8287b8f5db97e746a1562fbca0c9d29b.sdkstatcache -output-file-map /Users/admin/builder/spi-builder-workspace/.derivedData/Build/Intermediates.noindex/SwiftPM.build/Debug/POSIX.build/Objects-normal/arm64/POSIX-OutputFileMap.json -use-frontend-parseable-output -save-temps -no-color-diagnostics -serialize-diagnostics -emit-dependencies -emit-module -emit-module-path /Users/admin/builder/spi-builder-workspace/.derivedData/Build/Intermediates.noindex/SwiftPM.build/Debug/POSIX.build/Objects-normal/arm64/POSIX.swiftmodule -validate-clang-modules-once -clang-build-session-file /Users/admin/builder/spi-builder-workspace/.derivedData/ModuleCache.noindex/Session.modulevalidation -Xcc -I/Users/admin/builder/spi-builder-workspace/.derivedData/Build/Intermediates.noindex/SwiftPM.build/Debug/POSIX.build/swift-overrides.hmap -emit-const-values -Xfrontend -const-gather-protocols-file -Xfrontend /Users/admin/builder/spi-builder-workspace/.derivedData/Build/Intermediates.noindex/SwiftPM.build/Debug/POSIX.build/Objects-normal/arm64/POSIX_const_extract_protocols.json -Xcc -I/Users/admin/builder/spi-builder-workspace/.dependencies/checkouts/swift-package-manager/Sources/clibc/include -Xcc -I/Users/admin/builder/spi-builder-workspace/.derivedData/Build/Products/Debug/include -Xcc -I/Users/admin/builder/spi-builder-workspace/.derivedData/Build/Intermediates.noindex/SwiftPM.build/Debug/POSIX.build/DerivedSources-normal/arm64 -Xcc -I/Users/admin/builder/spi-builder-workspace/.derivedData/Build/Intermediates.noindex/SwiftPM.build/Debug/POSIX.build/DerivedSources/arm64 -Xcc -I/Users/admin/builder/spi-builder-workspace/.derivedData/Build/Intermediates.noindex/SwiftPM.build/Debug/POSIX.build/DerivedSources -Xcc -DSWIFT_PACKAGE -Xcc -DDEBUG\=1 -emit-objc-header -emit-objc-header-path /Users/admin/builder/spi-builder-workspace/.derivedData/Build/Intermediates.noindex/SwiftPM.build/Debug/POSIX.build/Objects-normal/arm64/POSIX-Swift.h -working-directory /Users/admin/builder/spi-builder-workspace/.swiftpm/xcode -experimental-emit-module-separately -disable-cmo
SwiftDriverJobDiscovery normal arm64 Compiling libc.swift (in target 'SPMLibc' from project 'SwiftPM')
SwiftDriver\ Compilation SPMLibc normal arm64 com.apple.xcode.tools.swift.compiler (in target 'SPMLibc' from project 'SwiftPM')
cd /Users/admin/builder/spi-builder-workspace/.swiftpm/xcode
builtin-Swift-Compilation -- /Applications/Xcode-16.3.0.app/Contents/Developer/Toolchains/XcodeDefault.xctoolchain/usr/bin/swiftc -module-name SPMLibc -Onone -enforce-exclusivity\=checked @/Users/admin/builder/spi-builder-workspace/.derivedData/Build/Intermediates.noindex/SwiftPM.build/Debug/SPMLibc.build/Objects-normal/arm64/SPMLibc.SwiftFileList -DSWIFT_PACKAGE -DDEBUG -DXcode -plugin-path /Applications/Xcode-16.3.0.app/Contents/Developer/Toolchains/XcodeDefault.xctoolchain/usr/lib/swift/host/plugins/testing -enable-experimental-feature DebugDescriptionMacro -sdk /Applications/Xcode-16.3.0.app/Contents/Developer/Platforms/MacOSX.platform/Developer/SDKs/MacOSX15.4.sdk -target arm64-apple-macos10.13 -g -module-cache-path /Users/admin/builder/spi-builder-workspace/.derivedData/ModuleCache.noindex -Xfrontend -serialize-debugging-options -profile-coverage-mapping -profile-generate -enable-testing -suppress-warnings -index-store-path /Users/admin/builder/spi-builder-workspace/.derivedData/Index.noindex/DataStore -swift-version 4.2 -I /Users/admin/builder/spi-builder-workspace/.derivedData/Build/Products/Debug -I /Applications/Xcode-16.3.0.app/Contents/Developer/Platforms/MacOSX.platform/Developer/usr/lib -F /Users/admin/builder/spi-builder-workspace/.derivedData/Build/Products/Debug/PackageFrameworks -F /Users/admin/builder/spi-builder-workspace/.derivedData/Build/Products/Debug -F /Applications/Xcode-16.3.0.app/Contents/Developer/Platforms/MacOSX.platform/Developer/Library/Frameworks -parse-as-library -c -j10 -enable-batch-mode -incremental -Xcc -ivfsstatcache -Xcc /Users/admin/builder/spi-builder-workspace/.derivedData/SDKStatCaches.noindex/macosx15.4-24E241-8287b8f5db97e746a1562fbca0c9d29b.sdkstatcache -output-file-map /Users/admin/builder/spi-builder-workspace/.derivedData/Build/Intermediates.noindex/SwiftPM.build/Debug/SPMLibc.build/Objects-normal/arm64/SPMLibc-OutputFileMap.json -use-frontend-parseable-output -save-temps -no-color-diagnostics -serialize-diagnostics -emit-dependencies -emit-module -emit-module-path /Users/admin/builder/spi-builder-workspace/.derivedData/Build/Intermediates.noindex/SwiftPM.build/Debug/SPMLibc.build/Objects-normal/arm64/SPMLibc.swiftmodule -validate-clang-modules-once -clang-build-session-file /Users/admin/builder/spi-builder-workspace/.derivedData/ModuleCache.noindex/Session.modulevalidation -Xcc -I/Users/admin/builder/spi-builder-workspace/.derivedData/Build/Intermediates.noindex/SwiftPM.build/Debug/SPMLibc.build/swift-overrides.hmap -emit-const-values -Xfrontend -const-gather-protocols-file -Xfrontend /Users/admin/builder/spi-builder-workspace/.derivedData/Build/Intermediates.noindex/SwiftPM.build/Debug/SPMLibc.build/Objects-normal/arm64/SPMLibc_const_extract_protocols.json -Xcc -I/Users/admin/builder/spi-builder-workspace/.dependencies/checkouts/swift-package-manager/Sources/clibc/include -Xcc -I/Users/admin/builder/spi-builder-workspace/.derivedData/Build/Products/Debug/include -Xcc -I/Users/admin/builder/spi-builder-workspace/.derivedData/Build/Intermediates.noindex/SwiftPM.build/Debug/SPMLibc.build/DerivedSources-normal/arm64 -Xcc -I/Users/admin/builder/spi-builder-workspace/.derivedData/Build/Intermediates.noindex/SwiftPM.build/Debug/SPMLibc.build/DerivedSources/arm64 -Xcc -I/Users/admin/builder/spi-builder-workspace/.derivedData/Build/Intermediates.noindex/SwiftPM.build/Debug/SPMLibc.build/DerivedSources -Xcc -DSWIFT_PACKAGE -Xcc -DDEBUG\=1 -emit-objc-header -emit-objc-header-path /Users/admin/builder/spi-builder-workspace/.derivedData/Build/Intermediates.noindex/SwiftPM.build/Debug/SPMLibc.build/Objects-normal/arm64/SPMLibc-Swift.h -working-directory /Users/admin/builder/spi-builder-workspace/.swiftpm/xcode -experimental-emit-module-separately -disable-cmo
Ld /Users/admin/builder/spi-builder-workspace/.derivedData/Build/Products/Debug/SPMLibc.o normal (in target 'SPMLibc' from project 'SwiftPM')
cd /Users/admin/builder/spi-builder-workspace/.dependencies/checkouts/swift-package-manager
/Applications/Xcode-16.3.0.app/Contents/Developer/Toolchains/XcodeDefault.xctoolchain/usr/bin/clang -Xlinker -reproducible -target arm64-apple-macos10.13 -r -isysroot /Applications/Xcode-16.3.0.app/Contents/Developer/Platforms/MacOSX.platform/Developer/SDKs/MacOSX15.4.sdk -O0 -w -L/Users/admin/builder/spi-builder-workspace/.derivedData/Build/Intermediates.noindex/EagerLinkingTBDs/Debug -L/Users/admin/builder/spi-builder-workspace/.derivedData/Build/Products/Debug -L/Applications/Xcode-16.3.0.app/Contents/Developer/Platforms/MacOSX.platform/Developer/usr/lib -F/Users/admin/builder/spi-builder-workspace/.derivedData/Build/Intermediates.noindex/EagerLinkingTBDs/Debug -F/Users/admin/builder/spi-builder-workspace/.derivedData/Build/Products/Debug/PackageFrameworks -F/Users/admin/builder/spi-builder-workspace/.derivedData/Build/Products/Debug -iframework /Applications/Xcode-16.3.0.app/Contents/Developer/Platforms/MacOSX.platform/Developer/Library/Frameworks -filelist /Users/admin/builder/spi-builder-workspace/.derivedData/Build/Intermediates.noindex/SwiftPM.build/Debug/SPMLibc.build/Objects-normal/arm64/SPMLibc.LinkFileList -nostdlib -Xlinker -object_path_lto -Xlinker /Users/admin/builder/spi-builder-workspace/.derivedData/Build/Intermediates.noindex/SwiftPM.build/Debug/SPMLibc.build/Objects-normal/arm64/SPMLibc_lto.o -rdynamic -Xlinker -no_deduplicate -Xlinker -debug_variant -Xlinker -dependency_info -Xlinker /Users/admin/builder/spi-builder-workspace/.derivedData/Build/Intermediates.noindex/SwiftPM.build/Debug/SPMLibc.build/Objects-normal/arm64/SPMLibc_dependency_info.dat -fobjc-link-runtime -L/Applications/Xcode-16.3.0.app/Contents/Developer/Toolchains/XcodeDefault.xctoolchain/usr/lib/swift/macosx -L/usr/lib/swift -Xlinker -add_ast_path -Xlinker /Users/admin/builder/spi-builder-workspace/.derivedData/Build/Intermediates.noindex/SwiftPM.build/Debug/SPMLibc.build/Objects-normal/arm64/SPMLibc.swiftmodule -o /Users/admin/builder/spi-builder-workspace/.derivedData/Build/Products/Debug/SPMLibc.o
SwiftCompile normal arm64 Compiling\ exit.swift /Users/admin/builder/spi-builder-workspace/.dependencies/checkouts/swift-package-manager/Sources/POSIX/exit.swift (in target 'POSIX' from project 'SwiftPM')
SwiftCompile normal arm64 /Users/admin/builder/spi-builder-workspace/.dependencies/checkouts/swift-package-manager/Sources/POSIX/exit.swift (in target 'POSIX' from project 'SwiftPM')
cd /Users/admin/builder/spi-builder-workspace/.swiftpm/xcode
SwiftCompile normal arm64 Compiling\ Error.swift,\ chdir.swift /Users/admin/builder/spi-builder-workspace/.dependencies/checkouts/swift-package-manager/Sources/POSIX/Error.swift /Users/admin/builder/spi-builder-workspace/.dependencies/checkouts/swift-package-manager/Sources/POSIX/chdir.swift (in target 'POSIX' from project 'SwiftPM')
SwiftCompile normal arm64 /Users/admin/builder/spi-builder-workspace/.dependencies/checkouts/swift-package-manager/Sources/POSIX/Error.swift (in target 'POSIX' from project 'SwiftPM')
cd /Users/admin/builder/spi-builder-workspace/.swiftpm/xcode
SwiftCompile normal arm64 /Users/admin/builder/spi-builder-workspace/.dependencies/checkouts/swift-package-manager/Sources/POSIX/chdir.swift (in target 'POSIX' from project 'SwiftPM')
cd /Users/admin/builder/spi-builder-workspace/.swiftpm/xcode
SwiftCompile normal arm64 Compiling\ env.swift /Users/admin/builder/spi-builder-workspace/.dependencies/checkouts/swift-package-manager/Sources/POSIX/env.swift (in target 'POSIX' from project 'SwiftPM')
SwiftCompile normal arm64 /Users/admin/builder/spi-builder-workspace/.dependencies/checkouts/swift-package-manager/Sources/POSIX/env.swift (in target 'POSIX' from project 'SwiftPM')
cd /Users/admin/builder/spi-builder-workspace/.swiftpm/xcode
SwiftCompile normal arm64 Compiling\ getcwd.swift /Users/admin/builder/spi-builder-workspace/.dependencies/checkouts/swift-package-manager/Sources/POSIX/getcwd.swift (in target 'POSIX' from project 'SwiftPM')
SwiftCompile normal arm64 /Users/admin/builder/spi-builder-workspace/.dependencies/checkouts/swift-package-manager/Sources/POSIX/getcwd.swift (in target 'POSIX' from project 'SwiftPM')
cd /Users/admin/builder/spi-builder-workspace/.swiftpm/xcode
SwiftEmitModule normal arm64 Emitting\ module\ for\ POSIX (in target 'POSIX' from project 'SwiftPM')
EmitSwiftModule normal arm64 (in target 'POSIX' from project 'SwiftPM')
cd /Users/admin/builder/spi-builder-workspace/.swiftpm/xcode
SwiftCompile normal arm64 Compiling\ usleep.swift /Users/admin/builder/spi-builder-workspace/.dependencies/checkouts/swift-package-manager/Sources/POSIX/usleep.swift (in target 'POSIX' from project 'SwiftPM')
SwiftCompile normal arm64 /Users/admin/builder/spi-builder-workspace/.dependencies/checkouts/swift-package-manager/Sources/POSIX/usleep.swift (in target 'POSIX' from project 'SwiftPM')
cd /Users/admin/builder/spi-builder-workspace/.swiftpm/xcode
SwiftCompile normal arm64 Compiling\ readdir.swift /Users/admin/builder/spi-builder-workspace/.dependencies/checkouts/swift-package-manager/Sources/POSIX/readdir.swift (in target 'POSIX' from project 'SwiftPM')
SwiftCompile normal arm64 /Users/admin/builder/spi-builder-workspace/.dependencies/checkouts/swift-package-manager/Sources/POSIX/readdir.swift (in target 'POSIX' from project 'SwiftPM')
cd /Users/admin/builder/spi-builder-workspace/.swiftpm/xcode
SwiftDriverJobDiscovery normal arm64 Compiling exit.swift (in target 'POSIX' from project 'SwiftPM')
SwiftCompile normal arm64 Compiling\ isatty.swift /Users/admin/builder/spi-builder-workspace/.dependencies/checkouts/swift-package-manager/Sources/POSIX/isatty.swift (in target 'POSIX' from project 'SwiftPM')
SwiftCompile normal arm64 /Users/admin/builder/spi-builder-workspace/.dependencies/checkouts/swift-package-manager/Sources/POSIX/isatty.swift (in target 'POSIX' from project 'SwiftPM')
cd /Users/admin/builder/spi-builder-workspace/.swiftpm/xcode
SwiftDriverJobDiscovery normal arm64 Emitting module for POSIX (in target 'POSIX' from project 'SwiftPM')
SwiftDriver\ Compilation\ Requirements POSIX normal arm64 com.apple.xcode.tools.swift.compiler (in target 'POSIX' from project 'SwiftPM')
cd /Users/admin/builder/spi-builder-workspace/.swiftpm/xcode
builtin-Swift-Compilation-Requirements -- /Applications/Xcode-16.3.0.app/Contents/Developer/Toolchains/XcodeDefault.xctoolchain/usr/bin/swiftc -module-name POSIX -Onone -enforce-exclusivity\=checked @/Users/admin/builder/spi-builder-workspace/.derivedData/Build/Intermediates.noindex/SwiftPM.build/Debug/POSIX.build/Objects-normal/arm64/POSIX.SwiftFileList -DSWIFT_PACKAGE -DDEBUG -DXcode -plugin-path /Applications/Xcode-16.3.0.app/Contents/Developer/Toolchains/XcodeDefault.xctoolchain/usr/lib/swift/host/plugins/testing -enable-experimental-feature DebugDescriptionMacro -sdk /Applications/Xcode-16.3.0.app/Contents/Developer/Platforms/MacOSX.platform/Developer/SDKs/MacOSX15.4.sdk -target arm64-apple-macos10.13 -g -module-cache-path /Users/admin/builder/spi-builder-workspace/.derivedData/ModuleCache.noindex -Xfrontend -serialize-debugging-options -profile-coverage-mapping -profile-generate -enable-testing -suppress-warnings -index-store-path /Users/admin/builder/spi-builder-workspace/.derivedData/Index.noindex/DataStore -swift-version 4.2 -I /Users/admin/builder/spi-builder-workspace/.derivedData/Build/Products/Debug -I /Applications/Xcode-16.3.0.app/Contents/Developer/Platforms/MacOSX.platform/Developer/usr/lib -F /Users/admin/builder/spi-builder-workspace/.derivedData/Build/Products/Debug/PackageFrameworks -F /Users/admin/builder/spi-builder-workspace/.derivedData/Build/Products/Debug/PackageFrameworks -F /Users/admin/builder/spi-builder-workspace/.derivedData/Build/Products/Debug -F /Applications/Xcode-16.3.0.app/Contents/Developer/Platforms/MacOSX.platform/Developer/Library/Frameworks -c -j10 -enable-batch-mode -incremental -Xcc -ivfsstatcache -Xcc /Users/admin/builder/spi-builder-workspace/.derivedData/SDKStatCaches.noindex/macosx15.4-24E241-8287b8f5db97e746a1562fbca0c9d29b.sdkstatcache -output-file-map /Users/admin/builder/spi-builder-workspace/.derivedData/Build/Intermediates.noindex/SwiftPM.build/Debug/POSIX.build/Objects-normal/arm64/POSIX-OutputFileMap.json -use-frontend-parseable-output -save-temps -no-color-diagnostics -serialize-diagnostics -emit-dependencies -emit-module -emit-module-path /Users/admin/builder/spi-builder-workspace/.derivedData/Build/Intermediates.noindex/SwiftPM.build/Debug/POSIX.build/Objects-normal/arm64/POSIX.swiftmodule -validate-clang-modules-once -clang-build-session-file /Users/admin/builder/spi-builder-workspace/.derivedData/ModuleCache.noindex/Session.modulevalidation -Xcc -I/Users/admin/builder/spi-builder-workspace/.derivedData/Build/Intermediates.noindex/SwiftPM.build/Debug/POSIX.build/swift-overrides.hmap -emit-const-values -Xfrontend -const-gather-protocols-file -Xfrontend /Users/admin/builder/spi-builder-workspace/.derivedData/Build/Intermediates.noindex/SwiftPM.build/Debug/POSIX.build/Objects-normal/arm64/POSIX_const_extract_protocols.json -Xcc -I/Users/admin/builder/spi-builder-workspace/.dependencies/checkouts/swift-package-manager/Sources/clibc/include -Xcc -I/Users/admin/builder/spi-builder-workspace/.derivedData/Build/Products/Debug/include -Xcc -I/Users/admin/builder/spi-builder-workspace/.derivedData/Build/Intermediates.noindex/SwiftPM.build/Debug/POSIX.build/DerivedSources-normal/arm64 -Xcc -I/Users/admin/builder/spi-builder-workspace/.derivedData/Build/Intermediates.noindex/SwiftPM.build/Debug/POSIX.build/DerivedSources/arm64 -Xcc -I/Users/admin/builder/spi-builder-workspace/.derivedData/Build/Intermediates.noindex/SwiftPM.build/Debug/POSIX.build/DerivedSources -Xcc -DSWIFT_PACKAGE -Xcc -DDEBUG\=1 -emit-objc-header -emit-objc-header-path /Users/admin/builder/spi-builder-workspace/.derivedData/Build/Intermediates.noindex/SwiftPM.build/Debug/POSIX.build/Objects-normal/arm64/POSIX-Swift.h -working-directory /Users/admin/builder/spi-builder-workspace/.swiftpm/xcode -experimental-emit-module-separately -disable-cmo
SwiftDriverJobDiscovery normal arm64 Compiling usleep.swift (in target 'POSIX' from project 'SwiftPM')
SwiftCompile normal arm64 Compiling\ rename.swift /Users/admin/builder/spi-builder-workspace/.dependencies/checkouts/swift-package-manager/Sources/POSIX/rename.swift (in target 'POSIX' from project 'SwiftPM')
SwiftCompile normal arm64 /Users/admin/builder/spi-builder-workspace/.dependencies/checkouts/swift-package-manager/Sources/POSIX/rename.swift (in target 'POSIX' from project 'SwiftPM')
cd /Users/admin/builder/spi-builder-workspace/.swiftpm/xcode
Copy /Users/admin/builder/spi-builder-workspace/.derivedData/Build/Products/Debug/POSIX.swiftmodule/arm64-apple-macos.abi.json /Users/admin/builder/spi-builder-workspace/.derivedData/Build/Intermediates.noindex/SwiftPM.build/Debug/POSIX.build/Objects-normal/arm64/POSIX.abi.json (in target 'POSIX' from project 'SwiftPM')
cd /Users/admin/builder/spi-builder-workspace/.dependencies/checkouts/swift-package-manager
builtin-copy -exclude .DS_Store -exclude CVS -exclude .svn -exclude .git -exclude .hg -resolve-src-symlinks -rename /Users/admin/builder/spi-builder-workspace/.derivedData/Build/Intermediates.noindex/SwiftPM.build/Debug/POSIX.build/Objects-normal/arm64/POSIX.abi.json /Users/admin/builder/spi-builder-workspace/.derivedData/Build/Products/Debug/POSIX.swiftmodule/arm64-apple-macos.abi.json
SwiftDriverJobDiscovery normal arm64 Compiling env.swift (in target 'POSIX' from project 'SwiftPM')
SwiftCompile normal arm64 Compiling\ stat.swift /Users/admin/builder/spi-builder-workspace/.dependencies/checkouts/swift-package-manager/Sources/POSIX/stat.swift (in target 'POSIX' from project 'SwiftPM')
SwiftCompile normal arm64 /Users/admin/builder/spi-builder-workspace/.dependencies/checkouts/swift-package-manager/Sources/POSIX/stat.swift (in target 'POSIX' from project 'SwiftPM')
cd /Users/admin/builder/spi-builder-workspace/.swiftpm/xcode
SwiftDriverJobDiscovery normal arm64 Compiling getcwd.swift (in target 'POSIX' from project 'SwiftPM')
SwiftCompile normal arm64 Compiling\ realpath.swift /Users/admin/builder/spi-builder-workspace/.dependencies/checkouts/swift-package-manager/Sources/POSIX/realpath.swift (in target 'POSIX' from project 'SwiftPM')
SwiftCompile normal arm64 /Users/admin/builder/spi-builder-workspace/.dependencies/checkouts/swift-package-manager/Sources/POSIX/realpath.swift (in target 'POSIX' from project 'SwiftPM')
cd /Users/admin/builder/spi-builder-workspace/.swiftpm/xcode
SwiftDriverJobDiscovery normal arm64 Compiling Error.swift, chdir.swift (in target 'POSIX' from project 'SwiftPM')
SwiftDriver Basic normal arm64 com.apple.xcode.tools.swift.compiler (in target 'Basic' from project 'SwiftPM')
cd /Users/admin/builder/spi-builder-workspace/.swiftpm/xcode
builtin-SwiftDriver -- /Applications/Xcode-16.3.0.app/Contents/Developer/Toolchains/XcodeDefault.xctoolchain/usr/bin/swiftc -module-name Basic -Onone -enforce-exclusivity\=checked @/Users/admin/builder/spi-builder-workspace/.derivedData/Build/Intermediates.noindex/SwiftPM.build/Debug/Basic.build/Objects-normal/arm64/Basic.SwiftFileList -DSWIFT_PACKAGE -DDEBUG -DXcode -plugin-path /Applications/Xcode-16.3.0.app/Contents/Developer/Toolchains/XcodeDefault.xctoolchain/usr/lib/swift/host/plugins/testing -enable-experimental-feature DebugDescriptionMacro -sdk /Applications/Xcode-16.3.0.app/Contents/Developer/Platforms/MacOSX.platform/Developer/SDKs/MacOSX15.4.sdk -target arm64-apple-macos10.13 -g -module-cache-path /Users/admin/builder/spi-builder-workspace/.derivedData/ModuleCache.noindex -Xfrontend -serialize-debugging-options -profile-coverage-mapping -profile-generate -enable-testing -suppress-warnings -index-store-path /Users/admin/builder/spi-builder-workspace/.derivedData/Index.noindex/DataStore -swift-version 4.2 -I /Users/admin/builder/spi-builder-workspace/.derivedData/Build/Products/Debug -I /Applications/Xcode-16.3.0.app/Contents/Developer/Platforms/MacOSX.platform/Developer/usr/lib -F /Users/admin/builder/spi-builder-workspace/.derivedData/Build/Products/Debug/PackageFrameworks -F /Users/admin/builder/spi-builder-workspace/.derivedData/Build/Products/Debug/PackageFrameworks -F /Users/admin/builder/spi-builder-workspace/.derivedData/Build/Products/Debug/PackageFrameworks -F /Users/admin/builder/spi-builder-workspace/.derivedData/Build/Products/Debug -F /Applications/Xcode-16.3.0.app/Contents/Developer/Platforms/MacOSX.platform/Developer/Library/Frameworks -c -j10 -enable-batch-mode -incremental -Xcc -ivfsstatcache -Xcc /Users/admin/builder/spi-builder-workspace/.derivedData/SDKStatCaches.noindex/macosx15.4-24E241-8287b8f5db97e746a1562fbca0c9d29b.sdkstatcache -output-file-map /Users/admin/builder/spi-builder-workspace/.derivedData/Build/Intermediates.noindex/SwiftPM.build/Debug/Basic.build/Objects-normal/arm64/Basic-OutputFileMap.json -use-frontend-parseable-output -save-temps -no-color-diagnostics -serialize-diagnostics -emit-dependencies -emit-module -emit-module-path /Users/admin/builder/spi-builder-workspace/.derivedData/Build/Intermediates.noindex/SwiftPM.build/Debug/Basic.build/Objects-normal/arm64/Basic.swiftmodule -validate-clang-modules-once -clang-build-session-file /Users/admin/builder/spi-builder-workspace/.derivedData/ModuleCache.noindex/Session.modulevalidation -Xcc -I/Users/admin/builder/spi-builder-workspace/.derivedData/Build/Intermediates.noindex/SwiftPM.build/Debug/Basic.build/swift-overrides.hmap -emit-const-values -Xfrontend -const-gather-protocols-file -Xfrontend /Users/admin/builder/spi-builder-workspace/.derivedData/Build/Intermediates.noindex/SwiftPM.build/Debug/Basic.build/Objects-normal/arm64/Basic_const_extract_protocols.json -Xcc -I/Users/admin/builder/spi-builder-workspace/.dependencies/checkouts/swift-package-manager/Sources/clibc/include -Xcc -I/Users/admin/builder/spi-builder-workspace/.derivedData/Build/Products/Debug/include -Xcc -I/Users/admin/builder/spi-builder-workspace/.derivedData/Build/Intermediates.noindex/SwiftPM.build/Debug/Basic.build/DerivedSources-normal/arm64 -Xcc -I/Users/admin/builder/spi-builder-workspace/.derivedData/Build/Intermediates.noindex/SwiftPM.build/Debug/Basic.build/DerivedSources/arm64 -Xcc -I/Users/admin/builder/spi-builder-workspace/.derivedData/Build/Intermediates.noindex/SwiftPM.build/Debug/Basic.build/DerivedSources -Xcc -DSWIFT_PACKAGE -Xcc -DDEBUG\=1 -emit-objc-header -emit-objc-header-path /Users/admin/builder/spi-builder-workspace/.derivedData/Build/Intermediates.noindex/SwiftPM.build/Debug/Basic.build/Objects-normal/arm64/Basic-Swift.h -working-directory /Users/admin/builder/spi-builder-workspace/.swiftpm/xcode -experimental-emit-module-separately -disable-cmo
ExtractAppIntentsMetadata (in target 'SPMLibc' from project 'SwiftPM')
cd /Users/admin/builder/spi-builder-workspace/.dependencies/checkouts/swift-package-manager
/Applications/Xcode-16.3.0.app/Contents/Developer/Toolchains/XcodeDefault.xctoolchain/usr/bin/appintentsmetadataprocessor --toolchain-dir /Applications/Xcode-16.3.0.app/Contents/Developer/Toolchains/XcodeDefault.xctoolchain --module-name SPMLibc --sdk-root /Applications/Xcode-16.3.0.app/Contents/Developer/Platforms/MacOSX.platform/Developer/SDKs/MacOSX15.4.sdk --xcode-version 16E140 --platform-family macOS --deployment-target 10.13 --bundle-identifier swift-package-manager.SPMLibc --output /Users/admin/builder/spi-builder-workspace/.derivedData/Build/Products/Debug/SPMLibc.appintents --target-triple arm64-apple-macos10.13 --binary-file /Users/admin/builder/spi-builder-workspace/.derivedData/Build/Products/Debug/SPMLibc.o --dependency-file /Users/admin/builder/spi-builder-workspace/.derivedData/Build/Intermediates.noindex/SwiftPM.build/Debug/SPMLibc.build/Objects-normal/arm64/SPMLibc_dependency_info.dat --stringsdata-file /Users/admin/builder/spi-builder-workspace/.derivedData/Build/Intermediates.noindex/SwiftPM.build/Debug/SPMLibc.build/Objects-normal/arm64/ExtractedAppShortcutsMetadata.stringsdata --source-file-list /Users/admin/builder/spi-builder-workspace/.derivedData/Build/Intermediates.noindex/SwiftPM.build/Debug/SPMLibc.build/Objects-normal/arm64/SPMLibc.SwiftFileList --metadata-file-list /Users/admin/builder/spi-builder-workspace/.derivedData/Build/Intermediates.noindex/SwiftPM.build/Debug/SPMLibc.build/SPMLibc.DependencyMetadataFileList --static-metadata-file-list /Users/admin/builder/spi-builder-workspace/.derivedData/Build/Intermediates.noindex/SwiftPM.build/Debug/SPMLibc.build/SPMLibc.DependencyStaticMetadataFileList --swift-const-vals-list /Users/admin/builder/spi-builder-workspace/.derivedData/Build/Intermediates.noindex/SwiftPM.build/Debug/SPMLibc.build/Objects-normal/arm64/SPMLibc.SwiftConstValuesFileList --force --compile-time-extraction --deployment-aware-processing --validate-assistant-intents --no-app-shortcuts-localization
2025-04-26 00:07:02.406 appintentsmetadataprocessor[888:4997] Starting appintentsmetadataprocessor export
2025-04-26 00:07:02.451 appintentsmetadataprocessor[888:4997] Extracted no relevant App Intents symbols, skipping writing output
SwiftEmitModule normal arm64 Emitting\ module\ for\ Basic (in target 'Basic' from project 'SwiftPM')
EmitSwiftModule normal arm64 (in target 'Basic' from project 'SwiftPM')
cd /Users/admin/builder/spi-builder-workspace/.swiftpm/xcode
SwiftDriverJobDiscovery normal arm64 Compiling isatty.swift (in target 'POSIX' from project 'SwiftPM')
SwiftCompile normal arm64 Compiling\ CollectionAlgorithms.swift,\ CollectionExtensions.swift,\ Condition.swift,\ DeltaAlgorithm.swift /Users/admin/builder/spi-builder-workspace/.dependencies/checkouts/swift-package-manager/Sources/Basic/CollectionAlgorithms.swift /Users/admin/builder/spi-builder-workspace/.dependencies/checkouts/swift-package-manager/Sources/Basic/CollectionExtensions.swift /Users/admin/builder/spi-builder-workspace/.dependencies/checkouts/swift-package-manager/Sources/Basic/Condition.swift /Users/admin/builder/spi-builder-workspace/.dependencies/checkouts/swift-package-manager/Sources/Basic/DeltaAlgorithm.swift (in target 'Basic' from project 'SwiftPM')
SwiftCompile normal arm64 /Users/admin/builder/spi-builder-workspace/.dependencies/checkouts/swift-package-manager/Sources/Basic/CollectionAlgorithms.swift (in target 'Basic' from project 'SwiftPM')
cd /Users/admin/builder/spi-builder-workspace/.swiftpm/xcode
SwiftCompile normal arm64 /Users/admin/builder/spi-builder-workspace/.dependencies/checkouts/swift-package-manager/Sources/Basic/CollectionExtensions.swift (in target 'Basic' from project 'SwiftPM')
cd /Users/admin/builder/spi-builder-workspace/.swiftpm/xcode
SwiftCompile normal arm64 /Users/admin/builder/spi-builder-workspace/.dependencies/checkouts/swift-package-manager/Sources/Basic/Condition.swift (in target 'Basic' from project 'SwiftPM')
cd /Users/admin/builder/spi-builder-workspace/.swiftpm/xcode
SwiftCompile normal arm64 /Users/admin/builder/spi-builder-workspace/.dependencies/checkouts/swift-package-manager/Sources/Basic/DeltaAlgorithm.swift (in target 'Basic' from project 'SwiftPM')
cd /Users/admin/builder/spi-builder-workspace/.swiftpm/xcode
SwiftDriverJobDiscovery normal arm64 Compiling rename.swift (in target 'POSIX' from project 'SwiftPM')
SwiftCompile normal arm64 Compiling\ Result.swift,\ SHA256.swift,\ SortedArray.swift,\ StringConversions.swift /Users/admin/builder/spi-builder-workspace/.dependencies/checkouts/swift-package-manager/Sources/Basic/Result.swift /Users/admin/builder/spi-builder-workspace/.dependencies/checkouts/swift-package-manager/Sources/Basic/SHA256.swift /Users/admin/builder/spi-builder-workspace/.dependencies/checkouts/swift-package-manager/Sources/Basic/SortedArray.swift /Users/admin/builder/spi-builder-workspace/.dependencies/checkouts/swift-package-manager/Sources/Basic/StringConversions.swift (in target 'Basic' from project 'SwiftPM')
SwiftCompile normal arm64 /Users/admin/builder/spi-builder-workspace/.dependencies/checkouts/swift-package-manager/Sources/Basic/Result.swift (in target 'Basic' from project 'SwiftPM')
cd /Users/admin/builder/spi-builder-workspace/.swiftpm/xcode
SwiftCompile normal arm64 /Users/admin/builder/spi-builder-workspace/.dependencies/checkouts/swift-package-manager/Sources/Basic/SHA256.swift (in target 'Basic' from project 'SwiftPM')
cd /Users/admin/builder/spi-builder-workspace/.swiftpm/xcode
SwiftCompile normal arm64 /Users/admin/builder/spi-builder-workspace/.dependencies/checkouts/swift-package-manager/Sources/Basic/SortedArray.swift (in target 'Basic' from project 'SwiftPM')
cd /Users/admin/builder/spi-builder-workspace/.swiftpm/xcode
SwiftCompile normal arm64 /Users/admin/builder/spi-builder-workspace/.dependencies/checkouts/swift-package-manager/Sources/Basic/StringConversions.swift (in target 'Basic' from project 'SwiftPM')
cd /Users/admin/builder/spi-builder-workspace/.swiftpm/xcode
SwiftDriverJobDiscovery normal arm64 Compiling readdir.swift (in target 'POSIX' from project 'SwiftPM')
SwiftCompile normal arm64 Compiling\ OrderedDictionary.swift,\ OrderedSet.swift,\ OutputByteStream.swift,\ Path.swift /Users/admin/builder/spi-builder-workspace/.dependencies/checkouts/swift-package-manager/Sources/Basic/OrderedDictionary.swift /Users/admin/builder/spi-builder-workspace/.dependencies/checkouts/swift-package-manager/Sources/Basic/OrderedSet.swift /Users/admin/builder/spi-builder-workspace/.dependencies/checkouts/swift-package-manager/Sources/Basic/OutputByteStream.swift /Users/admin/builder/spi-builder-workspace/.dependencies/checkouts/swift-package-manager/Sources/Basic/Path.swift (in target 'Basic' from project 'SwiftPM')
SwiftCompile normal arm64 /Users/admin/builder/spi-builder-workspace/.dependencies/checkouts/swift-package-manager/Sources/Basic/OrderedDictionary.swift (in target 'Basic' from project 'SwiftPM')
cd /Users/admin/builder/spi-builder-workspace/.swiftpm/xcode
SwiftCompile normal arm64 /Users/admin/builder/spi-builder-workspace/.dependencies/checkouts/swift-package-manager/Sources/Basic/OrderedSet.swift (in target 'Basic' from project 'SwiftPM')
cd /Users/admin/builder/spi-builder-workspace/.swiftpm/xcode
SwiftCompile normal arm64 /Users/admin/builder/spi-builder-workspace/.dependencies/checkouts/swift-package-manager/Sources/Basic/OutputByteStream.swift (in target 'Basic' from project 'SwiftPM')
cd /Users/admin/builder/spi-builder-workspace/.swiftpm/xcode
SwiftCompile normal arm64 /Users/admin/builder/spi-builder-workspace/.dependencies/checkouts/swift-package-manager/Sources/Basic/Path.swift (in target 'Basic' from project 'SwiftPM')
cd /Users/admin/builder/spi-builder-workspace/.swiftpm/xcode
SwiftDriverJobDiscovery normal arm64 Compiling realpath.swift (in target 'POSIX' from project 'SwiftPM')
SwiftCompile normal arm64 Compiling\ DiagnosticsEngine.swift,\ DictionaryExtensions.swift,\ DictionaryLiteralExtensions.swift,\ EditDistance.swift /Users/admin/builder/spi-builder-workspace/.dependencies/checkouts/swift-package-manager/Sources/Basic/DiagnosticsEngine.swift /Users/admin/builder/spi-builder-workspace/.dependencies/checkouts/swift-package-manager/Sources/Basic/DictionaryExtensions.swift /Users/admin/builder/spi-builder-workspace/.dependencies/checkouts/swift-package-manager/Sources/Basic/DictionaryLiteralExtensions.swift /Users/admin/builder/spi-builder-workspace/.dependencies/checkouts/swift-package-manager/Sources/Basic/EditDistance.swift (in target 'Basic' from project 'SwiftPM')
SwiftCompile normal arm64 /Users/admin/builder/spi-builder-workspace/.dependencies/checkouts/swift-package-manager/Sources/Basic/DiagnosticsEngine.swift (in target 'Basic' from project 'SwiftPM')
cd /Users/admin/builder/spi-builder-workspace/.swiftpm/xcode
SwiftCompile normal arm64 /Users/admin/builder/spi-builder-workspace/.dependencies/checkouts/swift-package-manager/Sources/Basic/DictionaryExtensions.swift (in target 'Basic' from project 'SwiftPM')
cd /Users/admin/builder/spi-builder-workspace/.swiftpm/xcode
SwiftCompile normal arm64 /Users/admin/builder/spi-builder-workspace/.dependencies/checkouts/swift-package-manager/Sources/Basic/DictionaryLiteralExtensions.swift (in target 'Basic' from project 'SwiftPM')
cd /Users/admin/builder/spi-builder-workspace/.swiftpm/xcode
SwiftCompile normal arm64 /Users/admin/builder/spi-builder-workspace/.dependencies/checkouts/swift-package-manager/Sources/Basic/EditDistance.swift (in target 'Basic' from project 'SwiftPM')
cd /Users/admin/builder/spi-builder-workspace/.swiftpm/xcode
SwiftDriverJobDiscovery normal arm64 Compiling stat.swift (in target 'POSIX' from project 'SwiftPM')
SwiftDriver\ Compilation POSIX normal arm64 com.apple.xcode.tools.swift.compiler (in target 'POSIX' from project 'SwiftPM')
cd /Users/admin/builder/spi-builder-workspace/.swiftpm/xcode
builtin-Swift-Compilation -- /Applications/Xcode-16.3.0.app/Contents/Developer/Toolchains/XcodeDefault.xctoolchain/usr/bin/swiftc -module-name POSIX -Onone -enforce-exclusivity\=checked @/Users/admin/builder/spi-builder-workspace/.derivedData/Build/Intermediates.noindex/SwiftPM.build/Debug/POSIX.build/Objects-normal/arm64/POSIX.SwiftFileList -DSWIFT_PACKAGE -DDEBUG -DXcode -plugin-path /Applications/Xcode-16.3.0.app/Contents/Developer/Toolchains/XcodeDefault.xctoolchain/usr/lib/swift/host/plugins/testing -enable-experimental-feature DebugDescriptionMacro -sdk /Applications/Xcode-16.3.0.app/Contents/Developer/Platforms/MacOSX.platform/Developer/SDKs/MacOSX15.4.sdk -target arm64-apple-macos10.13 -g -module-cache-path /Users/admin/builder/spi-builder-workspace/.derivedData/ModuleCache.noindex -Xfrontend -serialize-debugging-options -profile-coverage-mapping -profile-generate -enable-testing -suppress-warnings -index-store-path /Users/admin/builder/spi-builder-workspace/.derivedData/Index.noindex/DataStore -swift-version 4.2 -I /Users/admin/builder/spi-builder-workspace/.derivedData/Build/Products/Debug -I /Applications/Xcode-16.3.0.app/Contents/Developer/Platforms/MacOSX.platform/Developer/usr/lib -F /Users/admin/builder/spi-builder-workspace/.derivedData/Build/Products/Debug/PackageFrameworks -F /Users/admin/builder/spi-builder-workspace/.derivedData/Build/Products/Debug/PackageFrameworks -F /Users/admin/builder/spi-builder-workspace/.derivedData/Build/Products/Debug -F /Applications/Xcode-16.3.0.app/Contents/Developer/Platforms/MacOSX.platform/Developer/Library/Frameworks -c -j10 -enable-batch-mode -incremental -Xcc -ivfsstatcache -Xcc /Users/admin/builder/spi-builder-workspace/.derivedData/SDKStatCaches.noindex/macosx15.4-24E241-8287b8f5db97e746a1562fbca0c9d29b.sdkstatcache -output-file-map /Users/admin/builder/spi-builder-workspace/.derivedData/Build/Intermediates.noindex/SwiftPM.build/Debug/POSIX.build/Objects-normal/arm64/POSIX-OutputFileMap.json -use-frontend-parseable-output -save-temps -no-color-diagnostics -serialize-diagnostics -emit-dependencies -emit-module -emit-module-path /Users/admin/builder/spi-builder-workspace/.derivedData/Build/Intermediates.noindex/SwiftPM.build/Debug/POSIX.build/Objects-normal/arm64/POSIX.swiftmodule -validate-clang-modules-once -clang-build-session-file /Users/admin/builder/spi-builder-workspace/.derivedData/ModuleCache.noindex/Session.modulevalidation -Xcc -I/Users/admin/builder/spi-builder-workspace/.derivedData/Build/Intermediates.noindex/SwiftPM.build/Debug/POSIX.build/swift-overrides.hmap -emit-const-values -Xfrontend -const-gather-protocols-file -Xfrontend /Users/admin/builder/spi-builder-workspace/.derivedData/Build/Intermediates.noindex/SwiftPM.build/Debug/POSIX.build/Objects-normal/arm64/POSIX_const_extract_protocols.json -Xcc -I/Users/admin/builder/spi-builder-workspace/.dependencies/checkouts/swift-package-manager/Sources/clibc/include -Xcc -I/Users/admin/builder/spi-builder-workspace/.derivedData/Build/Products/Debug/include -Xcc -I/Users/admin/builder/spi-builder-workspace/.derivedData/Build/Intermediates.noindex/SwiftPM.build/Debug/POSIX.build/DerivedSources-normal/arm64 -Xcc -I/Users/admin/builder/spi-builder-workspace/.derivedData/Build/Intermediates.noindex/SwiftPM.build/Debug/POSIX.build/DerivedSources/arm64 -Xcc -I/Users/admin/builder/spi-builder-workspace/.derivedData/Build/Intermediates.noindex/SwiftPM.build/Debug/POSIX.build/DerivedSources -Xcc -DSWIFT_PACKAGE -Xcc -DDEBUG\=1 -emit-objc-header -emit-objc-header-path /Users/admin/builder/spi-builder-workspace/.derivedData/Build/Intermediates.noindex/SwiftPM.build/Debug/POSIX.build/Objects-normal/arm64/POSIX-Swift.h -working-directory /Users/admin/builder/spi-builder-workspace/.swiftpm/xcode -experimental-emit-module-separately -disable-cmo
SwiftCompile normal arm64 Compiling\ Await.swift,\ ByteString.swift,\ CStringArray.swift,\ CacheableSequence.swift /Users/admin/builder/spi-builder-workspace/.dependencies/checkouts/swift-package-manager/Sources/Basic/Await.swift /Users/admin/builder/spi-builder-workspace/.dependencies/checkouts/swift-package-manager/Sources/Basic/ByteString.swift /Users/admin/builder/spi-builder-workspace/.dependencies/checkouts/swift-package-manager/Sources/Basic/CStringArray.swift /Users/admin/builder/spi-builder-workspace/.dependencies/checkouts/swift-package-manager/Sources/Basic/CacheableSequence.swift (in target 'Basic' from project 'SwiftPM')
Failed frontend command:
/Applications/Xcode-16.3.0.app/Contents/Developer/Toolchains/XcodeDefault.xctoolchain/usr/bin/swift-frontend -frontend -c -primary-file /Users/admin/builder/spi-builder-workspace/.dependencies/checkouts/swift-package-manager/Sources/Basic/Await.swift -primary-file /Users/admin/builder/spi-builder-workspace/.dependencies/checkouts/swift-package-manager/Sources/Basic/ByteString.swift -primary-file /Users/admin/builder/spi-builder-workspace/.dependencies/checkouts/swift-package-manager/Sources/Basic/CStringArray.swift -primary-file /Users/admin/builder/spi-builder-workspace/.dependencies/checkouts/swift-package-manager/Sources/Basic/CacheableSequence.swift /Users/admin/builder/spi-builder-workspace/.dependencies/checkouts/swift-package-manager/Sources/Basic/CollectionAlgorithms.swift /Users/admin/builder/spi-builder-workspace/.dependencies/checkouts/swift-package-manager/Sources/Basic/CollectionExtensions.swift /Users/admin/builder/spi-builder-workspace/.dependencies/checkouts/swift-package-manager/Sources/Basic/Condition.swift /Users/admin/builder/spi-builder-workspace/.dependencies/checkouts/swift-package-manager/Sources/Basic/DeltaAlgorithm.swift /Users/admin/builder/spi-builder-workspace/.dependencies/checkouts/swift-package-manager/Sources/Basic/DiagnosticsEngine.swift /Users/admin/builder/spi-builder-workspace/.dependencies/checkouts/swift-package-manager/Sources/Basic/DictionaryExtensions.swift /Users/admin/builder/spi-builder-workspace/.dependencies/checkouts/swift-package-manager/Sources/Basic/DictionaryLiteralExtensions.swift /Users/admin/builder/spi-builder-workspace/.dependencies/checkouts/swift-package-manager/Sources/Basic/EditDistance.swift /Users/admin/builder/spi-builder-workspace/.dependencies/checkouts/swift-package-manager/Sources/Basic/FileSystem.swift /Users/admin/builder/spi-builder-workspace/.dependencies/checkouts/swift-package-manager/Sources/Basic/GraphAlgorithms.swift /Users/admin/builder/spi-builder-workspace/.dependencies/checkouts/swift-package-manager/Sources/Basic/JSON.swift /Users/admin/builder/spi-builder-workspace/.dependencies/checkouts/swift-package-manager/Sources/Basic/JSONMapper.swift /Users/admin/builder/spi-builder-workspace/.dependencies/checkouts/swift-package-manager/Sources/Basic/KeyedPair.swift /Users/admin/builder/spi-builder-workspace/.dependencies/checkouts/swift-package-manager/Sources/Basic/LazyCache.swift /Users/admin/builder/spi-builder-workspace/.dependencies/checkouts/swift-package-manager/Sources/Basic/Lock.swift /Users/admin/builder/spi-builder-workspace/.dependencies/checkouts/swift-package-manager/Sources/Basic/ObjectIdentifierProtocol.swift /Users/admin/builder/spi-builder-workspace/.dependencies/checkouts/swift-package-manager/Sources/Basic/OrderedDictionary.swift /Users/admin/builder/spi-builder-workspace/.dependencies/checkouts/swift-package-manager/Sources/Basic/OrderedSet.swift /Users/admin/builder/spi-builder-workspace/.dependencies/checkouts/swift-package-manager/Sources/Basic/OutputByteStream.swift /Users/admin/builder/spi-builder-workspace/.dependencies/checkouts/swift-package-manager/Sources/Basic/Path.swift /Users/admin/builder/spi-builder-workspace/.dependencies/checkouts/swift-package-manager/Sources/Basic/PathShims.swift /Users/admin/builder/spi-builder-workspace/.dependencies/checkouts/swift-package-manager/Sources/Basic/Process.swift /Users/admin/builder/spi-builder-workspace/.dependencies/checkouts/swift-package-manager/Sources/Basic/ProcessSet.swift /Users/admin/builder/spi-builder-workspace/.dependencies/checkouts/swift-package-manager/Sources/Basic/RegEx.swift /Users/admin/builder/spi-builder-workspace/.dependencies/checkouts/swift-package-manager/Sources/Basic/Result.swift /Users/admin/builder/spi-builder-workspace/.dependencies/checkouts/swift-package-manager/Sources/Basic/SHA256.swift /Users/admin/builder/spi-builder-workspace/.dependencies/checkouts/swift-package-manager/Sources/Basic/SortedArray.swift /Users/admin/builder/spi-builder-workspace/.dependencies/checkouts/swift-package-manager/Sources/Basic/StringConversions.swift /Users/admin/builder/spi-builder-workspace/.dependencies/checkouts/swift-package-manager/Sources/Basic/SynchronizedQueue.swift /Users/admin/builder/spi-builder-workspace/.dependencies/checkouts/swift-package-manager/Sources/Basic/TemporaryFile.swift /Users/admin/builder/spi-builder-workspace/.dependencies/checkouts/swift-package-manager/Sources/Basic/TerminalController.swift /Users/admin/builder/spi-builder-workspace/.dependencies/checkouts/swift-package-manager/Sources/Basic/Thread.swift /Users/admin/builder/spi-builder-workspace/.dependencies/checkouts/swift-package-manager/Sources/Basic/Tuple.swift /Users/admin/builder/spi-builder-workspace/.dependencies/checkouts/swift-package-manager/Sources/Basic/misc.swift -supplementary-output-file-map /Users/admin/builder/spi-builder-workspace/.derivedData/Build/Intermediates.noindex/SwiftPM.build/Debug/Basic.build/Objects-normal/arm64/supplementaryOutputs-1 -target arm64-apple-macos10.13 -Xllvm -aarch64-use-tbi -enable-objc-interop -sdk /Applications/Xcode-16.3.0.app/Contents/Developer/Platforms/MacOSX.platform/Developer/SDKs/MacOSX15.4.sdk -I /Users/admin/builder/spi-builder-workspace/.derivedData/Build/Products/Debug -I /Applications/Xcode-16.3.0.app/Contents/Developer/Platforms/MacOSX.platform/Developer/usr/lib -F /Users/admin/builder/spi-builder-workspace/.derivedData/Build/Products/Debug/PackageFrameworks -F /Users/admin/builder/spi-builder-workspace/.derivedData/Build/Products/Debug/PackageFrameworks -F /Users/admin/builder/spi-builder-workspace/.derivedData/Build/Products/Debug/PackageFrameworks -F /Users/admin/builder/spi-builder-workspace/.derivedData/Build/Products/Debug -F /Applications/Xcode-16.3.0.app/Contents/Developer/Platforms/MacOSX.platform/Developer/Library/Frameworks -no-color-diagnostics -enable-testing -g -debug-info-format\=dwarf -dwarf-version\=4 -module-cache-path /Users/admin/builder/spi-builder-workspace/.derivedData/ModuleCache.noindex -suppress-warnings -profile-generate -profile-coverage-mapping -swift-version 4.2 -enforce-exclusivity\=checked -Onone -D SWIFT_PACKAGE -D DEBUG -D Xcode -serialize-debugging-options -const-gather-protocols-file /Users/admin/builder/spi-builder-workspace/.derivedData/Build/Intermediates.noindex/SwiftPM.build/Debug/Basic.build/Objects-normal/arm64/Basic_const_extract_protocols.json -enable-experimental-feature DebugDescriptionMacro -empty-abi-descriptor -plugin-path /Applications/Xcode-16.3.0.app/Contents/Developer/Toolchains/XcodeDefault.xctoolchain/usr/lib/swift/host/plugins/testing -validate-clang-modules-once -clang-build-session-file /Users/admin/builder/spi-builder-workspace/.derivedData/ModuleCache.noindex/Session.modulevalidation -Xcc -working-directory -Xcc /Users/admin/builder/spi-builder-workspace/.swiftpm/xcode -resource-dir /Applications/Xcode-16.3.0.app/Contents/Developer/Toolchains/XcodeDefault.xctoolchain/usr/lib/swift -enable-anonymous-context-mangled-names -file-compilation-dir /Users/admin/builder/spi-builder-workspace/.swiftpm/xcode -Xcc -ivfsstatcache -Xcc /Users/admin/builder/spi-builder-workspace/.derivedData/SDKStatCaches.noindex/macosx15.4-24E241-8287b8f5db97e746a1562fbca0c9d29b.sdkstatcache -Xcc -I/Users/admin/builder/spi-builder-workspace/.derivedData/Build/Intermediates.noindex/SwiftPM.build/Debug/Basic.build/swift-overrides.hmap -Xcc -I/Users/admin/builder/spi-builder-workspace/.dependencies/checkouts/swift-package-manager/Sources/clibc/include -Xcc -I/Users/admin/builder/spi-builder-workspace/.derivedData/Build/Products/Debug/include -Xcc -I/Users/admin/builder/spi-builder-workspace/.derivedData/Build/Intermediates.noindex/SwiftPM.build/Debug/Basic.build/DerivedSources-normal/arm64 -Xcc -I/Users/admin/builder/spi-builder-workspace/.derivedData/Build/Intermediates.noindex/SwiftPM.build/Debug/Basic.build/DerivedSources/arm64 -Xcc -I/Users/admin/builder/spi-builder-workspace/.derivedData/Build/Intermediates.noindex/SwiftPM.build/Debug/Basic.build/DerivedSources -Xcc -DSWIFT_PACKAGE -Xcc -DDEBUG\=1 -module-name Basic -frontend-parseable-output -disable-clang-spi -target-sdk-version 15.4 -target-sdk-name macosx15.4 -external-plugin-path /Applications/Xcode-16.3.0.app/Contents/Developer/Platforms/MacOSX.platform/Developer/usr/lib/swift/host/plugins\#/Applications/Xcode-16.3.0.app/Contents/Developer/Platforms/MacOSX.platform/Developer/usr/bin/swift-plugin-server -external-plugin-path /Applications/Xcode-16.3.0.app/Contents/Developer/Platforms/MacOSX.platform/Developer/usr/local/lib/swift/host/plugins\#/Applications/Xcode-16.3.0.app/Contents/Developer/Platforms/MacOSX.platform/Developer/usr/bin/swift-plugin-server -in-process-plugin-server-path /Applications/Xcode-16.3.0.app/Contents/Developer/Toolchains/XcodeDefault.xctoolchain/usr/lib/swift/host/libSwiftInProcPluginServer.dylib -plugin-path /Applications/Xcode-16.3.0.app/Contents/Developer/Toolchains/XcodeDefault.xctoolchain/usr/lib/swift/host/plugins -plugin-path /Applications/Xcode-16.3.0.app/Contents/Developer/Toolchains/XcodeDefault.xctoolchain/usr/local/lib/swift/host/plugins -o /Users/admin/builder/spi-builder-workspace/.derivedData/Build/Intermediates.noindex/SwiftPM.build/Debug/Basic.build/Objects-normal/arm64/Await.o -o /Users/admin/builder/spi-builder-workspace/.derivedData/Build/Intermediates.noindex/SwiftPM.build/Debug/Basic.build/Objects-normal/arm64/ByteString.o -o /Users/admin/builder/spi-builder-workspace/.derivedData/Build/Intermediates.noindex/SwiftPM.build/Debug/Basic.build/Objects-normal/arm64/CStringArray.o -o /Users/admin/builder/spi-builder-workspace/.derivedData/Build/Intermediates.noindex/SwiftPM.build/Debug/Basic.build/Objects-normal/arm64/CacheableSequence.o -index-unit-output-path /SwiftPM.build/Debug/Basic.build/Objects-normal/arm64/Await.o -index-unit-output-path /SwiftPM.build/Debug/Basic.build/Objects-normal/arm64/ByteString.o -index-unit-output-path /SwiftPM.build/Debug/Basic.build/Objects-normal/arm64/CStringArray.o -index-unit-output-path /SwiftPM.build/Debug/Basic.build/Objects-normal/arm64/CacheableSequence.o -index-store-path /Users/admin/builder/spi-builder-workspace/.derivedData/Index.noindex/DataStore -index-system-modules
SwiftCompile normal arm64 /Users/admin/builder/spi-builder-workspace/.dependencies/checkouts/swift-package-manager/Sources/Basic/Await.swift (in target 'Basic' from project 'SwiftPM')
cd /Users/admin/builder/spi-builder-workspace/.swiftpm/xcode
/Users/admin/builder/spi-builder-workspace/.dependencies/checkouts/swift-package-manager/Sources/Basic/Await.swift:18:28: error: value of type '(@escaping (Result<T, ErrorType>) -> Void) -> Void' has no member 'dematerialize'
return try await(body).dematerialize()
~~~~~~ ^~~~~~~~~~~~~
SwiftCompile normal arm64 /Users/admin/builder/spi-builder-workspace/.dependencies/checkouts/swift-package-manager/Sources/Basic/ByteString.swift (in target 'Basic' from project 'SwiftPM')
cd /Users/admin/builder/spi-builder-workspace/.swiftpm/xcode
SwiftCompile normal arm64 /Users/admin/builder/spi-builder-workspace/.dependencies/checkouts/swift-package-manager/Sources/Basic/CStringArray.swift (in target 'Basic' from project 'SwiftPM')
cd /Users/admin/builder/spi-builder-workspace/.swiftpm/xcode
SwiftCompile normal arm64 /Users/admin/builder/spi-builder-workspace/.dependencies/checkouts/swift-package-manager/Sources/Basic/CacheableSequence.swift (in target 'Basic' from project 'SwiftPM')
cd /Users/admin/builder/spi-builder-workspace/.swiftpm/xcode
SwiftCompile normal arm64 Compiling\ SynchronizedQueue.swift,\ TemporaryFile.swift,\ TerminalController.swift /Users/admin/builder/spi-builder-workspace/.dependencies/checkouts/swift-package-manager/Sources/Basic/SynchronizedQueue.swift /Users/admin/builder/spi-builder-workspace/.dependencies/checkouts/swift-package-manager/Sources/Basic/TemporaryFile.swift /Users/admin/builder/spi-builder-workspace/.dependencies/checkouts/swift-package-manager/Sources/Basic/TerminalController.swift (in target 'Basic' from project 'SwiftPM')
Command SwiftCompile failed with a nonzero exit code
--- xcodebuild: WARNING: Using the first of multiple matching destinations:
{ platform:macOS, arch:arm64, id:21308100d59bd65e64953bf456a8bd4698dc3a31, name:My Mac }
{ platform:macOS, arch:arm64, variant:Mac Catalyst, id:21308100d59bd65e64953bf456a8bd4698dc3a31, name:My Mac }
{ platform:macOS, arch:arm64, variant:DriverKit, id:21308100d59bd65e64953bf456a8bd4698dc3a31, name:My Mac }
{ platform:macOS, arch:arm64, variant:Designed for [iPad,iPhone], id:21308100d59bd65e64953bf456a8bd4698dc3a31, name:My Mac }
** BUILD FAILED **
The following build commands failed:
SwiftCompile normal arm64 Compiling\ Await.swift,\ ByteString.swift,\ CStringArray.swift,\ CacheableSequence.swift /Users/admin/builder/spi-builder-workspace/.dependencies/checkouts/swift-package-manager/Sources/Basic/Await.swift /Users/admin/builder/spi-builder-workspace/.dependencies/checkouts/swift-package-manager/Sources/Basic/ByteString.swift /Users/admin/builder/spi-builder-workspace/.dependencies/checkouts/swift-package-manager/Sources/Basic/CStringArray.swift /Users/admin/builder/spi-builder-workspace/.dependencies/checkouts/swift-package-manager/Sources/Basic/CacheableSequence.swift (in target 'Basic' from project 'SwiftPM')
SwiftCompile normal arm64 /Users/admin/builder/spi-builder-workspace/.dependencies/checkouts/swift-package-manager/Sources/Basic/Await.swift (in target 'Basic' from project 'SwiftPM')
SwiftCompile normal arm64 Compiling\ SynchronizedQueue.swift,\ TemporaryFile.swift,\ TerminalController.swift /Users/admin/builder/spi-builder-workspace/.dependencies/checkouts/swift-package-manager/Sources/Basic/SynchronizedQueue.swift /Users/admin/builder/spi-builder-workspace/.dependencies/checkouts/swift-package-manager/Sources/Basic/TemporaryFile.swift /Users/admin/builder/spi-builder-workspace/.dependencies/checkouts/swift-package-manager/Sources/Basic/TerminalController.swift (in target 'Basic' from project 'SwiftPM')
Building workspace spi-builder-workspace with scheme Appetizer
(4 failures)
BUILD FAILURE 6.1 macosXcodebuild