Build Information
Failed to build Viperit, reference master (49d2d5
), with Swift 6.1 for macOS (Xcode) using Xcode 16.3 on 26 Apr 2025 15:18:17 UTC.
Build Command
env DEVELOPER_DIR=/Applications/Xcode-16.3.0.app xcrun xcodebuild -IDEClonedSourcePackagesDirPathOverride=$PWD/.dependencies -skipMacroValidation -skipPackagePluginValidation -derivedDataPath $PWD/.derivedData build -scheme Viperit -destination platform=macOS,arch=arm64
Build Log
========================================
RunAll
========================================
Builder version: 4.61.0
Interrupt handler set up.
========================================
Checkout
========================================
Clone URL: https://github.com/ferranabello/Viperit.git
Reference: master
Initialized empty Git repository in /Users/admin/builder/spi-builder-workspace/.git/
From https://github.com/ferranabello/Viperit
* branch master -> FETCH_HEAD
* [new branch] master -> origin/master
HEAD is now at 49d2d5a Update README.md
Submodule path 'Templates/Viperit': checked out '8e2a081a5bf5aa6a718d29f23b159089e0f86ca6'
Submodule 'Templates/Viperit' (https://github.com/ferranabello/ViperitTemplates.git) registered for path 'Templates/Viperit'
Cloning into '/Users/admin/builder/spi-builder-workspace/Templates/Viperit'...
Cloned https://github.com/ferranabello/Viperit.git
Revision (git rev-parse @):
49d2d5a7439d7c6deed8e56aa3d80a70ec58a07d
SUCCESS checkout https://github.com/ferranabello/Viperit.git at master
========================================
Build
========================================
Selected platform: macosXcodebuild
Swift version: 6.1
Building package at path: $PWD
https://github.com/ferranabello/Viperit.git
https://github.com/ferranabello/Viperit.git
{
"dependencies" : [
],
"manifest_display_name" : "Viperit",
"name" : "Viperit",
"path" : "/Users/admin/builder/spi-builder-workspace",
"platforms" : [
{
"name" : "ios",
"version" : "11.0"
}
],
"products" : [
{
"name" : "Viperit",
"targets" : [
"Viperit"
],
"type" : {
"library" : [
"automatic"
]
}
}
],
"targets" : [
{
"c99name" : "ViperitTests",
"module_type" : "SwiftTarget",
"name" : "ViperitTests",
"path" : "ViperitTests",
"sources" : [
"ExtensionsTests.swift",
"ModuleTests.swift",
"PresenterTests.swift",
"RouterTests.swift",
"Sample/Modules/CodeModule/CodeModuleDisplayData.swift",
"Sample/Modules/CodeModule/CodeModuleInteractor.swift",
"Sample/Modules/CodeModule/CodeModuleModuleApi.swift",
"Sample/Modules/CodeModule/CodeModulePresenter.swift",
"Sample/Modules/CodeModule/CodeModuleRouter.swift",
"Sample/Modules/CodeModule/CodeModuleView.swift",
"Sample/Modules/Sample/SampleDisplayData.swift",
"Sample/Modules/Sample/SampleInteractor.swift",
"Sample/Modules/Sample/SamplePresenter.swift",
"Sample/Modules/Sample/SampleRouter.swift",
"Sample/Modules/Sample/SampleView.swift",
"Sample/Modules/Sample/SampleViewPad.swift",
"Sample/Modules/SwiftUI/SwiftUIInteractor.swift",
"Sample/Modules/SwiftUI/SwiftUIModuleApi.swift",
"Sample/Modules/SwiftUI/SwiftUIPresenter.swift",
"Sample/Modules/SwiftUI/SwiftUIRouter.swift",
"Sample/Modules/SwiftUI/SwiftUIView.swift",
"Sample/Modules/SwiftUIWithEnv/SwiftUIWithEnvInteractor.swift",
"Sample/Modules/SwiftUIWithEnv/SwiftUIWithEnvModuleApi.swift",
"Sample/Modules/SwiftUIWithEnv/SwiftUIWithEnvPresenter.swift",
"Sample/Modules/SwiftUIWithEnv/SwiftUIWithEnvRouter.swift",
"Sample/Modules/SwiftUIWithEnv/SwiftUIWithEnvView.swift",
"Sample/Modules/XibModule/XibModuleDisplayData.swift",
"Sample/Modules/XibModule/XibModuleInteractor.swift",
"Sample/Modules/XibModule/XibModuleModuleApi.swift",
"Sample/Modules/XibModule/XibModulePresenter.swift",
"Sample/Modules/XibModule/XibModuleRouter.swift",
"Sample/Modules/XibModule/XibModuleView.swift",
"Sample/TestCleanModules.swift",
"Sample/TestModules.swift"
],
"target_dependencies" : [
"Viperit"
],
"type" : "test"
},
{
"c99name" : "Viperit",
"module_type" : "SwiftTarget",
"name" : "Viperit",
"path" : "Viperit",
"product_memberships" : [
"Viperit"
],
"sources" : [
"Core/DisplayData.swift",
"Core/Interactor.swift",
"Core/Module.swift",
"Core/Presenter.swift",
"Core/Router.swift",
"Core/UserInterface.swift",
"Core/ViperComponent.swift",
"Core/ViperitError.swift",
"Core/ViperitModule.swift",
"Extensions/String+.swift",
"Extensions/UserInterface+Collection.swift",
"Extensions/UserInterface+Split.swift",
"Extensions/UserInterface+SwiftUI.swift",
"Extensions/UserInterface+Table.swift"
],
"type" : "library"
}
],
"tools_version" : "5.0"
}
Command line invocation:
/Applications/Xcode-16.3.0.app/Contents/Developer/usr/bin/xcodebuild -IDEClonedSourcePackagesDirPathOverride=/Users/admin/builder/spi-builder-workspace/.dependencies -resolvePackageDependencies
resolved source packages:
{
"dependencies" : [
],
"manifest_display_name" : "Viperit",
"name" : "Viperit",
"path" : "/Users/admin/builder/spi-builder-workspace",
"platforms" : [
{
"name" : "ios",
"version" : "11.0"
}
],
"products" : [
{
"name" : "Viperit",
"targets" : [
"Viperit"
],
"type" : {
"library" : [
"automatic"
]
}
}
],
"targets" : [
{
"c99name" : "ViperitTests",
"module_type" : "SwiftTarget",
"name" : "ViperitTests",
"path" : "ViperitTests",
"sources" : [
"ExtensionsTests.swift",
"ModuleTests.swift",
"PresenterTests.swift",
"RouterTests.swift",
"Sample/Modules/CodeModule/CodeModuleDisplayData.swift",
"Sample/Modules/CodeModule/CodeModuleInteractor.swift",
"Sample/Modules/CodeModule/CodeModuleModuleApi.swift",
"Sample/Modules/CodeModule/CodeModulePresenter.swift",
"Sample/Modules/CodeModule/CodeModuleRouter.swift",
"Sample/Modules/CodeModule/CodeModuleView.swift",
"Sample/Modules/Sample/SampleDisplayData.swift",
"Sample/Modules/Sample/SampleInteractor.swift",
"Sample/Modules/Sample/SamplePresenter.swift",
"Sample/Modules/Sample/SampleRouter.swift",
"Sample/Modules/Sample/SampleView.swift",
"Sample/Modules/Sample/SampleViewPad.swift",
"Sample/Modules/SwiftUI/SwiftUIInteractor.swift",
"Sample/Modules/SwiftUI/SwiftUIModuleApi.swift",
"Sample/Modules/SwiftUI/SwiftUIPresenter.swift",
"Sample/Modules/SwiftUI/SwiftUIRouter.swift",
"Sample/Modules/SwiftUI/SwiftUIView.swift",
"Sample/Modules/SwiftUIWithEnv/SwiftUIWithEnvInteractor.swift",
"Sample/Modules/SwiftUIWithEnv/SwiftUIWithEnvModuleApi.swift",
"Sample/Modules/SwiftUIWithEnv/SwiftUIWithEnvPresenter.swift",
"Sample/Modules/SwiftUIWithEnv/SwiftUIWithEnvRouter.swift",
"Sample/Modules/SwiftUIWithEnv/SwiftUIWithEnvView.swift",
"Sample/Modules/XibModule/XibModuleDisplayData.swift",
"Sample/Modules/XibModule/XibModuleInteractor.swift",
"Sample/Modules/XibModule/XibModuleModuleApi.swift",
"Sample/Modules/XibModule/XibModulePresenter.swift",
"Sample/Modules/XibModule/XibModuleRouter.swift",
"Sample/Modules/XibModule/XibModuleView.swift",
"Sample/TestCleanModules.swift",
"Sample/TestModules.swift"
],
"target_dependencies" : [
"Viperit"
],
"type" : "test"
},
{
"c99name" : "Viperit",
"module_type" : "SwiftTarget",
"name" : "Viperit",
"path" : "Viperit",
"product_memberships" : [
"Viperit"
],
"sources" : [
"Core/DisplayData.swift",
"Core/Interactor.swift",
"Core/Module.swift",
"Core/Presenter.swift",
"Core/Router.swift",
"Core/UserInterface.swift",
"Core/ViperComponent.swift",
"Core/ViperitError.swift",
"Core/ViperitModule.swift",
"Extensions/String+.swift",
"Extensions/UserInterface+Collection.swift",
"Extensions/UserInterface+Split.swift",
"Extensions/UserInterface+SwiftUI.swift",
"Extensions/UserInterface+Table.swift"
],
"type" : "library"
}
],
"tools_version" : "5.0"
}
{
"project" : {
"configurations" : [
"Debug",
"Release"
],
"name" : "Viperit",
"schemes" : [
"Example",
"Viperit",
"ViperitTests"
],
"targets" : [
"Viperit",
"ViperitTests",
"Example",
"ExampleTests"
]
}
}
{
"workspace" : {
"name" : "spi-builder-workspace",
"schemes" : [
"Viperit"
]
}
}
Running build ...
env DEVELOPER_DIR=/Applications/Xcode-16.3.0.app xcrun xcodebuild -IDEClonedSourcePackagesDirPathOverride=$PWD/.dependencies -skipMacroValidation -skipPackagePluginValidation -derivedDataPath $PWD/.derivedData build -scheme Viperit -destination platform=macOS,arch=arm64 OTHER_SWIFT_FLAGS=-stats-output-dir .stats -strict-concurrency=complete -enable-upcoming-feature StrictConcurrency -enable-upcoming-feature DisableOutwardActorInference -enable-upcoming-feature GlobalActorIsolatedTypesUsability -enable-upcoming-feature InferSendableFromCaptures
Command line invocation:
/Applications/Xcode-16.3.0.app/Contents/Developer/usr/bin/xcodebuild -IDEClonedSourcePackagesDirPathOverride=/Users/admin/builder/spi-builder-workspace/.dependencies -skipMacroValidation -skipPackagePluginValidation -derivedDataPath /Users/admin/builder/spi-builder-workspace/.derivedData build -scheme Viperit -destination platform=macOS,arch=arm64 "OTHER_SWIFT_FLAGS=-stats-output-dir .stats -strict-concurrency=complete -enable-upcoming-feature StrictConcurrency -enable-upcoming-feature DisableOutwardActorInference -enable-upcoming-feature GlobalActorIsolatedTypesUsability -enable-upcoming-feature InferSendableFromCaptures"
Build settings from command line:
OTHER_SWIFT_FLAGS = -stats-output-dir .stats -strict-concurrency=complete -enable-upcoming-feature StrictConcurrency -enable-upcoming-feature DisableOutwardActorInference -enable-upcoming-feature GlobalActorIsolatedTypesUsability -enable-upcoming-feature InferSendableFromCaptures
Resolve Package Graph
Resolved source packages:
Viperit: /Users/admin/builder/spi-builder-workspace
ComputePackagePrebuildTargetDependencyGraph
Prepare packages
CreateBuildRequest
SendProjectDescription
CreateBuildOperation
ComputeTargetDependencyGraph
note: Building targets in dependency order
note: Target dependency graph (2 targets)
Target 'Viperit' in project 'Viperit'
➜ Explicit dependency on target 'Viperit' in project 'Viperit'
Target 'Viperit' in project 'Viperit' (no dependencies)
GatherProvisioningInputs
CreateBuildDescription
ExecuteExternalTool /Applications/Xcode-16.3.0.app/Contents/Developer/Toolchains/XcodeDefault.xctoolchain/usr/bin/clang -v -E -dM -isysroot /Applications/Xcode-16.3.0.app/Contents/Developer/Platforms/MacOSX.platform/Developer/SDKs/MacOSX15.4.sdk -x c -c /dev/null
ExecuteExternalTool /Applications/Xcode-16.3.0.app/Contents/Developer/Toolchains/XcodeDefault.xctoolchain/usr/bin/swiftc --version
ExecuteExternalTool /Applications/Xcode-16.3.0.app/Contents/Developer/Toolchains/XcodeDefault.xctoolchain/usr/bin/ld -version_details
Build description signature: 4d2bdf67266422c1a14a2a6e5878295a
Build description path: /Users/admin/builder/spi-builder-workspace/.derivedData/Build/Intermediates.noindex/XCBuildData/4d2bdf67266422c1a14a2a6e5878295a.xcbuilddata
CreateBuildDirectory /Users/admin/builder/spi-builder-workspace/.derivedData/Build/Products
cd /Users/admin/builder/spi-builder-workspace/.swiftpm/xcode
builtin-create-build-directory /Users/admin/builder/spi-builder-workspace/.derivedData/Build/Products
ClangStatCache /Applications/Xcode-16.3.0.app/Contents/Developer/Toolchains/XcodeDefault.xctoolchain/usr/bin/clang-stat-cache /Applications/Xcode-16.3.0.app/Contents/Developer/Platforms/MacOSX.platform/Developer/SDKs/MacOSX15.4.sdk /Users/admin/builder/spi-builder-workspace/.derivedData/SDKStatCaches.noindex/macosx15.4-24E241-8287b8f5db97e746a1562fbca0c9d29b.sdkstatcache
cd /Users/admin/builder/spi-builder-workspace/.swiftpm/xcode
/Applications/Xcode-16.3.0.app/Contents/Developer/Toolchains/XcodeDefault.xctoolchain/usr/bin/clang-stat-cache /Applications/Xcode-16.3.0.app/Contents/Developer/Platforms/MacOSX.platform/Developer/SDKs/MacOSX15.4.sdk -o /Users/admin/builder/spi-builder-workspace/.derivedData/SDKStatCaches.noindex/macosx15.4-24E241-8287b8f5db97e746a1562fbca0c9d29b.sdkstatcache
CreateBuildDirectory /Users/admin/builder/spi-builder-workspace/.derivedData/Build/Intermediates.noindex
cd /Users/admin/builder/spi-builder-workspace/.swiftpm/xcode
builtin-create-build-directory /Users/admin/builder/spi-builder-workspace/.derivedData/Build/Intermediates.noindex
CreateBuildDirectory /Users/admin/builder/spi-builder-workspace/.derivedData/Build/Products/Debug
cd /Users/admin/builder/spi-builder-workspace/.swiftpm/xcode
builtin-create-build-directory /Users/admin/builder/spi-builder-workspace/.derivedData/Build/Products/Debug
CreateBuildDirectory /Users/admin/builder/spi-builder-workspace/.derivedData/Build/Intermediates.noindex/EagerLinkingTBDs/Debug
cd /Users/admin/builder/spi-builder-workspace/.swiftpm/xcode
builtin-create-build-directory /Users/admin/builder/spi-builder-workspace/.derivedData/Build/Intermediates.noindex/EagerLinkingTBDs/Debug
CreateBuildDirectory /Users/admin/builder/spi-builder-workspace/.derivedData/Build/Products/Debug/PackageFrameworks
cd /Users/admin/builder/spi-builder-workspace/.swiftpm/xcode
builtin-create-build-directory /Users/admin/builder/spi-builder-workspace/.derivedData/Build/Products/Debug/PackageFrameworks
WriteAuxiliaryFile /Users/admin/builder/spi-builder-workspace/.derivedData/Build/Intermediates.noindex/Viperit.build/Debug/Viperit.build/Viperit.DependencyMetadataFileList (in target 'Viperit' from project 'Viperit')
cd /Users/admin/builder/spi-builder-workspace
write-file /Users/admin/builder/spi-builder-workspace/.derivedData/Build/Intermediates.noindex/Viperit.build/Debug/Viperit.build/Viperit.DependencyMetadataFileList
WriteAuxiliaryFile /Users/admin/builder/spi-builder-workspace/.derivedData/Build/Intermediates.noindex/Viperit.build/Debug/Viperit.build/Viperit.DependencyStaticMetadataFileList (in target 'Viperit' from project 'Viperit')
cd /Users/admin/builder/spi-builder-workspace
write-file /Users/admin/builder/spi-builder-workspace/.derivedData/Build/Intermediates.noindex/Viperit.build/Debug/Viperit.build/Viperit.DependencyStaticMetadataFileList
WriteAuxiliaryFile /Users/admin/builder/spi-builder-workspace/.derivedData/Build/Intermediates.noindex/Viperit.build/Debug/Viperit.build/Viperit.modulemap (in target 'Viperit' from project 'Viperit')
cd /Users/admin/builder/spi-builder-workspace
write-file /Users/admin/builder/spi-builder-workspace/.derivedData/Build/Intermediates.noindex/Viperit.build/Debug/Viperit.build/Viperit.modulemap
WriteAuxiliaryFile /Users/admin/builder/spi-builder-workspace/.derivedData/Build/Intermediates.noindex/Viperit.build/Debug/Viperit.build/Objects-normal/arm64/Viperit.SwiftConstValuesFileList (in target 'Viperit' from project 'Viperit')
cd /Users/admin/builder/spi-builder-workspace
write-file /Users/admin/builder/spi-builder-workspace/.derivedData/Build/Intermediates.noindex/Viperit.build/Debug/Viperit.build/Objects-normal/arm64/Viperit.SwiftConstValuesFileList
WriteAuxiliaryFile /Users/admin/builder/spi-builder-workspace/.derivedData/Build/Intermediates.noindex/Viperit.build/Debug/Viperit.build/Objects-normal/arm64/Viperit-OutputFileMap.json (in target 'Viperit' from project 'Viperit')
cd /Users/admin/builder/spi-builder-workspace
write-file /Users/admin/builder/spi-builder-workspace/.derivedData/Build/Intermediates.noindex/Viperit.build/Debug/Viperit.build/Objects-normal/arm64/Viperit-OutputFileMap.json
WriteAuxiliaryFile /Users/admin/builder/spi-builder-workspace/.derivedData/Build/Intermediates.noindex/Viperit.build/Debug/Viperit.build/Objects-normal/arm64/Viperit.LinkFileList (in target 'Viperit' from project 'Viperit')
cd /Users/admin/builder/spi-builder-workspace
write-file /Users/admin/builder/spi-builder-workspace/.derivedData/Build/Intermediates.noindex/Viperit.build/Debug/Viperit.build/Objects-normal/arm64/Viperit.LinkFileList
WriteAuxiliaryFile /Users/admin/builder/spi-builder-workspace/.derivedData/Build/Intermediates.noindex/Viperit.build/Debug/Viperit.build/Objects-normal/arm64/Viperit.SwiftFileList (in target 'Viperit' from project 'Viperit')
cd /Users/admin/builder/spi-builder-workspace
write-file /Users/admin/builder/spi-builder-workspace/.derivedData/Build/Intermediates.noindex/Viperit.build/Debug/Viperit.build/Objects-normal/arm64/Viperit.SwiftFileList
WriteAuxiliaryFile /Users/admin/builder/spi-builder-workspace/.derivedData/Build/Intermediates.noindex/Viperit.build/Debug/Viperit.build/Objects-normal/arm64/Viperit_const_extract_protocols.json (in target 'Viperit' from project 'Viperit')
cd /Users/admin/builder/spi-builder-workspace
write-file /Users/admin/builder/spi-builder-workspace/.derivedData/Build/Intermediates.noindex/Viperit.build/Debug/Viperit.build/Objects-normal/arm64/Viperit_const_extract_protocols.json
Copy /Users/admin/builder/spi-builder-workspace/.derivedData/Build/Intermediates.noindex/GeneratedModuleMaps/Viperit.modulemap /Users/admin/builder/spi-builder-workspace/.derivedData/Build/Intermediates.noindex/Viperit.build/Debug/Viperit.build/Viperit.modulemap (in target 'Viperit' from project 'Viperit')
cd /Users/admin/builder/spi-builder-workspace
builtin-copy -exclude .DS_Store -exclude CVS -exclude .svn -exclude .git -exclude .hg -resolve-src-symlinks /Users/admin/builder/spi-builder-workspace/.derivedData/Build/Intermediates.noindex/Viperit.build/Debug/Viperit.build/Viperit.modulemap /Users/admin/builder/spi-builder-workspace/.derivedData/Build/Intermediates.noindex/GeneratedModuleMaps
SwiftDriver Viperit normal arm64 com.apple.xcode.tools.swift.compiler (in target 'Viperit' from project 'Viperit')
cd /Users/admin/builder/spi-builder-workspace/.swiftpm/xcode
builtin-SwiftDriver -- /Applications/Xcode-16.3.0.app/Contents/Developer/Toolchains/XcodeDefault.xctoolchain/usr/bin/swiftc -module-name Viperit -Onone -enforce-exclusivity\=checked @/Users/admin/builder/spi-builder-workspace/.derivedData/Build/Intermediates.noindex/Viperit.build/Debug/Viperit.build/Objects-normal/arm64/Viperit.SwiftFileList -DSWIFT_PACKAGE -DDEBUG -stats-output-dir .stats -strict-concurrency\=complete -enable-upcoming-feature StrictConcurrency -enable-upcoming-feature DisableOutwardActorInference -enable-upcoming-feature GlobalActorIsolatedTypesUsability -enable-upcoming-feature InferSendableFromCaptures -plugin-path /Applications/Xcode-16.3.0.app/Contents/Developer/Toolchains/XcodeDefault.xctoolchain/usr/lib/swift/host/plugins/testing -enable-experimental-feature DebugDescriptionMacro -sdk /Applications/Xcode-16.3.0.app/Contents/Developer/Platforms/MacOSX.platform/Developer/SDKs/MacOSX15.4.sdk -target arm64-apple-macos10.13 -g -module-cache-path /Users/admin/builder/spi-builder-workspace/.derivedData/ModuleCache.noindex -Xfrontend -serialize-debugging-options -profile-coverage-mapping -profile-generate -enable-testing -index-store-path /Users/admin/builder/spi-builder-workspace/.derivedData/Index.noindex/DataStore -swift-version 5 -I /Users/admin/builder/spi-builder-workspace/.derivedData/Build/Products/Debug -I /Applications/Xcode-16.3.0.app/Contents/Developer/Platforms/MacOSX.platform/Developer/usr/lib -F /Users/admin/builder/spi-builder-workspace/.derivedData/Build/Products/Debug -F /Applications/Xcode-16.3.0.app/Contents/Developer/Platforms/MacOSX.platform/Developer/Library/Frameworks -c -j10 -enable-batch-mode -incremental -Xcc -ivfsstatcache -Xcc /Users/admin/builder/spi-builder-workspace/.derivedData/SDKStatCaches.noindex/macosx15.4-24E241-8287b8f5db97e746a1562fbca0c9d29b.sdkstatcache -output-file-map /Users/admin/builder/spi-builder-workspace/.derivedData/Build/Intermediates.noindex/Viperit.build/Debug/Viperit.build/Objects-normal/arm64/Viperit-OutputFileMap.json -use-frontend-parseable-output -save-temps -no-color-diagnostics -serialize-diagnostics -emit-dependencies -emit-module -emit-module-path /Users/admin/builder/spi-builder-workspace/.derivedData/Build/Intermediates.noindex/Viperit.build/Debug/Viperit.build/Objects-normal/arm64/Viperit.swiftmodule -validate-clang-modules-once -clang-build-session-file /Users/admin/builder/spi-builder-workspace/.derivedData/ModuleCache.noindex/Session.modulevalidation -Xcc -I/Users/admin/builder/spi-builder-workspace/.derivedData/Build/Intermediates.noindex/Viperit.build/Debug/Viperit.build/swift-overrides.hmap -emit-const-values -Xfrontend -const-gather-protocols-file -Xfrontend /Users/admin/builder/spi-builder-workspace/.derivedData/Build/Intermediates.noindex/Viperit.build/Debug/Viperit.build/Objects-normal/arm64/Viperit_const_extract_protocols.json -Xcc -I/Users/admin/builder/spi-builder-workspace/.derivedData/Build/Products/Debug/include -Xcc -I/Users/admin/builder/spi-builder-workspace/.derivedData/Build/Intermediates.noindex/Viperit.build/Debug/Viperit.build/DerivedSources-normal/arm64 -Xcc -I/Users/admin/builder/spi-builder-workspace/.derivedData/Build/Intermediates.noindex/Viperit.build/Debug/Viperit.build/DerivedSources/arm64 -Xcc -I/Users/admin/builder/spi-builder-workspace/.derivedData/Build/Intermediates.noindex/Viperit.build/Debug/Viperit.build/DerivedSources -Xcc -DSWIFT_PACKAGE -Xcc -DDEBUG\=1 -emit-objc-header -emit-objc-header-path /Users/admin/builder/spi-builder-workspace/.derivedData/Build/Intermediates.noindex/Viperit.build/Debug/Viperit.build/Objects-normal/arm64/Viperit-Swift.h -working-directory /Users/admin/builder/spi-builder-workspace/.swiftpm/xcode -experimental-emit-module-separately -disable-cmo
SwiftCompile normal arm64 Compiling\ DisplayData.swift,\ Interactor.swift /Users/admin/builder/spi-builder-workspace/Viperit/Core/DisplayData.swift /Users/admin/builder/spi-builder-workspace/Viperit/Core/Interactor.swift (in target 'Viperit' from project 'Viperit')
SwiftCompile normal arm64 /Users/admin/builder/spi-builder-workspace/Viperit/Core/DisplayData.swift (in target 'Viperit' from project 'Viperit')
cd /Users/admin/builder/spi-builder-workspace/.swiftpm/xcode
SwiftCompile normal arm64 /Users/admin/builder/spi-builder-workspace/Viperit/Core/Interactor.swift (in target 'Viperit' from project 'Viperit')
cd /Users/admin/builder/spi-builder-workspace/.swiftpm/xcode
SwiftCompile normal arm64 Compiling\ Router.swift,\ UserInterface.swift /Users/admin/builder/spi-builder-workspace/Viperit/Core/Router.swift /Users/admin/builder/spi-builder-workspace/Viperit/Core/UserInterface.swift (in target 'Viperit' from project 'Viperit')
SwiftCompile normal arm64 /Users/admin/builder/spi-builder-workspace/Viperit/Core/Router.swift (in target 'Viperit' from project 'Viperit')
cd /Users/admin/builder/spi-builder-workspace/.swiftpm/xcode
SwiftCompile normal arm64 /Users/admin/builder/spi-builder-workspace/Viperit/Core/UserInterface.swift (in target 'Viperit' from project 'Viperit')
cd /Users/admin/builder/spi-builder-workspace/.swiftpm/xcode
SwiftCompile normal arm64 Compiling\ UserInterface+Collection.swift /Users/admin/builder/spi-builder-workspace/Viperit/Extensions/UserInterface+Collection.swift (in target 'Viperit' from project 'Viperit')
SwiftCompile normal arm64 /Users/admin/builder/spi-builder-workspace/Viperit/Extensions/UserInterface+Collection.swift (in target 'Viperit' from project 'Viperit')
cd /Users/admin/builder/spi-builder-workspace/.swiftpm/xcode
SwiftCompile normal arm64 Compiling\ String+.swift /Users/admin/builder/spi-builder-workspace/Viperit/Extensions/String+.swift (in target 'Viperit' from project 'Viperit')
SwiftCompile normal arm64 /Users/admin/builder/spi-builder-workspace/Viperit/Extensions/String+.swift (in target 'Viperit' from project 'Viperit')
cd /Users/admin/builder/spi-builder-workspace/.swiftpm/xcode
SwiftCompile normal arm64 Compiling\ Module.swift,\ Presenter.swift /Users/admin/builder/spi-builder-workspace/Viperit/Core/Module.swift /Users/admin/builder/spi-builder-workspace/Viperit/Core/Presenter.swift (in target 'Viperit' from project 'Viperit')
SwiftCompile normal arm64 /Users/admin/builder/spi-builder-workspace/Viperit/Core/Module.swift (in target 'Viperit' from project 'Viperit')
cd /Users/admin/builder/spi-builder-workspace/.swiftpm/xcode
SwiftCompile normal arm64 /Users/admin/builder/spi-builder-workspace/Viperit/Core/Presenter.swift (in target 'Viperit' from project 'Viperit')
cd /Users/admin/builder/spi-builder-workspace/.swiftpm/xcode
SwiftCompile normal arm64 Compiling\ ViperComponent.swift,\ ViperitError.swift /Users/admin/builder/spi-builder-workspace/Viperit/Core/ViperComponent.swift /Users/admin/builder/spi-builder-workspace/Viperit/Core/ViperitError.swift (in target 'Viperit' from project 'Viperit')
SwiftCompile normal arm64 /Users/admin/builder/spi-builder-workspace/Viperit/Core/ViperComponent.swift (in target 'Viperit' from project 'Viperit')
cd /Users/admin/builder/spi-builder-workspace/.swiftpm/xcode
SwiftCompile normal arm64 /Users/admin/builder/spi-builder-workspace/Viperit/Core/ViperitError.swift (in target 'Viperit' from project 'Viperit')
cd /Users/admin/builder/spi-builder-workspace/.swiftpm/xcode
SwiftCompile normal arm64 Compiling\ UserInterface+Split.swift /Users/admin/builder/spi-builder-workspace/Viperit/Extensions/UserInterface+Split.swift (in target 'Viperit' from project 'Viperit')
SwiftCompile normal arm64 /Users/admin/builder/spi-builder-workspace/Viperit/Extensions/UserInterface+Split.swift (in target 'Viperit' from project 'Viperit')
cd /Users/admin/builder/spi-builder-workspace/.swiftpm/xcode
SwiftCompile normal arm64 Compiling\ UserInterface+Table.swift /Users/admin/builder/spi-builder-workspace/Viperit/Extensions/UserInterface+Table.swift (in target 'Viperit' from project 'Viperit')
SwiftCompile normal arm64 /Users/admin/builder/spi-builder-workspace/Viperit/Extensions/UserInterface+Table.swift (in target 'Viperit' from project 'Viperit')
cd /Users/admin/builder/spi-builder-workspace/.swiftpm/xcode
SwiftCompile normal arm64 Compiling\ UserInterface+SwiftUI.swift /Users/admin/builder/spi-builder-workspace/Viperit/Extensions/UserInterface+SwiftUI.swift (in target 'Viperit' from project 'Viperit')
SwiftCompile normal arm64 /Users/admin/builder/spi-builder-workspace/Viperit/Extensions/UserInterface+SwiftUI.swift (in target 'Viperit' from project 'Viperit')
cd /Users/admin/builder/spi-builder-workspace/.swiftpm/xcode
SwiftEmitModule normal arm64 Emitting\ module\ for\ Viperit (in target 'Viperit' from project 'Viperit')
Failed frontend command:
/Applications/Xcode-16.3.0.app/Contents/Developer/Toolchains/XcodeDefault.xctoolchain/usr/bin/swift-frontend -frontend -emit-module -experimental-skip-non-inlinable-function-bodies-without-types /Users/admin/builder/spi-builder-workspace/Viperit/Core/DisplayData.swift /Users/admin/builder/spi-builder-workspace/Viperit/Core/Interactor.swift /Users/admin/builder/spi-builder-workspace/Viperit/Core/Module.swift /Users/admin/builder/spi-builder-workspace/Viperit/Core/Presenter.swift /Users/admin/builder/spi-builder-workspace/Viperit/Core/Router.swift /Users/admin/builder/spi-builder-workspace/Viperit/Core/UserInterface.swift /Users/admin/builder/spi-builder-workspace/Viperit/Core/ViperComponent.swift /Users/admin/builder/spi-builder-workspace/Viperit/Core/ViperitError.swift /Users/admin/builder/spi-builder-workspace/Viperit/Core/ViperitModule.swift /Users/admin/builder/spi-builder-workspace/Viperit/Extensions/String+.swift /Users/admin/builder/spi-builder-workspace/Viperit/Extensions/UserInterface+Collection.swift /Users/admin/builder/spi-builder-workspace/Viperit/Extensions/UserInterface+Split.swift /Users/admin/builder/spi-builder-workspace/Viperit/Extensions/UserInterface+SwiftUI.swift /Users/admin/builder/spi-builder-workspace/Viperit/Extensions/UserInterface+Table.swift -target arm64-apple-macos10.13 -Xllvm -aarch64-use-tbi -enable-objc-interop -sdk /Applications/Xcode-16.3.0.app/Contents/Developer/Platforms/MacOSX.platform/Developer/SDKs/MacOSX15.4.sdk -I /Users/admin/builder/spi-builder-workspace/.derivedData/Build/Products/Debug -I /Applications/Xcode-16.3.0.app/Contents/Developer/Platforms/MacOSX.platform/Developer/usr/lib -F /Users/admin/builder/spi-builder-workspace/.derivedData/Build/Products/Debug -F /Applications/Xcode-16.3.0.app/Contents/Developer/Platforms/MacOSX.platform/Developer/Library/Frameworks -no-color-diagnostics -enable-testing -g -debug-info-format\=dwarf -dwarf-version\=4 -module-cache-path /Users/admin/builder/spi-builder-workspace/.derivedData/ModuleCache.noindex -profile-generate -profile-coverage-mapping -swift-version 5 -enforce-exclusivity\=checked -stats-output-dir /Users/admin/builder/spi-builder-workspace/.swiftpm/xcode/.stats -Onone -D SWIFT_PACKAGE -D DEBUG -serialize-debugging-options -const-gather-protocols-file /Users/admin/builder/spi-builder-workspace/.derivedData/Build/Intermediates.noindex/Viperit.build/Debug/Viperit.build/Objects-normal/arm64/Viperit_const_extract_protocols.json -enable-upcoming-feature StrictConcurrency -enable-upcoming-feature DisableOutwardActorInference -enable-upcoming-feature GlobalActorIsolatedTypesUsability -enable-upcoming-feature InferSendableFromCaptures -enable-experimental-feature DebugDescriptionMacro -strict-concurrency\=complete -empty-abi-descriptor -plugin-path /Applications/Xcode-16.3.0.app/Contents/Developer/Toolchains/XcodeDefault.xctoolchain/usr/lib/swift/host/plugins/testing -validate-clang-modules-once -clang-build-session-file /Users/admin/builder/spi-builder-workspace/.derivedData/ModuleCache.noindex/Session.modulevalidation -Xcc -working-directory -Xcc /Users/admin/builder/spi-builder-workspace/.swiftpm/xcode -resource-dir /Applications/Xcode-16.3.0.app/Contents/Developer/Toolchains/XcodeDefault.xctoolchain/usr/lib/swift -enable-anonymous-context-mangled-names -file-compilation-dir /Users/admin/builder/spi-builder-workspace/.swiftpm/xcode -Xcc -ivfsstatcache -Xcc /Users/admin/builder/spi-builder-workspace/.derivedData/SDKStatCaches.noindex/macosx15.4-24E241-8287b8f5db97e746a1562fbca0c9d29b.sdkstatcache -Xcc -I/Users/admin/builder/spi-builder-workspace/.derivedData/Build/Intermediates.noindex/Viperit.build/Debug/Viperit.build/swift-overrides.hmap -Xcc -I/Users/admin/builder/spi-builder-workspace/.derivedData/Build/Products/Debug/include -Xcc -I/Users/admin/builder/spi-builder-workspace/.derivedData/Build/Intermediates.noindex/Viperit.build/Debug/Viperit.build/DerivedSources-normal/arm64 -Xcc -I/Users/admin/builder/spi-builder-workspace/.derivedData/Build/Intermediates.noindex/Viperit.build/Debug/Viperit.build/DerivedSources/arm64 -Xcc -I/Users/admin/builder/spi-builder-workspace/.derivedData/Build/Intermediates.noindex/Viperit.build/Debug/Viperit.build/DerivedSources -Xcc -DSWIFT_PACKAGE -Xcc -DDEBUG\=1 -module-name Viperit -frontend-parseable-output -disable-clang-spi -target-sdk-version 15.4 -target-sdk-name macosx15.4 -external-plugin-path /Applications/Xcode-16.3.0.app/Contents/Developer/Platforms/MacOSX.platform/Developer/usr/lib/swift/host/plugins\#/Applications/Xcode-16.3.0.app/Contents/Developer/Platforms/MacOSX.platform/Developer/usr/bin/swift-plugin-server -external-plugin-path /Applications/Xcode-16.3.0.app/Contents/Developer/Platforms/MacOSX.platform/Developer/usr/local/lib/swift/host/plugins\#/Applications/Xcode-16.3.0.app/Contents/Developer/Platforms/MacOSX.platform/Developer/usr/bin/swift-plugin-server -in-process-plugin-server-path /Applications/Xcode-16.3.0.app/Contents/Developer/Toolchains/XcodeDefault.xctoolchain/usr/lib/swift/host/libSwiftInProcPluginServer.dylib -plugin-path /Applications/Xcode-16.3.0.app/Contents/Developer/Toolchains/XcodeDefault.xctoolchain/usr/lib/swift/host/plugins -plugin-path /Applications/Xcode-16.3.0.app/Contents/Developer/Toolchains/XcodeDefault.xctoolchain/usr/local/lib/swift/host/plugins -emit-module-doc-path /Users/admin/builder/spi-builder-workspace/.derivedData/Build/Intermediates.noindex/Viperit.build/Debug/Viperit.build/Objects-normal/arm64/Viperit.swiftdoc -emit-module-source-info-path /Users/admin/builder/spi-builder-workspace/.derivedData/Build/Intermediates.noindex/Viperit.build/Debug/Viperit.build/Objects-normal/arm64/Viperit.swiftsourceinfo -emit-objc-header-path /Users/admin/builder/spi-builder-workspace/.derivedData/Build/Intermediates.noindex/Viperit.build/Debug/Viperit.build/Objects-normal/arm64/Viperit-Swift.h -serialize-diagnostics-path /Users/admin/builder/spi-builder-workspace/.derivedData/Build/Intermediates.noindex/Viperit.build/Debug/Viperit.build/Objects-normal/arm64/Viperit-master-emit-module.dia -emit-dependencies-path /Users/admin/builder/spi-builder-workspace/.derivedData/Build/Intermediates.noindex/Viperit.build/Debug/Viperit.build/Objects-normal/arm64/Viperit-master-emit-module.d -o /Users/admin/builder/spi-builder-workspace/.derivedData/Build/Intermediates.noindex/Viperit.build/Debug/Viperit.build/Objects-normal/arm64/Viperit.swiftmodule -emit-abi-descriptor-path /Users/admin/builder/spi-builder-workspace/.derivedData/Build/Intermediates.noindex/Viperit.build/Debug/Viperit.build/Objects-normal/arm64/Viperit.abi.json
EmitSwiftModule normal arm64 (in target 'Viperit' from project 'Viperit')
cd /Users/admin/builder/spi-builder-workspace/.swiftpm/xcode
/Users/admin/builder/spi-builder-workspace/Viperit/Core/Module.swift:10:8: error: no such module 'UIKit'
import UIKit
^
SwiftCompile normal arm64 Compiling\ ViperitModule.swift /Users/admin/builder/spi-builder-workspace/Viperit/Core/ViperitModule.swift (in target 'Viperit' from project 'Viperit')
Command SwiftCompile failed with a nonzero exit code
--- xcodebuild: WARNING: Using the first of multiple matching destinations:
{ platform:macOS, arch:arm64, id:3678c7a802501fa94c470d9f64bd6a9c7d1927ce, name:My Mac }
{ platform:macOS, arch:arm64, variant:Mac Catalyst, id:3678c7a802501fa94c470d9f64bd6a9c7d1927ce, name:My Mac }
{ platform:macOS, arch:arm64, variant:DriverKit, id:3678c7a802501fa94c470d9f64bd6a9c7d1927ce, name:My Mac }
{ platform:macOS, arch:arm64, variant:Designed for [iPad,iPhone], id:3678c7a802501fa94c470d9f64bd6a9c7d1927ce, name:My Mac }
** BUILD FAILED **
The following build commands failed:
SwiftEmitModule normal arm64 Emitting\ module\ for\ Viperit (in target 'Viperit' from project 'Viperit')
EmitSwiftModule normal arm64 (in target 'Viperit' from project 'Viperit')
SwiftCompile normal arm64 Compiling\ ViperitModule.swift /Users/admin/builder/spi-builder-workspace/Viperit/Core/ViperitModule.swift (in target 'Viperit' from project 'Viperit')
Building workspace spi-builder-workspace with scheme Viperit
(4 failures)
Command line invocation:
/Applications/Xcode-16.3.0.app/Contents/Developer/usr/bin/xcodebuild -IDEClonedSourcePackagesDirPathOverride=/Users/admin/builder/spi-builder-workspace/.dependencies -resolvePackageDependencies
Resolve Package Graph
Resolved source packages:
Viperit: /Users/admin/builder/spi-builder-workspace
resolved source packages: Viperit
{
"dependencies" : [
],
"manifest_display_name" : "Viperit",
"name" : "Viperit",
"path" : "/Users/admin/builder/spi-builder-workspace",
"platforms" : [
{
"name" : "ios",
"version" : "11.0"
}
],
"products" : [
{
"name" : "Viperit",
"targets" : [
"Viperit"
],
"type" : {
"library" : [
"automatic"
]
}
}
],
"targets" : [
{
"c99name" : "ViperitTests",
"module_type" : "SwiftTarget",
"name" : "ViperitTests",
"path" : "ViperitTests",
"sources" : [
"ExtensionsTests.swift",
"ModuleTests.swift",
"PresenterTests.swift",
"RouterTests.swift",
"Sample/Modules/CodeModule/CodeModuleDisplayData.swift",
"Sample/Modules/CodeModule/CodeModuleInteractor.swift",
"Sample/Modules/CodeModule/CodeModuleModuleApi.swift",
"Sample/Modules/CodeModule/CodeModulePresenter.swift",
"Sample/Modules/CodeModule/CodeModuleRouter.swift",
"Sample/Modules/CodeModule/CodeModuleView.swift",
"Sample/Modules/Sample/SampleDisplayData.swift",
"Sample/Modules/Sample/SampleInteractor.swift",
"Sample/Modules/Sample/SamplePresenter.swift",
"Sample/Modules/Sample/SampleRouter.swift",
"Sample/Modules/Sample/SampleView.swift",
"Sample/Modules/Sample/SampleViewPad.swift",
"Sample/Modules/SwiftUI/SwiftUIInteractor.swift",
"Sample/Modules/SwiftUI/SwiftUIModuleApi.swift",
"Sample/Modules/SwiftUI/SwiftUIPresenter.swift",
"Sample/Modules/SwiftUI/SwiftUIRouter.swift",
"Sample/Modules/SwiftUI/SwiftUIView.swift",
"Sample/Modules/SwiftUIWithEnv/SwiftUIWithEnvInteractor.swift",
"Sample/Modules/SwiftUIWithEnv/SwiftUIWithEnvModuleApi.swift",
"Sample/Modules/SwiftUIWithEnv/SwiftUIWithEnvPresenter.swift",
"Sample/Modules/SwiftUIWithEnv/SwiftUIWithEnvRouter.swift",
"Sample/Modules/SwiftUIWithEnv/SwiftUIWithEnvView.swift",
"Sample/Modules/XibModule/XibModuleDisplayData.swift",
"Sample/Modules/XibModule/XibModuleInteractor.swift",
"Sample/Modules/XibModule/XibModuleModuleApi.swift",
"Sample/Modules/XibModule/XibModulePresenter.swift",
"Sample/Modules/XibModule/XibModuleRouter.swift",
"Sample/Modules/XibModule/XibModuleView.swift",
"Sample/TestCleanModules.swift",
"Sample/TestModules.swift"
],
"target_dependencies" : [
"Viperit"
],
"type" : "test"
},
{
"c99name" : "Viperit",
"module_type" : "SwiftTarget",
"name" : "Viperit",
"path" : "Viperit",
"product_memberships" : [
"Viperit"
],
"sources" : [
"Core/DisplayData.swift",
"Core/Interactor.swift",
"Core/Module.swift",
"Core/Presenter.swift",
"Core/Router.swift",
"Core/UserInterface.swift",
"Core/ViperComponent.swift",
"Core/ViperitError.swift",
"Core/ViperitModule.swift",
"Extensions/String+.swift",
"Extensions/UserInterface+Collection.swift",
"Extensions/UserInterface+Split.swift",
"Extensions/UserInterface+SwiftUI.swift",
"Extensions/UserInterface+Table.swift"
],
"type" : "library"
}
],
"tools_version" : "5.0"
}
{
"workspace" : {
"name" : "spi-builder-workspace",
"schemes" : [
"Viperit"
]
}
}
Running build ...
env DEVELOPER_DIR=/Applications/Xcode-16.3.0.app xcrun xcodebuild -IDEClonedSourcePackagesDirPathOverride=$PWD/.dependencies -skipMacroValidation -skipPackagePluginValidation -derivedDataPath $PWD/.derivedData build -scheme Viperit -destination platform=macOS,arch=arm64
Command line invocation:
/Applications/Xcode-16.3.0.app/Contents/Developer/usr/bin/xcodebuild -IDEClonedSourcePackagesDirPathOverride=/Users/admin/builder/spi-builder-workspace/.dependencies -skipMacroValidation -skipPackagePluginValidation -derivedDataPath /Users/admin/builder/spi-builder-workspace/.derivedData build -scheme Viperit -destination platform=macOS,arch=arm64
Resolve Package Graph
Resolved source packages:
Viperit: /Users/admin/builder/spi-builder-workspace
ComputePackagePrebuildTargetDependencyGraph
Prepare packages
CreateBuildRequest
SendProjectDescription
CreateBuildOperation
ComputeTargetDependencyGraph
note: Building targets in dependency order
note: Target dependency graph (2 targets)
Target 'Viperit' in project 'Viperit'
➜ Explicit dependency on target 'Viperit' in project 'Viperit'
Target 'Viperit' in project 'Viperit' (no dependencies)
GatherProvisioningInputs
CreateBuildDescription
ExecuteExternalTool /Applications/Xcode-16.3.0.app/Contents/Developer/Toolchains/XcodeDefault.xctoolchain/usr/bin/clang -v -E -dM -isysroot /Applications/Xcode-16.3.0.app/Contents/Developer/Platforms/MacOSX.platform/Developer/SDKs/MacOSX15.4.sdk -x c -c /dev/null
ExecuteExternalTool /Applications/Xcode-16.3.0.app/Contents/Developer/Toolchains/XcodeDefault.xctoolchain/usr/bin/swiftc --version
ExecuteExternalTool /Applications/Xcode-16.3.0.app/Contents/Developer/Toolchains/XcodeDefault.xctoolchain/usr/bin/ld -version_details
Build description signature: 31a3693e1d091ed06f9844389855d586
Build description path: /Users/admin/builder/spi-builder-workspace/.derivedData/Build/Intermediates.noindex/XCBuildData/31a3693e1d091ed06f9844389855d586.xcbuilddata
ClangStatCache /Applications/Xcode-16.3.0.app/Contents/Developer/Toolchains/XcodeDefault.xctoolchain/usr/bin/clang-stat-cache /Applications/Xcode-16.3.0.app/Contents/Developer/Platforms/MacOSX.platform/Developer/SDKs/MacOSX15.4.sdk /Users/admin/builder/spi-builder-workspace/.derivedData/SDKStatCaches.noindex/macosx15.4-24E241-8287b8f5db97e746a1562fbca0c9d29b.sdkstatcache
cd /Users/admin/builder/spi-builder-workspace/.swiftpm/xcode
/Applications/Xcode-16.3.0.app/Contents/Developer/Toolchains/XcodeDefault.xctoolchain/usr/bin/clang-stat-cache /Applications/Xcode-16.3.0.app/Contents/Developer/Platforms/MacOSX.platform/Developer/SDKs/MacOSX15.4.sdk -o /Users/admin/builder/spi-builder-workspace/.derivedData/SDKStatCaches.noindex/macosx15.4-24E241-8287b8f5db97e746a1562fbca0c9d29b.sdkstatcache
SwiftDriver Viperit normal arm64 com.apple.xcode.tools.swift.compiler (in target 'Viperit' from project 'Viperit')
cd /Users/admin/builder/spi-builder-workspace/.swiftpm/xcode
builtin-SwiftDriver -- /Applications/Xcode-16.3.0.app/Contents/Developer/Toolchains/XcodeDefault.xctoolchain/usr/bin/swiftc -module-name Viperit -Onone -enforce-exclusivity\=checked @/Users/admin/builder/spi-builder-workspace/.derivedData/Build/Intermediates.noindex/Viperit.build/Debug/Viperit.build/Objects-normal/arm64/Viperit.SwiftFileList -DSWIFT_PACKAGE -DDEBUG -DXcode -plugin-path /Applications/Xcode-16.3.0.app/Contents/Developer/Toolchains/XcodeDefault.xctoolchain/usr/lib/swift/host/plugins/testing -enable-experimental-feature DebugDescriptionMacro -sdk /Applications/Xcode-16.3.0.app/Contents/Developer/Platforms/MacOSX.platform/Developer/SDKs/MacOSX15.4.sdk -target arm64-apple-macos10.13 -g -module-cache-path /Users/admin/builder/spi-builder-workspace/.derivedData/ModuleCache.noindex -Xfrontend -serialize-debugging-options -profile-coverage-mapping -profile-generate -enable-testing -index-store-path /Users/admin/builder/spi-builder-workspace/.derivedData/Index.noindex/DataStore -swift-version 5 -I /Users/admin/builder/spi-builder-workspace/.derivedData/Build/Products/Debug -I /Applications/Xcode-16.3.0.app/Contents/Developer/Platforms/MacOSX.platform/Developer/usr/lib -F /Users/admin/builder/spi-builder-workspace/.derivedData/Build/Products/Debug -F /Applications/Xcode-16.3.0.app/Contents/Developer/Platforms/MacOSX.platform/Developer/Library/Frameworks -c -j10 -enable-batch-mode -incremental -Xcc -ivfsstatcache -Xcc /Users/admin/builder/spi-builder-workspace/.derivedData/SDKStatCaches.noindex/macosx15.4-24E241-8287b8f5db97e746a1562fbca0c9d29b.sdkstatcache -output-file-map /Users/admin/builder/spi-builder-workspace/.derivedData/Build/Intermediates.noindex/Viperit.build/Debug/Viperit.build/Objects-normal/arm64/Viperit-OutputFileMap.json -use-frontend-parseable-output -save-temps -no-color-diagnostics -serialize-diagnostics -emit-dependencies -emit-module -emit-module-path /Users/admin/builder/spi-builder-workspace/.derivedData/Build/Intermediates.noindex/Viperit.build/Debug/Viperit.build/Objects-normal/arm64/Viperit.swiftmodule -validate-clang-modules-once -clang-build-session-file /Users/admin/builder/spi-builder-workspace/.derivedData/ModuleCache.noindex/Session.modulevalidation -Xcc -I/Users/admin/builder/spi-builder-workspace/.derivedData/Build/Intermediates.noindex/Viperit.build/Debug/Viperit.build/swift-overrides.hmap -emit-const-values -Xfrontend -const-gather-protocols-file -Xfrontend /Users/admin/builder/spi-builder-workspace/.derivedData/Build/Intermediates.noindex/Viperit.build/Debug/Viperit.build/Objects-normal/arm64/Viperit_const_extract_protocols.json -Xcc -I/Users/admin/builder/spi-builder-workspace/.derivedData/Build/Products/Debug/include -Xcc -I/Users/admin/builder/spi-builder-workspace/.derivedData/Build/Intermediates.noindex/Viperit.build/Debug/Viperit.build/DerivedSources-normal/arm64 -Xcc -I/Users/admin/builder/spi-builder-workspace/.derivedData/Build/Intermediates.noindex/Viperit.build/Debug/Viperit.build/DerivedSources/arm64 -Xcc -I/Users/admin/builder/spi-builder-workspace/.derivedData/Build/Intermediates.noindex/Viperit.build/Debug/Viperit.build/DerivedSources -Xcc -DSWIFT_PACKAGE -Xcc -DDEBUG\=1 -emit-objc-header -emit-objc-header-path /Users/admin/builder/spi-builder-workspace/.derivedData/Build/Intermediates.noindex/Viperit.build/Debug/Viperit.build/Objects-normal/arm64/Viperit-Swift.h -working-directory /Users/admin/builder/spi-builder-workspace/.swiftpm/xcode -experimental-emit-module-separately -disable-cmo
SwiftCompile normal arm64 Compiling\ DisplayData.swift,\ Interactor.swift /Users/admin/builder/spi-builder-workspace/Viperit/Core/DisplayData.swift /Users/admin/builder/spi-builder-workspace/Viperit/Core/Interactor.swift (in target 'Viperit' from project 'Viperit')
SwiftCompile normal arm64 /Users/admin/builder/spi-builder-workspace/Viperit/Core/DisplayData.swift (in target 'Viperit' from project 'Viperit')
cd /Users/admin/builder/spi-builder-workspace/.swiftpm/xcode
SwiftCompile normal arm64 /Users/admin/builder/spi-builder-workspace/Viperit/Core/Interactor.swift (in target 'Viperit' from project 'Viperit')
cd /Users/admin/builder/spi-builder-workspace/.swiftpm/xcode
SwiftCompile normal arm64 Compiling\ Module.swift,\ Presenter.swift /Users/admin/builder/spi-builder-workspace/Viperit/Core/Module.swift /Users/admin/builder/spi-builder-workspace/Viperit/Core/Presenter.swift (in target 'Viperit' from project 'Viperit')
SwiftCompile normal arm64 /Users/admin/builder/spi-builder-workspace/Viperit/Core/Module.swift (in target 'Viperit' from project 'Viperit')
cd /Users/admin/builder/spi-builder-workspace/.swiftpm/xcode
SwiftCompile normal arm64 /Users/admin/builder/spi-builder-workspace/Viperit/Core/Presenter.swift (in target 'Viperit' from project 'Viperit')
cd /Users/admin/builder/spi-builder-workspace/.swiftpm/xcode
SwiftCompile normal arm64 Compiling\ String+.swift /Users/admin/builder/spi-builder-workspace/Viperit/Extensions/String+.swift (in target 'Viperit' from project 'Viperit')
SwiftCompile normal arm64 /Users/admin/builder/spi-builder-workspace/Viperit/Extensions/String+.swift (in target 'Viperit' from project 'Viperit')
cd /Users/admin/builder/spi-builder-workspace/.swiftpm/xcode
SwiftCompile normal arm64 Compiling\ UserInterface+Collection.swift /Users/admin/builder/spi-builder-workspace/Viperit/Extensions/UserInterface+Collection.swift (in target 'Viperit' from project 'Viperit')
Failed frontend command:
/Applications/Xcode-16.3.0.app/Contents/Developer/Toolchains/XcodeDefault.xctoolchain/usr/bin/swift-frontend -frontend -c /Users/admin/builder/spi-builder-workspace/Viperit/Core/DisplayData.swift /Users/admin/builder/spi-builder-workspace/Viperit/Core/Interactor.swift /Users/admin/builder/spi-builder-workspace/Viperit/Core/Module.swift /Users/admin/builder/spi-builder-workspace/Viperit/Core/Presenter.swift /Users/admin/builder/spi-builder-workspace/Viperit/Core/Router.swift /Users/admin/builder/spi-builder-workspace/Viperit/Core/UserInterface.swift /Users/admin/builder/spi-builder-workspace/Viperit/Core/ViperComponent.swift /Users/admin/builder/spi-builder-workspace/Viperit/Core/ViperitError.swift /Users/admin/builder/spi-builder-workspace/Viperit/Core/ViperitModule.swift /Users/admin/builder/spi-builder-workspace/Viperit/Extensions/String+.swift -primary-file /Users/admin/builder/spi-builder-workspace/Viperit/Extensions/UserInterface+Collection.swift /Users/admin/builder/spi-builder-workspace/Viperit/Extensions/UserInterface+Split.swift /Users/admin/builder/spi-builder-workspace/Viperit/Extensions/UserInterface+SwiftUI.swift /Users/admin/builder/spi-builder-workspace/Viperit/Extensions/UserInterface+Table.swift -emit-dependencies-path /Users/admin/builder/spi-builder-workspace/.derivedData/Build/Intermediates.noindex/Viperit.build/Debug/Viperit.build/Objects-normal/arm64/UserInterface+Collection.d -emit-const-values-path /Users/admin/builder/spi-builder-workspace/.derivedData/Build/Intermediates.noindex/Viperit.build/Debug/Viperit.build/Objects-normal/arm64/UserInterface+Collection.swiftconstvalues -emit-reference-dependencies-path /Users/admin/builder/spi-builder-workspace/.derivedData/Build/Intermediates.noindex/Viperit.build/Debug/Viperit.build/Objects-normal/arm64/UserInterface+Collection.swiftdeps -serialize-diagnostics-path /Users/admin/builder/spi-builder-workspace/.derivedData/Build/Intermediates.noindex/Viperit.build/Debug/Viperit.build/Objects-normal/arm64/UserInterface+Collection.dia -target arm64-apple-macos10.13 -Xllvm -aarch64-use-tbi -enable-objc-interop -sdk /Applications/Xcode-16.3.0.app/Contents/Developer/Platforms/MacOSX.platform/Developer/SDKs/MacOSX15.4.sdk -I /Users/admin/builder/spi-builder-workspace/.derivedData/Build/Products/Debug -I /Applications/Xcode-16.3.0.app/Contents/Developer/Platforms/MacOSX.platform/Developer/usr/lib -F /Users/admin/builder/spi-builder-workspace/.derivedData/Build/Products/Debug -F /Applications/Xcode-16.3.0.app/Contents/Developer/Platforms/MacOSX.platform/Developer/Library/Frameworks -no-color-diagnostics -enable-testing -g -debug-info-format\=dwarf -dwarf-version\=4 -module-cache-path /Users/admin/builder/spi-builder-workspace/.derivedData/ModuleCache.noindex -profile-generate -profile-coverage-mapping -swift-version 5 -enforce-exclusivity\=checked -Onone -D SWIFT_PACKAGE -D DEBUG -D Xcode -serialize-debugging-options -const-gather-protocols-file /Users/admin/builder/spi-builder-workspace/.derivedData/Build/Intermediates.noindex/Viperit.build/Debug/Viperit.build/Objects-normal/arm64/Viperit_const_extract_protocols.json -enable-experimental-feature DebugDescriptionMacro -empty-abi-descriptor -plugin-path /Applications/Xcode-16.3.0.app/Contents/Developer/Toolchains/XcodeDefault.xctoolchain/usr/lib/swift/host/plugins/testing -validate-clang-modules-once -clang-build-session-file /Users/admin/builder/spi-builder-workspace/.derivedData/ModuleCache.noindex/Session.modulevalidation -Xcc -working-directory -Xcc /Users/admin/builder/spi-builder-workspace/.swiftpm/xcode -resource-dir /Applications/Xcode-16.3.0.app/Contents/Developer/Toolchains/XcodeDefault.xctoolchain/usr/lib/swift -enable-anonymous-context-mangled-names -file-compilation-dir /Users/admin/builder/spi-builder-workspace/.swiftpm/xcode -Xcc -ivfsstatcache -Xcc /Users/admin/builder/spi-builder-workspace/.derivedData/SDKStatCaches.noindex/macosx15.4-24E241-8287b8f5db97e746a1562fbca0c9d29b.sdkstatcache -Xcc -I/Users/admin/builder/spi-builder-workspace/.derivedData/Build/Intermediates.noindex/Viperit.build/Debug/Viperit.build/swift-overrides.hmap -Xcc -I/Users/admin/builder/spi-builder-workspace/.derivedData/Build/Products/Debug/include -Xcc -I/Users/admin/builder/spi-builder-workspace/.derivedData/Build/Intermediates.noindex/Viperit.build/Debug/Viperit.build/DerivedSources-normal/arm64 -Xcc -I/Users/admin/builder/spi-builder-workspace/.derivedData/Build/Intermediates.noindex/Viperit.build/Debug/Viperit.build/DerivedSources/arm64 -Xcc -I/Users/admin/builder/spi-builder-workspace/.derivedData/Build/Intermediates.noindex/Viperit.build/Debug/Viperit.build/DerivedSources -Xcc -DSWIFT_PACKAGE -Xcc -DDEBUG\=1 -module-name Viperit -frontend-parseable-output -disable-clang-spi -target-sdk-version 15.4 -target-sdk-name macosx15.4 -external-plugin-path /Applications/Xcode-16.3.0.app/Contents/Developer/Platforms/MacOSX.platform/Developer/usr/lib/swift/host/plugins\#/Applications/Xcode-16.3.0.app/Contents/Developer/Platforms/MacOSX.platform/Developer/usr/bin/swift-plugin-server -external-plugin-path /Applications/Xcode-16.3.0.app/Contents/Developer/Platforms/MacOSX.platform/Developer/usr/local/lib/swift/host/plugins\#/Applications/Xcode-16.3.0.app/Contents/Developer/Platforms/MacOSX.platform/Developer/usr/bin/swift-plugin-server -in-process-plugin-server-path /Applications/Xcode-16.3.0.app/Contents/Developer/Toolchains/XcodeDefault.xctoolchain/usr/lib/swift/host/libSwiftInProcPluginServer.dylib -plugin-path /Applications/Xcode-16.3.0.app/Contents/Developer/Toolchains/XcodeDefault.xctoolchain/usr/lib/swift/host/plugins -plugin-path /Applications/Xcode-16.3.0.app/Contents/Developer/Toolchains/XcodeDefault.xctoolchain/usr/local/lib/swift/host/plugins -o /Users/admin/builder/spi-builder-workspace/.derivedData/Build/Intermediates.noindex/Viperit.build/Debug/Viperit.build/Objects-normal/arm64/UserInterface+Collection.o -index-unit-output-path /Viperit.build/Debug/Viperit.build/Objects-normal/arm64/UserInterface+Collection.o -index-store-path /Users/admin/builder/spi-builder-workspace/.derivedData/Index.noindex/DataStore -index-system-modules
SwiftCompile normal arm64 /Users/admin/builder/spi-builder-workspace/Viperit/Extensions/UserInterface+Collection.swift (in target 'Viperit' from project 'Viperit')
cd /Users/admin/builder/spi-builder-workspace/.swiftpm/xcode
/Users/admin/builder/spi-builder-workspace/Viperit/Core/Module.swift:10:8: error: no such module 'UIKit'
import UIKit
^
SwiftCompile normal arm64 Compiling\ UserInterface+Table.swift /Users/admin/builder/spi-builder-workspace/Viperit/Extensions/UserInterface+Table.swift (in target 'Viperit' from project 'Viperit')
SwiftCompile normal arm64 /Users/admin/builder/spi-builder-workspace/Viperit/Extensions/UserInterface+Table.swift (in target 'Viperit' from project 'Viperit')
cd /Users/admin/builder/spi-builder-workspace/.swiftpm/xcode
/Users/admin/builder/spi-builder-workspace/Viperit/Core/Module.swift:10:8: error: no such module 'UIKit'
import UIKit
^
SwiftCompile normal arm64 Compiling\ UserInterface+SwiftUI.swift /Users/admin/builder/spi-builder-workspace/Viperit/Extensions/UserInterface+SwiftUI.swift (in target 'Viperit' from project 'Viperit')
SwiftCompile normal arm64 /Users/admin/builder/spi-builder-workspace/Viperit/Extensions/UserInterface+SwiftUI.swift (in target 'Viperit' from project 'Viperit')
cd /Users/admin/builder/spi-builder-workspace/.swiftpm/xcode
SwiftCompile normal arm64 Compiling\ UserInterface+Split.swift /Users/admin/builder/spi-builder-workspace/Viperit/Extensions/UserInterface+Split.swift (in target 'Viperit' from project 'Viperit')
SwiftCompile normal arm64 /Users/admin/builder/spi-builder-workspace/Viperit/Extensions/UserInterface+Split.swift (in target 'Viperit' from project 'Viperit')
cd /Users/admin/builder/spi-builder-workspace/.swiftpm/xcode
/Users/admin/builder/spi-builder-workspace/Viperit/Core/Module.swift:10:8: error: no such module 'UIKit'
import UIKit
^
SwiftCompile normal arm64 Compiling\ ViperitModule.swift /Users/admin/builder/spi-builder-workspace/Viperit/Core/ViperitModule.swift (in target 'Viperit' from project 'Viperit')
SwiftCompile normal arm64 /Users/admin/builder/spi-builder-workspace/Viperit/Core/ViperitModule.swift (in target 'Viperit' from project 'Viperit')
cd /Users/admin/builder/spi-builder-workspace/.swiftpm/xcode
SwiftCompile normal arm64 Compiling\ ViperComponent.swift,\ ViperitError.swift /Users/admin/builder/spi-builder-workspace/Viperit/Core/ViperComponent.swift /Users/admin/builder/spi-builder-workspace/Viperit/Core/ViperitError.swift (in target 'Viperit' from project 'Viperit')
SwiftCompile normal arm64 /Users/admin/builder/spi-builder-workspace/Viperit/Core/ViperComponent.swift (in target 'Viperit' from project 'Viperit')
cd /Users/admin/builder/spi-builder-workspace/.swiftpm/xcode
SwiftCompile normal arm64 /Users/admin/builder/spi-builder-workspace/Viperit/Core/ViperitError.swift (in target 'Viperit' from project 'Viperit')
cd /Users/admin/builder/spi-builder-workspace/.swiftpm/xcode
SwiftCompile normal arm64 Compiling\ Router.swift,\ UserInterface.swift /Users/admin/builder/spi-builder-workspace/Viperit/Core/Router.swift /Users/admin/builder/spi-builder-workspace/Viperit/Core/UserInterface.swift (in target 'Viperit' from project 'Viperit')
SwiftCompile normal arm64 /Users/admin/builder/spi-builder-workspace/Viperit/Core/Router.swift (in target 'Viperit' from project 'Viperit')
cd /Users/admin/builder/spi-builder-workspace/.swiftpm/xcode
SwiftCompile normal arm64 /Users/admin/builder/spi-builder-workspace/Viperit/Core/UserInterface.swift (in target 'Viperit' from project 'Viperit')
cd /Users/admin/builder/spi-builder-workspace/.swiftpm/xcode
SwiftEmitModule normal arm64 Emitting\ module\ for\ Viperit (in target 'Viperit' from project 'Viperit')
Command SwiftEmitModule failed with a nonzero exit code
--- xcodebuild: WARNING: Using the first of multiple matching destinations:
{ platform:macOS, arch:arm64, id:3678c7a802501fa94c470d9f64bd6a9c7d1927ce, name:My Mac }
{ platform:macOS, arch:arm64, variant:Mac Catalyst, id:3678c7a802501fa94c470d9f64bd6a9c7d1927ce, name:My Mac }
{ platform:macOS, arch:arm64, variant:DriverKit, id:3678c7a802501fa94c470d9f64bd6a9c7d1927ce, name:My Mac }
{ platform:macOS, arch:arm64, variant:Designed for [iPad,iPhone], id:3678c7a802501fa94c470d9f64bd6a9c7d1927ce, name:My Mac }
** BUILD FAILED **
The following build commands failed:
SwiftCompile normal arm64 Compiling\ UserInterface+Collection.swift /Users/admin/builder/spi-builder-workspace/Viperit/Extensions/UserInterface+Collection.swift (in target 'Viperit' from project 'Viperit')
SwiftCompile normal arm64 /Users/admin/builder/spi-builder-workspace/Viperit/Extensions/UserInterface+Collection.swift (in target 'Viperit' from project 'Viperit')
SwiftCompile normal arm64 /Users/admin/builder/spi-builder-workspace/Viperit/Extensions/UserInterface+Table.swift (in target 'Viperit' from project 'Viperit')
SwiftCompile normal arm64 /Users/admin/builder/spi-builder-workspace/Viperit/Extensions/UserInterface+Split.swift (in target 'Viperit' from project 'Viperit')
SwiftEmitModule normal arm64 Emitting\ module\ for\ Viperit (in target 'Viperit' from project 'Viperit')
Building workspace spi-builder-workspace with scheme Viperit
(6 failures)
BUILD FAILURE 6.1 macosXcodebuild