Build Information
Failed to build FluidInterfaceKit, reference main (303d34
), with Swift 6.1 for tvOS using Xcode 16.3 on 29 Apr 2025 21:22:13 UTC.
Build Command
env DEVELOPER_DIR=/Applications/Xcode-16.3.0.app xcrun xcodebuild -IDEClonedSourcePackagesDirPathOverride=$PWD/.dependencies -skipMacroValidation -skipPackagePluginValidation -derivedDataPath $PWD/.derivedData build -scheme FluidInterfaceKit-Package -destination generic/platform=tvOS
Build Log
PrecompileModule /Users/admin/builder/spi-builder-workspace/.derivedData/Build/Intermediates.noindex/ExplicitPrecompiledModules/_locale-50498IP3DY4VASQLQX8RAUENQ.scan
cd /Users/admin/builder/spi-builder-workspace/.swiftpm/xcode
builtin-precompileModule /Users/admin/builder/spi-builder-workspace/.derivedData/Build/Intermediates.noindex/ExplicitPrecompiledModules/_locale-50498IP3DY4VASQLQX8RAUENQ.scan
PrecompileModule /Users/admin/builder/spi-builder-workspace/.derivedData/Build/Intermediates.noindex/ExplicitPrecompiledModules/_limits-2UL8VJQY66TI5DP4P65PW8RWM.scan
cd /Users/admin/builder/spi-builder-workspace/.swiftpm/xcode
builtin-precompileModule /Users/admin/builder/spi-builder-workspace/.derivedData/Build/Intermediates.noindex/ExplicitPrecompiledModules/_limits-2UL8VJQY66TI5DP4P65PW8RWM.scan
PrecompileModule /Users/admin/builder/spi-builder-workspace/.derivedData/Build/Intermediates.noindex/ExplicitPrecompiledModules/uuid-7XN642PNA74V8ULFB4U2DBJKL.scan
cd /Users/admin/builder/spi-builder-workspace/.swiftpm/xcode
builtin-precompileModule /Users/admin/builder/spi-builder-workspace/.derivedData/Build/Intermediates.noindex/ExplicitPrecompiledModules/uuid-7XN642PNA74V8ULFB4U2DBJKL.scan
SwiftDriverJobDiscovery normal arm64 Emitting module for FluidPortal (in target 'FluidPortal' from project 'FluidInterfaceKit')
PrecompileModule /Users/admin/builder/spi-builder-workspace/.derivedData/Build/Intermediates.noindex/ExplicitPrecompiledModules/mach-1SPVQ858LQIPXWRU3PTJK4JB9.scan
cd /Users/admin/builder/spi-builder-workspace/.swiftpm/xcode
builtin-precompileModule /Users/admin/builder/spi-builder-workspace/.derivedData/Build/Intermediates.noindex/ExplicitPrecompiledModules/mach-1SPVQ858LQIPXWRU3PTJK4JB9.scan
SwiftDriver\ Compilation\ Requirements FluidPortal normal arm64 com.apple.xcode.tools.swift.compiler (in target 'FluidPortal' from project 'FluidInterfaceKit')
cd /Users/admin/builder/spi-builder-workspace/.swiftpm/xcode
builtin-Swift-Compilation-Requirements -- /Applications/Xcode-16.3.0.app/Contents/Developer/Toolchains/XcodeDefault.xctoolchain/usr/bin/swiftc -module-name FluidPortal -Onone -enforce-exclusivity\=checked @/Users/admin/builder/spi-builder-workspace/.derivedData/Build/Intermediates.noindex/FluidInterfaceKit.build/Debug-appletvos/FluidPortal.build/Objects-normal/arm64/FluidPortal.SwiftFileList -DSWIFT_PACKAGE -DDEBUG -Xcc -fmodule-map-file\=/Users/admin/builder/spi-builder-workspace/.derivedData/Build/Intermediates.noindex/GeneratedModuleMaps-appletvos/FluidRuntime.modulemap -stats-output-dir .stats -plugin-path /Applications/Xcode-16.3.0.app/Contents/Developer/Toolchains/XcodeDefault.xctoolchain/usr/lib/swift/host/plugins/testing -enable-experimental-feature DebugDescriptionMacro -sdk /Applications/Xcode-16.3.0.app/Contents/Developer/Platforms/AppleTVOS.platform/Developer/SDKs/AppleTVOS18.4.sdk -target arm64-apple-tvos13.0 -g -module-cache-path /Users/admin/builder/spi-builder-workspace/.derivedData/ModuleCache.noindex -Xfrontend -serialize-debugging-options -profile-coverage-mapping -profile-generate -enable-testing -index-store-path /Users/admin/builder/spi-builder-workspace/.derivedData/Index.noindex/DataStore -swift-version 6 -I /Users/admin/builder/spi-builder-workspace/.derivedData/Build/Products/Debug-appletvos -I /Applications/Xcode-16.3.0.app/Contents/Developer/Platforms/AppleTVOS.platform/Developer/usr/lib -F /Users/admin/builder/spi-builder-workspace/.derivedData/Build/Products/Debug-appletvos/PackageFrameworks -F /Users/admin/builder/spi-builder-workspace/.derivedData/Build/Products/Debug-appletvos -F /Applications/Xcode-16.3.0.app/Contents/Developer/Platforms/AppleTVOS.platform/Developer/Library/Frameworks -F /Applications/Xcode-16.3.0.app/Contents/Developer/Platforms/AppleTVOS.platform/Developer/SDKs/AppleTVOS18.4.sdk/Developer/Library/Frameworks -c -j10 -enable-batch-mode -incremental -Xcc -ivfsstatcache -Xcc /Users/admin/builder/spi-builder-workspace/.derivedData/SDKStatCaches.noindex/appletvos18.4-22L251-271d326055c85f9856fa135c41255102.sdkstatcache -output-file-map /Users/admin/builder/spi-builder-workspace/.derivedData/Build/Intermediates.noindex/FluidInterfaceKit.build/Debug-appletvos/FluidPortal.build/Objects-normal/arm64/FluidPortal-OutputFileMap.json -use-frontend-parseable-output -save-temps -no-color-diagnostics -serialize-diagnostics -emit-dependencies -emit-module -emit-module-path /Users/admin/builder/spi-builder-workspace/.derivedData/Build/Intermediates.noindex/FluidInterfaceKit.build/Debug-appletvos/FluidPortal.build/Objects-normal/arm64/FluidPortal.swiftmodule -validate-clang-modules-once -clang-build-session-file /Users/admin/builder/spi-builder-workspace/.derivedData/ModuleCache.noindex/Session.modulevalidation -package-name spi_builder_workspace -Xcc -I/Users/admin/builder/spi-builder-workspace/.derivedData/Build/Intermediates.noindex/FluidInterfaceKit.build/Debug-appletvos/FluidPortal.build/swift-overrides.hmap -emit-const-values -Xfrontend -const-gather-protocols-file -Xfrontend /Users/admin/builder/spi-builder-workspace/.derivedData/Build/Intermediates.noindex/FluidInterfaceKit.build/Debug-appletvos/FluidPortal.build/Objects-normal/arm64/FluidPortal_const_extract_protocols.json -Xcc -I/Users/admin/builder/spi-builder-workspace/Sources/FluidRuntime/include -Xcc -I/Users/admin/builder/spi-builder-workspace/.derivedData/Build/Products/Debug-appletvos/include -Xcc -I/Users/admin/builder/spi-builder-workspace/.derivedData/Build/Intermediates.noindex/FluidInterfaceKit.build/Debug-appletvos/FluidPortal.build/DerivedSources-normal/arm64 -Xcc -I/Users/admin/builder/spi-builder-workspace/.derivedData/Build/Intermediates.noindex/FluidInterfaceKit.build/Debug-appletvos/FluidPortal.build/DerivedSources/arm64 -Xcc -I/Users/admin/builder/spi-builder-workspace/.derivedData/Build/Intermediates.noindex/FluidInterfaceKit.build/Debug-appletvos/FluidPortal.build/DerivedSources -Xcc -DSWIFT_PACKAGE -Xcc -DDEBUG\=1 -emit-objc-header -emit-objc-header-path /Users/admin/builder/spi-builder-workspace/.derivedData/Build/Intermediates.noindex/FluidInterfaceKit.build/Debug-appletvos/FluidPortal.build/Objects-normal/arm64/FluidPortal-Swift.h -working-directory /Users/admin/builder/spi-builder-workspace/.swiftpm/xcode -experimental-emit-module-separately -disable-cmo
PrecompileModule /Users/admin/builder/spi-builder-workspace/.derivedData/Build/Intermediates.noindex/ExplicitPrecompiledModules/_math-4SLSWAENG5AENA1GPF38B8XVF.scan
cd /Users/admin/builder/spi-builder-workspace/.swiftpm/xcode
builtin-precompileModule /Users/admin/builder/spi-builder-workspace/.derivedData/Build/Intermediates.noindex/ExplicitPrecompiledModules/_math-4SLSWAENG5AENA1GPF38B8XVF.scan
SwiftMergeGeneratedHeaders /Users/admin/builder/spi-builder-workspace/.derivedData/Build/Intermediates.noindex/GeneratedModuleMaps-appletvos/FluidPortal-Swift.h /Users/admin/builder/spi-builder-workspace/.derivedData/Build/Intermediates.noindex/FluidInterfaceKit.build/Debug-appletvos/FluidPortal.build/Objects-normal/arm64/FluidPortal-Swift.h (in target 'FluidPortal' from project 'FluidInterfaceKit')
cd /Users/admin/builder/spi-builder-workspace
builtin-swiftHeaderTool -arch arm64 /Users/admin/builder/spi-builder-workspace/.derivedData/Build/Intermediates.noindex/FluidInterfaceKit.build/Debug-appletvos/FluidPortal.build/Objects-normal/arm64/FluidPortal-Swift.h -o /Users/admin/builder/spi-builder-workspace/.derivedData/Build/Intermediates.noindex/GeneratedModuleMaps-appletvos/FluidPortal-Swift.h
Copy /Users/admin/builder/spi-builder-workspace/.derivedData/Build/Products/Debug-appletvos/FluidPortal.swiftmodule/arm64-apple-tvos.swiftmodule /Users/admin/builder/spi-builder-workspace/.derivedData/Build/Intermediates.noindex/FluidInterfaceKit.build/Debug-appletvos/FluidPortal.build/Objects-normal/arm64/FluidPortal.swiftmodule (in target 'FluidPortal' from project 'FluidInterfaceKit')
cd /Users/admin/builder/spi-builder-workspace
builtin-copy -exclude .DS_Store -exclude CVS -exclude .svn -exclude .git -exclude .hg -resolve-src-symlinks -rename /Users/admin/builder/spi-builder-workspace/.derivedData/Build/Intermediates.noindex/FluidInterfaceKit.build/Debug-appletvos/FluidPortal.build/Objects-normal/arm64/FluidPortal.swiftmodule /Users/admin/builder/spi-builder-workspace/.derivedData/Build/Products/Debug-appletvos/FluidPortal.swiftmodule/arm64-apple-tvos.swiftmodule
Copy /Users/admin/builder/spi-builder-workspace/.derivedData/Build/Products/Debug-appletvos/FluidPortal.swiftmodule/arm64-apple-tvos.swiftdoc /Users/admin/builder/spi-builder-workspace/.derivedData/Build/Intermediates.noindex/FluidInterfaceKit.build/Debug-appletvos/FluidPortal.build/Objects-normal/arm64/FluidPortal.swiftdoc (in target 'FluidPortal' from project 'FluidInterfaceKit')
cd /Users/admin/builder/spi-builder-workspace
builtin-copy -exclude .DS_Store -exclude CVS -exclude .svn -exclude .git -exclude .hg -resolve-src-symlinks -rename /Users/admin/builder/spi-builder-workspace/.derivedData/Build/Intermediates.noindex/FluidInterfaceKit.build/Debug-appletvos/FluidPortal.build/Objects-normal/arm64/FluidPortal.swiftdoc /Users/admin/builder/spi-builder-workspace/.derivedData/Build/Products/Debug-appletvos/FluidPortal.swiftmodule/arm64-apple-tvos.swiftdoc
Copy /Users/admin/builder/spi-builder-workspace/.derivedData/Build/Products/Debug-appletvos/FluidPortal.swiftmodule/arm64-apple-tvos.abi.json /Users/admin/builder/spi-builder-workspace/.derivedData/Build/Intermediates.noindex/FluidInterfaceKit.build/Debug-appletvos/FluidPortal.build/Objects-normal/arm64/FluidPortal.abi.json (in target 'FluidPortal' from project 'FluidInterfaceKit')
cd /Users/admin/builder/spi-builder-workspace
builtin-copy -exclude .DS_Store -exclude CVS -exclude .svn -exclude .git -exclude .hg -resolve-src-symlinks -rename /Users/admin/builder/spi-builder-workspace/.derivedData/Build/Intermediates.noindex/FluidInterfaceKit.build/Debug-appletvos/FluidPortal.build/Objects-normal/arm64/FluidPortal.abi.json /Users/admin/builder/spi-builder-workspace/.derivedData/Build/Products/Debug-appletvos/FluidPortal.swiftmodule/arm64-apple-tvos.abi.json
Copy /Users/admin/builder/spi-builder-workspace/.derivedData/Build/Products/Debug-appletvos/FluidPortal.swiftmodule/Project/arm64-apple-tvos.swiftsourceinfo /Users/admin/builder/spi-builder-workspace/.derivedData/Build/Intermediates.noindex/FluidInterfaceKit.build/Debug-appletvos/FluidPortal.build/Objects-normal/arm64/FluidPortal.swiftsourceinfo (in target 'FluidPortal' from project 'FluidInterfaceKit')
cd /Users/admin/builder/spi-builder-workspace
builtin-copy -exclude .DS_Store -exclude CVS -exclude .svn -exclude .git -exclude .hg -resolve-src-symlinks -rename /Users/admin/builder/spi-builder-workspace/.derivedData/Build/Intermediates.noindex/FluidInterfaceKit.build/Debug-appletvos/FluidPortal.build/Objects-normal/arm64/FluidPortal.swiftsourceinfo /Users/admin/builder/spi-builder-workspace/.derivedData/Build/Products/Debug-appletvos/FluidPortal.swiftmodule/Project/arm64-apple-tvos.swiftsourceinfo
PrecompileModule /Users/admin/builder/spi-builder-workspace/.derivedData/Build/Intermediates.noindex/ExplicitPrecompiledModules/sys_time-7HEXF0LE828PG75YVYYEM4U7H.scan
cd /Users/admin/builder/spi-builder-workspace/.swiftpm/xcode
builtin-precompileModule /Users/admin/builder/spi-builder-workspace/.derivedData/Build/Intermediates.noindex/ExplicitPrecompiledModules/sys_time-7HEXF0LE828PG75YVYYEM4U7H.scan
PrecompileModule /Users/admin/builder/spi-builder-workspace/.derivedData/Build/Intermediates.noindex/ExplicitPrecompiledModules/_strings-EAI4LVRQOQK3D94HBFT7FPU6A.scan
cd /Users/admin/builder/spi-builder-workspace/.swiftpm/xcode
builtin-precompileModule /Users/admin/builder/spi-builder-workspace/.derivedData/Build/Intermediates.noindex/ExplicitPrecompiledModules/_strings-EAI4LVRQOQK3D94HBFT7FPU6A.scan
PrecompileModule /Users/admin/builder/spi-builder-workspace/.derivedData/Build/Intermediates.noindex/ExplicitPrecompiledModules/_useconds_t-2PEGADCM6F9RM3KFIVKCPPJ87.scan
cd /Users/admin/builder/spi-builder-workspace/.swiftpm/xcode
builtin-precompileModule /Users/admin/builder/spi-builder-workspace/.derivedData/Build/Intermediates.noindex/ExplicitPrecompiledModules/_useconds_t-2PEGADCM6F9RM3KFIVKCPPJ87.scan
PrecompileModule /Users/admin/builder/spi-builder-workspace/.derivedData/Build/Intermediates.noindex/ExplicitPrecompiledModules/xlocale-AH3JEPXVSD7WDMXRRI8X850TT.scan
cd /Users/admin/builder/spi-builder-workspace/.swiftpm/xcode
builtin-precompileModule /Users/admin/builder/spi-builder-workspace/.derivedData/Build/Intermediates.noindex/ExplicitPrecompiledModules/xlocale-AH3JEPXVSD7WDMXRRI8X850TT.scan
PrecompileModule /Users/admin/builder/spi-builder-workspace/.derivedData/Build/Intermediates.noindex/ExplicitPrecompiledModules/_Builtin_limits-3DMN7EYJL2ML1N7W32J99KNTV.scan
cd /Users/admin/builder/spi-builder-workspace/.swiftpm/xcode
builtin-precompileModule /Users/admin/builder/spi-builder-workspace/.derivedData/Build/Intermediates.noindex/ExplicitPrecompiledModules/_Builtin_limits-3DMN7EYJL2ML1N7W32J99KNTV.scan
PrecompileModule /Users/admin/builder/spi-builder-workspace/.derivedData/Build/Intermediates.noindex/ExplicitPrecompiledModules/_assert-3U4POB1KRJDLJD5XWAFOWCZ57.scan
cd /Users/admin/builder/spi-builder-workspace/.swiftpm/xcode
builtin-precompileModule /Users/admin/builder/spi-builder-workspace/.derivedData/Build/Intermediates.noindex/ExplicitPrecompiledModules/_assert-3U4POB1KRJDLJD5XWAFOWCZ57.scan
PrecompileModule /Users/admin/builder/spi-builder-workspace/.derivedData/Build/Intermediates.noindex/ExplicitPrecompiledModules/_stdint-2YPUC6Q84W7XJ62LXQJ3X9ZZ.scan
cd /Users/admin/builder/spi-builder-workspace/.swiftpm/xcode
builtin-precompileModule /Users/admin/builder/spi-builder-workspace/.derivedData/Build/Intermediates.noindex/ExplicitPrecompiledModules/_stdint-2YPUC6Q84W7XJ62LXQJ3X9ZZ.scan
PrecompileModule /Users/admin/builder/spi-builder-workspace/.derivedData/Build/Intermediates.noindex/ExplicitPrecompiledModules/_errno-AEHD3KJJJT85V7I6402XR4OLZ.scan
cd /Users/admin/builder/spi-builder-workspace/.swiftpm/xcode
builtin-precompileModule /Users/admin/builder/spi-builder-workspace/.derivedData/Build/Intermediates.noindex/ExplicitPrecompiledModules/_errno-AEHD3KJJJT85V7I6402XR4OLZ.scan
PrecompileModule /Users/admin/builder/spi-builder-workspace/.derivedData/Build/Intermediates.noindex/ExplicitPrecompiledModules/_complex-8GPIW2IJJO8Q5JDJ31BIHTAH.scan
cd /Users/admin/builder/spi-builder-workspace/.swiftpm/xcode
builtin-precompileModule /Users/admin/builder/spi-builder-workspace/.derivedData/Build/Intermediates.noindex/ExplicitPrecompiledModules/_complex-8GPIW2IJJO8Q5JDJ31BIHTAH.scan
PrecompileModule /Users/admin/builder/spi-builder-workspace/.derivedData/Build/Intermediates.noindex/ExplicitPrecompiledModules/AvailabilityMacros-4CHOJ4KXD0Z2YT6NRDGNU8MKF.scan
cd /Users/admin/builder/spi-builder-workspace/.swiftpm/xcode
builtin-precompileModule /Users/admin/builder/spi-builder-workspace/.derivedData/Build/Intermediates.noindex/ExplicitPrecompiledModules/AvailabilityMacros-4CHOJ4KXD0Z2YT6NRDGNU8MKF.scan
PrecompileModule /Users/admin/builder/spi-builder-workspace/.derivedData/Build/Intermediates.noindex/ExplicitPrecompiledModules/_ctype-1H9D907YDQQUJFWM4XPEPTFW7.scan
cd /Users/admin/builder/spi-builder-workspace/.swiftpm/xcode
builtin-precompileModule /Users/admin/builder/spi-builder-workspace/.derivedData/Build/Intermediates.noindex/ExplicitPrecompiledModules/_ctype-1H9D907YDQQUJFWM4XPEPTFW7.scan
PrecompileModule /Users/admin/builder/spi-builder-workspace/.derivedData/Build/Intermediates.noindex/ExplicitPrecompiledModules/_Builtin_stdint-21YY71Z4ATMDRSU23CPHWHOE2.scan
cd /Users/admin/builder/spi-builder-workspace/.swiftpm/xcode
builtin-precompileModule /Users/admin/builder/spi-builder-workspace/.derivedData/Build/Intermediates.noindex/ExplicitPrecompiledModules/_Builtin_stdint-21YY71Z4ATMDRSU23CPHWHOE2.scan
PrecompileModule /Users/admin/builder/spi-builder-workspace/.derivedData/Build/Intermediates.noindex/ExplicitPrecompiledModules/sys_types-8MBRH8WGYZHU7L8TE6D3JKUYP.scan
cd /Users/admin/builder/spi-builder-workspace/.swiftpm/xcode
builtin-precompileModule /Users/admin/builder/spi-builder-workspace/.derivedData/Build/Intermediates.noindex/ExplicitPrecompiledModules/sys_types-8MBRH8WGYZHU7L8TE6D3JKUYP.scan
PrecompileModule /Users/admin/builder/spi-builder-workspace/.derivedData/Build/Intermediates.noindex/ExplicitPrecompiledModules/_setjmp-BDKURV9GRYCAIXD3P2C617WFX.scan
cd /Users/admin/builder/spi-builder-workspace/.swiftpm/xcode
builtin-precompileModule /Users/admin/builder/spi-builder-workspace/.derivedData/Build/Intermediates.noindex/ExplicitPrecompiledModules/_setjmp-BDKURV9GRYCAIXD3P2C617WFX.scan
PrecompileModule /Users/admin/builder/spi-builder-workspace/.derivedData/Build/Intermediates.noindex/ExplicitPrecompiledModules/_tgmath-3YSW1HY1EBCPQFDQ9JYTLS7M8.scan
cd /Users/admin/builder/spi-builder-workspace/.swiftpm/xcode
builtin-precompileModule /Users/admin/builder/spi-builder-workspace/.derivedData/Build/Intermediates.noindex/ExplicitPrecompiledModules/_tgmath-3YSW1HY1EBCPQFDQ9JYTLS7M8.scan
PrecompileModule /Users/admin/builder/spi-builder-workspace/.derivedData/Build/Intermediates.noindex/ExplicitPrecompiledModules/__wctype-7VXMG5DZ2LF4T2CNMAAFM01P5.scan
cd /Users/admin/builder/spi-builder-workspace/.swiftpm/xcode
builtin-precompileModule /Users/admin/builder/spi-builder-workspace/.derivedData/Build/Intermediates.noindex/ExplicitPrecompiledModules/__wctype-7VXMG5DZ2LF4T2CNMAAFM01P5.scan
PrecompileModule /Users/admin/builder/spi-builder-workspace/.derivedData/Build/Intermediates.noindex/ExplicitPrecompiledModules/_Builtin_stdatomic-7L30Z28T6VY9GWXLC43PSZ6LU.scan
cd /Users/admin/builder/spi-builder-workspace/.swiftpm/xcode
builtin-precompileModule /Users/admin/builder/spi-builder-workspace/.derivedData/Build/Intermediates.noindex/ExplicitPrecompiledModules/_Builtin_stdatomic-7L30Z28T6VY9GWXLC43PSZ6LU.scan
PrecompileModule /Users/admin/builder/spi-builder-workspace/.derivedData/Build/Intermediates.noindex/ExplicitPrecompiledModules/_inttypes-DSUY97WI3MR6LTCFK8B28T1DA.scan
cd /Users/admin/builder/spi-builder-workspace/.swiftpm/xcode
builtin-precompileModule /Users/admin/builder/spi-builder-workspace/.derivedData/Build/Intermediates.noindex/ExplicitPrecompiledModules/_inttypes-DSUY97WI3MR6LTCFK8B28T1DA.scan
PrecompileModule /Users/admin/builder/spi-builder-workspace/.derivedData/Build/Intermediates.noindex/ExplicitPrecompiledModules/_signal-7WH8GCVQI21Y0SOLMM1TQSRHT.scan
cd /Users/admin/builder/spi-builder-workspace/.swiftpm/xcode
builtin-precompileModule /Users/admin/builder/spi-builder-workspace/.derivedData/Build/Intermediates.noindex/ExplicitPrecompiledModules/_signal-7WH8GCVQI21Y0SOLMM1TQSRHT.scan
PrecompileModule /Users/admin/builder/spi-builder-workspace/.derivedData/Build/Intermediates.noindex/ExplicitPrecompiledModules/sys_resource-F4JHQEPXI1QV4SLOHSVWFXUI1.scan
cd /Users/admin/builder/spi-builder-workspace/.swiftpm/xcode
builtin-precompileModule /Users/admin/builder/spi-builder-workspace/.derivedData/Build/Intermediates.noindex/ExplicitPrecompiledModules/sys_resource-F4JHQEPXI1QV4SLOHSVWFXUI1.scan
PrecompileModule /Users/admin/builder/spi-builder-workspace/.derivedData/Build/Intermediates.noindex/ExplicitPrecompiledModules/_string-9U5NFUOUTQ5B667BEMUTXGPU6.scan
cd /Users/admin/builder/spi-builder-workspace/.swiftpm/xcode
builtin-precompileModule /Users/admin/builder/spi-builder-workspace/.derivedData/Build/Intermediates.noindex/ExplicitPrecompiledModules/_string-9U5NFUOUTQ5B667BEMUTXGPU6.scan
PrecompileModule /Users/admin/builder/spi-builder-workspace/.derivedData/Build/Intermediates.noindex/ExplicitPrecompiledModules/nl_types-5SWXO5J9S7B21R9289WUAUQ2O.scan
cd /Users/admin/builder/spi-builder-workspace/.swiftpm/xcode
builtin-precompileModule /Users/admin/builder/spi-builder-workspace/.derivedData/Build/Intermediates.noindex/ExplicitPrecompiledModules/nl_types-5SWXO5J9S7B21R9289WUAUQ2O.scan
PrecompileModule /Users/admin/builder/spi-builder-workspace/.derivedData/Build/Intermediates.noindex/ExplicitPrecompiledModules/_wctype-1JR3L0A0WPA4CYEF109KIM9P2.scan
cd /Users/admin/builder/spi-builder-workspace/.swiftpm/xcode
builtin-precompileModule /Users/admin/builder/spi-builder-workspace/.derivedData/Build/Intermediates.noindex/ExplicitPrecompiledModules/_wctype-1JR3L0A0WPA4CYEF109KIM9P2.scan
PrecompileModule /Users/admin/builder/spi-builder-workspace/.derivedData/Build/Intermediates.noindex/ExplicitPrecompiledModules/_stdio-7ATE4IDPU240D2FTWSV7QSW77.scan
cd /Users/admin/builder/spi-builder-workspace/.swiftpm/xcode
builtin-precompileModule /Users/admin/builder/spi-builder-workspace/.derivedData/Build/Intermediates.noindex/ExplicitPrecompiledModules/_stdio-7ATE4IDPU240D2FTWSV7QSW77.scan
PrecompileModule /Users/admin/builder/spi-builder-workspace/.derivedData/Build/Intermediates.noindex/ExplicitPrecompiledModules/sys_wait-EP380X3LMJCKOLRG49KDQTN43.scan
cd /Users/admin/builder/spi-builder-workspace/.swiftpm/xcode
builtin-precompileModule /Users/admin/builder/spi-builder-workspace/.derivedData/Build/Intermediates.noindex/ExplicitPrecompiledModules/sys_wait-EP380X3LMJCKOLRG49KDQTN43.scan
PrecompileModule /Users/admin/builder/spi-builder-workspace/.derivedData/Build/Intermediates.noindex/ExplicitPrecompiledModules/_Builtin_tgmath-4F74FMVH6INQST8EW7KACPNH5.scan
cd /Users/admin/builder/spi-builder-workspace/.swiftpm/xcode
builtin-precompileModule /Users/admin/builder/spi-builder-workspace/.derivedData/Build/Intermediates.noindex/ExplicitPrecompiledModules/_Builtin_tgmath-4F74FMVH6INQST8EW7KACPNH5.scan
PrecompileModule /Users/admin/builder/spi-builder-workspace/.derivedData/Build/Intermediates.noindex/ExplicitPrecompiledModules/_time-4V4P97WDDSFN0QOU17952MXXU.scan
cd /Users/admin/builder/spi-builder-workspace/.swiftpm/xcode
builtin-precompileModule /Users/admin/builder/spi-builder-workspace/.derivedData/Build/Intermediates.noindex/ExplicitPrecompiledModules/_time-4V4P97WDDSFN0QOU17952MXXU.scan
PrecompileModule /Users/admin/builder/spi-builder-workspace/.derivedData/Build/Intermediates.noindex/ExplicitPrecompiledModules/_Builtin_inttypes-5QFHCZMAC5CQGW8LOK7DW31V6.scan
cd /Users/admin/builder/spi-builder-workspace/.swiftpm/xcode
builtin-precompileModule /Users/admin/builder/spi-builder-workspace/.derivedData/Build/Intermediates.noindex/ExplicitPrecompiledModules/_Builtin_inttypes-5QFHCZMAC5CQGW8LOK7DW31V6.scan
SwiftCompile normal arm64 Compiling\ BaseModifier.swift /Users/admin/builder/spi-builder-workspace/.dependencies/checkouts/swiftui-Hosting/Sources/SwiftUIHosting/BaseModifier.swift (in target 'SwiftUIHosting' from project 'swiftui-hosting')
SwiftCompile normal arm64 /Users/admin/builder/spi-builder-workspace/.dependencies/checkouts/swiftui-Hosting/Sources/SwiftUIHosting/BaseModifier.swift (in target 'SwiftUIHosting' from project 'swiftui-hosting')
cd /Users/admin/builder/spi-builder-workspace/.swiftpm/xcode
SwiftCompile normal arm64 Compiling\ HostingController.swift /Users/admin/builder/spi-builder-workspace/.dependencies/checkouts/swiftui-Hosting/Sources/SwiftUIHosting/HostingController.swift (in target 'SwiftUIHosting' from project 'swiftui-hosting')
SwiftCompile normal arm64 /Users/admin/builder/spi-builder-workspace/.dependencies/checkouts/swiftui-Hosting/Sources/SwiftUIHosting/HostingController.swift (in target 'SwiftUIHosting' from project 'swiftui-hosting')
cd /Users/admin/builder/spi-builder-workspace/.swiftpm/xcode
PrecompileModule /Users/admin/builder/spi-builder-workspace/.derivedData/Build/Intermediates.noindex/ExplicitPrecompiledModules/_stdlib-DNFYPYV3C5GC8N6GT5TTIJY53.scan
cd /Users/admin/builder/spi-builder-workspace/.swiftpm/xcode
builtin-precompileModule /Users/admin/builder/spi-builder-workspace/.derivedData/Build/Intermediates.noindex/ExplicitPrecompiledModules/_stdlib-DNFYPYV3C5GC8N6GT5TTIJY53.scan
PrecompileModule /Users/admin/builder/spi-builder-workspace/.derivedData/Build/Intermediates.noindex/ExplicitPrecompiledModules/sys_select-1LYFQO067SH4ZT96U1PHMO55B.scan
cd /Users/admin/builder/spi-builder-workspace/.swiftpm/xcode
builtin-precompileModule /Users/admin/builder/spi-builder-workspace/.derivedData/Build/Intermediates.noindex/ExplicitPrecompiledModules/sys_select-1LYFQO067SH4ZT96U1PHMO55B.scan
PrecompileModule /Users/admin/builder/spi-builder-workspace/.derivedData/Build/Intermediates.noindex/ExplicitPrecompiledModules/_wchar-C8ZZW2OIGBBTQD4A6YVJHFO2V.scan
cd /Users/admin/builder/spi-builder-workspace/.swiftpm/xcode
builtin-precompileModule /Users/admin/builder/spi-builder-workspace/.derivedData/Build/Intermediates.noindex/ExplicitPrecompiledModules/_wchar-C8ZZW2OIGBBTQD4A6YVJHFO2V.scan
PrecompileModule /Users/admin/builder/spi-builder-workspace/.derivedData/Build/Intermediates.noindex/ExplicitPrecompiledModules/gethostuuid-8VMHOUDO2BRMO4C8NH57ZAO1I.scan
cd /Users/admin/builder/spi-builder-workspace/.swiftpm/xcode
builtin-precompileModule /Users/admin/builder/spi-builder-workspace/.derivedData/Build/Intermediates.noindex/ExplicitPrecompiledModules/gethostuuid-8VMHOUDO2BRMO4C8NH57ZAO1I.scan
SwiftDriverJobDiscovery normal arm64 Emitting module for SwiftUIHosting (in target 'SwiftUIHosting' from project 'swiftui-hosting')
PrecompileModule /Users/admin/builder/spi-builder-workspace/.derivedData/Build/Intermediates.noindex/ExplicitPrecompiledModules/pthread-34Z7PSUX9LRRTE8D10M375NRJ.scan
cd /Users/admin/builder/spi-builder-workspace/.swiftpm/xcode
builtin-precompileModule /Users/admin/builder/spi-builder-workspace/.derivedData/Build/Intermediates.noindex/ExplicitPrecompiledModules/pthread-34Z7PSUX9LRRTE8D10M375NRJ.scan
SwiftDriver\ Compilation\ Requirements SwiftUIHosting normal arm64 com.apple.xcode.tools.swift.compiler (in target 'SwiftUIHosting' from project 'swiftui-hosting')
cd /Users/admin/builder/spi-builder-workspace/.swiftpm/xcode
builtin-Swift-Compilation-Requirements -- /Applications/Xcode-16.3.0.app/Contents/Developer/Toolchains/XcodeDefault.xctoolchain/usr/bin/swiftc -module-name SwiftUIHosting -Onone -enforce-exclusivity\=checked @/Users/admin/builder/spi-builder-workspace/.derivedData/Build/Intermediates.noindex/swiftui-hosting.build/Debug-appletvos/SwiftUIHosting.build/Objects-normal/arm64/SwiftUIHosting.SwiftFileList -DSWIFT_PACKAGE -DDEBUG -stats-output-dir .stats -plugin-path /Applications/Xcode-16.3.0.app/Contents/Developer/Toolchains/XcodeDefault.xctoolchain/usr/lib/swift/host/plugins/testing -enable-experimental-feature DebugDescriptionMacro -sdk /Applications/Xcode-16.3.0.app/Contents/Developer/Platforms/AppleTVOS.platform/Developer/SDKs/AppleTVOS18.4.sdk -target arm64-apple-tvos13.0 -g -module-cache-path /Users/admin/builder/spi-builder-workspace/.derivedData/ModuleCache.noindex -Xfrontend -serialize-debugging-options -profile-coverage-mapping -profile-generate -enable-testing -suppress-warnings -index-store-path /Users/admin/builder/spi-builder-workspace/.derivedData/Index.noindex/DataStore -swift-version 6 -I /Users/admin/builder/spi-builder-workspace/.derivedData/Build/Products/Debug-appletvos -I /Applications/Xcode-16.3.0.app/Contents/Developer/Platforms/AppleTVOS.platform/Developer/usr/lib -F /Users/admin/builder/spi-builder-workspace/.derivedData/Build/Products/Debug-appletvos -F /Applications/Xcode-16.3.0.app/Contents/Developer/Platforms/AppleTVOS.platform/Developer/Library/Frameworks -F /Applications/Xcode-16.3.0.app/Contents/Developer/Platforms/AppleTVOS.platform/Developer/SDKs/AppleTVOS18.4.sdk/Developer/Library/Frameworks -c -j10 -enable-batch-mode -incremental -Xcc -ivfsstatcache -Xcc /Users/admin/builder/spi-builder-workspace/.derivedData/SDKStatCaches.noindex/appletvos18.4-22L251-271d326055c85f9856fa135c41255102.sdkstatcache -output-file-map /Users/admin/builder/spi-builder-workspace/.derivedData/Build/Intermediates.noindex/swiftui-hosting.build/Debug-appletvos/SwiftUIHosting.build/Objects-normal/arm64/SwiftUIHosting-OutputFileMap.json -use-frontend-parseable-output -save-temps -no-color-diagnostics -serialize-diagnostics -emit-dependencies -emit-module -emit-module-path /Users/admin/builder/spi-builder-workspace/.derivedData/Build/Intermediates.noindex/swiftui-hosting.build/Debug-appletvos/SwiftUIHosting.build/Objects-normal/arm64/SwiftUIHosting.swiftmodule -user-module-version 2.3.0 -validate-clang-modules-once -clang-build-session-file /Users/admin/builder/spi-builder-workspace/.derivedData/ModuleCache.noindex/Session.modulevalidation -package-name swiftui_hosting -Xcc -I/Users/admin/builder/spi-builder-workspace/.derivedData/Build/Intermediates.noindex/swiftui-hosting.build/Debug-appletvos/SwiftUIHosting.build/swift-overrides.hmap -emit-const-values -Xfrontend -const-gather-protocols-file -Xfrontend /Users/admin/builder/spi-builder-workspace/.derivedData/Build/Intermediates.noindex/swiftui-hosting.build/Debug-appletvos/SwiftUIHosting.build/Objects-normal/arm64/SwiftUIHosting_const_extract_protocols.json -Xcc -I/Users/admin/builder/spi-builder-workspace/.derivedData/Build/Products/Debug-appletvos/include -Xcc -I/Users/admin/builder/spi-builder-workspace/.derivedData/Build/Intermediates.noindex/swiftui-hosting.build/Debug-appletvos/SwiftUIHosting.build/DerivedSources-normal/arm64 -Xcc -I/Users/admin/builder/spi-builder-workspace/.derivedData/Build/Intermediates.noindex/swiftui-hosting.build/Debug-appletvos/SwiftUIHosting.build/DerivedSources/arm64 -Xcc -I/Users/admin/builder/spi-builder-workspace/.derivedData/Build/Intermediates.noindex/swiftui-hosting.build/Debug-appletvos/SwiftUIHosting.build/DerivedSources -Xcc -DSWIFT_PACKAGE -Xcc -DDEBUG\=1 -emit-objc-header -emit-objc-header-path /Users/admin/builder/spi-builder-workspace/.derivedData/Build/Intermediates.noindex/swiftui-hosting.build/Debug-appletvos/SwiftUIHosting.build/Objects-normal/arm64/SwiftUIHosting-Swift.h -working-directory /Users/admin/builder/spi-builder-workspace/.swiftpm/xcode -experimental-emit-module-separately -disable-cmo
PrecompileModule /Users/admin/builder/spi-builder-workspace/.derivedData/Build/Intermediates.noindex/ExplicitPrecompiledModules/unistd-BDLX56G7M71TTQHDTRNMGS8XK.scan
cd /Users/admin/builder/spi-builder-workspace/.swiftpm/xcode
builtin-precompileModule /Users/admin/builder/spi-builder-workspace/.derivedData/Build/Intermediates.noindex/ExplicitPrecompiledModules/unistd-BDLX56G7M71TTQHDTRNMGS8XK.scan
SwiftMergeGeneratedHeaders /Users/admin/builder/spi-builder-workspace/.derivedData/Build/Intermediates.noindex/GeneratedModuleMaps-appletvos/SwiftUIHosting-Swift.h /Users/admin/builder/spi-builder-workspace/.derivedData/Build/Intermediates.noindex/swiftui-hosting.build/Debug-appletvos/SwiftUIHosting.build/Objects-normal/arm64/SwiftUIHosting-Swift.h (in target 'SwiftUIHosting' from project 'swiftui-hosting')
cd /Users/admin/builder/spi-builder-workspace/.dependencies/checkouts/swiftui-Hosting
builtin-swiftHeaderTool -arch arm64 /Users/admin/builder/spi-builder-workspace/.derivedData/Build/Intermediates.noindex/swiftui-hosting.build/Debug-appletvos/SwiftUIHosting.build/Objects-normal/arm64/SwiftUIHosting-Swift.h -o /Users/admin/builder/spi-builder-workspace/.derivedData/Build/Intermediates.noindex/GeneratedModuleMaps-appletvos/SwiftUIHosting-Swift.h
Copy /Users/admin/builder/spi-builder-workspace/.derivedData/Build/Products/Debug-appletvos/SwiftUIHosting.swiftmodule/arm64-apple-tvos.swiftmodule /Users/admin/builder/spi-builder-workspace/.derivedData/Build/Intermediates.noindex/swiftui-hosting.build/Debug-appletvos/SwiftUIHosting.build/Objects-normal/arm64/SwiftUIHosting.swiftmodule (in target 'SwiftUIHosting' from project 'swiftui-hosting')
cd /Users/admin/builder/spi-builder-workspace/.dependencies/checkouts/swiftui-Hosting
builtin-copy -exclude .DS_Store -exclude CVS -exclude .svn -exclude .git -exclude .hg -resolve-src-symlinks -rename /Users/admin/builder/spi-builder-workspace/.derivedData/Build/Intermediates.noindex/swiftui-hosting.build/Debug-appletvos/SwiftUIHosting.build/Objects-normal/arm64/SwiftUIHosting.swiftmodule /Users/admin/builder/spi-builder-workspace/.derivedData/Build/Products/Debug-appletvos/SwiftUIHosting.swiftmodule/arm64-apple-tvos.swiftmodule
Copy /Users/admin/builder/spi-builder-workspace/.derivedData/Build/Products/Debug-appletvos/SwiftUIHosting.swiftmodule/arm64-apple-tvos.swiftdoc /Users/admin/builder/spi-builder-workspace/.derivedData/Build/Intermediates.noindex/swiftui-hosting.build/Debug-appletvos/SwiftUIHosting.build/Objects-normal/arm64/SwiftUIHosting.swiftdoc (in target 'SwiftUIHosting' from project 'swiftui-hosting')
cd /Users/admin/builder/spi-builder-workspace/.dependencies/checkouts/swiftui-Hosting
builtin-copy -exclude .DS_Store -exclude CVS -exclude .svn -exclude .git -exclude .hg -resolve-src-symlinks -rename /Users/admin/builder/spi-builder-workspace/.derivedData/Build/Intermediates.noindex/swiftui-hosting.build/Debug-appletvos/SwiftUIHosting.build/Objects-normal/arm64/SwiftUIHosting.swiftdoc /Users/admin/builder/spi-builder-workspace/.derivedData/Build/Products/Debug-appletvos/SwiftUIHosting.swiftmodule/arm64-apple-tvos.swiftdoc
Copy /Users/admin/builder/spi-builder-workspace/.derivedData/Build/Products/Debug-appletvos/SwiftUIHosting.swiftmodule/arm64-apple-tvos.abi.json /Users/admin/builder/spi-builder-workspace/.derivedData/Build/Intermediates.noindex/swiftui-hosting.build/Debug-appletvos/SwiftUIHosting.build/Objects-normal/arm64/SwiftUIHosting.abi.json (in target 'SwiftUIHosting' from project 'swiftui-hosting')
cd /Users/admin/builder/spi-builder-workspace/.dependencies/checkouts/swiftui-Hosting
builtin-copy -exclude .DS_Store -exclude CVS -exclude .svn -exclude .git -exclude .hg -resolve-src-symlinks -rename /Users/admin/builder/spi-builder-workspace/.derivedData/Build/Intermediates.noindex/swiftui-hosting.build/Debug-appletvos/SwiftUIHosting.build/Objects-normal/arm64/SwiftUIHosting.abi.json /Users/admin/builder/spi-builder-workspace/.derivedData/Build/Products/Debug-appletvos/SwiftUIHosting.swiftmodule/arm64-apple-tvos.abi.json
Copy /Users/admin/builder/spi-builder-workspace/.derivedData/Build/Products/Debug-appletvos/SwiftUIHosting.swiftmodule/Project/arm64-apple-tvos.swiftsourceinfo /Users/admin/builder/spi-builder-workspace/.derivedData/Build/Intermediates.noindex/swiftui-hosting.build/Debug-appletvos/SwiftUIHosting.build/Objects-normal/arm64/SwiftUIHosting.swiftsourceinfo (in target 'SwiftUIHosting' from project 'swiftui-hosting')
cd /Users/admin/builder/spi-builder-workspace/.dependencies/checkouts/swiftui-Hosting
builtin-copy -exclude .DS_Store -exclude CVS -exclude .svn -exclude .git -exclude .hg -resolve-src-symlinks -rename /Users/admin/builder/spi-builder-workspace/.derivedData/Build/Intermediates.noindex/swiftui-hosting.build/Debug-appletvos/SwiftUIHosting.build/Objects-normal/arm64/SwiftUIHosting.swiftsourceinfo /Users/admin/builder/spi-builder-workspace/.derivedData/Build/Products/Debug-appletvos/SwiftUIHosting.swiftmodule/Project/arm64-apple-tvos.swiftsourceinfo
SwiftDriver\ Compilation RubberBanding normal arm64 com.apple.xcode.tools.swift.compiler (in target 'RubberBanding' from project 'RubberBanding')
cd /Users/admin/builder/spi-builder-workspace/.swiftpm/xcode
builtin-Swift-Compilation -- /Applications/Xcode-16.3.0.app/Contents/Developer/Toolchains/XcodeDefault.xctoolchain/usr/bin/swiftc -module-name RubberBanding -Onone -enforce-exclusivity\=checked @/Users/admin/builder/spi-builder-workspace/.derivedData/Build/Intermediates.noindex/RubberBanding.build/Debug-appletvos/RubberBanding.build/Objects-normal/arm64/RubberBanding.SwiftFileList -DSWIFT_PACKAGE -DDEBUG -stats-output-dir .stats -plugin-path /Applications/Xcode-16.3.0.app/Contents/Developer/Toolchains/XcodeDefault.xctoolchain/usr/lib/swift/host/plugins/testing -enable-experimental-feature DebugDescriptionMacro -sdk /Applications/Xcode-16.3.0.app/Contents/Developer/Platforms/AppleTVOS.platform/Developer/SDKs/AppleTVOS18.4.sdk -target arm64-apple-tvos12.0 -g -module-cache-path /Users/admin/builder/spi-builder-workspace/.derivedData/ModuleCache.noindex -Xfrontend -serialize-debugging-options -profile-coverage-mapping -profile-generate -enable-testing -suppress-warnings -index-store-path /Users/admin/builder/spi-builder-workspace/.derivedData/Index.noindex/DataStore -swift-version 5 -I /Users/admin/builder/spi-builder-workspace/.derivedData/Build/Products/Debug-appletvos -I /Applications/Xcode-16.3.0.app/Contents/Developer/Platforms/AppleTVOS.platform/Developer/usr/lib -F /Users/admin/builder/spi-builder-workspace/.derivedData/Build/Products/Debug-appletvos -F /Applications/Xcode-16.3.0.app/Contents/Developer/Platforms/AppleTVOS.platform/Developer/Library/Frameworks -F /Applications/Xcode-16.3.0.app/Contents/Developer/Platforms/AppleTVOS.platform/Developer/SDKs/AppleTVOS18.4.sdk/Developer/Library/Frameworks -parse-as-library -c -j10 -enable-batch-mode -incremental -Xcc -ivfsstatcache -Xcc /Users/admin/builder/spi-builder-workspace/.derivedData/SDKStatCaches.noindex/appletvos18.4-22L251-271d326055c85f9856fa135c41255102.sdkstatcache -output-file-map /Users/admin/builder/spi-builder-workspace/.derivedData/Build/Intermediates.noindex/RubberBanding.build/Debug-appletvos/RubberBanding.build/Objects-normal/arm64/RubberBanding-OutputFileMap.json -use-frontend-parseable-output -save-temps -no-color-diagnostics -serialize-diagnostics -emit-dependencies -emit-module -emit-module-path /Users/admin/builder/spi-builder-workspace/.derivedData/Build/Intermediates.noindex/RubberBanding.build/Debug-appletvos/RubberBanding.build/Objects-normal/arm64/RubberBanding.swiftmodule -validate-clang-modules-once -clang-build-session-file /Users/admin/builder/spi-builder-workspace/.derivedData/ModuleCache.noindex/Session.modulevalidation -package-name swift_rubber_banding -Xcc -I/Users/admin/builder/spi-builder-workspace/.derivedData/Build/Intermediates.noindex/RubberBanding.build/Debug-appletvos/RubberBanding.build/swift-overrides.hmap -emit-const-values -Xfrontend -const-gather-protocols-file -Xfrontend /Users/admin/builder/spi-builder-workspace/.derivedData/Build/Intermediates.noindex/RubberBanding.build/Debug-appletvos/RubberBanding.build/Objects-normal/arm64/RubberBanding_const_extract_protocols.json -Xcc -I/Users/admin/builder/spi-builder-workspace/.derivedData/Build/Products/Debug-appletvos/include -Xcc -I/Users/admin/builder/spi-builder-workspace/.derivedData/Build/Intermediates.noindex/RubberBanding.build/Debug-appletvos/RubberBanding.build/DerivedSources-normal/arm64 -Xcc -I/Users/admin/builder/spi-builder-workspace/.derivedData/Build/Intermediates.noindex/RubberBanding.build/Debug-appletvos/RubberBanding.build/DerivedSources/arm64 -Xcc -I/Users/admin/builder/spi-builder-workspace/.derivedData/Build/Intermediates.noindex/RubberBanding.build/Debug-appletvos/RubberBanding.build/DerivedSources -Xcc -DSWIFT_PACKAGE -Xcc -DDEBUG\=1 -emit-objc-header -emit-objc-header-path /Users/admin/builder/spi-builder-workspace/.derivedData/Build/Intermediates.noindex/RubberBanding.build/Debug-appletvos/RubberBanding.build/Objects-normal/arm64/RubberBanding-Swift.h -working-directory /Users/admin/builder/spi-builder-workspace/.swiftpm/xcode -experimental-emit-module-separately -disable-cmo
SwiftCompile normal arm64 Compiling\ InternalUtils.swift,\ RideauContentContainerView.swift /Users/admin/builder/spi-builder-workspace/.dependencies/checkouts/Rideau/Rideau/Core/InternalUtils.swift /Users/admin/builder/spi-builder-workspace/.dependencies/checkouts/Rideau/Rideau/Core/RideauContentContainerView.swift (in target 'Rideau' from project 'Rideau')
SwiftCompile normal arm64 /Users/admin/builder/spi-builder-workspace/.dependencies/checkouts/Rideau/Rideau/Core/InternalUtils.swift (in target 'Rideau' from project 'Rideau')
cd /Users/admin/builder/spi-builder-workspace/.swiftpm/xcode
SwiftCompile normal arm64 /Users/admin/builder/spi-builder-workspace/.dependencies/checkouts/Rideau/Rideau/Core/RideauContentContainerView.swift (in target 'Rideau' from project 'Rideau')
cd /Users/admin/builder/spi-builder-workspace/.swiftpm/xcode
SwiftCompile normal arm64 Compiling\ Logger.swift /Users/admin/builder/spi-builder-workspace/.dependencies/checkouts/Rideau/Rideau/Logger.swift (in target 'Rideau' from project 'Rideau')
SwiftCompile normal arm64 /Users/admin/builder/spi-builder-workspace/.dependencies/checkouts/Rideau/Rideau/Logger.swift (in target 'Rideau' from project 'Rideau')
cd /Users/admin/builder/spi-builder-workspace/.swiftpm/xcode
SwiftCompile normal arm64 Compiling\ RideauSnapPoint.swift,\ RideauTouchThroughView.swift /Users/admin/builder/spi-builder-workspace/.dependencies/checkouts/Rideau/Rideau/Core/RideauSnapPoint.swift /Users/admin/builder/spi-builder-workspace/.dependencies/checkouts/Rideau/Rideau/Core/RideauTouchThroughView.swift (in target 'Rideau' from project 'Rideau')
SwiftCompile normal arm64 /Users/admin/builder/spi-builder-workspace/.dependencies/checkouts/Rideau/Rideau/Core/RideauSnapPoint.swift (in target 'Rideau' from project 'Rideau')
cd /Users/admin/builder/spi-builder-workspace/.swiftpm/xcode
SwiftCompile normal arm64 /Users/admin/builder/spi-builder-workspace/.dependencies/checkouts/Rideau/Rideau/Core/RideauTouchThroughView.swift (in target 'Rideau' from project 'Rideau')
cd /Users/admin/builder/spi-builder-workspace/.swiftpm/xcode
PrecompileModule /Users/admin/builder/spi-builder-workspace/.derivedData/Build/Intermediates.noindex/ExplicitPrecompiledModules/Darwin-EYTA1KL156FGS7YZVDQ7LK4BQ.scan
cd /Users/admin/builder/spi-builder-workspace/.swiftpm/xcode
builtin-precompileModule /Users/admin/builder/spi-builder-workspace/.derivedData/Build/Intermediates.noindex/ExplicitPrecompiledModules/Darwin-EYTA1KL156FGS7YZVDQ7LK4BQ.scan
SwiftDriverJobDiscovery normal arm64 Emitting module for Rideau (in target 'Rideau' from project 'Rideau')
SwiftDriver\ Compilation\ Requirements Rideau normal arm64 com.apple.xcode.tools.swift.compiler (in target 'Rideau' from project 'Rideau')
cd /Users/admin/builder/spi-builder-workspace/.swiftpm/xcode
builtin-Swift-Compilation-Requirements -- /Applications/Xcode-16.3.0.app/Contents/Developer/Toolchains/XcodeDefault.xctoolchain/usr/bin/swiftc -module-name Rideau -Onone -enforce-exclusivity\=checked @/Users/admin/builder/spi-builder-workspace/.derivedData/Build/Intermediates.noindex/Rideau.build/Debug-appletvos/Rideau.build/Objects-normal/arm64/Rideau.SwiftFileList -DSWIFT_PACKAGE -DDEBUG -stats-output-dir .stats -plugin-path /Applications/Xcode-16.3.0.app/Contents/Developer/Toolchains/XcodeDefault.xctoolchain/usr/lib/swift/host/plugins/testing -enable-experimental-feature DebugDescriptionMacro -sdk /Applications/Xcode-16.3.0.app/Contents/Developer/Platforms/AppleTVOS.platform/Developer/SDKs/AppleTVOS18.4.sdk -target arm64-apple-tvos12.0 -g -module-cache-path /Users/admin/builder/spi-builder-workspace/.derivedData/ModuleCache.noindex -Xfrontend -serialize-debugging-options -profile-coverage-mapping -profile-generate -enable-testing -suppress-warnings -index-store-path /Users/admin/builder/spi-builder-workspace/.derivedData/Index.noindex/DataStore -swift-version 5 -I /Users/admin/builder/spi-builder-workspace/.derivedData/Build/Products/Debug-appletvos -I /Applications/Xcode-16.3.0.app/Contents/Developer/Platforms/AppleTVOS.platform/Developer/usr/lib -F /Users/admin/builder/spi-builder-workspace/.derivedData/Build/Products/Debug-appletvos -F /Applications/Xcode-16.3.0.app/Contents/Developer/Platforms/AppleTVOS.platform/Developer/Library/Frameworks -F /Applications/Xcode-16.3.0.app/Contents/Developer/Platforms/AppleTVOS.platform/Developer/SDKs/AppleTVOS18.4.sdk/Developer/Library/Frameworks -c -j10 -enable-batch-mode -incremental -Xcc -ivfsstatcache -Xcc /Users/admin/builder/spi-builder-workspace/.derivedData/SDKStatCaches.noindex/appletvos18.4-22L251-271d326055c85f9856fa135c41255102.sdkstatcache -output-file-map /Users/admin/builder/spi-builder-workspace/.derivedData/Build/Intermediates.noindex/Rideau.build/Debug-appletvos/Rideau.build/Objects-normal/arm64/Rideau-OutputFileMap.json -use-frontend-parseable-output -save-temps -no-color-diagnostics -serialize-diagnostics -emit-dependencies -emit-module -emit-module-path /Users/admin/builder/spi-builder-workspace/.derivedData/Build/Intermediates.noindex/Rideau.build/Debug-appletvos/Rideau.build/Objects-normal/arm64/Rideau.swiftmodule -validate-clang-modules-once -clang-build-session-file /Users/admin/builder/spi-builder-workspace/.derivedData/ModuleCache.noindex/Session.modulevalidation -Xcc -I/Users/admin/builder/spi-builder-workspace/.derivedData/Build/Intermediates.noindex/Rideau.build/Debug-appletvos/Rideau.build/swift-overrides.hmap -emit-const-values -Xfrontend -const-gather-protocols-file -Xfrontend /Users/admin/builder/spi-builder-workspace/.derivedData/Build/Intermediates.noindex/Rideau.build/Debug-appletvos/Rideau.build/Objects-normal/arm64/Rideau_const_extract_protocols.json -Xcc -I/Users/admin/builder/spi-builder-workspace/.derivedData/Build/Products/Debug-appletvos/include -Xcc -I/Users/admin/builder/spi-builder-workspace/.derivedData/Build/Intermediates.noindex/Rideau.build/Debug-appletvos/Rideau.build/DerivedSources-normal/arm64 -Xcc -I/Users/admin/builder/spi-builder-workspace/.derivedData/Build/Intermediates.noindex/Rideau.build/Debug-appletvos/Rideau.build/DerivedSources/arm64 -Xcc -I/Users/admin/builder/spi-builder-workspace/.derivedData/Build/Intermediates.noindex/Rideau.build/Debug-appletvos/Rideau.build/DerivedSources -Xcc -DSWIFT_PACKAGE -Xcc -DDEBUG\=1 -emit-objc-header -emit-objc-header-path /Users/admin/builder/spi-builder-workspace/.derivedData/Build/Intermediates.noindex/Rideau.build/Debug-appletvos/Rideau.build/Objects-normal/arm64/Rideau-Swift.h -working-directory /Users/admin/builder/spi-builder-workspace/.swiftpm/xcode -experimental-emit-module-separately -disable-cmo
PrecompileModule /Users/admin/builder/spi-builder-workspace/.derivedData/Build/Intermediates.noindex/ExplicitPrecompiledModules/ObjectiveC-9DUYF8UY4YJ5GPEEPGX6VH3TZ.scan
cd /Users/admin/builder/spi-builder-workspace/.swiftpm/xcode
builtin-precompileModule /Users/admin/builder/spi-builder-workspace/.derivedData/Build/Intermediates.noindex/ExplicitPrecompiledModules/ObjectiveC-9DUYF8UY4YJ5GPEEPGX6VH3TZ.scan
SwiftMergeGeneratedHeaders /Users/admin/builder/spi-builder-workspace/.derivedData/Build/Intermediates.noindex/GeneratedModuleMaps-appletvos/Rideau-Swift.h /Users/admin/builder/spi-builder-workspace/.derivedData/Build/Intermediates.noindex/Rideau.build/Debug-appletvos/Rideau.build/Objects-normal/arm64/Rideau-Swift.h (in target 'Rideau' from project 'Rideau')
cd /Users/admin/builder/spi-builder-workspace/.dependencies/checkouts/Rideau
builtin-swiftHeaderTool -arch arm64 /Users/admin/builder/spi-builder-workspace/.derivedData/Build/Intermediates.noindex/Rideau.build/Debug-appletvos/Rideau.build/Objects-normal/arm64/Rideau-Swift.h -o /Users/admin/builder/spi-builder-workspace/.derivedData/Build/Intermediates.noindex/GeneratedModuleMaps-appletvos/Rideau-Swift.h
Copy /Users/admin/builder/spi-builder-workspace/.derivedData/Build/Products/Debug-appletvos/Rideau.swiftmodule/arm64-apple-tvos.swiftmodule /Users/admin/builder/spi-builder-workspace/.derivedData/Build/Intermediates.noindex/Rideau.build/Debug-appletvos/Rideau.build/Objects-normal/arm64/Rideau.swiftmodule (in target 'Rideau' from project 'Rideau')
cd /Users/admin/builder/spi-builder-workspace/.dependencies/checkouts/Rideau
builtin-copy -exclude .DS_Store -exclude CVS -exclude .svn -exclude .git -exclude .hg -resolve-src-symlinks -rename /Users/admin/builder/spi-builder-workspace/.derivedData/Build/Intermediates.noindex/Rideau.build/Debug-appletvos/Rideau.build/Objects-normal/arm64/Rideau.swiftmodule /Users/admin/builder/spi-builder-workspace/.derivedData/Build/Products/Debug-appletvos/Rideau.swiftmodule/arm64-apple-tvos.swiftmodule
Copy /Users/admin/builder/spi-builder-workspace/.derivedData/Build/Products/Debug-appletvos/Rideau.swiftmodule/arm64-apple-tvos.swiftdoc /Users/admin/builder/spi-builder-workspace/.derivedData/Build/Intermediates.noindex/Rideau.build/Debug-appletvos/Rideau.build/Objects-normal/arm64/Rideau.swiftdoc (in target 'Rideau' from project 'Rideau')
cd /Users/admin/builder/spi-builder-workspace/.dependencies/checkouts/Rideau
builtin-copy -exclude .DS_Store -exclude CVS -exclude .svn -exclude .git -exclude .hg -resolve-src-symlinks -rename /Users/admin/builder/spi-builder-workspace/.derivedData/Build/Intermediates.noindex/Rideau.build/Debug-appletvos/Rideau.build/Objects-normal/arm64/Rideau.swiftdoc /Users/admin/builder/spi-builder-workspace/.derivedData/Build/Products/Debug-appletvos/Rideau.swiftmodule/arm64-apple-tvos.swiftdoc
Copy /Users/admin/builder/spi-builder-workspace/.derivedData/Build/Products/Debug-appletvos/Rideau.swiftmodule/arm64-apple-tvos.abi.json /Users/admin/builder/spi-builder-workspace/.derivedData/Build/Intermediates.noindex/Rideau.build/Debug-appletvos/Rideau.build/Objects-normal/arm64/Rideau.abi.json (in target 'Rideau' from project 'Rideau')
cd /Users/admin/builder/spi-builder-workspace/.dependencies/checkouts/Rideau
builtin-copy -exclude .DS_Store -exclude CVS -exclude .svn -exclude .git -exclude .hg -resolve-src-symlinks -rename /Users/admin/builder/spi-builder-workspace/.derivedData/Build/Intermediates.noindex/Rideau.build/Debug-appletvos/Rideau.build/Objects-normal/arm64/Rideau.abi.json /Users/admin/builder/spi-builder-workspace/.derivedData/Build/Products/Debug-appletvos/Rideau.swiftmodule/arm64-apple-tvos.abi.json
Copy /Users/admin/builder/spi-builder-workspace/.derivedData/Build/Products/Debug-appletvos/Rideau.swiftmodule/Project/arm64-apple-tvos.swiftsourceinfo /Users/admin/builder/spi-builder-workspace/.derivedData/Build/Intermediates.noindex/Rideau.build/Debug-appletvos/Rideau.build/Objects-normal/arm64/Rideau.swiftsourceinfo (in target 'Rideau' from project 'Rideau')
cd /Users/admin/builder/spi-builder-workspace/.dependencies/checkouts/Rideau
builtin-copy -exclude .DS_Store -exclude CVS -exclude .svn -exclude .git -exclude .hg -resolve-src-symlinks -rename /Users/admin/builder/spi-builder-workspace/.derivedData/Build/Intermediates.noindex/Rideau.build/Debug-appletvos/Rideau.build/Objects-normal/arm64/Rideau.swiftsourceinfo /Users/admin/builder/spi-builder-workspace/.derivedData/Build/Products/Debug-appletvos/Rideau.swiftmodule/Project/arm64-apple-tvos.swiftsourceinfo
PrecompileModule /Users/admin/builder/spi-builder-workspace/.derivedData/Build/Intermediates.noindex/ExplicitPrecompiledModules/os_object-B8DQ3VEN5QW4P8ST4VYUKCWOA.scan
cd /Users/admin/builder/spi-builder-workspace/.swiftpm/xcode
builtin-precompileModule /Users/admin/builder/spi-builder-workspace/.derivedData/Build/Intermediates.noindex/ExplicitPrecompiledModules/os_object-B8DQ3VEN5QW4P8ST4VYUKCWOA.scan
SwiftCompile normal arm64 Compiling\ RideauMaskedCornerRoundedViewController.swift /Users/admin/builder/spi-builder-workspace/.dependencies/checkouts/Rideau/Rideau/Plugin/RideauMaskedCornerRoundedViewController.swift (in target 'Rideau' from project 'Rideau')
SwiftCompile normal arm64 /Users/admin/builder/spi-builder-workspace/.dependencies/checkouts/Rideau/Rideau/Plugin/RideauMaskedCornerRoundedViewController.swift (in target 'Rideau' from project 'Rideau')
cd /Users/admin/builder/spi-builder-workspace/.swiftpm/xcode
PrecompileModule /Users/admin/builder/spi-builder-workspace/.derivedData/Build/Intermediates.noindex/ExplicitPrecompiledModules/os_workgroup-6CJAL1Q1V0WPM6DWFMKN7QIUZ.scan
cd /Users/admin/builder/spi-builder-workspace/.swiftpm/xcode
builtin-precompileModule /Users/admin/builder/spi-builder-workspace/.derivedData/Build/Intermediates.noindex/ExplicitPrecompiledModules/os_workgroup-6CJAL1Q1V0WPM6DWFMKN7QIUZ.scan
SwiftDriverJobDiscovery normal arm64 Compiling UIResponder+.swift (in target 'SwiftUIHosting' from project 'swiftui-hosting')
SwiftCompile normal arm64 Compiling\ RideauContentType.swift,\ RideauHostingView.swift /Users/admin/builder/spi-builder-workspace/.dependencies/checkouts/Rideau/Rideau/Core/RideauContentType.swift /Users/admin/builder/spi-builder-workspace/.dependencies/checkouts/Rideau/Rideau/Core/RideauHostingView.swift (in target 'Rideau' from project 'Rideau')
SwiftCompile normal arm64 /Users/admin/builder/spi-builder-workspace/.dependencies/checkouts/Rideau/Rideau/Core/RideauContentType.swift (in target 'Rideau' from project 'Rideau')
cd /Users/admin/builder/spi-builder-workspace/.swiftpm/xcode
SwiftCompile normal arm64 /Users/admin/builder/spi-builder-workspace/.dependencies/checkouts/Rideau/Rideau/Core/RideauHostingView.swift (in target 'Rideau' from project 'Rideau')
cd /Users/admin/builder/spi-builder-workspace/.swiftpm/xcode
SwiftDriverJobDiscovery normal arm64 Compiling SafeAreaFinder.swift (in target 'FluidCore' from project 'FluidInterfaceKit')
SwiftCompile normal arm64 Compiling\ RideauViewController.swift,\ RideauViewDragGestureRecognizer.swift /Users/admin/builder/spi-builder-workspace/.dependencies/checkouts/Rideau/Rideau/Core/RideauViewController.swift /Users/admin/builder/spi-builder-workspace/.dependencies/checkouts/Rideau/Rideau/Core/RideauViewDragGestureRecognizer.swift (in target 'Rideau' from project 'Rideau')
SwiftCompile normal arm64 /Users/admin/builder/spi-builder-workspace/.dependencies/checkouts/Rideau/Rideau/Core/RideauViewController.swift (in target 'Rideau' from project 'Rideau')
cd /Users/admin/builder/spi-builder-workspace/.swiftpm/xcode
SwiftCompile normal arm64 /Users/admin/builder/spi-builder-workspace/.dependencies/checkouts/Rideau/Rideau/Core/RideauViewDragGestureRecognizer.swift (in target 'Rideau' from project 'Rideau')
cd /Users/admin/builder/spi-builder-workspace/.swiftpm/xcode
SwiftCompile normal arm64 Compiling\ ScrollController.swift,\ TransitionPatch.swift /Users/admin/builder/spi-builder-workspace/.dependencies/checkouts/Rideau/Rideau/Core/ScrollController.swift /Users/admin/builder/spi-builder-workspace/.dependencies/checkouts/Rideau/Rideau/Core/TransitionPatch.swift (in target 'Rideau' from project 'Rideau')
SwiftCompile normal arm64 /Users/admin/builder/spi-builder-workspace/.dependencies/checkouts/Rideau/Rideau/Core/ScrollController.swift (in target 'Rideau' from project 'Rideau')
cd /Users/admin/builder/spi-builder-workspace/.swiftpm/xcode
SwiftCompile normal arm64 /Users/admin/builder/spi-builder-workspace/.dependencies/checkouts/Rideau/Rideau/Core/TransitionPatch.swift (in target 'Rideau' from project 'Rideau')
cd /Users/admin/builder/spi-builder-workspace/.swiftpm/xcode
SwiftDriverJobDiscovery normal arm64 Compiling RideauSnapPoint.swift, RideauTouchThroughView.swift (in target 'Rideau' from project 'Rideau')
SwiftDriverJobDiscovery normal arm64 Compiling Logger.swift (in target 'Rideau' from project 'Rideau')
SwiftCompile normal arm64 Compiling\ RideauThumbView.swift /Users/admin/builder/spi-builder-workspace/.dependencies/checkouts/Rideau/Rideau/Plugin/RideauThumbView.swift (in target 'Rideau' from project 'Rideau')
SwiftCompile normal arm64 /Users/admin/builder/spi-builder-workspace/.dependencies/checkouts/Rideau/Rideau/Plugin/RideauThumbView.swift (in target 'Rideau' from project 'Rideau')
cd /Users/admin/builder/spi-builder-workspace/.swiftpm/xcode
SwiftDriverJobDiscovery normal arm64 Compiling InternalUtils.swift, RideauContentContainerView.swift (in target 'Rideau' from project 'Rideau')
SwiftCompile normal arm64 Compiling\ RideauMaskedCornerRoundedView.swift /Users/admin/builder/spi-builder-workspace/.dependencies/checkouts/Rideau/Rideau/Plugin/RideauMaskedCornerRoundedView.swift (in target 'Rideau' from project 'Rideau')
Failed frontend command:
/Applications/Xcode-16.3.0.app/Contents/Developer/Toolchains/XcodeDefault.xctoolchain/usr/bin/swift-frontend -frontend -c /Users/admin/builder/spi-builder-workspace/.dependencies/checkouts/Rideau/Rideau/Core/InternalUtils.swift /Users/admin/builder/spi-builder-workspace/.dependencies/checkouts/Rideau/Rideau/Core/RideauContentContainerView.swift /Users/admin/builder/spi-builder-workspace/.dependencies/checkouts/Rideau/Rideau/Core/RideauContentType.swift /Users/admin/builder/spi-builder-workspace/.dependencies/checkouts/Rideau/Rideau/Core/RideauHostingView.swift /Users/admin/builder/spi-builder-workspace/.dependencies/checkouts/Rideau/Rideau/Core/RideauSnapPoint.swift /Users/admin/builder/spi-builder-workspace/.dependencies/checkouts/Rideau/Rideau/Core/RideauTouchThroughView.swift /Users/admin/builder/spi-builder-workspace/.dependencies/checkouts/Rideau/Rideau/Core/RideauTransitionController.swift /Users/admin/builder/spi-builder-workspace/.dependencies/checkouts/Rideau/Rideau/Core/RideauView.swift /Users/admin/builder/spi-builder-workspace/.dependencies/checkouts/Rideau/Rideau/Core/RideauViewController.swift /Users/admin/builder/spi-builder-workspace/.dependencies/checkouts/Rideau/Rideau/Core/RideauViewDragGestureRecognizer.swift /Users/admin/builder/spi-builder-workspace/.dependencies/checkouts/Rideau/Rideau/Core/ScrollController.swift /Users/admin/builder/spi-builder-workspace/.dependencies/checkouts/Rideau/Rideau/Core/TransitionPatch.swift /Users/admin/builder/spi-builder-workspace/.dependencies/checkouts/Rideau/Rideau/Logger.swift -primary-file /Users/admin/builder/spi-builder-workspace/.dependencies/checkouts/Rideau/Rideau/Plugin/RideauMaskedCornerRoundedView.swift /Users/admin/builder/spi-builder-workspace/.dependencies/checkouts/Rideau/Rideau/Plugin/RideauMaskedCornerRoundedViewController.swift /Users/admin/builder/spi-builder-workspace/.dependencies/checkouts/Rideau/Rideau/Plugin/RideauThumbView.swift -emit-dependencies-path /Users/admin/builder/spi-builder-workspace/.derivedData/Build/Intermediates.noindex/Rideau.build/Debug-appletvos/Rideau.build/Objects-normal/arm64/RideauMaskedCornerRoundedView.d -emit-const-values-path /Users/admin/builder/spi-builder-workspace/.derivedData/Build/Intermediates.noindex/Rideau.build/Debug-appletvos/Rideau.build/Objects-normal/arm64/RideauMaskedCornerRoundedView.swiftconstvalues -emit-reference-dependencies-path /Users/admin/builder/spi-builder-workspace/.derivedData/Build/Intermediates.noindex/Rideau.build/Debug-appletvos/Rideau.build/Objects-normal/arm64/RideauMaskedCornerRoundedView.swiftdeps -serialize-diagnostics-path /Users/admin/builder/spi-builder-workspace/.derivedData/Build/Intermediates.noindex/Rideau.build/Debug-appletvos/Rideau.build/Objects-normal/arm64/RideauMaskedCornerRoundedView.dia -target arm64-apple-tvos12.0 -Xllvm -aarch64-use-tbi -enable-objc-interop -sdk /Applications/Xcode-16.3.0.app/Contents/Developer/Platforms/AppleTVOS.platform/Developer/SDKs/AppleTVOS18.4.sdk -I /Users/admin/builder/spi-builder-workspace/.derivedData/Build/Products/Debug-appletvos -I /Applications/Xcode-16.3.0.app/Contents/Developer/Platforms/AppleTVOS.platform/Developer/usr/lib -F /Users/admin/builder/spi-builder-workspace/.derivedData/Build/Products/Debug-appletvos -F /Applications/Xcode-16.3.0.app/Contents/Developer/Platforms/AppleTVOS.platform/Developer/Library/Frameworks -F /Applications/Xcode-16.3.0.app/Contents/Developer/Platforms/AppleTVOS.platform/Developer/SDKs/AppleTVOS18.4.sdk/Developer/Library/Frameworks -no-color-diagnostics -enable-testing -g -debug-info-format\=dwarf -dwarf-version\=4 -module-cache-path /Users/admin/builder/spi-builder-workspace/.derivedData/ModuleCache.noindex -suppress-warnings -profile-generate -profile-coverage-mapping -swift-version 5 -enforce-exclusivity\=checked -stats-output-dir /Users/admin/builder/spi-builder-workspace/.swiftpm/xcode/.stats -Onone -D SWIFT_PACKAGE -D DEBUG -serialize-debugging-options -const-gather-protocols-file /Users/admin/builder/spi-builder-workspace/.derivedData/Build/Intermediates.noindex/Rideau.build/Debug-appletvos/Rideau.build/Objects-normal/arm64/Rideau_const_extract_protocols.json -enable-experimental-feature DebugDescriptionMacro -empty-abi-descriptor -plugin-path /Applications/Xcode-16.3.0.app/Contents/Developer/Toolchains/XcodeDefault.xctoolchain/usr/lib/swift/host/plugins/testing -validate-clang-modules-once -clang-build-session-file /Users/admin/builder/spi-builder-workspace/.derivedData/ModuleCache.noindex/Session.modulevalidation -Xcc -working-directory -Xcc /Users/admin/builder/spi-builder-workspace/.swiftpm/xcode -resource-dir /Applications/Xcode-16.3.0.app/Contents/Developer/Toolchains/XcodeDefault.xctoolchain/usr/lib/swift -enable-anonymous-context-mangled-names -file-compilation-dir /Users/admin/builder/spi-builder-workspace/.swiftpm/xcode -Xcc -ivfsstatcache -Xcc /Users/admin/builder/spi-builder-workspace/.derivedData/SDKStatCaches.noindex/appletvos18.4-22L251-271d326055c85f9856fa135c41255102.sdkstatcache -Xcc -I/Users/admin/builder/spi-builder-workspace/.derivedData/Build/Intermediates.noindex/Rideau.build/Debug-appletvos/Rideau.build/swift-overrides.hmap -Xcc -I/Users/admin/builder/spi-builder-workspace/.derivedData/Build/Products/Debug-appletvos/include -Xcc -I/Users/admin/builder/spi-builder-workspace/.derivedData/Build/Intermediates.noindex/Rideau.build/Debug-appletvos/Rideau.build/DerivedSources-normal/arm64 -Xcc -I/Users/admin/builder/spi-builder-workspace/.derivedData/Build/Intermediates.noindex/Rideau.build/Debug-appletvos/Rideau.build/DerivedSources/arm64 -Xcc -I/Users/admin/builder/spi-builder-workspace/.derivedData/Build/Intermediates.noindex/Rideau.build/Debug-appletvos/Rideau.build/DerivedSources -Xcc -DSWIFT_PACKAGE -Xcc -DDEBUG\=1 -module-name Rideau -frontend-parseable-output -disable-clang-spi -target-sdk-version 18.4 -target-sdk-name appletvos18.4 -external-plugin-path /Applications/Xcode-16.3.0.app/Contents/Developer/Platforms/AppleTVOS.platform/Developer/usr/lib/swift/host/plugins\#/Applications/Xcode-16.3.0.app/Contents/Developer/Platforms/AppleTVOS.platform/Developer/usr/bin/swift-plugin-server -external-plugin-path /Applications/Xcode-16.3.0.app/Contents/Developer/Platforms/AppleTVOS.platform/Developer/usr/local/lib/swift/host/plugins\#/Applications/Xcode-16.3.0.app/Contents/Developer/Platforms/AppleTVOS.platform/Developer/usr/bin/swift-plugin-server -in-process-plugin-server-path /Applications/Xcode-16.3.0.app/Contents/Developer/Toolchains/XcodeDefault.xctoolchain/usr/lib/swift/host/libSwiftInProcPluginServer.dylib -plugin-path /Applications/Xcode-16.3.0.app/Contents/Developer/Toolchains/XcodeDefault.xctoolchain/usr/lib/swift/host/plugins -plugin-path /Applications/Xcode-16.3.0.app/Contents/Developer/Toolchains/XcodeDefault.xctoolchain/usr/local/lib/swift/host/plugins -o /Users/admin/builder/spi-builder-workspace/.derivedData/Build/Intermediates.noindex/Rideau.build/Debug-appletvos/Rideau.build/Objects-normal/arm64/RideauMaskedCornerRoundedView.o -index-unit-output-path /Rideau.build/Debug-appletvos/Rideau.build/Objects-normal/arm64/RideauMaskedCornerRoundedView.o -index-store-path /Users/admin/builder/spi-builder-workspace/.derivedData/Index.noindex/DataStore -index-system-modules
SwiftCompile normal arm64 /Users/admin/builder/spi-builder-workspace/.dependencies/checkouts/Rideau/Rideau/Plugin/RideauMaskedCornerRoundedView.swift (in target 'Rideau' from project 'Rideau')
cd /Users/admin/builder/spi-builder-workspace/.swiftpm/xcode
/Users/admin/builder/spi-builder-workspace/.dependencies/checkouts/Rideau/Rideau/Plugin/RideauMaskedCornerRoundedView.swift:51:20: error: 'cornerCurve' is only available in tvOS 13.0 or newer
self.layer.cornerCurve = .continuous
^
/Users/admin/builder/spi-builder-workspace/.dependencies/checkouts/Rideau/Rideau/Plugin/RideauMaskedCornerRoundedView.swift:51:20: note: add 'if #available' version check
self.layer.cornerCurve = .continuous
^
/Users/admin/builder/spi-builder-workspace/.dependencies/checkouts/Rideau/Rideau/Plugin/RideauMaskedCornerRoundedView.swift:42:19: note: add @available attribute to enclosing initializer
public override init(
^
/Users/admin/builder/spi-builder-workspace/.dependencies/checkouts/Rideau/Rideau/Plugin/RideauMaskedCornerRoundedView.swift:27:12: note: add @available attribute to enclosing class
open class RideauMaskedCornerRoundedView: UIView {
^
/Users/admin/builder/spi-builder-workspace/.dependencies/checkouts/Rideau/Rideau/Plugin/RideauMaskedCornerRoundedView.swift:51:35: error: 'continuous' is only available in tvOS 13.0 or newer
self.layer.cornerCurve = .continuous
^
/Users/admin/builder/spi-builder-workspace/.dependencies/checkouts/Rideau/Rideau/Plugin/RideauMaskedCornerRoundedView.swift:51:35: note: add 'if #available' version check
self.layer.cornerCurve = .continuous
^
/Users/admin/builder/spi-builder-workspace/.dependencies/checkouts/Rideau/Rideau/Plugin/RideauMaskedCornerRoundedView.swift:42:19: note: add @available attribute to enclosing initializer
public override init(
^
/Users/admin/builder/spi-builder-workspace/.dependencies/checkouts/Rideau/Rideau/Plugin/RideauMaskedCornerRoundedView.swift:27:12: note: add @available attribute to enclosing class
open class RideauMaskedCornerRoundedView: UIView {
^
PrecompileModule /Users/admin/builder/spi-builder-workspace/.derivedData/Build/Intermediates.noindex/ExplicitPrecompiledModules/Dispatch-4D7BW92ENIJ3DQJHPMILY6378.scan
cd /Users/admin/builder/spi-builder-workspace/.swiftpm/xcode
builtin-precompileModule /Users/admin/builder/spi-builder-workspace/.derivedData/Build/Intermediates.noindex/ExplicitPrecompiledModules/Dispatch-4D7BW92ENIJ3DQJHPMILY6378.scan
SwiftDriverJobDiscovery normal arm64 Compiling RideauMaskedCornerRoundedViewController.swift (in target 'Rideau' from project 'Rideau')
SwiftCompile normal arm64 Compiling\ RideauTransitionController.swift,\ RideauView.swift /Users/admin/builder/spi-builder-workspace/.dependencies/checkouts/Rideau/Rideau/Core/RideauTransitionController.swift /Users/admin/builder/spi-builder-workspace/.dependencies/checkouts/Rideau/Rideau/Core/RideauView.swift (in target 'Rideau' from project 'Rideau')
** BUILD FAILED **
The following build commands failed:
SwiftCompile normal arm64 Compiling\ RideauMaskedCornerRoundedView.swift /Users/admin/builder/spi-builder-workspace/.dependencies/checkouts/Rideau/Rideau/Plugin/RideauMaskedCornerRoundedView.swift (in target 'Rideau' from project 'Rideau')
SwiftCompile normal arm64 /Users/admin/builder/spi-builder-workspace/.dependencies/checkouts/Rideau/Rideau/Plugin/RideauMaskedCornerRoundedView.swift (in target 'Rideau' from project 'Rideau')
Building workspace spi-builder-workspace with scheme FluidInterfaceKit-Package
(3 failures)
Command line invocation:
/Applications/Xcode-16.3.0.app/Contents/Developer/usr/bin/xcodebuild -IDEClonedSourcePackagesDirPathOverride=/Users/admin/builder/spi-builder-workspace/.dependencies -resolvePackageDependencies
Resolve Package Graph
Resolved source packages:
ResultBuilderKit: https://github.com/FluidGroup/ResultBuilderKit.git @ 1.3.0
RubberBanding: https://github.com/FluidGroup/swift-rubber-banding @ 1.0.0
swiftui-hosting: https://github.com/FluidGroup/swiftui-Hosting @ 2.3.0
FluidInterfaceKit: /Users/admin/builder/spi-builder-workspace
GeometryKit: https://github.com/FluidGroup/GeometryKit @ 1.1.0
Rideau: https://github.com/FluidGroup/Rideau.git @ 2.4.0
resolved source packages: ResultBuilderKit, RubberBanding, swiftui-hosting, FluidInterfaceKit, GeometryKit, Rideau
{
"dependencies" : [
{
"identity" : "geometrykit",
"requirement" : {
"range" : [
{
"lower_bound" : "1.1.0",
"upper_bound" : "2.0.0"
}
]
},
"type" : "sourceControl",
"url" : "https://github.com/FluidGroup/GeometryKit"
},
{
"identity" : "resultbuilderkit",
"requirement" : {
"range" : [
{
"lower_bound" : "1.2.0",
"upper_bound" : "2.0.0"
}
]
},
"type" : "sourceControl",
"url" : "https://github.com/FluidGroup/ResultBuilderKit.git"
},
{
"identity" : "rideau",
"requirement" : {
"range" : [
{
"lower_bound" : "2.1.0",
"upper_bound" : "3.0.0"
}
]
},
"type" : "sourceControl",
"url" : "https://github.com/FluidGroup/Rideau.git"
},
{
"identity" : "swiftui-hosting",
"requirement" : {
"range" : [
{
"lower_bound" : "2.0.0",
"upper_bound" : "3.0.0"
}
]
},
"type" : "sourceControl",
"url" : "https://github.com/FluidGroup/swiftui-Hosting"
},
{
"identity" : "swift-rubber-banding",
"requirement" : {
"range" : [
{
"lower_bound" : "1.0.0",
"upper_bound" : "2.0.0"
}
]
},
"type" : "sourceControl",
"url" : "https://github.com/FluidGroup/swift-rubber-banding"
}
],
"manifest_display_name" : "FluidInterfaceKit",
"name" : "FluidInterfaceKit",
"path" : "/Users/admin/builder/spi-builder-workspace",
"platforms" : [
{
"name" : "ios",
"version" : "13.0"
}
],
"products" : [
{
"name" : "FluidPortal",
"targets" : [
"FluidPortal"
],
"type" : {
"library" : [
"automatic"
]
}
},
{
"name" : "FluidGesture",
"targets" : [
"FluidGesture"
],
"type" : {
"library" : [
"automatic"
]
}
},
{
"name" : "FluidStack",
"targets" : [
"FluidStack"
],
"type" : {
"library" : [
"automatic"
]
}
},
{
"name" : "FluidSnackbar",
"targets" : [
"FluidSnackbar"
],
"type" : {
"library" : [
"automatic"
]
}
},
{
"name" : "FluidPictureInPicture",
"targets" : [
"FluidPictureInPicture"
],
"type" : {
"library" : [
"automatic"
]
}
},
{
"name" : "FluidTooltipSupport",
"targets" : [
"FluidTooltipSupport"
],
"type" : {
"library" : [
"automatic"
]
}
},
{
"name" : "FluidStackRideauSupport",
"targets" : [
"FluidStackRideauSupport"
],
"type" : {
"library" : [
"automatic"
]
}
},
{
"name" : "FluidKeyboardSupport",
"targets" : [
"FluidKeyboardSupport"
],
"type" : {
"library" : [
"automatic"
]
}
}
],
"targets" : [
{
"c99name" : "FluidTooltipSupport",
"module_type" : "SwiftTarget",
"name" : "FluidTooltipSupport",
"path" : "Sources/FluidTooltipSupport",
"product_memberships" : [
"FluidTooltipSupport"
],
"sources" : [
"FluidPopupHostingView.swift"
],
"target_dependencies" : [
"FluidPortal"
],
"type" : "library"
},
{
"c99name" : "FluidStackTests",
"module_type" : "SwiftTarget",
"name" : "FluidStackTests",
"path" : "Tests/FluidStackTests",
"sources" : [
"FluidInterfaceKitTests.swift",
"FluidLocalEnvironmentTests.swift",
"FluidStackControllerTests.swift",
"FluidViewControllerTests.swift",
"TreeBuilder.swift",
"UIKitPresentationTests.swift",
"UINavigationItemTests.swift",
"UIViewControllerExtentionTests.swift"
],
"target_dependencies" : [
"FluidStack"
],
"type" : "test"
},
{
"c99name" : "FluidStackRideauSupport",
"module_type" : "SwiftTarget",
"name" : "FluidStackRideauSupport",
"path" : "Sources/FluidStackRideauSupport",
"product_dependencies" : [
"Rideau"
],
"product_memberships" : [
"FluidStackRideauSupport"
],
"sources" : [
"FluidRideauViewController.swift"
],
"target_dependencies" : [
"FluidStack"
],
"type" : "library"
},
{
"c99name" : "FluidStack",
"module_type" : "SwiftTarget",
"name" : "FluidStack",
"path" : "Sources/FluidStack",
"product_dependencies" : [
"GeometryKit",
"ResultBuilderKit"
],
"product_memberships" : [
"FluidStack",
"FluidPictureInPicture",
"FluidStackRideauSupport"
],
"sources" : [
"ContextMenu/ContextMenuSupport.swift",
"Development/Debugging.swift",
"Development/Logger.swift",
"Experimental/Blur.swift",
"FluidInterfaceKit.swift",
"GlobalConfiguration.swift",
"Helper/BatchApplier.swift",
"Helper/CALayer+activeLayer.swift",
"Helper/CGVector+Magnitude.swift",
"Helper/ContextualTransitionSourceComponentType.swift",
"Helper/Fluid+withTransaction.swift",
"Helper/Fluid.swift",
"Helper/FluidExtentionViewController.swift",
"Helper/MirrorViewProvider.swift",
"Helper/ReparentingView.swift",
"Helper/ScrollView+Handling.swift",
"Helper/SourceCodeLocation.swift",
"Helper/StackingRelation.swift",
"Helper/UIBarButtonItem+.swift",
"Helper/UINavigationItem+.swift",
"Helper/UIView+.swift",
"Helper/UIView+Geometry.swift",
"Helper/UIViewController+.swift",
"Interaction/AnyRemovingInteraction+horizontalDragging.swift",
"Interaction/AnyRemovingInteraction+leftToRight.swift",
"Interaction/AnyRemovingInteraction.swift",
"Transition/AddingPresets/AnyAddingTransition+contextualExpanding.swift",
"Transition/AddingPresets/AnyAddingTransition+contextualInstagramThreads.swift",
"Transition/AddingPresets/AnyAddingTransition+fadeIn.swift",
"Transition/AddingPresets/AnyAddingTransition+modalIdiom.swift",
"Transition/AddingPresets/AnyAddingTransition+navigationStyle.swift",
"Transition/AddingPresets/AnyAddingTransition+noAnimation.swift",
"Transition/AddingPresets/AnyAddingTransition+popup.swift",
"Transition/AddingTransitionContext.swift",
"Transition/AnyAddingTransition.swift",
"Transition/AnyBatchRemovingTransition.swift",
"Transition/AnyRemovingTransition.swift",
"Transition/BatchRemovingTransitionContext.swift",
"Transition/RemovingPresets/AnyRemovingTransition+contextual.swift",
"Transition/RemovingPresets/AnyRemovingTransition+fadeOut.swift",
"Transition/RemovingPresets/AnyRemovingTransition+modalIdiom.swift",
"Transition/RemovingPresets/AnyRemovingTransition+navigationStyle.swift",
"Transition/RemovingPresets/AnyRemovingTransition+noAnimation.swift",
"Transition/RemovingPresets/AnyRemovingTransition+vanishing.swift",
"Transition/RemovingTransitionContext.swift",
"Transition/TransitionContext.swift",
"ViewController/FluidGestureHandlingViewController.swift",
"ViewController/FluidPopoverViewController.swift",
"ViewController/FluidSceneSwitchController.swift",
"ViewController/FluidStackContext.swift",
"ViewController/FluidStackController.swift",
"ViewController/FluidStageViewController.swift",
"ViewController/FluidSwitchController.swift",
"ViewController/FluidTabBarController.swift",
"ViewController/FluidTransitionViewController.swift",
"ViewController/FluidViewController.swift",
"ViewController/FluidWrapperViewController.swift"
],
"target_dependencies" : [
"FluidPortal",
"FluidCore"
],
"type" : "library"
},
{
"c99name" : "FluidSnackbar",
"module_type" : "SwiftTarget",
"name" : "FluidSnackbar",
"path" : "Sources/FluidSnackbar",
"product_dependencies" : [
"SwiftUIHosting",
"RubberBanding"
],
"product_memberships" : [
"FluidSnackbar"
],
"sources" : [
"FloatingDisplayContext.swift",
"FloatingDisplayController.swift",
"FloatingDisplayTarget.swift",
"FloatingDisplayTransitionType.swift",
"FloatingDisplayViewType.swift",
"Library/FloatingDisplayPopupTransition.swift",
"Library/FloatingDisplaySlideInTrantision.swift",
"Library/SnackbarDraggableBase.swift",
"Library/SnackbarPlainBase.swift"
],
"target_dependencies" : [
"FluidCore"
],
"type" : "library"
},
{
"c99name" : "FluidRuntime",
"module_type" : "ClangTarget",
"name" : "FluidRuntime",
"path" : "Sources/FluidRuntime",
"product_memberships" : [
"FluidPortal",
"FluidStack",
"FluidPictureInPicture",
"FluidTooltipSupport",
"FluidStackRideauSupport"
],
"sources" : [
"FluidRuntime.m"
],
"type" : "library"
},
{
"c99name" : "FluidPortal",
"module_type" : "SwiftTarget",
"name" : "FluidPortal",
"path" : "Sources/FluidPortal",
"product_memberships" : [
"FluidPortal",
"FluidStack",
"FluidPictureInPicture",
"FluidTooltipSupport",
"FluidStackRideauSupport"
],
"sources" : [
"DisplaySource.swift",
"Logger.swift",
"NativePortalView.swift",
"PortalStackView.swift",
"PortalView.swift"
],
"target_dependencies" : [
"FluidRuntime"
],
"type" : "library"
},
{
"c99name" : "FluidPictureInPicture",
"module_type" : "SwiftTarget",
"name" : "FluidPictureInPicture",
"path" : "Sources/FluidPictureInPicture",
"product_dependencies" : [
"GeometryKit"
],
"product_memberships" : [
"FluidPictureInPicture"
],
"sources" : [
"FluidPictureInPictureController.swift"
],
"target_dependencies" : [
"FluidCore",
"FluidStack"
],
"type" : "library"
},
{
"c99name" : "FluidKeyboardSupport",
"module_type" : "SwiftTarget",
"name" : "FluidKeyboardSupport",
"path" : "Sources/FluidKeyboardSupport",
"product_memberships" : [
"FluidKeyboardSupport"
],
"sources" : [
"KeyboardFrameInfo.swift",
"KeyboardObservation.swift",
"UIScrollView+HidingKeyboard.swift",
"UIScrollView+TrackingKeyboard.swift",
"UIView+TrackingKeyboard.swift"
],
"type" : "library"
},
{
"c99name" : "FluidGesture",
"module_type" : "SwiftTarget",
"name" : "FluidGesture",
"path" : "Sources/FluidGesture",
"product_dependencies" : [
"RubberBanding"
],
"product_memberships" : [
"FluidGesture"
],
"sources" : [
"Drag.swift",
"Internal/CGVector+FluidGesture.swift"
],
"type" : "library"
},
{
"c99name" : "FluidCore",
"module_type" : "SwiftTarget",
"name" : "FluidCore",
"path" : "Sources/FluidCore",
"product_memberships" : [
"FluidStack",
"FluidSnackbar",
"FluidPictureInPicture",
"FluidStackRideauSupport"
],
"sources" : [
"SafeAreaFinder.swift"
],
"type" : "library"
}
],
"tools_version" : "6.0"
}
{
"workspace" : {
"name" : "spi-builder-workspace",
"schemes" : [
"FluidGesture",
"FluidInterfaceKit-Package",
"FluidKeyboardSupport",
"FluidPictureInPicture",
"FluidPortal",
"FluidSnackbar",
"FluidStack",
"FluidStackRideauSupport",
"FluidTooltipSupport"
]
}
}
Running build ...
env DEVELOPER_DIR=/Applications/Xcode-16.3.0.app xcrun xcodebuild -IDEClonedSourcePackagesDirPathOverride=$PWD/.dependencies -skipMacroValidation -skipPackagePluginValidation -derivedDataPath $PWD/.derivedData build -scheme FluidInterfaceKit-Package -destination generic/platform=tvOS
Command line invocation:
/Applications/Xcode-16.3.0.app/Contents/Developer/usr/bin/xcodebuild -IDEClonedSourcePackagesDirPathOverride=/Users/admin/builder/spi-builder-workspace/.dependencies -skipMacroValidation -skipPackagePluginValidation -derivedDataPath /Users/admin/builder/spi-builder-workspace/.derivedData build -scheme FluidInterfaceKit-Package -destination generic/platform=tvOS
Resolve Package Graph
Resolved source packages:
GeometryKit: https://github.com/FluidGroup/GeometryKit @ 1.1.0
RubberBanding: https://github.com/FluidGroup/swift-rubber-banding @ 1.0.0
swiftui-hosting: https://github.com/FluidGroup/swiftui-Hosting @ 2.3.0
ResultBuilderKit: https://github.com/FluidGroup/ResultBuilderKit.git @ 1.3.0
Rideau: https://github.com/FluidGroup/Rideau.git @ 2.4.0
FluidInterfaceKit: /Users/admin/builder/spi-builder-workspace
ComputePackagePrebuildTargetDependencyGraph
Prepare packages
CreateBuildRequest
SendProjectDescription
CreateBuildOperation
ComputeTargetDependencyGraph
note: Building targets in dependency order
note: Target dependency graph (28 targets)
Target 'FluidTooltipSupport' in project 'FluidInterfaceKit'
➜ Explicit dependency on target 'FluidTooltipSupport' in project 'FluidInterfaceKit'
➜ Explicit dependency on target 'FluidRuntime' in project 'FluidInterfaceKit'
➜ Explicit dependency on target 'FluidPortal' in project 'FluidInterfaceKit'
Target 'FluidTooltipSupport' in project 'FluidInterfaceKit'
➜ Explicit dependency on target 'FluidRuntime' in project 'FluidInterfaceKit'
➜ Explicit dependency on target 'FluidPortal' in project 'FluidInterfaceKit'
Target 'FluidStackRideauSupport' in project 'FluidInterfaceKit'
➜ Explicit dependency on target 'FluidStackRideauSupport' in project 'FluidInterfaceKit'
➜ Explicit dependency on target 'FluidRuntime' in project 'FluidInterfaceKit'
➜ Explicit dependency on target 'FluidPortal' in project 'FluidInterfaceKit'
➜ Explicit dependency on target 'FluidCore' in project 'FluidInterfaceKit'
➜ Explicit dependency on target 'FluidStack' in project 'FluidInterfaceKit'
➜ Explicit dependency on target 'GeometryKit' in project 'GeometryKit'
➜ Explicit dependency on target 'ResultBuilderKit' in project 'ResultBuilderKit'
➜ Explicit dependency on target 'Rideau' in project 'Rideau'
Target 'FluidStackRideauSupport' in project 'FluidInterfaceKit'
➜ Explicit dependency on target 'FluidRuntime' in project 'FluidInterfaceKit'
➜ Explicit dependency on target 'FluidPortal' in project 'FluidInterfaceKit'
➜ Explicit dependency on target 'FluidCore' in project 'FluidInterfaceKit'
➜ Explicit dependency on target 'FluidStack' in project 'FluidInterfaceKit'
➜ Explicit dependency on target 'GeometryKit' in project 'GeometryKit'
➜ Explicit dependency on target 'ResultBuilderKit' in project 'ResultBuilderKit'
➜ Explicit dependency on target 'Rideau' in project 'Rideau'
Target 'Rideau' in project 'Rideau'
➜ Explicit dependency on target 'Rideau' in project 'Rideau'
Target 'Rideau' in project 'Rideau' (no dependencies)
Target 'FluidStack' in project 'FluidInterfaceKit'
➜ Explicit dependency on target 'FluidStack' in project 'FluidInterfaceKit'
➜ Explicit dependency on target 'FluidRuntime' in project 'FluidInterfaceKit'
➜ Explicit dependency on target 'FluidPortal' in project 'FluidInterfaceKit'
➜ Explicit dependency on target 'FluidCore' in project 'FluidInterfaceKit'
➜ Explicit dependency on target 'GeometryKit' in project 'GeometryKit'
➜ Explicit dependency on target 'ResultBuilderKit' in project 'ResultBuilderKit'
Target 'FluidSnackbar' in project 'FluidInterfaceKit'
➜ Explicit dependency on target 'FluidSnackbar' in project 'FluidInterfaceKit'
➜ Explicit dependency on target 'FluidCore' in project 'FluidInterfaceKit'
➜ Explicit dependency on target 'SwiftUIHosting' in project 'swiftui-hosting'
➜ Explicit dependency on target 'RubberBanding' in project 'RubberBanding'
Target 'FluidSnackbar' in project 'FluidInterfaceKit'
➜ Explicit dependency on target 'FluidCore' in project 'FluidInterfaceKit'
➜ Explicit dependency on target 'SwiftUIHosting' in project 'swiftui-hosting'
➜ Explicit dependency on target 'RubberBanding' in project 'RubberBanding'
Target 'SwiftUIHosting' in project 'swiftui-hosting'
➜ Explicit dependency on target 'SwiftUIHosting' in project 'swiftui-hosting'
Target 'SwiftUIHosting' in project 'swiftui-hosting' (no dependencies)
Target 'FluidPortal' in project 'FluidInterfaceKit'
➜ Explicit dependency on target 'FluidPortal' in project 'FluidInterfaceKit'
➜ Explicit dependency on target 'FluidRuntime' in project 'FluidInterfaceKit'
Target 'FluidPictureInPicture' in project 'FluidInterfaceKit'
➜ Explicit dependency on target 'FluidPictureInPicture' in project 'FluidInterfaceKit'
➜ Explicit dependency on target 'FluidCore' in project 'FluidInterfaceKit'
➜ Explicit dependency on target 'FluidRuntime' in project 'FluidInterfaceKit'
➜ Explicit dependency on target 'FluidPortal' in project 'FluidInterfaceKit'
➜ Explicit dependency on target 'FluidStack' in project 'FluidInterfaceKit'
➜ Explicit dependency on target 'GeometryKit' in project 'GeometryKit'
➜ Explicit dependency on target 'ResultBuilderKit' in project 'ResultBuilderKit'
Target 'FluidPictureInPicture' in project 'FluidInterfaceKit'
➜ Explicit dependency on target 'FluidCore' in project 'FluidInterfaceKit'
➜ Explicit dependency on target 'FluidRuntime' in project 'FluidInterfaceKit'
➜ Explicit dependency on target 'FluidPortal' in project 'FluidInterfaceKit'
➜ Explicit dependency on target 'FluidStack' in project 'FluidInterfaceKit'
➜ Explicit dependency on target 'GeometryKit' in project 'GeometryKit'
➜ Explicit dependency on target 'ResultBuilderKit' in project 'ResultBuilderKit'
Target 'FluidStack' in project 'FluidInterfaceKit'
➜ Explicit dependency on target 'FluidRuntime' in project 'FluidInterfaceKit'
➜ Explicit dependency on target 'FluidPortal' in project 'FluidInterfaceKit'
➜ Explicit dependency on target 'FluidCore' in project 'FluidInterfaceKit'
➜ Explicit dependency on target 'GeometryKit' in project 'GeometryKit'
➜ Explicit dependency on target 'ResultBuilderKit' in project 'ResultBuilderKit'
Target 'ResultBuilderKit' in project 'ResultBuilderKit'
➜ Explicit dependency on target 'ResultBuilderKit' in project 'ResultBuilderKit'
Target 'ResultBuilderKit' in project 'ResultBuilderKit' (no dependencies)
Target 'GeometryKit' in project 'GeometryKit'
➜ Explicit dependency on target 'GeometryKit' in project 'GeometryKit'
Target 'GeometryKit' in project 'GeometryKit' (no dependencies)
Target 'FluidPortal' in project 'FluidInterfaceKit'
➜ Explicit dependency on target 'FluidRuntime' in project 'FluidInterfaceKit'
Target 'FluidRuntime' in project 'FluidInterfaceKit' (no dependencies)
Target 'FluidCore' in project 'FluidInterfaceKit' (no dependencies)
Target 'FluidKeyboardSupport' in project 'FluidInterfaceKit'
➜ Explicit dependency on target 'FluidKeyboardSupport' in project 'FluidInterfaceKit'
Target 'FluidKeyboardSupport' in project 'FluidInterfaceKit' (no dependencies)
Target 'FluidGesture' in project 'FluidInterfaceKit'
➜ Explicit dependency on target 'FluidGesture' in project 'FluidInterfaceKit'
➜ Explicit dependency on target 'RubberBanding' in project 'RubberBanding'
Target 'FluidGesture' in project 'FluidInterfaceKit'
➜ Explicit dependency on target 'RubberBanding' in project 'RubberBanding'
Target 'RubberBanding' in project 'RubberBanding'
➜ Explicit dependency on target 'RubberBanding' in project 'RubberBanding'
Target 'RubberBanding' in project 'RubberBanding' (no dependencies)
GatherProvisioningInputs
CreateBuildDescription
ExecuteExternalTool /Applications/Xcode-16.3.0.app/Contents/Developer/Toolchains/XcodeDefault.xctoolchain/usr/bin/swiftc --version
ExecuteExternalTool /Applications/Xcode-16.3.0.app/Contents/Developer/Toolchains/XcodeDefault.xctoolchain/usr/bin/clang -v -E -dM -arch arm64 -isysroot /Applications/Xcode-16.3.0.app/Contents/Developer/Platforms/AppleTVOS.platform/Developer/SDKs/AppleTVOS18.4.sdk -x objective-c -c /dev/null
ExecuteExternalTool /Applications/Xcode-16.3.0.app/Contents/Developer/Toolchains/XcodeDefault.xctoolchain/usr/bin/clang -v -E -dM -isysroot /Applications/Xcode-16.3.0.app/Contents/Developer/Platforms/AppleTVOS.platform/Developer/SDKs/AppleTVOS18.4.sdk -x c -c /dev/null
ExecuteExternalTool /Applications/Xcode-16.3.0.app/Contents/Developer/Toolchains/XcodeDefault.xctoolchain/usr/bin/ld -version_details
ReadFileContents /Applications/Xcode-16.3.0.app/Contents/Developer/Toolchains/XcodeDefault.xctoolchain/usr/share/docc/features.json
ExecuteExternalTool /Applications/Xcode-16.3.0.app/Contents/Developer/Toolchains/XcodeDefault.xctoolchain/usr/bin/clang -v -E -dM -arch arm64 -isysroot /Applications/Xcode-16.3.0.app/Contents/Developer/Platforms/AppleTVOS.platform/Developer/SDKs/AppleTVOS18.4.sdk -x c -c /dev/null
Build description signature: 313431dbbbf68f988b495a698311d22e
Build description path: /Users/admin/builder/spi-builder-workspace/.derivedData/Build/Intermediates.noindex/XCBuildData/313431dbbbf68f988b495a698311d22e.xcbuilddata
ClangStatCache /Applications/Xcode-16.3.0.app/Contents/Developer/Toolchains/XcodeDefault.xctoolchain/usr/bin/clang-stat-cache /Applications/Xcode-16.3.0.app/Contents/Developer/Platforms/AppleTVOS.platform/Developer/SDKs/AppleTVOS18.4.sdk /Users/admin/builder/spi-builder-workspace/.derivedData/SDKStatCaches.noindex/appletvos18.4-22L251-271d326055c85f9856fa135c41255102.sdkstatcache
cd /Users/admin/builder/spi-builder-workspace/.swiftpm/xcode
/Applications/Xcode-16.3.0.app/Contents/Developer/Toolchains/XcodeDefault.xctoolchain/usr/bin/clang-stat-cache /Applications/Xcode-16.3.0.app/Contents/Developer/Platforms/AppleTVOS.platform/Developer/SDKs/AppleTVOS18.4.sdk -o /Users/admin/builder/spi-builder-workspace/.derivedData/SDKStatCaches.noindex/appletvos18.4-22L251-271d326055c85f9856fa135c41255102.sdkstatcache
SwiftDriver ResultBuilderKit normal arm64 com.apple.xcode.tools.swift.compiler (in target 'ResultBuilderKit' from project 'ResultBuilderKit')
cd /Users/admin/builder/spi-builder-workspace/.swiftpm/xcode
builtin-SwiftDriver -- /Applications/Xcode-16.3.0.app/Contents/Developer/Toolchains/XcodeDefault.xctoolchain/usr/bin/swiftc -module-name ResultBuilderKit -Onone -enforce-exclusivity\=checked @/Users/admin/builder/spi-builder-workspace/.derivedData/Build/Intermediates.noindex/ResultBuilderKit.build/Debug-appletvos/ResultBuilderKit.build/Objects-normal/arm64/ResultBuilderKit.SwiftFileList -DSWIFT_PACKAGE -DDEBUG -DXcode -plugin-path /Applications/Xcode-16.3.0.app/Contents/Developer/Toolchains/XcodeDefault.xctoolchain/usr/lib/swift/host/plugins/testing -enable-experimental-feature DebugDescriptionMacro -sdk /Applications/Xcode-16.3.0.app/Contents/Developer/Platforms/AppleTVOS.platform/Developer/SDKs/AppleTVOS18.4.sdk -target arm64-apple-tvos12.0 -g -module-cache-path /Users/admin/builder/spi-builder-workspace/.derivedData/ModuleCache.noindex -Xfrontend -serialize-debugging-options -profile-coverage-mapping -profile-generate -enable-testing -suppress-warnings -index-store-path /Users/admin/builder/spi-builder-workspace/.derivedData/Index.noindex/DataStore -swift-version 5 -I /Users/admin/builder/spi-builder-workspace/.derivedData/Build/Products/Debug-appletvos -I /Applications/Xcode-16.3.0.app/Contents/Developer/Platforms/AppleTVOS.platform/Developer/usr/lib -F /Users/admin/builder/spi-builder-workspace/.derivedData/Build/Products/Debug-appletvos -F /Applications/Xcode-16.3.0.app/Contents/Developer/Platforms/AppleTVOS.platform/Developer/Library/Frameworks -F /Applications/Xcode-16.3.0.app/Contents/Developer/Platforms/AppleTVOS.platform/Developer/SDKs/AppleTVOS18.4.sdk/Developer/Library/Frameworks -parse-as-library -c -j10 -enable-batch-mode -incremental -Xcc -ivfsstatcache -Xcc /Users/admin/builder/spi-builder-workspace/.derivedData/SDKStatCaches.noindex/appletvos18.4-22L251-271d326055c85f9856fa135c41255102.sdkstatcache -output-file-map /Users/admin/builder/spi-builder-workspace/.derivedData/Build/Intermediates.noindex/ResultBuilderKit.build/Debug-appletvos/ResultBuilderKit.build/Objects-normal/arm64/ResultBuilderKit-OutputFileMap.json -use-frontend-parseable-output -save-temps -no-color-diagnostics -serialize-diagnostics -emit-dependencies -emit-module -emit-module-path /Users/admin/builder/spi-builder-workspace/.derivedData/Build/Intermediates.noindex/ResultBuilderKit.build/Debug-appletvos/ResultBuilderKit.build/Objects-normal/arm64/ResultBuilderKit.swiftmodule -validate-clang-modules-once -clang-build-session-file /Users/admin/builder/spi-builder-workspace/.derivedData/ModuleCache.noindex/Session.modulevalidation -Xcc -I/Users/admin/builder/spi-builder-workspace/.derivedData/Build/Intermediates.noindex/ResultBuilderKit.build/Debug-appletvos/ResultBuilderKit.build/swift-overrides.hmap -emit-const-values -Xfrontend -const-gather-protocols-file -Xfrontend /Users/admin/builder/spi-builder-workspace/.derivedData/Build/Intermediates.noindex/ResultBuilderKit.build/Debug-appletvos/ResultBuilderKit.build/Objects-normal/arm64/ResultBuilderKit_const_extract_protocols.json -Xcc -I/Users/admin/builder/spi-builder-workspace/.derivedData/Build/Products/Debug-appletvos/include -Xcc -I/Users/admin/builder/spi-builder-workspace/.derivedData/Build/Intermediates.noindex/ResultBuilderKit.build/Debug-appletvos/ResultBuilderKit.build/DerivedSources-normal/arm64 -Xcc -I/Users/admin/builder/spi-builder-workspace/.derivedData/Build/Intermediates.noindex/ResultBuilderKit.build/Debug-appletvos/ResultBuilderKit.build/DerivedSources/arm64 -Xcc -I/Users/admin/builder/spi-builder-workspace/.derivedData/Build/Intermediates.noindex/ResultBuilderKit.build/Debug-appletvos/ResultBuilderKit.build/DerivedSources -Xcc -DSWIFT_PACKAGE -Xcc -DDEBUG\=1 -emit-objc-header -emit-objc-header-path /Users/admin/builder/spi-builder-workspace/.derivedData/Build/Intermediates.noindex/ResultBuilderKit.build/Debug-appletvos/ResultBuilderKit.build/Objects-normal/arm64/ResultBuilderKit-Swift.h -working-directory /Users/admin/builder/spi-builder-workspace/.swiftpm/xcode -experimental-emit-module-separately -disable-cmo
SwiftDriver GeometryKit normal arm64 com.apple.xcode.tools.swift.compiler (in target 'GeometryKit' from project 'GeometryKit')
cd /Users/admin/builder/spi-builder-workspace/.swiftpm/xcode
builtin-SwiftDriver -- /Applications/Xcode-16.3.0.app/Contents/Developer/Toolchains/XcodeDefault.xctoolchain/usr/bin/swiftc -module-name GeometryKit -Onone -enforce-exclusivity\=checked @/Users/admin/builder/spi-builder-workspace/.derivedData/Build/Intermediates.noindex/GeometryKit.build/Debug-appletvos/GeometryKit.build/Objects-normal/arm64/GeometryKit.SwiftFileList -DSWIFT_PACKAGE -DDEBUG -DXcode -plugin-path /Applications/Xcode-16.3.0.app/Contents/Developer/Toolchains/XcodeDefault.xctoolchain/usr/lib/swift/host/plugins/testing -enable-experimental-feature DebugDescriptionMacro -sdk /Applications/Xcode-16.3.0.app/Contents/Developer/Platforms/AppleTVOS.platform/Developer/SDKs/AppleTVOS18.4.sdk -target arm64-apple-tvos12.0 -g -module-cache-path /Users/admin/builder/spi-builder-workspace/.derivedData/ModuleCache.noindex -Xfrontend -serialize-debugging-options -profile-coverage-mapping -profile-generate -enable-testing -suppress-warnings -index-store-path /Users/admin/builder/spi-builder-workspace/.derivedData/Index.noindex/DataStore -swift-version 5 -I /Users/admin/builder/spi-builder-workspace/.derivedData/Build/Products/Debug-appletvos -I /Applications/Xcode-16.3.0.app/Contents/Developer/Platforms/AppleTVOS.platform/Developer/usr/lib -F /Users/admin/builder/spi-builder-workspace/.derivedData/Build/Products/Debug-appletvos -F /Applications/Xcode-16.3.0.app/Contents/Developer/Platforms/AppleTVOS.platform/Developer/Library/Frameworks -F /Applications/Xcode-16.3.0.app/Contents/Developer/Platforms/AppleTVOS.platform/Developer/SDKs/AppleTVOS18.4.sdk/Developer/Library/Frameworks -parse-as-library -c -j10 -enable-batch-mode -incremental -Xcc -ivfsstatcache -Xcc /Users/admin/builder/spi-builder-workspace/.derivedData/SDKStatCaches.noindex/appletvos18.4-22L251-271d326055c85f9856fa135c41255102.sdkstatcache -output-file-map /Users/admin/builder/spi-builder-workspace/.derivedData/Build/Intermediates.noindex/GeometryKit.build/Debug-appletvos/GeometryKit.build/Objects-normal/arm64/GeometryKit-OutputFileMap.json -use-frontend-parseable-output -save-temps -no-color-diagnostics -serialize-diagnostics -emit-dependencies -emit-module -emit-module-path /Users/admin/builder/spi-builder-workspace/.derivedData/Build/Intermediates.noindex/GeometryKit.build/Debug-appletvos/GeometryKit.build/Objects-normal/arm64/GeometryKit.swiftmodule -validate-clang-modules-once -clang-build-session-file /Users/admin/builder/spi-builder-workspace/.derivedData/ModuleCache.noindex/Session.modulevalidation -Xcc -I/Users/admin/builder/spi-builder-workspace/.derivedData/Build/Intermediates.noindex/GeometryKit.build/Debug-appletvos/GeometryKit.build/swift-overrides.hmap -emit-const-values -Xfrontend -const-gather-protocols-file -Xfrontend /Users/admin/builder/spi-builder-workspace/.derivedData/Build/Intermediates.noindex/GeometryKit.build/Debug-appletvos/GeometryKit.build/Objects-normal/arm64/GeometryKit_const_extract_protocols.json -Xcc -I/Users/admin/builder/spi-builder-workspace/.derivedData/Build/Products/Debug-appletvos/include -Xcc -I/Users/admin/builder/spi-builder-workspace/.derivedData/Build/Intermediates.noindex/GeometryKit.build/Debug-appletvos/GeometryKit.build/DerivedSources-normal/arm64 -Xcc -I/Users/admin/builder/spi-builder-workspace/.derivedData/Build/Intermediates.noindex/GeometryKit.build/Debug-appletvos/GeometryKit.build/DerivedSources/arm64 -Xcc -I/Users/admin/builder/spi-builder-workspace/.derivedData/Build/Intermediates.noindex/GeometryKit.build/Debug-appletvos/GeometryKit.build/DerivedSources -Xcc -DSWIFT_PACKAGE -Xcc -DDEBUG\=1 -emit-objc-header -emit-objc-header-path /Users/admin/builder/spi-builder-workspace/.derivedData/Build/Intermediates.noindex/GeometryKit.build/Debug-appletvos/GeometryKit.build/Objects-normal/arm64/GeometryKit-Swift.h -working-directory /Users/admin/builder/spi-builder-workspace/.swiftpm/xcode -experimental-emit-module-separately -disable-cmo
SwiftDriver Rideau normal arm64 com.apple.xcode.tools.swift.compiler (in target 'Rideau' from project 'Rideau')
cd /Users/admin/builder/spi-builder-workspace/.swiftpm/xcode
builtin-SwiftDriver -- /Applications/Xcode-16.3.0.app/Contents/Developer/Toolchains/XcodeDefault.xctoolchain/usr/bin/swiftc -module-name Rideau -Onone -enforce-exclusivity\=checked @/Users/admin/builder/spi-builder-workspace/.derivedData/Build/Intermediates.noindex/Rideau.build/Debug-appletvos/Rideau.build/Objects-normal/arm64/Rideau.SwiftFileList -DSWIFT_PACKAGE -DDEBUG -DXcode -plugin-path /Applications/Xcode-16.3.0.app/Contents/Developer/Toolchains/XcodeDefault.xctoolchain/usr/lib/swift/host/plugins/testing -enable-experimental-feature DebugDescriptionMacro -sdk /Applications/Xcode-16.3.0.app/Contents/Developer/Platforms/AppleTVOS.platform/Developer/SDKs/AppleTVOS18.4.sdk -target arm64-apple-tvos12.0 -g -module-cache-path /Users/admin/builder/spi-builder-workspace/.derivedData/ModuleCache.noindex -Xfrontend -serialize-debugging-options -profile-coverage-mapping -profile-generate -enable-testing -suppress-warnings -index-store-path /Users/admin/builder/spi-builder-workspace/.derivedData/Index.noindex/DataStore -swift-version 5 -I /Users/admin/builder/spi-builder-workspace/.derivedData/Build/Products/Debug-appletvos -I /Applications/Xcode-16.3.0.app/Contents/Developer/Platforms/AppleTVOS.platform/Developer/usr/lib -F /Users/admin/builder/spi-builder-workspace/.derivedData/Build/Products/Debug-appletvos -F /Applications/Xcode-16.3.0.app/Contents/Developer/Platforms/AppleTVOS.platform/Developer/Library/Frameworks -F /Applications/Xcode-16.3.0.app/Contents/Developer/Platforms/AppleTVOS.platform/Developer/SDKs/AppleTVOS18.4.sdk/Developer/Library/Frameworks -c -j10 -enable-batch-mode -incremental -Xcc -ivfsstatcache -Xcc /Users/admin/builder/spi-builder-workspace/.derivedData/SDKStatCaches.noindex/appletvos18.4-22L251-271d326055c85f9856fa135c41255102.sdkstatcache -output-file-map /Users/admin/builder/spi-builder-workspace/.derivedData/Build/Intermediates.noindex/Rideau.build/Debug-appletvos/Rideau.build/Objects-normal/arm64/Rideau-OutputFileMap.json -use-frontend-parseable-output -save-temps -no-color-diagnostics -serialize-diagnostics -emit-dependencies -emit-module -emit-module-path /Users/admin/builder/spi-builder-workspace/.derivedData/Build/Intermediates.noindex/Rideau.build/Debug-appletvos/Rideau.build/Objects-normal/arm64/Rideau.swiftmodule -validate-clang-modules-once -clang-build-session-file /Users/admin/builder/spi-builder-workspace/.derivedData/ModuleCache.noindex/Session.modulevalidation -Xcc -I/Users/admin/builder/spi-builder-workspace/.derivedData/Build/Intermediates.noindex/Rideau.build/Debug-appletvos/Rideau.build/swift-overrides.hmap -emit-const-values -Xfrontend -const-gather-protocols-file -Xfrontend /Users/admin/builder/spi-builder-workspace/.derivedData/Build/Intermediates.noindex/Rideau.build/Debug-appletvos/Rideau.build/Objects-normal/arm64/Rideau_const_extract_protocols.json -Xcc -I/Users/admin/builder/spi-builder-workspace/.derivedData/Build/Products/Debug-appletvos/include -Xcc -I/Users/admin/builder/spi-builder-workspace/.derivedData/Build/Intermediates.noindex/Rideau.build/Debug-appletvos/Rideau.build/DerivedSources-normal/arm64 -Xcc -I/Users/admin/builder/spi-builder-workspace/.derivedData/Build/Intermediates.noindex/Rideau.build/Debug-appletvos/Rideau.build/DerivedSources/arm64 -Xcc -I/Users/admin/builder/spi-builder-workspace/.derivedData/Build/Intermediates.noindex/Rideau.build/Debug-appletvos/Rideau.build/DerivedSources -Xcc -DSWIFT_PACKAGE -Xcc -DDEBUG\=1 -emit-objc-header -emit-objc-header-path /Users/admin/builder/spi-builder-workspace/.derivedData/Build/Intermediates.noindex/Rideau.build/Debug-appletvos/Rideau.build/Objects-normal/arm64/Rideau-Swift.h -working-directory /Users/admin/builder/spi-builder-workspace/.swiftpm/xcode -experimental-emit-module-separately -disable-cmo
SwiftDriver RubberBanding normal arm64 com.apple.xcode.tools.swift.compiler (in target 'RubberBanding' from project 'RubberBanding')
cd /Users/admin/builder/spi-builder-workspace/.swiftpm/xcode
builtin-SwiftDriver -- /Applications/Xcode-16.3.0.app/Contents/Developer/Toolchains/XcodeDefault.xctoolchain/usr/bin/swiftc -module-name RubberBanding -Onone -enforce-exclusivity\=checked @/Users/admin/builder/spi-builder-workspace/.derivedData/Build/Intermediates.noindex/RubberBanding.build/Debug-appletvos/RubberBanding.build/Objects-normal/arm64/RubberBanding.SwiftFileList -DSWIFT_PACKAGE -DDEBUG -DXcode -plugin-path /Applications/Xcode-16.3.0.app/Contents/Developer/Toolchains/XcodeDefault.xctoolchain/usr/lib/swift/host/plugins/testing -enable-experimental-feature DebugDescriptionMacro -sdk /Applications/Xcode-16.3.0.app/Contents/Developer/Platforms/AppleTVOS.platform/Developer/SDKs/AppleTVOS18.4.sdk -target arm64-apple-tvos12.0 -g -module-cache-path /Users/admin/builder/spi-builder-workspace/.derivedData/ModuleCache.noindex -Xfrontend -serialize-debugging-options -profile-coverage-mapping -profile-generate -enable-testing -suppress-warnings -index-store-path /Users/admin/builder/spi-builder-workspace/.derivedData/Index.noindex/DataStore -swift-version 5 -I /Users/admin/builder/spi-builder-workspace/.derivedData/Build/Products/Debug-appletvos -I /Applications/Xcode-16.3.0.app/Contents/Developer/Platforms/AppleTVOS.platform/Developer/usr/lib -F /Users/admin/builder/spi-builder-workspace/.derivedData/Build/Products/Debug-appletvos -F /Applications/Xcode-16.3.0.app/Contents/Developer/Platforms/AppleTVOS.platform/Developer/Library/Frameworks -F /Applications/Xcode-16.3.0.app/Contents/Developer/Platforms/AppleTVOS.platform/Developer/SDKs/AppleTVOS18.4.sdk/Developer/Library/Frameworks -parse-as-library -c -j10 -enable-batch-mode -incremental -Xcc -ivfsstatcache -Xcc /Users/admin/builder/spi-builder-workspace/.derivedData/SDKStatCaches.noindex/appletvos18.4-22L251-271d326055c85f9856fa135c41255102.sdkstatcache -output-file-map /Users/admin/builder/spi-builder-workspace/.derivedData/Build/Intermediates.noindex/RubberBanding.build/Debug-appletvos/RubberBanding.build/Objects-normal/arm64/RubberBanding-OutputFileMap.json -use-frontend-parseable-output -save-temps -no-color-diagnostics -serialize-diagnostics -emit-dependencies -emit-module -emit-module-path /Users/admin/builder/spi-builder-workspace/.derivedData/Build/Intermediates.noindex/RubberBanding.build/Debug-appletvos/RubberBanding.build/Objects-normal/arm64/RubberBanding.swiftmodule -validate-clang-modules-once -clang-build-session-file /Users/admin/builder/spi-builder-workspace/.derivedData/ModuleCache.noindex/Session.modulevalidation -package-name swift_rubber_banding -Xcc -I/Users/admin/builder/spi-builder-workspace/.derivedData/Build/Intermediates.noindex/RubberBanding.build/Debug-appletvos/RubberBanding.build/swift-overrides.hmap -emit-const-values -Xfrontend -const-gather-protocols-file -Xfrontend /Users/admin/builder/spi-builder-workspace/.derivedData/Build/Intermediates.noindex/RubberBanding.build/Debug-appletvos/RubberBanding.build/Objects-normal/arm64/RubberBanding_const_extract_protocols.json -Xcc -I/Users/admin/builder/spi-builder-workspace/.derivedData/Build/Products/Debug-appletvos/include -Xcc -I/Users/admin/builder/spi-builder-workspace/.derivedData/Build/Intermediates.noindex/RubberBanding.build/Debug-appletvos/RubberBanding.build/DerivedSources-normal/arm64 -Xcc -I/Users/admin/builder/spi-builder-workspace/.derivedData/Build/Intermediates.noindex/RubberBanding.build/Debug-appletvos/RubberBanding.build/DerivedSources/arm64 -Xcc -I/Users/admin/builder/spi-builder-workspace/.derivedData/Build/Intermediates.noindex/RubberBanding.build/Debug-appletvos/RubberBanding.build/DerivedSources -Xcc -DSWIFT_PACKAGE -Xcc -DDEBUG\=1 -emit-objc-header -emit-objc-header-path /Users/admin/builder/spi-builder-workspace/.derivedData/Build/Intermediates.noindex/RubberBanding.build/Debug-appletvos/RubberBanding.build/Objects-normal/arm64/RubberBanding-Swift.h -working-directory /Users/admin/builder/spi-builder-workspace/.swiftpm/xcode -experimental-emit-module-separately -disable-cmo
SwiftDriver SwiftUIHosting normal arm64 com.apple.xcode.tools.swift.compiler (in target 'SwiftUIHosting' from project 'swiftui-hosting')
cd /Users/admin/builder/spi-builder-workspace/.swiftpm/xcode
builtin-SwiftDriver -- /Applications/Xcode-16.3.0.app/Contents/Developer/Toolchains/XcodeDefault.xctoolchain/usr/bin/swiftc -module-name SwiftUIHosting -Onone -enforce-exclusivity\=checked @/Users/admin/builder/spi-builder-workspace/.derivedData/Build/Intermediates.noindex/swiftui-hosting.build/Debug-appletvos/SwiftUIHosting.build/Objects-normal/arm64/SwiftUIHosting.SwiftFileList -DSWIFT_PACKAGE -DDEBUG -DXcode -plugin-path /Applications/Xcode-16.3.0.app/Contents/Developer/Toolchains/XcodeDefault.xctoolchain/usr/lib/swift/host/plugins/testing -enable-experimental-feature DebugDescriptionMacro -sdk /Applications/Xcode-16.3.0.app/Contents/Developer/Platforms/AppleTVOS.platform/Developer/SDKs/AppleTVOS18.4.sdk -target arm64-apple-tvos13.0 -g -module-cache-path /Users/admin/builder/spi-builder-workspace/.derivedData/ModuleCache.noindex -Xfrontend -serialize-debugging-options -profile-coverage-mapping -profile-generate -enable-testing -suppress-warnings -index-store-path /Users/admin/builder/spi-builder-workspace/.derivedData/Index.noindex/DataStore -swift-version 6 -I /Users/admin/builder/spi-builder-workspace/.derivedData/Build/Products/Debug-appletvos -I /Applications/Xcode-16.3.0.app/Contents/Developer/Platforms/AppleTVOS.platform/Developer/usr/lib -F /Users/admin/builder/spi-builder-workspace/.derivedData/Build/Products/Debug-appletvos -F /Applications/Xcode-16.3.0.app/Contents/Developer/Platforms/AppleTVOS.platform/Developer/Library/Frameworks -F /Applications/Xcode-16.3.0.app/Contents/Developer/Platforms/AppleTVOS.platform/Developer/SDKs/AppleTVOS18.4.sdk/Developer/Library/Frameworks -c -j10 -enable-batch-mode -incremental -Xcc -ivfsstatcache -Xcc /Users/admin/builder/spi-builder-workspace/.derivedData/SDKStatCaches.noindex/appletvos18.4-22L251-271d326055c85f9856fa135c41255102.sdkstatcache -output-file-map /Users/admin/builder/spi-builder-workspace/.derivedData/Build/Intermediates.noindex/swiftui-hosting.build/Debug-appletvos/SwiftUIHosting.build/Objects-normal/arm64/SwiftUIHosting-OutputFileMap.json -use-frontend-parseable-output -save-temps -no-color-diagnostics -serialize-diagnostics -emit-dependencies -emit-module -emit-module-path /Users/admin/builder/spi-builder-workspace/.derivedData/Build/Intermediates.noindex/swiftui-hosting.build/Debug-appletvos/SwiftUIHosting.build/Objects-normal/arm64/SwiftUIHosting.swiftmodule -user-module-version 2.3.0 -validate-clang-modules-once -clang-build-session-file /Users/admin/builder/spi-builder-workspace/.derivedData/ModuleCache.noindex/Session.modulevalidation -package-name swiftui_hosting -Xcc -I/Users/admin/builder/spi-builder-workspace/.derivedData/Build/Intermediates.noindex/swiftui-hosting.build/Debug-appletvos/SwiftUIHosting.build/swift-overrides.hmap -emit-const-values -Xfrontend -const-gather-protocols-file -Xfrontend /Users/admin/builder/spi-builder-workspace/.derivedData/Build/Intermediates.noindex/swiftui-hosting.build/Debug-appletvos/SwiftUIHosting.build/Objects-normal/arm64/SwiftUIHosting_const_extract_protocols.json -Xcc -I/Users/admin/builder/spi-builder-workspace/.derivedData/Build/Products/Debug-appletvos/include -Xcc -I/Users/admin/builder/spi-builder-workspace/.derivedData/Build/Intermediates.noindex/swiftui-hosting.build/Debug-appletvos/SwiftUIHosting.build/DerivedSources-normal/arm64 -Xcc -I/Users/admin/builder/spi-builder-workspace/.derivedData/Build/Intermediates.noindex/swiftui-hosting.build/Debug-appletvos/SwiftUIHosting.build/DerivedSources/arm64 -Xcc -I/Users/admin/builder/spi-builder-workspace/.derivedData/Build/Intermediates.noindex/swiftui-hosting.build/Debug-appletvos/SwiftUIHosting.build/DerivedSources -Xcc -DSWIFT_PACKAGE -Xcc -DDEBUG\=1 -emit-objc-header -emit-objc-header-path /Users/admin/builder/spi-builder-workspace/.derivedData/Build/Intermediates.noindex/swiftui-hosting.build/Debug-appletvos/SwiftUIHosting.build/Objects-normal/arm64/SwiftUIHosting-Swift.h -working-directory /Users/admin/builder/spi-builder-workspace/.swiftpm/xcode -experimental-emit-module-separately -disable-cmo
SwiftDriver FluidKeyboardSupport normal arm64 com.apple.xcode.tools.swift.compiler (in target 'FluidKeyboardSupport' from project 'FluidInterfaceKit')
cd /Users/admin/builder/spi-builder-workspace/.swiftpm/xcode
builtin-SwiftDriver -- /Applications/Xcode-16.3.0.app/Contents/Developer/Toolchains/XcodeDefault.xctoolchain/usr/bin/swiftc -module-name FluidKeyboardSupport -Onone -enforce-exclusivity\=checked @/Users/admin/builder/spi-builder-workspace/.derivedData/Build/Intermediates.noindex/FluidInterfaceKit.build/Debug-appletvos/FluidKeyboardSupport.build/Objects-normal/arm64/FluidKeyboardSupport.SwiftFileList -DSWIFT_PACKAGE -DDEBUG -DXcode -plugin-path /Applications/Xcode-16.3.0.app/Contents/Developer/Toolchains/XcodeDefault.xctoolchain/usr/lib/swift/host/plugins/testing -enable-experimental-feature DebugDescriptionMacro -sdk /Applications/Xcode-16.3.0.app/Contents/Developer/Platforms/AppleTVOS.platform/Developer/SDKs/AppleTVOS18.4.sdk -target arm64-apple-tvos13.0 -g -module-cache-path /Users/admin/builder/spi-builder-workspace/.derivedData/ModuleCache.noindex -Xfrontend -serialize-debugging-options -profile-coverage-mapping -profile-generate -enable-testing -index-store-path /Users/admin/builder/spi-builder-workspace/.derivedData/Index.noindex/DataStore -swift-version 6 -I /Users/admin/builder/spi-builder-workspace/.derivedData/Build/Products/Debug-appletvos -I /Applications/Xcode-16.3.0.app/Contents/Developer/Platforms/AppleTVOS.platform/Developer/usr/lib -F /Users/admin/builder/spi-builder-workspace/.derivedData/Build/Products/Debug-appletvos -F /Applications/Xcode-16.3.0.app/Contents/Developer/Platforms/AppleTVOS.platform/Developer/Library/Frameworks -F /Applications/Xcode-16.3.0.app/Contents/Developer/Platforms/AppleTVOS.platform/Developer/SDKs/AppleTVOS18.4.sdk/Developer/Library/Frameworks -c -j10 -enable-batch-mode -incremental -Xcc -ivfsstatcache -Xcc /Users/admin/builder/spi-builder-workspace/.derivedData/SDKStatCaches.noindex/appletvos18.4-22L251-271d326055c85f9856fa135c41255102.sdkstatcache -output-file-map /Users/admin/builder/spi-builder-workspace/.derivedData/Build/Intermediates.noindex/FluidInterfaceKit.build/Debug-appletvos/FluidKeyboardSupport.build/Objects-normal/arm64/FluidKeyboardSupport-OutputFileMap.json -use-frontend-parseable-output -save-temps -no-color-diagnostics -serialize-diagnostics -emit-dependencies -emit-module -emit-module-path /Users/admin/builder/spi-builder-workspace/.derivedData/Build/Intermediates.noindex/FluidInterfaceKit.build/Debug-appletvos/FluidKeyboardSupport.build/Objects-normal/arm64/FluidKeyboardSupport.swiftmodule -validate-clang-modules-once -clang-build-session-file /Users/admin/builder/spi-builder-workspace/.derivedData/ModuleCache.noindex/Session.modulevalidation -package-name spi_builder_workspace -Xcc -I/Users/admin/builder/spi-builder-workspace/.derivedData/Build/Intermediates.noindex/FluidInterfaceKit.build/Debug-appletvos/FluidKeyboardSupport.build/swift-overrides.hmap -emit-const-values -Xfrontend -const-gather-protocols-file -Xfrontend /Users/admin/builder/spi-builder-workspace/.derivedData/Build/Intermediates.noindex/FluidInterfaceKit.build/Debug-appletvos/FluidKeyboardSupport.build/Objects-normal/arm64/FluidKeyboardSupport_const_extract_protocols.json -Xcc -I/Users/admin/builder/spi-builder-workspace/.derivedData/Build/Products/Debug-appletvos/include -Xcc -I/Users/admin/builder/spi-builder-workspace/.derivedData/Build/Intermediates.noindex/FluidInterfaceKit.build/Debug-appletvos/FluidKeyboardSupport.build/DerivedSources-normal/arm64 -Xcc -I/Users/admin/builder/spi-builder-workspace/.derivedData/Build/Intermediates.noindex/FluidInterfaceKit.build/Debug-appletvos/FluidKeyboardSupport.build/DerivedSources/arm64 -Xcc -I/Users/admin/builder/spi-builder-workspace/.derivedData/Build/Intermediates.noindex/FluidInterfaceKit.build/Debug-appletvos/FluidKeyboardSupport.build/DerivedSources -Xcc -DSWIFT_PACKAGE -Xcc -DDEBUG\=1 -emit-objc-header -emit-objc-header-path /Users/admin/builder/spi-builder-workspace/.derivedData/Build/Intermediates.noindex/FluidInterfaceKit.build/Debug-appletvos/FluidKeyboardSupport.build/Objects-normal/arm64/FluidKeyboardSupport-Swift.h -working-directory /Users/admin/builder/spi-builder-workspace/.swiftpm/xcode -experimental-emit-module-separately -disable-cmo
SwiftDriver FluidPortal normal arm64 com.apple.xcode.tools.swift.compiler (in target 'FluidPortal' from project 'FluidInterfaceKit')
cd /Users/admin/builder/spi-builder-workspace/.swiftpm/xcode
builtin-SwiftDriver -- /Applications/Xcode-16.3.0.app/Contents/Developer/Toolchains/XcodeDefault.xctoolchain/usr/bin/swiftc -module-name FluidPortal -Onone -enforce-exclusivity\=checked @/Users/admin/builder/spi-builder-workspace/.derivedData/Build/Intermediates.noindex/FluidInterfaceKit.build/Debug-appletvos/FluidPortal.build/Objects-normal/arm64/FluidPortal.SwiftFileList -DSWIFT_PACKAGE -DDEBUG -Xcc -fmodule-map-file\=/Users/admin/builder/spi-builder-workspace/.derivedData/Build/Intermediates.noindex/GeneratedModuleMaps-appletvos/FluidRuntime.modulemap -DXcode -plugin-path /Applications/Xcode-16.3.0.app/Contents/Developer/Toolchains/XcodeDefault.xctoolchain/usr/lib/swift/host/plugins/testing -enable-experimental-feature DebugDescriptionMacro -sdk /Applications/Xcode-16.3.0.app/Contents/Developer/Platforms/AppleTVOS.platform/Developer/SDKs/AppleTVOS18.4.sdk -target arm64-apple-tvos13.0 -g -module-cache-path /Users/admin/builder/spi-builder-workspace/.derivedData/ModuleCache.noindex -Xfrontend -serialize-debugging-options -profile-coverage-mapping -profile-generate -enable-testing -index-store-path /Users/admin/builder/spi-builder-workspace/.derivedData/Index.noindex/DataStore -swift-version 6 -I /Users/admin/builder/spi-builder-workspace/.derivedData/Build/Products/Debug-appletvos -I /Applications/Xcode-16.3.0.app/Contents/Developer/Platforms/AppleTVOS.platform/Developer/usr/lib -F /Users/admin/builder/spi-builder-workspace/.derivedData/Build/Products/Debug-appletvos/PackageFrameworks -F /Users/admin/builder/spi-builder-workspace/.derivedData/Build/Products/Debug-appletvos -F /Applications/Xcode-16.3.0.app/Contents/Developer/Platforms/AppleTVOS.platform/Developer/Library/Frameworks -F /Applications/Xcode-16.3.0.app/Contents/Developer/Platforms/AppleTVOS.platform/Developer/SDKs/AppleTVOS18.4.sdk/Developer/Library/Frameworks -c -j10 -enable-batch-mode -incremental -Xcc -ivfsstatcache -Xcc /Users/admin/builder/spi-builder-workspace/.derivedData/SDKStatCaches.noindex/appletvos18.4-22L251-271d326055c85f9856fa135c41255102.sdkstatcache -output-file-map /Users/admin/builder/spi-builder-workspace/.derivedData/Build/Intermediates.noindex/FluidInterfaceKit.build/Debug-appletvos/FluidPortal.build/Objects-normal/arm64/FluidPortal-OutputFileMap.json -use-frontend-parseable-output -save-temps -no-color-diagnostics -serialize-diagnostics -emit-dependencies -emit-module -emit-module-path /Users/admin/builder/spi-builder-workspace/.derivedData/Build/Intermediates.noindex/FluidInterfaceKit.build/Debug-appletvos/FluidPortal.build/Objects-normal/arm64/FluidPortal.swiftmodule -validate-clang-modules-once -clang-build-session-file /Users/admin/builder/spi-builder-workspace/.derivedData/ModuleCache.noindex/Session.modulevalidation -package-name spi_builder_workspace -Xcc -I/Users/admin/builder/spi-builder-workspace/.derivedData/Build/Intermediates.noindex/FluidInterfaceKit.build/Debug-appletvos/FluidPortal.build/swift-overrides.hmap -emit-const-values -Xfrontend -const-gather-protocols-file -Xfrontend /Users/admin/builder/spi-builder-workspace/.derivedData/Build/Intermediates.noindex/FluidInterfaceKit.build/Debug-appletvos/FluidPortal.build/Objects-normal/arm64/FluidPortal_const_extract_protocols.json -Xcc -I/Users/admin/builder/spi-builder-workspace/Sources/FluidRuntime/include -Xcc -I/Users/admin/builder/spi-builder-workspace/.derivedData/Build/Products/Debug-appletvos/include -Xcc -I/Users/admin/builder/spi-builder-workspace/.derivedData/Build/Intermediates.noindex/FluidInterfaceKit.build/Debug-appletvos/FluidPortal.build/DerivedSources-normal/arm64 -Xcc -I/Users/admin/builder/spi-builder-workspace/.derivedData/Build/Intermediates.noindex/FluidInterfaceKit.build/Debug-appletvos/FluidPortal.build/DerivedSources/arm64 -Xcc -I/Users/admin/builder/spi-builder-workspace/.derivedData/Build/Intermediates.noindex/FluidInterfaceKit.build/Debug-appletvos/FluidPortal.build/DerivedSources -Xcc -DSWIFT_PACKAGE -Xcc -DDEBUG\=1 -emit-objc-header -emit-objc-header-path /Users/admin/builder/spi-builder-workspace/.derivedData/Build/Intermediates.noindex/FluidInterfaceKit.build/Debug-appletvos/FluidPortal.build/Objects-normal/arm64/FluidPortal-Swift.h -working-directory /Users/admin/builder/spi-builder-workspace/.swiftpm/xcode -experimental-emit-module-separately -disable-cmo
SwiftDriver FluidCore normal arm64 com.apple.xcode.tools.swift.compiler (in target 'FluidCore' from project 'FluidInterfaceKit')
cd /Users/admin/builder/spi-builder-workspace/.swiftpm/xcode
builtin-SwiftDriver -- /Applications/Xcode-16.3.0.app/Contents/Developer/Toolchains/XcodeDefault.xctoolchain/usr/bin/swiftc -module-name FluidCore -Onone -enforce-exclusivity\=checked @/Users/admin/builder/spi-builder-workspace/.derivedData/Build/Intermediates.noindex/FluidInterfaceKit.build/Debug-appletvos/FluidCore.build/Objects-normal/arm64/FluidCore.SwiftFileList -DSWIFT_PACKAGE -DDEBUG -DXcode -plugin-path /Applications/Xcode-16.3.0.app/Contents/Developer/Toolchains/XcodeDefault.xctoolchain/usr/lib/swift/host/plugins/testing -enable-experimental-feature DebugDescriptionMacro -sdk /Applications/Xcode-16.3.0.app/Contents/Developer/Platforms/AppleTVOS.platform/Developer/SDKs/AppleTVOS18.4.sdk -target arm64-apple-tvos13.0 -g -module-cache-path /Users/admin/builder/spi-builder-workspace/.derivedData/ModuleCache.noindex -Xfrontend -serialize-debugging-options -profile-coverage-mapping -profile-generate -enable-testing -index-store-path /Users/admin/builder/spi-builder-workspace/.derivedData/Index.noindex/DataStore -swift-version 6 -I /Users/admin/builder/spi-builder-workspace/.derivedData/Build/Products/Debug-appletvos -I /Applications/Xcode-16.3.0.app/Contents/Developer/Platforms/AppleTVOS.platform/Developer/usr/lib -F /Users/admin/builder/spi-builder-workspace/.derivedData/Build/Products/Debug-appletvos -F /Applications/Xcode-16.3.0.app/Contents/Developer/Platforms/AppleTVOS.platform/Developer/Library/Frameworks -F /Applications/Xcode-16.3.0.app/Contents/Developer/Platforms/AppleTVOS.platform/Developer/SDKs/AppleTVOS18.4.sdk/Developer/Library/Frameworks -parse-as-library -c -j10 -enable-batch-mode -incremental -Xcc -ivfsstatcache -Xcc /Users/admin/builder/spi-builder-workspace/.derivedData/SDKStatCaches.noindex/appletvos18.4-22L251-271d326055c85f9856fa135c41255102.sdkstatcache -output-file-map /Users/admin/builder/spi-builder-workspace/.derivedData/Build/Intermediates.noindex/FluidInterfaceKit.build/Debug-appletvos/FluidCore.build/Objects-normal/arm64/FluidCore-OutputFileMap.json -use-frontend-parseable-output -save-temps -no-color-diagnostics -serialize-diagnostics -emit-dependencies -emit-module -emit-module-path /Users/admin/builder/spi-builder-workspace/.derivedData/Build/Intermediates.noindex/FluidInterfaceKit.build/Debug-appletvos/FluidCore.build/Objects-normal/arm64/FluidCore.swiftmodule -validate-clang-modules-once -clang-build-session-file /Users/admin/builder/spi-builder-workspace/.derivedData/ModuleCache.noindex/Session.modulevalidation -package-name spi_builder_workspace -Xcc -I/Users/admin/builder/spi-builder-workspace/.derivedData/Build/Intermediates.noindex/FluidInterfaceKit.build/Debug-appletvos/FluidCore.build/swift-overrides.hmap -emit-const-values -Xfrontend -const-gather-protocols-file -Xfrontend /Users/admin/builder/spi-builder-workspace/.derivedData/Build/Intermediates.noindex/FluidInterfaceKit.build/Debug-appletvos/FluidCore.build/Objects-normal/arm64/FluidCore_const_extract_protocols.json -Xcc -I/Users/admin/builder/spi-builder-workspace/.derivedData/Build/Products/Debug-appletvos/include -Xcc -I/Users/admin/builder/spi-builder-workspace/.derivedData/Build/Intermediates.noindex/FluidInterfaceKit.build/Debug-appletvos/FluidCore.build/DerivedSources-normal/arm64 -Xcc -I/Users/admin/builder/spi-builder-workspace/.derivedData/Build/Intermediates.noindex/FluidInterfaceKit.build/Debug-appletvos/FluidCore.build/DerivedSources/arm64 -Xcc -I/Users/admin/builder/spi-builder-workspace/.derivedData/Build/Intermediates.noindex/FluidInterfaceKit.build/Debug-appletvos/FluidCore.build/DerivedSources -Xcc -DSWIFT_PACKAGE -Xcc -DDEBUG\=1 -emit-objc-header -emit-objc-header-path /Users/admin/builder/spi-builder-workspace/.derivedData/Build/Intermediates.noindex/FluidInterfaceKit.build/Debug-appletvos/FluidCore.build/Objects-normal/arm64/FluidCore-Swift.h -working-directory /Users/admin/builder/spi-builder-workspace/.swiftpm/xcode -experimental-emit-module-separately -disable-cmo
PrecompileModule /Users/admin/builder/spi-builder-workspace/.derivedData/Build/Intermediates.noindex/ExplicitPrecompiledModules/CoreFoundation-ED2KNA7FZDVXKMXA1Y5V5OW9X.scan
cd /Users/admin/builder/spi-builder-workspace/.swiftpm/xcode
builtin-precompileModule /Users/admin/builder/spi-builder-workspace/.derivedData/Build/Intermediates.noindex/ExplicitPrecompiledModules/CoreFoundation-ED2KNA7FZDVXKMXA1Y5V5OW9X.scan
PrecompileModule /Users/admin/builder/spi-builder-workspace/.derivedData/Build/Intermediates.noindex/ExplicitPrecompiledModules/CFNetwork-2ANMPCS1KUQA1SV2QHW602N1S.scan
cd /Users/admin/builder/spi-builder-workspace/.swiftpm/xcode
builtin-precompileModule /Users/admin/builder/spi-builder-workspace/.derivedData/Build/Intermediates.noindex/ExplicitPrecompiledModules/CFNetwork-2ANMPCS1KUQA1SV2QHW602N1S.scan
PrecompileModule /Users/admin/builder/spi-builder-workspace/.derivedData/Build/Intermediates.noindex/ExplicitPrecompiledModules/Security-ANGSGWUHB5UZYOM2HH4M5HNY6.scan
cd /Users/admin/builder/spi-builder-workspace/.swiftpm/xcode
builtin-precompileModule /Users/admin/builder/spi-builder-workspace/.derivedData/Build/Intermediates.noindex/ExplicitPrecompiledModules/Security-ANGSGWUHB5UZYOM2HH4M5HNY6.scan
PrecompileModule /Users/admin/builder/spi-builder-workspace/.derivedData/Build/Intermediates.noindex/ExplicitPrecompiledModules/CoreGraphics-HE96AAITHPCC1QR7HSO7VTXV.scan
cd /Users/admin/builder/spi-builder-workspace/.swiftpm/xcode
builtin-precompileModule /Users/admin/builder/spi-builder-workspace/.derivedData/Build/Intermediates.noindex/ExplicitPrecompiledModules/CoreGraphics-HE96AAITHPCC1QR7HSO7VTXV.scan
SwiftCompile normal arm64 Compiling\ rubberBand.swift /Users/admin/builder/spi-builder-workspace/.dependencies/checkouts/swift-rubber-banding/Sources/RubberBanding/rubberBand.swift (in target 'RubberBanding' from project 'RubberBanding')
SwiftCompile normal arm64 /Users/admin/builder/spi-builder-workspace/.dependencies/checkouts/swift-rubber-banding/Sources/RubberBanding/rubberBand.swift (in target 'RubberBanding' from project 'RubberBanding')
cd /Users/admin/builder/spi-builder-workspace/.swiftpm/xcode
SwiftEmitModule normal arm64 Emitting\ module\ for\ RubberBanding (in target 'RubberBanding' from project 'RubberBanding')
SwiftCompile normal arm64 /Users/admin/builder/spi-builder-workspace/.dependencies/checkouts/swift-rubber-banding/Sources/RubberBanding/rubberBand.swift (in target 'RubberBanding' from project 'RubberBanding')
cd /Users/admin/builder/spi-builder-workspace/.swiftpm/xcode
SwiftEmitModule normal arm64 Emitting\ module\ for\ ResultBuilderKit (in target 'ResultBuilderKit' from project 'ResultBuilderKit')
SwiftCompile normal arm64 /Users/admin/builder/spi-builder-workspace/.dependencies/checkouts/ResultBuilderKit/Sources/ResultBuilderKit/ArrayBuilder.swift (in target 'ResultBuilderKit' from project 'ResultBuilderKit')
cd /Users/admin/builder/spi-builder-workspace/.swiftpm/xcode
SwiftEmitModule normal arm64 Emitting\ module\ for\ GeometryKit (in target 'GeometryKit' from project 'GeometryKit')
SwiftCompile normal arm64 /Users/admin/builder/spi-builder-workspace/.dependencies/checkouts/GeometryKit/Sources/GeometryKit.swift (in target 'GeometryKit' from project 'GeometryKit')
cd /Users/admin/builder/spi-builder-workspace/.swiftpm/xcode
SwiftEmitModule normal arm64 Emitting\ module\ for\ FluidCore (in target 'FluidCore' from project 'FluidInterfaceKit')
SwiftCompile normal arm64 /Users/admin/builder/spi-builder-workspace/Sources/FluidCore/SafeAreaFinder.swift (in target 'FluidCore' from project 'FluidInterfaceKit')
cd /Users/admin/builder/spi-builder-workspace/.swiftpm/xcode
PrecompileModule /Users/admin/builder/spi-builder-workspace/.derivedData/Build/Intermediates.noindex/ExplicitPrecompiledModules/Foundation-AQ3S8FKU9R2PE4KUXTWHA40B7.scan
cd /Users/admin/builder/spi-builder-workspace/.swiftpm/xcode
builtin-precompileModule /Users/admin/builder/spi-builder-workspace/.derivedData/Build/Intermediates.noindex/ExplicitPrecompiledModules/Foundation-AQ3S8FKU9R2PE4KUXTWHA40B7.scan
SwiftCompile normal arm64 Compiling\ ArrayBuilder.swift /Users/admin/builder/spi-builder-workspace/.dependencies/checkouts/ResultBuilderKit/Sources/ResultBuilderKit/ArrayBuilder.swift (in target 'ResultBuilderKit' from project 'ResultBuilderKit')
SwiftCompile normal arm64 /Users/admin/builder/spi-builder-workspace/.dependencies/checkouts/ResultBuilderKit/Sources/ResultBuilderKit/ArrayBuilder.swift (in target 'ResultBuilderKit' from project 'ResultBuilderKit')
cd /Users/admin/builder/spi-builder-workspace/.swiftpm/xcode
SwiftCompile normal arm64 Compiling\ GeometryKit.swift /Users/admin/builder/spi-builder-workspace/.dependencies/checkouts/GeometryKit/Sources/GeometryKit.swift (in target 'GeometryKit' from project 'GeometryKit')
SwiftCompile normal arm64 /Users/admin/builder/spi-builder-workspace/.dependencies/checkouts/GeometryKit/Sources/GeometryKit.swift (in target 'GeometryKit' from project 'GeometryKit')
cd /Users/admin/builder/spi-builder-workspace/.swiftpm/xcode
SwiftEmitModule normal arm64 Emitting\ module\ for\ SwiftUIHosting (in target 'SwiftUIHosting' from project 'swiftui-hosting')
EmitSwiftModule normal arm64 (in target 'SwiftUIHosting' from project 'swiftui-hosting')
cd /Users/admin/builder/spi-builder-workspace/.swiftpm/xcode
SwiftEmitModule normal arm64 Emitting\ module\ for\ Rideau (in target 'Rideau' from project 'Rideau')
EmitSwiftModule normal arm64 (in target 'Rideau' from project 'Rideau')
cd /Users/admin/builder/spi-builder-workspace/.swiftpm/xcode
SwiftEmitModule normal arm64 Emitting\ module\ for\ FluidPortal (in target 'FluidPortal' from project 'FluidInterfaceKit')
EmitSwiftModule normal arm64 (in target 'FluidPortal' from project 'FluidInterfaceKit')
cd /Users/admin/builder/spi-builder-workspace/.swiftpm/xcode
SwiftDriverJobDiscovery normal arm64 Emitting module for RubberBanding (in target 'RubberBanding' from project 'RubberBanding')
SwiftDriver\ Compilation\ Requirements RubberBanding normal arm64 com.apple.xcode.tools.swift.compiler (in target 'RubberBanding' from project 'RubberBanding')
cd /Users/admin/builder/spi-builder-workspace/.swiftpm/xcode
builtin-Swift-Compilation-Requirements -- /Applications/Xcode-16.3.0.app/Contents/Developer/Toolchains/XcodeDefault.xctoolchain/usr/bin/swiftc -module-name RubberBanding -Onone -enforce-exclusivity\=checked @/Users/admin/builder/spi-builder-workspace/.derivedData/Build/Intermediates.noindex/RubberBanding.build/Debug-appletvos/RubberBanding.build/Objects-normal/arm64/RubberBanding.SwiftFileList -DSWIFT_PACKAGE -DDEBUG -DXcode -plugin-path /Applications/Xcode-16.3.0.app/Contents/Developer/Toolchains/XcodeDefault.xctoolchain/usr/lib/swift/host/plugins/testing -enable-experimental-feature DebugDescriptionMacro -sdk /Applications/Xcode-16.3.0.app/Contents/Developer/Platforms/AppleTVOS.platform/Developer/SDKs/AppleTVOS18.4.sdk -target arm64-apple-tvos12.0 -g -module-cache-path /Users/admin/builder/spi-builder-workspace/.derivedData/ModuleCache.noindex -Xfrontend -serialize-debugging-options -profile-coverage-mapping -profile-generate -enable-testing -suppress-warnings -index-store-path /Users/admin/builder/spi-builder-workspace/.derivedData/Index.noindex/DataStore -swift-version 5 -I /Users/admin/builder/spi-builder-workspace/.derivedData/Build/Products/Debug-appletvos -I /Applications/Xcode-16.3.0.app/Contents/Developer/Platforms/AppleTVOS.platform/Developer/usr/lib -F /Users/admin/builder/spi-builder-workspace/.derivedData/Build/Products/Debug-appletvos -F /Applications/Xcode-16.3.0.app/Contents/Developer/Platforms/AppleTVOS.platform/Developer/Library/Frameworks -F /Applications/Xcode-16.3.0.app/Contents/Developer/Platforms/AppleTVOS.platform/Developer/SDKs/AppleTVOS18.4.sdk/Developer/Library/Frameworks -parse-as-library -c -j10 -enable-batch-mode -incremental -Xcc -ivfsstatcache -Xcc /Users/admin/builder/spi-builder-workspace/.derivedData/SDKStatCaches.noindex/appletvos18.4-22L251-271d326055c85f9856fa135c41255102.sdkstatcache -output-file-map /Users/admin/builder/spi-builder-workspace/.derivedData/Build/Intermediates.noindex/RubberBanding.build/Debug-appletvos/RubberBanding.build/Objects-normal/arm64/RubberBanding-OutputFileMap.json -use-frontend-parseable-output -save-temps -no-color-diagnostics -serialize-diagnostics -emit-dependencies -emit-module -emit-module-path /Users/admin/builder/spi-builder-workspace/.derivedData/Build/Intermediates.noindex/RubberBanding.build/Debug-appletvos/RubberBanding.build/Objects-normal/arm64/RubberBanding.swiftmodule -validate-clang-modules-once -clang-build-session-file /Users/admin/builder/spi-builder-workspace/.derivedData/ModuleCache.noindex/Session.modulevalidation -package-name swift_rubber_banding -Xcc -I/Users/admin/builder/spi-builder-workspace/.derivedData/Build/Intermediates.noindex/RubberBanding.build/Debug-appletvos/RubberBanding.build/swift-overrides.hmap -emit-const-values -Xfrontend -const-gather-protocols-file -Xfrontend /Users/admin/builder/spi-builder-workspace/.derivedData/Build/Intermediates.noindex/RubberBanding.build/Debug-appletvos/RubberBanding.build/Objects-normal/arm64/RubberBanding_const_extract_protocols.json -Xcc -I/Users/admin/builder/spi-builder-workspace/.derivedData/Build/Products/Debug-appletvos/include -Xcc -I/Users/admin/builder/spi-builder-workspace/.derivedData/Build/Intermediates.noindex/RubberBanding.build/Debug-appletvos/RubberBanding.build/DerivedSources-normal/arm64 -Xcc -I/Users/admin/builder/spi-builder-workspace/.derivedData/Build/Intermediates.noindex/RubberBanding.build/Debug-appletvos/RubberBanding.build/DerivedSources/arm64 -Xcc -I/Users/admin/builder/spi-builder-workspace/.derivedData/Build/Intermediates.noindex/RubberBanding.build/Debug-appletvos/RubberBanding.build/DerivedSources -Xcc -DSWIFT_PACKAGE -Xcc -DDEBUG\=1 -emit-objc-header -emit-objc-header-path /Users/admin/builder/spi-builder-workspace/.derivedData/Build/Intermediates.noindex/RubberBanding.build/Debug-appletvos/RubberBanding.build/Objects-normal/arm64/RubberBanding-Swift.h -working-directory /Users/admin/builder/spi-builder-workspace/.swiftpm/xcode -experimental-emit-module-separately -disable-cmo
SwiftDriverJobDiscovery normal arm64 Emitting module for ResultBuilderKit (in target 'ResultBuilderKit' from project 'ResultBuilderKit')
SwiftEmitModule normal arm64 Emitting\ module\ for\ FluidKeyboardSupport (in target 'FluidKeyboardSupport' from project 'FluidInterfaceKit')
EmitSwiftModule normal arm64 (in target 'FluidKeyboardSupport' from project 'FluidInterfaceKit')
cd /Users/admin/builder/spi-builder-workspace/.swiftpm/xcode
Copy /Users/admin/builder/spi-builder-workspace/.derivedData/Build/Products/Debug-appletvos/RubberBanding.swiftmodule/arm64-apple-tvos.abi.json /Users/admin/builder/spi-builder-workspace/.derivedData/Build/Intermediates.noindex/RubberBanding.build/Debug-appletvos/RubberBanding.build/Objects-normal/arm64/RubberBanding.abi.json (in target 'RubberBanding' from project 'RubberBanding')
cd /Users/admin/builder/spi-builder-workspace/.dependencies/checkouts/swift-rubber-banding
builtin-copy -exclude .DS_Store -exclude CVS -exclude .svn -exclude .git -exclude .hg -resolve-src-symlinks -rename /Users/admin/builder/spi-builder-workspace/.derivedData/Build/Intermediates.noindex/RubberBanding.build/Debug-appletvos/RubberBanding.build/Objects-normal/arm64/RubberBanding.abi.json /Users/admin/builder/spi-builder-workspace/.derivedData/Build/Products/Debug-appletvos/RubberBanding.swiftmodule/arm64-apple-tvos.abi.json
SwiftDriverJobDiscovery normal arm64 Compiling ArrayBuilder.swift (in target 'ResultBuilderKit' from project 'ResultBuilderKit')
SwiftDriver\ Compilation\ Requirements ResultBuilderKit normal arm64 com.apple.xcode.tools.swift.compiler (in target 'ResultBuilderKit' from project 'ResultBuilderKit')
cd /Users/admin/builder/spi-builder-workspace/.swiftpm/xcode
builtin-Swift-Compilation-Requirements -- /Applications/Xcode-16.3.0.app/Contents/Developer/Toolchains/XcodeDefault.xctoolchain/usr/bin/swiftc -module-name ResultBuilderKit -Onone -enforce-exclusivity\=checked @/Users/admin/builder/spi-builder-workspace/.derivedData/Build/Intermediates.noindex/ResultBuilderKit.build/Debug-appletvos/ResultBuilderKit.build/Objects-normal/arm64/ResultBuilderKit.SwiftFileList -DSWIFT_PACKAGE -DDEBUG -DXcode -plugin-path /Applications/Xcode-16.3.0.app/Contents/Developer/Toolchains/XcodeDefault.xctoolchain/usr/lib/swift/host/plugins/testing -enable-experimental-feature DebugDescriptionMacro -sdk /Applications/Xcode-16.3.0.app/Contents/Developer/Platforms/AppleTVOS.platform/Developer/SDKs/AppleTVOS18.4.sdk -target arm64-apple-tvos12.0 -g -module-cache-path /Users/admin/builder/spi-builder-workspace/.derivedData/ModuleCache.noindex -Xfrontend -serialize-debugging-options -profile-coverage-mapping -profile-generate -enable-testing -suppress-warnings -index-store-path /Users/admin/builder/spi-builder-workspace/.derivedData/Index.noindex/DataStore -swift-version 5 -I /Users/admin/builder/spi-builder-workspace/.derivedData/Build/Products/Debug-appletvos -I /Applications/Xcode-16.3.0.app/Contents/Developer/Platforms/AppleTVOS.platform/Developer/usr/lib -F /Users/admin/builder/spi-builder-workspace/.derivedData/Build/Products/Debug-appletvos -F /Applications/Xcode-16.3.0.app/Contents/Developer/Platforms/AppleTVOS.platform/Developer/Library/Frameworks -F /Applications/Xcode-16.3.0.app/Contents/Developer/Platforms/AppleTVOS.platform/Developer/SDKs/AppleTVOS18.4.sdk/Developer/Library/Frameworks -parse-as-library -c -j10 -enable-batch-mode -incremental -Xcc -ivfsstatcache -Xcc /Users/admin/builder/spi-builder-workspace/.derivedData/SDKStatCaches.noindex/appletvos18.4-22L251-271d326055c85f9856fa135c41255102.sdkstatcache -output-file-map /Users/admin/builder/spi-builder-workspace/.derivedData/Build/Intermediates.noindex/ResultBuilderKit.build/Debug-appletvos/ResultBuilderKit.build/Objects-normal/arm64/ResultBuilderKit-OutputFileMap.json -use-frontend-parseable-output -save-temps -no-color-diagnostics -serialize-diagnostics -emit-dependencies -emit-module -emit-module-path /Users/admin/builder/spi-builder-workspace/.derivedData/Build/Intermediates.noindex/ResultBuilderKit.build/Debug-appletvos/ResultBuilderKit.build/Objects-normal/arm64/ResultBuilderKit.swiftmodule -validate-clang-modules-once -clang-build-session-file /Users/admin/builder/spi-builder-workspace/.derivedData/ModuleCache.noindex/Session.modulevalidation -Xcc -I/Users/admin/builder/spi-builder-workspace/.derivedData/Build/Intermediates.noindex/ResultBuilderKit.build/Debug-appletvos/ResultBuilderKit.build/swift-overrides.hmap -emit-const-values -Xfrontend -const-gather-protocols-file -Xfrontend /Users/admin/builder/spi-builder-workspace/.derivedData/Build/Intermediates.noindex/ResultBuilderKit.build/Debug-appletvos/ResultBuilderKit.build/Objects-normal/arm64/ResultBuilderKit_const_extract_protocols.json -Xcc -I/Users/admin/builder/spi-builder-workspace/.derivedData/Build/Products/Debug-appletvos/include -Xcc -I/Users/admin/builder/spi-builder-workspace/.derivedData/Build/Intermediates.noindex/ResultBuilderKit.build/Debug-appletvos/ResultBuilderKit.build/DerivedSources-normal/arm64 -Xcc -I/Users/admin/builder/spi-builder-workspace/.derivedData/Build/Intermediates.noindex/ResultBuilderKit.build/Debug-appletvos/ResultBuilderKit.build/DerivedSources/arm64 -Xcc -I/Users/admin/builder/spi-builder-workspace/.derivedData/Build/Intermediates.noindex/ResultBuilderKit.build/Debug-appletvos/ResultBuilderKit.build/DerivedSources -Xcc -DSWIFT_PACKAGE -Xcc -DDEBUG\=1 -emit-objc-header -emit-objc-header-path /Users/admin/builder/spi-builder-workspace/.derivedData/Build/Intermediates.noindex/ResultBuilderKit.build/Debug-appletvos/ResultBuilderKit.build/Objects-normal/arm64/ResultBuilderKit-Swift.h -working-directory /Users/admin/builder/spi-builder-workspace/.swiftpm/xcode -experimental-emit-module-separately -disable-cmo
SwiftDriverJobDiscovery normal arm64 Compiling rubberBand.swift (in target 'RubberBanding' from project 'RubberBanding')
PrecompileModule /Users/admin/builder/spi-builder-workspace/.derivedData/Build/Intermediates.noindex/ExplicitPrecompiledModules/ImageIO-8EMY7QNPAKKQVNE33DGKNTD26.scan
cd /Users/admin/builder/spi-builder-workspace/.swiftpm/xcode
builtin-precompileModule /Users/admin/builder/spi-builder-workspace/.derivedData/Build/Intermediates.noindex/ExplicitPrecompiledModules/ImageIO-8EMY7QNPAKKQVNE33DGKNTD26.scan
PrecompileModule /Users/admin/builder/spi-builder-workspace/.derivedData/Build/Intermediates.noindex/ExplicitPrecompiledModules/CoreText-9PCZ4OUZ7A7STHVFDQGS5FBAF.scan
cd /Users/admin/builder/spi-builder-workspace/.swiftpm/xcode
builtin-precompileModule /Users/admin/builder/spi-builder-workspace/.derivedData/Build/Intermediates.noindex/ExplicitPrecompiledModules/CoreText-9PCZ4OUZ7A7STHVFDQGS5FBAF.scan
Copy /Users/admin/builder/spi-builder-workspace/.derivedData/Build/Products/Debug-appletvos/ResultBuilderKit.swiftmodule/arm64-apple-tvos.abi.json /Users/admin/builder/spi-builder-workspace/.derivedData/Build/Intermediates.noindex/ResultBuilderKit.build/Debug-appletvos/ResultBuilderKit.build/Objects-normal/arm64/ResultBuilderKit.abi.json (in target 'ResultBuilderKit' from project 'ResultBuilderKit')
cd /Users/admin/builder/spi-builder-workspace/.dependencies/checkouts/ResultBuilderKit
builtin-copy -exclude .DS_Store -exclude CVS -exclude .svn -exclude .git -exclude .hg -resolve-src-symlinks -rename /Users/admin/builder/spi-builder-workspace/.derivedData/Build/Intermediates.noindex/ResultBuilderKit.build/Debug-appletvos/ResultBuilderKit.build/Objects-normal/arm64/ResultBuilderKit.abi.json /Users/admin/builder/spi-builder-workspace/.derivedData/Build/Products/Debug-appletvos/ResultBuilderKit.swiftmodule/arm64-apple-tvos.abi.json
SwiftDriverJobDiscovery normal arm64 Emitting module for GeometryKit (in target 'GeometryKit' from project 'GeometryKit')
SwiftDriver\ Compilation\ Requirements GeometryKit normal arm64 com.apple.xcode.tools.swift.compiler (in target 'GeometryKit' from project 'GeometryKit')
cd /Users/admin/builder/spi-builder-workspace/.swiftpm/xcode
builtin-Swift-Compilation-Requirements -- /Applications/Xcode-16.3.0.app/Contents/Developer/Toolchains/XcodeDefault.xctoolchain/usr/bin/swiftc -module-name GeometryKit -Onone -enforce-exclusivity\=checked @/Users/admin/builder/spi-builder-workspace/.derivedData/Build/Intermediates.noindex/GeometryKit.build/Debug-appletvos/GeometryKit.build/Objects-normal/arm64/GeometryKit.SwiftFileList -DSWIFT_PACKAGE -DDEBUG -DXcode -plugin-path /Applications/Xcode-16.3.0.app/Contents/Developer/Toolchains/XcodeDefault.xctoolchain/usr/lib/swift/host/plugins/testing -enable-experimental-feature DebugDescriptionMacro -sdk /Applications/Xcode-16.3.0.app/Contents/Developer/Platforms/AppleTVOS.platform/Developer/SDKs/AppleTVOS18.4.sdk -target arm64-apple-tvos12.0 -g -module-cache-path /Users/admin/builder/spi-builder-workspace/.derivedData/ModuleCache.noindex -Xfrontend -serialize-debugging-options -profile-coverage-mapping -profile-generate -enable-testing -suppress-warnings -index-store-path /Users/admin/builder/spi-builder-workspace/.derivedData/Index.noindex/DataStore -swift-version 5 -I /Users/admin/builder/spi-builder-workspace/.derivedData/Build/Products/Debug-appletvos -I /Applications/Xcode-16.3.0.app/Contents/Developer/Platforms/AppleTVOS.platform/Developer/usr/lib -F /Users/admin/builder/spi-builder-workspace/.derivedData/Build/Products/Debug-appletvos -F /Applications/Xcode-16.3.0.app/Contents/Developer/Platforms/AppleTVOS.platform/Developer/Library/Frameworks -F /Applications/Xcode-16.3.0.app/Contents/Developer/Platforms/AppleTVOS.platform/Developer/SDKs/AppleTVOS18.4.sdk/Developer/Library/Frameworks -parse-as-library -c -j10 -enable-batch-mode -incremental -Xcc -ivfsstatcache -Xcc /Users/admin/builder/spi-builder-workspace/.derivedData/SDKStatCaches.noindex/appletvos18.4-22L251-271d326055c85f9856fa135c41255102.sdkstatcache -output-file-map /Users/admin/builder/spi-builder-workspace/.derivedData/Build/Intermediates.noindex/GeometryKit.build/Debug-appletvos/GeometryKit.build/Objects-normal/arm64/GeometryKit-OutputFileMap.json -use-frontend-parseable-output -save-temps -no-color-diagnostics -serialize-diagnostics -emit-dependencies -emit-module -emit-module-path /Users/admin/builder/spi-builder-workspace/.derivedData/Build/Intermediates.noindex/GeometryKit.build/Debug-appletvos/GeometryKit.build/Objects-normal/arm64/GeometryKit.swiftmodule -validate-clang-modules-once -clang-build-session-file /Users/admin/builder/spi-builder-workspace/.derivedData/ModuleCache.noindex/Session.modulevalidation -Xcc -I/Users/admin/builder/spi-builder-workspace/.derivedData/Build/Intermediates.noindex/GeometryKit.build/Debug-appletvos/GeometryKit.build/swift-overrides.hmap -emit-const-values -Xfrontend -const-gather-protocols-file -Xfrontend /Users/admin/builder/spi-builder-workspace/.derivedData/Build/Intermediates.noindex/GeometryKit.build/Debug-appletvos/GeometryKit.build/Objects-normal/arm64/GeometryKit_const_extract_protocols.json -Xcc -I/Users/admin/builder/spi-builder-workspace/.derivedData/Build/Products/Debug-appletvos/include -Xcc -I/Users/admin/builder/spi-builder-workspace/.derivedData/Build/Intermediates.noindex/GeometryKit.build/Debug-appletvos/GeometryKit.build/DerivedSources-normal/arm64 -Xcc -I/Users/admin/builder/spi-builder-workspace/.derivedData/Build/Intermediates.noindex/GeometryKit.build/Debug-appletvos/GeometryKit.build/DerivedSources/arm64 -Xcc -I/Users/admin/builder/spi-builder-workspace/.derivedData/Build/Intermediates.noindex/GeometryKit.build/Debug-appletvos/GeometryKit.build/DerivedSources -Xcc -DSWIFT_PACKAGE -Xcc -DDEBUG\=1 -emit-objc-header -emit-objc-header-path /Users/admin/builder/spi-builder-workspace/.derivedData/Build/Intermediates.noindex/GeometryKit.build/Debug-appletvos/GeometryKit.build/Objects-normal/arm64/GeometryKit-Swift.h -working-directory /Users/admin/builder/spi-builder-workspace/.swiftpm/xcode -experimental-emit-module-separately -disable-cmo
SwiftCompile normal arm64 Compiling\ UIResponder+.swift /Users/admin/builder/spi-builder-workspace/.dependencies/checkouts/swiftui-Hosting/Sources/SwiftUIHosting/UIResponder+.swift (in target 'SwiftUIHosting' from project 'swiftui-hosting')
SwiftCompile normal arm64 /Users/admin/builder/spi-builder-workspace/.dependencies/checkouts/swiftui-Hosting/Sources/SwiftUIHosting/UIResponder+.swift (in target 'SwiftUIHosting' from project 'swiftui-hosting')
cd /Users/admin/builder/spi-builder-workspace/.swiftpm/xcode
Copy /Users/admin/builder/spi-builder-workspace/.derivedData/Build/Products/Debug-appletvos/GeometryKit.swiftmodule/arm64-apple-tvos.abi.json /Users/admin/builder/spi-builder-workspace/.derivedData/Build/Intermediates.noindex/GeometryKit.build/Debug-appletvos/GeometryKit.build/Objects-normal/arm64/GeometryKit.abi.json (in target 'GeometryKit' from project 'GeometryKit')
cd /Users/admin/builder/spi-builder-workspace/.dependencies/checkouts/GeometryKit
builtin-copy -exclude .DS_Store -exclude CVS -exclude .svn -exclude .git -exclude .hg -resolve-src-symlinks -rename /Users/admin/builder/spi-builder-workspace/.derivedData/Build/Intermediates.noindex/GeometryKit.build/Debug-appletvos/GeometryKit.build/Objects-normal/arm64/GeometryKit.abi.json /Users/admin/builder/spi-builder-workspace/.derivedData/Build/Products/Debug-appletvos/GeometryKit.swiftmodule/arm64-apple-tvos.abi.json
SwiftCompile normal arm64 Compiling\ HostingController.swift /Users/admin/builder/spi-builder-workspace/.dependencies/checkouts/swiftui-Hosting/Sources/SwiftUIHosting/HostingController.swift (in target 'SwiftUIHosting' from project 'swiftui-hosting')
SwiftCompile normal arm64 /Users/admin/builder/spi-builder-workspace/.dependencies/checkouts/swiftui-Hosting/Sources/SwiftUIHosting/HostingController.swift (in target 'SwiftUIHosting' from project 'swiftui-hosting')
cd /Users/admin/builder/spi-builder-workspace/.swiftpm/xcode
SwiftCompile normal arm64 Compiling\ BaseModifier.swift /Users/admin/builder/spi-builder-workspace/.dependencies/checkouts/swiftui-Hosting/Sources/SwiftUIHosting/BaseModifier.swift (in target 'SwiftUIHosting' from project 'swiftui-hosting')
SwiftCompile normal arm64 /Users/admin/builder/spi-builder-workspace/.dependencies/checkouts/swiftui-Hosting/Sources/SwiftUIHosting/BaseModifier.swift (in target 'SwiftUIHosting' from project 'swiftui-hosting')
cd /Users/admin/builder/spi-builder-workspace/.swiftpm/xcode
SwiftCompile normal arm64 Compiling\ SwiftUIHostingView.swift /Users/admin/builder/spi-builder-workspace/.dependencies/checkouts/swiftui-Hosting/Sources/SwiftUIHosting/SwiftUIHostingView.swift (in target 'SwiftUIHosting' from project 'swiftui-hosting')
SwiftCompile normal arm64 /Users/admin/builder/spi-builder-workspace/.dependencies/checkouts/swiftui-Hosting/Sources/SwiftUIHosting/SwiftUIHostingView.swift (in target 'SwiftUIHosting' from project 'swiftui-hosting')
cd /Users/admin/builder/spi-builder-workspace/.swiftpm/xcode
SwiftDriverJobDiscovery normal arm64 Emitting module for FluidCore (in target 'FluidCore' from project 'FluidInterfaceKit')
SwiftDriver\ Compilation\ Requirements FluidCore normal arm64 com.apple.xcode.tools.swift.compiler (in target 'FluidCore' from project 'FluidInterfaceKit')
cd /Users/admin/builder/spi-builder-workspace/.swiftpm/xcode
builtin-Swift-Compilation-Requirements -- /Applications/Xcode-16.3.0.app/Contents/Developer/Toolchains/XcodeDefault.xctoolchain/usr/bin/swiftc -module-name FluidCore -Onone -enforce-exclusivity\=checked @/Users/admin/builder/spi-builder-workspace/.derivedData/Build/Intermediates.noindex/FluidInterfaceKit.build/Debug-appletvos/FluidCore.build/Objects-normal/arm64/FluidCore.SwiftFileList -DSWIFT_PACKAGE -DDEBUG -DXcode -plugin-path /Applications/Xcode-16.3.0.app/Contents/Developer/Toolchains/XcodeDefault.xctoolchain/usr/lib/swift/host/plugins/testing -enable-experimental-feature DebugDescriptionMacro -sdk /Applications/Xcode-16.3.0.app/Contents/Developer/Platforms/AppleTVOS.platform/Developer/SDKs/AppleTVOS18.4.sdk -target arm64-apple-tvos13.0 -g -module-cache-path /Users/admin/builder/spi-builder-workspace/.derivedData/ModuleCache.noindex -Xfrontend -serialize-debugging-options -profile-coverage-mapping -profile-generate -enable-testing -index-store-path /Users/admin/builder/spi-builder-workspace/.derivedData/Index.noindex/DataStore -swift-version 6 -I /Users/admin/builder/spi-builder-workspace/.derivedData/Build/Products/Debug-appletvos -I /Applications/Xcode-16.3.0.app/Contents/Developer/Platforms/AppleTVOS.platform/Developer/usr/lib -F /Users/admin/builder/spi-builder-workspace/.derivedData/Build/Products/Debug-appletvos -F /Applications/Xcode-16.3.0.app/Contents/Developer/Platforms/AppleTVOS.platform/Developer/Library/Frameworks -F /Applications/Xcode-16.3.0.app/Contents/Developer/Platforms/AppleTVOS.platform/Developer/SDKs/AppleTVOS18.4.sdk/Developer/Library/Frameworks -parse-as-library -c -j10 -enable-batch-mode -incremental -Xcc -ivfsstatcache -Xcc /Users/admin/builder/spi-builder-workspace/.derivedData/SDKStatCaches.noindex/appletvos18.4-22L251-271d326055c85f9856fa135c41255102.sdkstatcache -output-file-map /Users/admin/builder/spi-builder-workspace/.derivedData/Build/Intermediates.noindex/FluidInterfaceKit.build/Debug-appletvos/FluidCore.build/Objects-normal/arm64/FluidCore-OutputFileMap.json -use-frontend-parseable-output -save-temps -no-color-diagnostics -serialize-diagnostics -emit-dependencies -emit-module -emit-module-path /Users/admin/builder/spi-builder-workspace/.derivedData/Build/Intermediates.noindex/FluidInterfaceKit.build/Debug-appletvos/FluidCore.build/Objects-normal/arm64/FluidCore.swiftmodule -validate-clang-modules-once -clang-build-session-file /Users/admin/builder/spi-builder-workspace/.derivedData/ModuleCache.noindex/Session.modulevalidation -package-name spi_builder_workspace -Xcc -I/Users/admin/builder/spi-builder-workspace/.derivedData/Build/Intermediates.noindex/FluidInterfaceKit.build/Debug-appletvos/FluidCore.build/swift-overrides.hmap -emit-const-values -Xfrontend -const-gather-protocols-file -Xfrontend /Users/admin/builder/spi-builder-workspace/.derivedData/Build/Intermediates.noindex/FluidInterfaceKit.build/Debug-appletvos/FluidCore.build/Objects-normal/arm64/FluidCore_const_extract_protocols.json -Xcc -I/Users/admin/builder/spi-builder-workspace/.derivedData/Build/Products/Debug-appletvos/include -Xcc -I/Users/admin/builder/spi-builder-workspace/.derivedData/Build/Intermediates.noindex/FluidInterfaceKit.build/Debug-appletvos/FluidCore.build/DerivedSources-normal/arm64 -Xcc -I/Users/admin/builder/spi-builder-workspace/.derivedData/Build/Intermediates.noindex/FluidInterfaceKit.build/Debug-appletvos/FluidCore.build/DerivedSources/arm64 -Xcc -I/Users/admin/builder/spi-builder-workspace/.derivedData/Build/Intermediates.noindex/FluidInterfaceKit.build/Debug-appletvos/FluidCore.build/DerivedSources -Xcc -DSWIFT_PACKAGE -Xcc -DDEBUG\=1 -emit-objc-header -emit-objc-header-path /Users/admin/builder/spi-builder-workspace/.derivedData/Build/Intermediates.noindex/FluidInterfaceKit.build/Debug-appletvos/FluidCore.build/Objects-normal/arm64/FluidCore-Swift.h -working-directory /Users/admin/builder/spi-builder-workspace/.swiftpm/xcode -experimental-emit-module-separately -disable-cmo
SwiftDriverJobDiscovery normal arm64 Compiling GeometryKit.swift (in target 'GeometryKit' from project 'GeometryKit')
SwiftCompile normal arm64 Compiling\ SwiftUIHostingViewController.swift /Users/admin/builder/spi-builder-workspace/.dependencies/checkouts/swiftui-Hosting/Sources/SwiftUIHosting/SwiftUIHostingViewController.swift (in target 'SwiftUIHosting' from project 'swiftui-hosting')
SwiftCompile normal arm64 /Users/admin/builder/spi-builder-workspace/.dependencies/checkouts/swiftui-Hosting/Sources/SwiftUIHosting/SwiftUIHostingViewController.swift (in target 'SwiftUIHosting' from project 'swiftui-hosting')
cd /Users/admin/builder/spi-builder-workspace/.swiftpm/xcode
Copy /Users/admin/builder/spi-builder-workspace/.derivedData/Build/Products/Debug-appletvos/FluidCore.swiftmodule/arm64-apple-tvos.abi.json /Users/admin/builder/spi-builder-workspace/.derivedData/Build/Intermediates.noindex/FluidInterfaceKit.build/Debug-appletvos/FluidCore.build/Objects-normal/arm64/FluidCore.abi.json (in target 'FluidCore' from project 'FluidInterfaceKit')
cd /Users/admin/builder/spi-builder-workspace
builtin-copy -exclude .DS_Store -exclude CVS -exclude .svn -exclude .git -exclude .hg -resolve-src-symlinks -rename /Users/admin/builder/spi-builder-workspace/.derivedData/Build/Intermediates.noindex/FluidInterfaceKit.build/Debug-appletvos/FluidCore.build/Objects-normal/arm64/FluidCore.abi.json /Users/admin/builder/spi-builder-workspace/.derivedData/Build/Products/Debug-appletvos/FluidCore.swiftmodule/arm64-apple-tvos.abi.json
SwiftDriver\ Compilation RubberBanding normal arm64 com.apple.xcode.tools.swift.compiler (in target 'RubberBanding' from project 'RubberBanding')
cd /Users/admin/builder/spi-builder-workspace/.swiftpm/xcode
builtin-Swift-Compilation -- /Applications/Xcode-16.3.0.app/Contents/Developer/Toolchains/XcodeDefault.xctoolchain/usr/bin/swiftc -module-name RubberBanding -Onone -enforce-exclusivity\=checked @/Users/admin/builder/spi-builder-workspace/.derivedData/Build/Intermediates.noindex/RubberBanding.build/Debug-appletvos/RubberBanding.build/Objects-normal/arm64/RubberBanding.SwiftFileList -DSWIFT_PACKAGE -DDEBUG -DXcode -plugin-path /Applications/Xcode-16.3.0.app/Contents/Developer/Toolchains/XcodeDefault.xctoolchain/usr/lib/swift/host/plugins/testing -enable-experimental-feature DebugDescriptionMacro -sdk /Applications/Xcode-16.3.0.app/Contents/Developer/Platforms/AppleTVOS.platform/Developer/SDKs/AppleTVOS18.4.sdk -target arm64-apple-tvos12.0 -g -module-cache-path /Users/admin/builder/spi-builder-workspace/.derivedData/ModuleCache.noindex -Xfrontend -serialize-debugging-options -profile-coverage-mapping -profile-generate -enable-testing -suppress-warnings -index-store-path /Users/admin/builder/spi-builder-workspace/.derivedData/Index.noindex/DataStore -swift-version 5 -I /Users/admin/builder/spi-builder-workspace/.derivedData/Build/Products/Debug-appletvos -I /Applications/Xcode-16.3.0.app/Contents/Developer/Platforms/AppleTVOS.platform/Developer/usr/lib -F /Users/admin/builder/spi-builder-workspace/.derivedData/Build/Products/Debug-appletvos -F /Applications/Xcode-16.3.0.app/Contents/Developer/Platforms/AppleTVOS.platform/Developer/Library/Frameworks -F /Applications/Xcode-16.3.0.app/Contents/Developer/Platforms/AppleTVOS.platform/Developer/SDKs/AppleTVOS18.4.sdk/Developer/Library/Frameworks -parse-as-library -c -j10 -enable-batch-mode -incremental -Xcc -ivfsstatcache -Xcc /Users/admin/builder/spi-builder-workspace/.derivedData/SDKStatCaches.noindex/appletvos18.4-22L251-271d326055c85f9856fa135c41255102.sdkstatcache -output-file-map /Users/admin/builder/spi-builder-workspace/.derivedData/Build/Intermediates.noindex/RubberBanding.build/Debug-appletvos/RubberBanding.build/Objects-normal/arm64/RubberBanding-OutputFileMap.json -use-frontend-parseable-output -save-temps -no-color-diagnostics -serialize-diagnostics -emit-dependencies -emit-module -emit-module-path /Users/admin/builder/spi-builder-workspace/.derivedData/Build/Intermediates.noindex/RubberBanding.build/Debug-appletvos/RubberBanding.build/Objects-normal/arm64/RubberBanding.swiftmodule -validate-clang-modules-once -clang-build-session-file /Users/admin/builder/spi-builder-workspace/.derivedData/ModuleCache.noindex/Session.modulevalidation -package-name swift_rubber_banding -Xcc -I/Users/admin/builder/spi-builder-workspace/.derivedData/Build/Intermediates.noindex/RubberBanding.build/Debug-appletvos/RubberBanding.build/swift-overrides.hmap -emit-const-values -Xfrontend -const-gather-protocols-file -Xfrontend /Users/admin/builder/spi-builder-workspace/.derivedData/Build/Intermediates.noindex/RubberBanding.build/Debug-appletvos/RubberBanding.build/Objects-normal/arm64/RubberBanding_const_extract_protocols.json -Xcc -I/Users/admin/builder/spi-builder-workspace/.derivedData/Build/Products/Debug-appletvos/include -Xcc -I/Users/admin/builder/spi-builder-workspace/.derivedData/Build/Intermediates.noindex/RubberBanding.build/Debug-appletvos/RubberBanding.build/DerivedSources-normal/arm64 -Xcc -I/Users/admin/builder/spi-builder-workspace/.derivedData/Build/Intermediates.noindex/RubberBanding.build/Debug-appletvos/RubberBanding.build/DerivedSources/arm64 -Xcc -I/Users/admin/builder/spi-builder-workspace/.derivedData/Build/Intermediates.noindex/RubberBanding.build/Debug-appletvos/RubberBanding.build/DerivedSources -Xcc -DSWIFT_PACKAGE -Xcc -DDEBUG\=1 -emit-objc-header -emit-objc-header-path /Users/admin/builder/spi-builder-workspace/.derivedData/Build/Intermediates.noindex/RubberBanding.build/Debug-appletvos/RubberBanding.build/Objects-normal/arm64/RubberBanding-Swift.h -working-directory /Users/admin/builder/spi-builder-workspace/.swiftpm/xcode -experimental-emit-module-separately -disable-cmo
SwiftCompile normal arm64 Compiling\ RideauTransitionController.swift,\ RideauView.swift /Users/admin/builder/spi-builder-workspace/.dependencies/checkouts/Rideau/Rideau/Core/RideauTransitionController.swift /Users/admin/builder/spi-builder-workspace/.dependencies/checkouts/Rideau/Rideau/Core/RideauView.swift (in target 'Rideau' from project 'Rideau')
Failed frontend command:
/Applications/Xcode-16.3.0.app/Contents/Developer/Toolchains/XcodeDefault.xctoolchain/usr/bin/swift-frontend -frontend -c /Users/admin/builder/spi-builder-workspace/.dependencies/checkouts/Rideau/Rideau/Core/InternalUtils.swift /Users/admin/builder/spi-builder-workspace/.dependencies/checkouts/Rideau/Rideau/Core/RideauContentContainerView.swift /Users/admin/builder/spi-builder-workspace/.dependencies/checkouts/Rideau/Rideau/Core/RideauContentType.swift /Users/admin/builder/spi-builder-workspace/.dependencies/checkouts/Rideau/Rideau/Core/RideauHostingView.swift /Users/admin/builder/spi-builder-workspace/.dependencies/checkouts/Rideau/Rideau/Core/RideauSnapPoint.swift /Users/admin/builder/spi-builder-workspace/.dependencies/checkouts/Rideau/Rideau/Core/RideauTouchThroughView.swift -primary-file /Users/admin/builder/spi-builder-workspace/.dependencies/checkouts/Rideau/Rideau/Core/RideauTransitionController.swift -primary-file /Users/admin/builder/spi-builder-workspace/.dependencies/checkouts/Rideau/Rideau/Core/RideauView.swift /Users/admin/builder/spi-builder-workspace/.dependencies/checkouts/Rideau/Rideau/Core/RideauViewController.swift /Users/admin/builder/spi-builder-workspace/.dependencies/checkouts/Rideau/Rideau/Core/RideauViewDragGestureRecognizer.swift /Users/admin/builder/spi-builder-workspace/.dependencies/checkouts/Rideau/Rideau/Core/ScrollController.swift /Users/admin/builder/spi-builder-workspace/.dependencies/checkouts/Rideau/Rideau/Core/TransitionPatch.swift /Users/admin/builder/spi-builder-workspace/.dependencies/checkouts/Rideau/Rideau/Logger.swift /Users/admin/builder/spi-builder-workspace/.dependencies/checkouts/Rideau/Rideau/Plugin/RideauMaskedCornerRoundedView.swift /Users/admin/builder/spi-builder-workspace/.dependencies/checkouts/Rideau/Rideau/Plugin/RideauMaskedCornerRoundedViewController.swift /Users/admin/builder/spi-builder-workspace/.dependencies/checkouts/Rideau/Rideau/Plugin/RideauThumbView.swift -emit-dependencies-path /Users/admin/builder/spi-builder-workspace/.derivedData/Build/Intermediates.noindex/Rideau.build/Debug-appletvos/Rideau.build/Objects-normal/arm64/RideauTransitionController.d -emit-const-values-path /Users/admin/builder/spi-builder-workspace/.derivedData/Build/Intermediates.noindex/Rideau.build/Debug-appletvos/Rideau.build/Objects-normal/arm64/RideauTransitionController.swiftconstvalues -emit-reference-dependencies-path /Users/admin/builder/spi-builder-workspace/.derivedData/Build/Intermediates.noindex/Rideau.build/Debug-appletvos/Rideau.build/Objects-normal/arm64/RideauTransitionController.swiftdeps -serialize-diagnostics-path /Users/admin/builder/spi-builder-workspace/.derivedData/Build/Intermediates.noindex/Rideau.build/Debug-appletvos/Rideau.build/Objects-normal/arm64/RideauTransitionController.dia -emit-dependencies-path /Users/admin/builder/spi-builder-workspace/.derivedData/Build/Intermediates.noindex/Rideau.build/Debug-appletvos/Rideau.build/Objects-normal/arm64/RideauView.d -emit-const-values-path /Users/admin/builder/spi-builder-workspace/.derivedData/Build/Intermediates.noindex/Rideau.build/Debug-appletvos/Rideau.build/Objects-normal/arm64/RideauView.swiftconstvalues -emit-reference-dependencies-path /Users/admin/builder/spi-builder-workspace/.derivedData/Build/Intermediates.noindex/Rideau.build/Debug-appletvos/Rideau.build/Objects-normal/arm64/RideauView.swiftdeps -serialize-diagnostics-path /Users/admin/builder/spi-builder-workspace/.derivedData/Build/Intermediates.noindex/Rideau.build/Debug-appletvos/Rideau.build/Objects-normal/arm64/RideauView.dia -target arm64-apple-tvos12.0 -Xllvm -aarch64-use-tbi -enable-objc-interop -sdk /Applications/Xcode-16.3.0.app/Contents/Developer/Platforms/AppleTVOS.platform/Developer/SDKs/AppleTVOS18.4.sdk -I /Users/admin/builder/spi-builder-workspace/.derivedData/Build/Products/Debug-appletvos -I /Applications/Xcode-16.3.0.app/Contents/Developer/Platforms/AppleTVOS.platform/Developer/usr/lib -F /Users/admin/builder/spi-builder-workspace/.derivedData/Build/Products/Debug-appletvos -F /Applications/Xcode-16.3.0.app/Contents/Developer/Platforms/AppleTVOS.platform/Developer/Library/Frameworks -F /Applications/Xcode-16.3.0.app/Contents/Developer/Platforms/AppleTVOS.platform/Developer/SDKs/AppleTVOS18.4.sdk/Developer/Library/Frameworks -no-color-diagnostics -enable-testing -g -debug-info-format\=dwarf -dwarf-version\=4 -module-cache-path /Users/admin/builder/spi-builder-workspace/.derivedData/ModuleCache.noindex -suppress-warnings -profile-generate -profile-coverage-mapping -swift-version 5 -enforce-exclusivity\=checked -Onone -D SWIFT_PACKAGE -D DEBUG -D Xcode -serialize-debugging-options -const-gather-protocols-file /Users/admin/builder/spi-builder-workspace/.derivedData/Build/Intermediates.noindex/Rideau.build/Debug-appletvos/Rideau.build/Objects-normal/arm64/Rideau_const_extract_protocols.json -enable-experimental-feature DebugDescriptionMacro -empty-abi-descriptor -plugin-path /Applications/Xcode-16.3.0.app/Contents/Developer/Toolchains/XcodeDefault.xctoolchain/usr/lib/swift/host/plugins/testing -validate-clang-modules-once -clang-build-session-file /Users/admin/builder/spi-builder-workspace/.derivedData/ModuleCache.noindex/Session.modulevalidation -Xcc -working-directory -Xcc /Users/admin/builder/spi-builder-workspace/.swiftpm/xcode -resource-dir /Applications/Xcode-16.3.0.app/Contents/Developer/Toolchains/XcodeDefault.xctoolchain/usr/lib/swift -enable-anonymous-context-mangled-names -file-compilation-dir /Users/admin/builder/spi-builder-workspace/.swiftpm/xcode -Xcc -ivfsstatcache -Xcc /Users/admin/builder/spi-builder-workspace/.derivedData/SDKStatCaches.noindex/appletvos18.4-22L251-271d326055c85f9856fa135c41255102.sdkstatcache -Xcc -I/Users/admin/builder/spi-builder-workspace/.derivedData/Build/Intermediates.noindex/Rideau.build/Debug-appletvos/Rideau.build/swift-overrides.hmap -Xcc -I/Users/admin/builder/spi-builder-workspace/.derivedData/Build/Products/Debug-appletvos/include -Xcc -I/Users/admin/builder/spi-builder-workspace/.derivedData/Build/Intermediates.noindex/Rideau.build/Debug-appletvos/Rideau.build/DerivedSources-normal/arm64 -Xcc -I/Users/admin/builder/spi-builder-workspace/.derivedData/Build/Intermediates.noindex/Rideau.build/Debug-appletvos/Rideau.build/DerivedSources/arm64 -Xcc -I/Users/admin/builder/spi-builder-workspace/.derivedData/Build/Intermediates.noindex/Rideau.build/Debug-appletvos/Rideau.build/DerivedSources -Xcc -DSWIFT_PACKAGE -Xcc -DDEBUG\=1 -module-name Rideau -frontend-parseable-output -disable-clang-spi -target-sdk-version 18.4 -target-sdk-name appletvos18.4 -external-plugin-path /Applications/Xcode-16.3.0.app/Contents/Developer/Platforms/AppleTVOS.platform/Developer/usr/lib/swift/host/plugins\#/Applications/Xcode-16.3.0.app/Contents/Developer/Platforms/AppleTVOS.platform/Developer/usr/bin/swift-plugin-server -external-plugin-path /Applications/Xcode-16.3.0.app/Contents/Developer/Platforms/AppleTVOS.platform/Developer/usr/local/lib/swift/host/plugins\#/Applications/Xcode-16.3.0.app/Contents/Developer/Platforms/AppleTVOS.platform/Developer/usr/bin/swift-plugin-server -in-process-plugin-server-path /Applications/Xcode-16.3.0.app/Contents/Developer/Toolchains/XcodeDefault.xctoolchain/usr/lib/swift/host/libSwiftInProcPluginServer.dylib -plugin-path /Applications/Xcode-16.3.0.app/Contents/Developer/Toolchains/XcodeDefault.xctoolchain/usr/lib/swift/host/plugins -plugin-path /Applications/Xcode-16.3.0.app/Contents/Developer/Toolchains/XcodeDefault.xctoolchain/usr/local/lib/swift/host/plugins -o /Users/admin/builder/spi-builder-workspace/.derivedData/Build/Intermediates.noindex/Rideau.build/Debug-appletvos/Rideau.build/Objects-normal/arm64/RideauTransitionController.o -o /Users/admin/builder/spi-builder-workspace/.derivedData/Build/Intermediates.noindex/Rideau.build/Debug-appletvos/Rideau.build/Objects-normal/arm64/RideauView.o -index-unit-output-path /Rideau.build/Debug-appletvos/Rideau.build/Objects-normal/arm64/RideauTransitionController.o -index-unit-output-path /Rideau.build/Debug-appletvos/Rideau.build/Objects-normal/arm64/RideauView.o -index-store-path /Users/admin/builder/spi-builder-workspace/.derivedData/Index.noindex/DataStore -index-system-modules
SwiftCompile normal arm64 /Users/admin/builder/spi-builder-workspace/.dependencies/checkouts/Rideau/Rideau/Core/RideauTransitionController.swift (in target 'Rideau' from project 'Rideau')
cd /Users/admin/builder/spi-builder-workspace/.swiftpm/xcode
SwiftCompile normal arm64 /Users/admin/builder/spi-builder-workspace/.dependencies/checkouts/Rideau/Rideau/Core/RideauView.swift (in target 'Rideau' from project 'Rideau')
cd /Users/admin/builder/spi-builder-workspace/.swiftpm/xcode
/Users/admin/builder/spi-builder-workspace/.dependencies/checkouts/Rideau/Rideau/Core/RideauView.swift:280:25: error: 'keyboardWillChangeFrameNotification' is unavailable in tvOS
name: UIResponder.keyboardWillChangeFrameNotification,
^~~~~~~~~~~~~~~~~~~~~~~~~~~~~~~~~~~
/Applications/Xcode-16.3.0.app/Contents/Developer/Platforms/AppleTVOS.platform/Developer/SDKs/AppleTVOS18.4.sdk/System/Library/Frameworks/UIKit.framework/Headers/UIWindow.h:142:39: note: 'keyboardWillChangeFrameNotification' has been explicitly marked unavailable here
UIKIT_EXTERN NSNotificationName const UIKeyboardWillChangeFrameNotification API_AVAILABLE(ios(5.0)) API_UNAVAILABLE(tvos, watchos) NS_SWIFT_NONISOLATED;
^
/Users/admin/builder/spi-builder-workspace/.dependencies/checkouts/Rideau/Rideau/Core/RideauView.swift:294:48: error: 'keyboardFrameEndUserInfoKey' is unavailable in tvOS
guard let v = note.userInfo?[UIResponder.keyboardFrameEndUserInfoKey] as? NSValue else {
^~~~~~~~~~~~~~~~~~~~~~~~~~~
/Applications/Xcode-16.3.0.app/Contents/Developer/Platforms/AppleTVOS.platform/Developer/SDKs/AppleTVOS18.4.sdk/System/Library/Frameworks/UIKit.framework/Headers/UIWindow.h:135:30: note: 'keyboardFrameEndUserInfoKey' has been explicitly marked unavailable here
UIKIT_EXTERN NSString *const UIKeyboardFrameEndUserInfoKey API_AVAILABLE(ios(3.2)) API_UNAVAILABLE(tvos, watchos) NS_SWIFT_NONISOLATED; // NSValue of CGRect
^
/Users/admin/builder/spi-builder-workspace/.dependencies/checkouts/Rideau/Rideau/Core/RideauView.swift:303:50: error: 'keyboardAnimationDurationUserInfoKey' is unavailable in tvOS
if let number = note.userInfo?[UIResponder.keyboardAnimationDurationUserInfoKey] as? NSNumber {
^~~~~~~~~~~~~~~~~~~~~~~~~~~~~~~~~~~~
/Applications/Xcode-16.3.0.app/Contents/Developer/Platforms/AppleTVOS.platform/Developer/SDKs/AppleTVOS18.4.sdk/System/Library/Frameworks/UIKit.framework/Headers/UIWindow.h:136:30: note: 'keyboardAnimationDurationUserInfoKey' has been explicitly marked unavailable here
UIKIT_EXTERN NSString *const UIKeyboardAnimationDurationUserInfoKey API_AVAILABLE(ios(3.0)) API_UNAVAILABLE(tvos, watchos) NS_SWIFT_NONISOLATED; // NSNumber of double
^
/Users/admin/builder/spi-builder-workspace/.dependencies/checkouts/Rideau/Rideau/Core/RideauView.swift:311:50: error: 'keyboardAnimationCurveUserInfoKey' is unavailable in tvOS
if let number = note.userInfo?[UIResponder.keyboardAnimationCurveUserInfoKey] as? NSNumber {
^~~~~~~~~~~~~~~~~~~~~~~~~~~~~~~~~
/Applications/Xcode-16.3.0.app/Contents/Developer/Platforms/AppleTVOS.platform/Developer/SDKs/AppleTVOS18.4.sdk/System/Library/Frameworks/UIKit.framework/Headers/UIWindow.h:137:30: note: 'keyboardAnimationCurveUserInfoKey' has been explicitly marked unavailable here
UIKIT_EXTERN NSString *const UIKeyboardAnimationCurveUserInfoKey API_AVAILABLE(ios(3.0)) API_UNAVAILABLE(tvos, watchos) NS_SWIFT_NONISOLATED; // NSNumber of NSUInteger (UIViewAnimationCurve)
^
PrecompileModule /Users/admin/builder/spi-builder-workspace/.derivedData/Build/Intermediates.noindex/ExplicitPrecompiledModules/UserNotifications-72GW0JZ856UCZKRPTOEDH9L1J.scan
cd /Users/admin/builder/spi-builder-workspace/.swiftpm/xcode
builtin-precompileModule /Users/admin/builder/spi-builder-workspace/.derivedData/Build/Intermediates.noindex/ExplicitPrecompiledModules/UserNotifications-72GW0JZ856UCZKRPTOEDH9L1J.scan
SwiftDriverJobDiscovery normal arm64 Emitting module for FluidKeyboardSupport (in target 'FluidKeyboardSupport' from project 'FluidInterfaceKit')
SwiftDriver\ Compilation\ Requirements FluidKeyboardSupport normal arm64 com.apple.xcode.tools.swift.compiler (in target 'FluidKeyboardSupport' from project 'FluidInterfaceKit')
cd /Users/admin/builder/spi-builder-workspace/.swiftpm/xcode
builtin-Swift-Compilation-Requirements -- /Applications/Xcode-16.3.0.app/Contents/Developer/Toolchains/XcodeDefault.xctoolchain/usr/bin/swiftc -module-name FluidKeyboardSupport -Onone -enforce-exclusivity\=checked @/Users/admin/builder/spi-builder-workspace/.derivedData/Build/Intermediates.noindex/FluidInterfaceKit.build/Debug-appletvos/FluidKeyboardSupport.build/Objects-normal/arm64/FluidKeyboardSupport.SwiftFileList -DSWIFT_PACKAGE -DDEBUG -DXcode -plugin-path /Applications/Xcode-16.3.0.app/Contents/Developer/Toolchains/XcodeDefault.xctoolchain/usr/lib/swift/host/plugins/testing -enable-experimental-feature DebugDescriptionMacro -sdk /Applications/Xcode-16.3.0.app/Contents/Developer/Platforms/AppleTVOS.platform/Developer/SDKs/AppleTVOS18.4.sdk -target arm64-apple-tvos13.0 -g -module-cache-path /Users/admin/builder/spi-builder-workspace/.derivedData/ModuleCache.noindex -Xfrontend -serialize-debugging-options -profile-coverage-mapping -profile-generate -enable-testing -index-store-path /Users/admin/builder/spi-builder-workspace/.derivedData/Index.noindex/DataStore -swift-version 6 -I /Users/admin/builder/spi-builder-workspace/.derivedData/Build/Products/Debug-appletvos -I /Applications/Xcode-16.3.0.app/Contents/Developer/Platforms/AppleTVOS.platform/Developer/usr/lib -F /Users/admin/builder/spi-builder-workspace/.derivedData/Build/Products/Debug-appletvos -F /Applications/Xcode-16.3.0.app/Contents/Developer/Platforms/AppleTVOS.platform/Developer/Library/Frameworks -F /Applications/Xcode-16.3.0.app/Contents/Developer/Platforms/AppleTVOS.platform/Developer/SDKs/AppleTVOS18.4.sdk/Developer/Library/Frameworks -c -j10 -enable-batch-mode -incremental -Xcc -ivfsstatcache -Xcc /Users/admin/builder/spi-builder-workspace/.derivedData/SDKStatCaches.noindex/appletvos18.4-22L251-271d326055c85f9856fa135c41255102.sdkstatcache -output-file-map /Users/admin/builder/spi-builder-workspace/.derivedData/Build/Intermediates.noindex/FluidInterfaceKit.build/Debug-appletvos/FluidKeyboardSupport.build/Objects-normal/arm64/FluidKeyboardSupport-OutputFileMap.json -use-frontend-parseable-output -save-temps -no-color-diagnostics -serialize-diagnostics -emit-dependencies -emit-module -emit-module-path /Users/admin/builder/spi-builder-workspace/.derivedData/Build/Intermediates.noindex/FluidInterfaceKit.build/Debug-appletvos/FluidKeyboardSupport.build/Objects-normal/arm64/FluidKeyboardSupport.swiftmodule -validate-clang-modules-once -clang-build-session-file /Users/admin/builder/spi-builder-workspace/.derivedData/ModuleCache.noindex/Session.modulevalidation -package-name spi_builder_workspace -Xcc -I/Users/admin/builder/spi-builder-workspace/.derivedData/Build/Intermediates.noindex/FluidInterfaceKit.build/Debug-appletvos/FluidKeyboardSupport.build/swift-overrides.hmap -emit-const-values -Xfrontend -const-gather-protocols-file -Xfrontend /Users/admin/builder/spi-builder-workspace/.derivedData/Build/Intermediates.noindex/FluidInterfaceKit.build/Debug-appletvos/FluidKeyboardSupport.build/Objects-normal/arm64/FluidKeyboardSupport_const_extract_protocols.json -Xcc -I/Users/admin/builder/spi-builder-workspace/.derivedData/Build/Products/Debug-appletvos/include -Xcc -I/Users/admin/builder/spi-builder-workspace/.derivedData/Build/Intermediates.noindex/FluidInterfaceKit.build/Debug-appletvos/FluidKeyboardSupport.build/DerivedSources-normal/arm64 -Xcc -I/Users/admin/builder/spi-builder-workspace/.derivedData/Build/Intermediates.noindex/FluidInterfaceKit.build/Debug-appletvos/FluidKeyboardSupport.build/DerivedSources/arm64 -Xcc -I/Users/admin/builder/spi-builder-workspace/.derivedData/Build/Intermediates.noindex/FluidInterfaceKit.build/Debug-appletvos/FluidKeyboardSupport.build/DerivedSources -Xcc -DSWIFT_PACKAGE -Xcc -DDEBUG\=1 -emit-objc-header -emit-objc-header-path /Users/admin/builder/spi-builder-workspace/.derivedData/Build/Intermediates.noindex/FluidInterfaceKit.build/Debug-appletvos/FluidKeyboardSupport.build/Objects-normal/arm64/FluidKeyboardSupport-Swift.h -working-directory /Users/admin/builder/spi-builder-workspace/.swiftpm/xcode -experimental-emit-module-separately -disable-cmo
SwiftDriverJobDiscovery normal arm64 Emitting module for SwiftUIHosting (in target 'SwiftUIHosting' from project 'swiftui-hosting')
SwiftDriver\ Compilation\ Requirements SwiftUIHosting normal arm64 com.apple.xcode.tools.swift.compiler (in target 'SwiftUIHosting' from project 'swiftui-hosting')
cd /Users/admin/builder/spi-builder-workspace/.swiftpm/xcode
builtin-Swift-Compilation-Requirements -- /Applications/Xcode-16.3.0.app/Contents/Developer/Toolchains/XcodeDefault.xctoolchain/usr/bin/swiftc -module-name SwiftUIHosting -Onone -enforce-exclusivity\=checked @/Users/admin/builder/spi-builder-workspace/.derivedData/Build/Intermediates.noindex/swiftui-hosting.build/Debug-appletvos/SwiftUIHosting.build/Objects-normal/arm64/SwiftUIHosting.SwiftFileList -DSWIFT_PACKAGE -DDEBUG -DXcode -plugin-path /Applications/Xcode-16.3.0.app/Contents/Developer/Toolchains/XcodeDefault.xctoolchain/usr/lib/swift/host/plugins/testing -enable-experimental-feature DebugDescriptionMacro -sdk /Applications/Xcode-16.3.0.app/Contents/Developer/Platforms/AppleTVOS.platform/Developer/SDKs/AppleTVOS18.4.sdk -target arm64-apple-tvos13.0 -g -module-cache-path /Users/admin/builder/spi-builder-workspace/.derivedData/ModuleCache.noindex -Xfrontend -serialize-debugging-options -profile-coverage-mapping -profile-generate -enable-testing -suppress-warnings -index-store-path /Users/admin/builder/spi-builder-workspace/.derivedData/Index.noindex/DataStore -swift-version 6 -I /Users/admin/builder/spi-builder-workspace/.derivedData/Build/Products/Debug-appletvos -I /Applications/Xcode-16.3.0.app/Contents/Developer/Platforms/AppleTVOS.platform/Developer/usr/lib -F /Users/admin/builder/spi-builder-workspace/.derivedData/Build/Products/Debug-appletvos -F /Applications/Xcode-16.3.0.app/Contents/Developer/Platforms/AppleTVOS.platform/Developer/Library/Frameworks -F /Applications/Xcode-16.3.0.app/Contents/Developer/Platforms/AppleTVOS.platform/Developer/SDKs/AppleTVOS18.4.sdk/Developer/Library/Frameworks -c -j10 -enable-batch-mode -incremental -Xcc -ivfsstatcache -Xcc /Users/admin/builder/spi-builder-workspace/.derivedData/SDKStatCaches.noindex/appletvos18.4-22L251-271d326055c85f9856fa135c41255102.sdkstatcache -output-file-map /Users/admin/builder/spi-builder-workspace/.derivedData/Build/Intermediates.noindex/swiftui-hosting.build/Debug-appletvos/SwiftUIHosting.build/Objects-normal/arm64/SwiftUIHosting-OutputFileMap.json -use-frontend-parseable-output -save-temps -no-color-diagnostics -serialize-diagnostics -emit-dependencies -emit-module -emit-module-path /Users/admin/builder/spi-builder-workspace/.derivedData/Build/Intermediates.noindex/swiftui-hosting.build/Debug-appletvos/SwiftUIHosting.build/Objects-normal/arm64/SwiftUIHosting.swiftmodule -user-module-version 2.3.0 -validate-clang-modules-once -clang-build-session-file /Users/admin/builder/spi-builder-workspace/.derivedData/ModuleCache.noindex/Session.modulevalidation -package-name swiftui_hosting -Xcc -I/Users/admin/builder/spi-builder-workspace/.derivedData/Build/Intermediates.noindex/swiftui-hosting.build/Debug-appletvos/SwiftUIHosting.build/swift-overrides.hmap -emit-const-values -Xfrontend -const-gather-protocols-file -Xfrontend /Users/admin/builder/spi-builder-workspace/.derivedData/Build/Intermediates.noindex/swiftui-hosting.build/Debug-appletvos/SwiftUIHosting.build/Objects-normal/arm64/SwiftUIHosting_const_extract_protocols.json -Xcc -I/Users/admin/builder/spi-builder-workspace/.derivedData/Build/Products/Debug-appletvos/include -Xcc -I/Users/admin/builder/spi-builder-workspace/.derivedData/Build/Intermediates.noindex/swiftui-hosting.build/Debug-appletvos/SwiftUIHosting.build/DerivedSources-normal/arm64 -Xcc -I/Users/admin/builder/spi-builder-workspace/.derivedData/Build/Intermediates.noindex/swiftui-hosting.build/Debug-appletvos/SwiftUIHosting.build/DerivedSources/arm64 -Xcc -I/Users/admin/builder/spi-builder-workspace/.derivedData/Build/Intermediates.noindex/swiftui-hosting.build/Debug-appletvos/SwiftUIHosting.build/DerivedSources -Xcc -DSWIFT_PACKAGE -Xcc -DDEBUG\=1 -emit-objc-header -emit-objc-header-path /Users/admin/builder/spi-builder-workspace/.derivedData/Build/Intermediates.noindex/swiftui-hosting.build/Debug-appletvos/SwiftUIHosting.build/Objects-normal/arm64/SwiftUIHosting-Swift.h -working-directory /Users/admin/builder/spi-builder-workspace/.swiftpm/xcode -experimental-emit-module-separately -disable-cmo
Copy /Users/admin/builder/spi-builder-workspace/.derivedData/Build/Products/Debug-appletvos/FluidKeyboardSupport.swiftmodule/arm64-apple-tvos.abi.json /Users/admin/builder/spi-builder-workspace/.derivedData/Build/Intermediates.noindex/FluidInterfaceKit.build/Debug-appletvos/FluidKeyboardSupport.build/Objects-normal/arm64/FluidKeyboardSupport.abi.json (in target 'FluidKeyboardSupport' from project 'FluidInterfaceKit')
cd /Users/admin/builder/spi-builder-workspace
builtin-copy -exclude .DS_Store -exclude CVS -exclude .svn -exclude .git -exclude .hg -resolve-src-symlinks -rename /Users/admin/builder/spi-builder-workspace/.derivedData/Build/Intermediates.noindex/FluidInterfaceKit.build/Debug-appletvos/FluidKeyboardSupport.build/Objects-normal/arm64/FluidKeyboardSupport.abi.json /Users/admin/builder/spi-builder-workspace/.derivedData/Build/Products/Debug-appletvos/FluidKeyboardSupport.swiftmodule/arm64-apple-tvos.abi.json
Copy /Users/admin/builder/spi-builder-workspace/.derivedData/Build/Products/Debug-appletvos/SwiftUIHosting.swiftmodule/arm64-apple-tvos.abi.json /Users/admin/builder/spi-builder-workspace/.derivedData/Build/Intermediates.noindex/swiftui-hosting.build/Debug-appletvos/SwiftUIHosting.build/Objects-normal/arm64/SwiftUIHosting.abi.json (in target 'SwiftUIHosting' from project 'swiftui-hosting')
cd /Users/admin/builder/spi-builder-workspace/.dependencies/checkouts/swiftui-Hosting
builtin-copy -exclude .DS_Store -exclude CVS -exclude .svn -exclude .git -exclude .hg -resolve-src-symlinks -rename /Users/admin/builder/spi-builder-workspace/.derivedData/Build/Intermediates.noindex/swiftui-hosting.build/Debug-appletvos/SwiftUIHosting.build/Objects-normal/arm64/SwiftUIHosting.abi.json /Users/admin/builder/spi-builder-workspace/.derivedData/Build/Products/Debug-appletvos/SwiftUIHosting.swiftmodule/arm64-apple-tvos.abi.json
PrecompileModule /Users/admin/builder/spi-builder-workspace/.derivedData/Build/Intermediates.noindex/ExplicitPrecompiledModules/Symbols-7L3MA3HJ1FFNZNOL5PKQVSEVN.scan
cd /Users/admin/builder/spi-builder-workspace/.swiftpm/xcode
builtin-precompileModule /Users/admin/builder/spi-builder-workspace/.derivedData/Build/Intermediates.noindex/ExplicitPrecompiledModules/Symbols-7L3MA3HJ1FFNZNOL5PKQVSEVN.scan
PrecompileModule /Users/admin/builder/spi-builder-workspace/.derivedData/Build/Intermediates.noindex/ExplicitPrecompiledModules/IOSurface-2NVNHDZ0MN82JTI49555Z5BLW.scan
cd /Users/admin/builder/spi-builder-workspace/.swiftpm/xcode
builtin-precompileModule /Users/admin/builder/spi-builder-workspace/.derivedData/Build/Intermediates.noindex/ExplicitPrecompiledModules/IOSurface-2NVNHDZ0MN82JTI49555Z5BLW.scan
SwiftDriverJobDiscovery normal arm64 Emitting module for FluidPortal (in target 'FluidPortal' from project 'FluidInterfaceKit')
SwiftDriver\ Compilation\ Requirements FluidPortal normal arm64 com.apple.xcode.tools.swift.compiler (in target 'FluidPortal' from project 'FluidInterfaceKit')
cd /Users/admin/builder/spi-builder-workspace/.swiftpm/xcode
builtin-Swift-Compilation-Requirements -- /Applications/Xcode-16.3.0.app/Contents/Developer/Toolchains/XcodeDefault.xctoolchain/usr/bin/swiftc -module-name FluidPortal -Onone -enforce-exclusivity\=checked @/Users/admin/builder/spi-builder-workspace/.derivedData/Build/Intermediates.noindex/FluidInterfaceKit.build/Debug-appletvos/FluidPortal.build/Objects-normal/arm64/FluidPortal.SwiftFileList -DSWIFT_PACKAGE -DDEBUG -Xcc -fmodule-map-file\=/Users/admin/builder/spi-builder-workspace/.derivedData/Build/Intermediates.noindex/GeneratedModuleMaps-appletvos/FluidRuntime.modulemap -DXcode -plugin-path /Applications/Xcode-16.3.0.app/Contents/Developer/Toolchains/XcodeDefault.xctoolchain/usr/lib/swift/host/plugins/testing -enable-experimental-feature DebugDescriptionMacro -sdk /Applications/Xcode-16.3.0.app/Contents/Developer/Platforms/AppleTVOS.platform/Developer/SDKs/AppleTVOS18.4.sdk -target arm64-apple-tvos13.0 -g -module-cache-path /Users/admin/builder/spi-builder-workspace/.derivedData/ModuleCache.noindex -Xfrontend -serialize-debugging-options -profile-coverage-mapping -profile-generate -enable-testing -index-store-path /Users/admin/builder/spi-builder-workspace/.derivedData/Index.noindex/DataStore -swift-version 6 -I /Users/admin/builder/spi-builder-workspace/.derivedData/Build/Products/Debug-appletvos -I /Applications/Xcode-16.3.0.app/Contents/Developer/Platforms/AppleTVOS.platform/Developer/usr/lib -F /Users/admin/builder/spi-builder-workspace/.derivedData/Build/Products/Debug-appletvos/PackageFrameworks -F /Users/admin/builder/spi-builder-workspace/.derivedData/Build/Products/Debug-appletvos -F /Applications/Xcode-16.3.0.app/Contents/Developer/Platforms/AppleTVOS.platform/Developer/Library/Frameworks -F /Applications/Xcode-16.3.0.app/Contents/Developer/Platforms/AppleTVOS.platform/Developer/SDKs/AppleTVOS18.4.sdk/Developer/Library/Frameworks -c -j10 -enable-batch-mode -incremental -Xcc -ivfsstatcache -Xcc /Users/admin/builder/spi-builder-workspace/.derivedData/SDKStatCaches.noindex/appletvos18.4-22L251-271d326055c85f9856fa135c41255102.sdkstatcache -output-file-map /Users/admin/builder/spi-builder-workspace/.derivedData/Build/Intermediates.noindex/FluidInterfaceKit.build/Debug-appletvos/FluidPortal.build/Objects-normal/arm64/FluidPortal-OutputFileMap.json -use-frontend-parseable-output -save-temps -no-color-diagnostics -serialize-diagnostics -emit-dependencies -emit-module -emit-module-path /Users/admin/builder/spi-builder-workspace/.derivedData/Build/Intermediates.noindex/FluidInterfaceKit.build/Debug-appletvos/FluidPortal.build/Objects-normal/arm64/FluidPortal.swiftmodule -validate-clang-modules-once -clang-build-session-file /Users/admin/builder/spi-builder-workspace/.derivedData/ModuleCache.noindex/Session.modulevalidation -package-name spi_builder_workspace -Xcc -I/Users/admin/builder/spi-builder-workspace/.derivedData/Build/Intermediates.noindex/FluidInterfaceKit.build/Debug-appletvos/FluidPortal.build/swift-overrides.hmap -emit-const-values -Xfrontend -const-gather-protocols-file -Xfrontend /Users/admin/builder/spi-builder-workspace/.derivedData/Build/Intermediates.noindex/FluidInterfaceKit.build/Debug-appletvos/FluidPortal.build/Objects-normal/arm64/FluidPortal_const_extract_protocols.json -Xcc -I/Users/admin/builder/spi-builder-workspace/Sources/FluidRuntime/include -Xcc -I/Users/admin/builder/spi-builder-workspace/.derivedData/Build/Products/Debug-appletvos/include -Xcc -I/Users/admin/builder/spi-builder-workspace/.derivedData/Build/Intermediates.noindex/FluidInterfaceKit.build/Debug-appletvos/FluidPortal.build/DerivedSources-normal/arm64 -Xcc -I/Users/admin/builder/spi-builder-workspace/.derivedData/Build/Intermediates.noindex/FluidInterfaceKit.build/Debug-appletvos/FluidPortal.build/DerivedSources/arm64 -Xcc -I/Users/admin/builder/spi-builder-workspace/.derivedData/Build/Intermediates.noindex/FluidInterfaceKit.build/Debug-appletvos/FluidPortal.build/DerivedSources -Xcc -DSWIFT_PACKAGE -Xcc -DDEBUG\=1 -emit-objc-header -emit-objc-header-path /Users/admin/builder/spi-builder-workspace/.derivedData/Build/Intermediates.noindex/FluidInterfaceKit.build/Debug-appletvos/FluidPortal.build/Objects-normal/arm64/FluidPortal-Swift.h -working-directory /Users/admin/builder/spi-builder-workspace/.swiftpm/xcode -experimental-emit-module-separately -disable-cmo
SwiftCompile normal arm64 Compiling\ RideauContentType.swift,\ RideauHostingView.swift /Users/admin/builder/spi-builder-workspace/.dependencies/checkouts/Rideau/Rideau/Core/RideauContentType.swift /Users/admin/builder/spi-builder-workspace/.dependencies/checkouts/Rideau/Rideau/Core/RideauHostingView.swift (in target 'Rideau' from project 'Rideau')
SwiftCompile normal arm64 /Users/admin/builder/spi-builder-workspace/.dependencies/checkouts/Rideau/Rideau/Core/RideauContentType.swift (in target 'Rideau' from project 'Rideau')
cd /Users/admin/builder/spi-builder-workspace/.swiftpm/xcode
SwiftCompile normal arm64 /Users/admin/builder/spi-builder-workspace/.dependencies/checkouts/Rideau/Rideau/Core/RideauHostingView.swift (in target 'Rideau' from project 'Rideau')
cd /Users/admin/builder/spi-builder-workspace/.swiftpm/xcode
Copy /Users/admin/builder/spi-builder-workspace/.derivedData/Build/Products/Debug-appletvos/FluidPortal.swiftmodule/arm64-apple-tvos.abi.json /Users/admin/builder/spi-builder-workspace/.derivedData/Build/Intermediates.noindex/FluidInterfaceKit.build/Debug-appletvos/FluidPortal.build/Objects-normal/arm64/FluidPortal.abi.json (in target 'FluidPortal' from project 'FluidInterfaceKit')
cd /Users/admin/builder/spi-builder-workspace
builtin-copy -exclude .DS_Store -exclude CVS -exclude .svn -exclude .git -exclude .hg -resolve-src-symlinks -rename /Users/admin/builder/spi-builder-workspace/.derivedData/Build/Intermediates.noindex/FluidInterfaceKit.build/Debug-appletvos/FluidPortal.build/Objects-normal/arm64/FluidPortal.abi.json /Users/admin/builder/spi-builder-workspace/.derivedData/Build/Products/Debug-appletvos/FluidPortal.swiftmodule/arm64-apple-tvos.abi.json
SwiftCompile normal arm64 Compiling\ RideauMaskedCornerRoundedViewController.swift /Users/admin/builder/spi-builder-workspace/.dependencies/checkouts/Rideau/Rideau/Plugin/RideauMaskedCornerRoundedViewController.swift (in target 'Rideau' from project 'Rideau')
SwiftCompile normal arm64 /Users/admin/builder/spi-builder-workspace/.dependencies/checkouts/Rideau/Rideau/Plugin/RideauMaskedCornerRoundedViewController.swift (in target 'Rideau' from project 'Rideau')
cd /Users/admin/builder/spi-builder-workspace/.swiftpm/xcode
SwiftCompile normal arm64 Compiling\ RideauViewController.swift,\ RideauViewDragGestureRecognizer.swift /Users/admin/builder/spi-builder-workspace/.dependencies/checkouts/Rideau/Rideau/Core/RideauViewController.swift /Users/admin/builder/spi-builder-workspace/.dependencies/checkouts/Rideau/Rideau/Core/RideauViewDragGestureRecognizer.swift (in target 'Rideau' from project 'Rideau')
SwiftCompile normal arm64 /Users/admin/builder/spi-builder-workspace/.dependencies/checkouts/Rideau/Rideau/Core/RideauViewController.swift (in target 'Rideau' from project 'Rideau')
cd /Users/admin/builder/spi-builder-workspace/.swiftpm/xcode
SwiftCompile normal arm64 /Users/admin/builder/spi-builder-workspace/.dependencies/checkouts/Rideau/Rideau/Core/RideauViewDragGestureRecognizer.swift (in target 'Rideau' from project 'Rideau')
cd /Users/admin/builder/spi-builder-workspace/.swiftpm/xcode
SwiftDriverJobDiscovery normal arm64 Compiling UIResponder+.swift (in target 'SwiftUIHosting' from project 'swiftui-hosting')
SwiftCompile normal arm64 Compiling\ InternalUtils.swift,\ RideauContentContainerView.swift /Users/admin/builder/spi-builder-workspace/.dependencies/checkouts/Rideau/Rideau/Core/InternalUtils.swift /Users/admin/builder/spi-builder-workspace/.dependencies/checkouts/Rideau/Rideau/Core/RideauContentContainerView.swift (in target 'Rideau' from project 'Rideau')
SwiftCompile normal arm64 /Users/admin/builder/spi-builder-workspace/.dependencies/checkouts/Rideau/Rideau/Core/InternalUtils.swift (in target 'Rideau' from project 'Rideau')
cd /Users/admin/builder/spi-builder-workspace/.swiftpm/xcode
SwiftCompile normal arm64 /Users/admin/builder/spi-builder-workspace/.dependencies/checkouts/Rideau/Rideau/Core/RideauContentContainerView.swift (in target 'Rideau' from project 'Rideau')
cd /Users/admin/builder/spi-builder-workspace/.swiftpm/xcode
PrecompileModule /Users/admin/builder/spi-builder-workspace/.derivedData/Build/Intermediates.noindex/ExplicitPrecompiledModules/OpenGLES-4QV3POKJHIISAJ98QRXV8IXQ4.scan
cd /Users/admin/builder/spi-builder-workspace/.swiftpm/xcode
builtin-precompileModule /Users/admin/builder/spi-builder-workspace/.derivedData/Build/Intermediates.noindex/ExplicitPrecompiledModules/OpenGLES-4QV3POKJHIISAJ98QRXV8IXQ4.scan
SwiftDriverJobDiscovery normal arm64 Emitting module for Rideau (in target 'Rideau' from project 'Rideau')
SwiftDriver\ Compilation\ Requirements Rideau normal arm64 com.apple.xcode.tools.swift.compiler (in target 'Rideau' from project 'Rideau')
cd /Users/admin/builder/spi-builder-workspace/.swiftpm/xcode
builtin-Swift-Compilation-Requirements -- /Applications/Xcode-16.3.0.app/Contents/Developer/Toolchains/XcodeDefault.xctoolchain/usr/bin/swiftc -module-name Rideau -Onone -enforce-exclusivity\=checked @/Users/admin/builder/spi-builder-workspace/.derivedData/Build/Intermediates.noindex/Rideau.build/Debug-appletvos/Rideau.build/Objects-normal/arm64/Rideau.SwiftFileList -DSWIFT_PACKAGE -DDEBUG -DXcode -plugin-path /Applications/Xcode-16.3.0.app/Contents/Developer/Toolchains/XcodeDefault.xctoolchain/usr/lib/swift/host/plugins/testing -enable-experimental-feature DebugDescriptionMacro -sdk /Applications/Xcode-16.3.0.app/Contents/Developer/Platforms/AppleTVOS.platform/Developer/SDKs/AppleTVOS18.4.sdk -target arm64-apple-tvos12.0 -g -module-cache-path /Users/admin/builder/spi-builder-workspace/.derivedData/ModuleCache.noindex -Xfrontend -serialize-debugging-options -profile-coverage-mapping -profile-generate -enable-testing -suppress-warnings -index-store-path /Users/admin/builder/spi-builder-workspace/.derivedData/Index.noindex/DataStore -swift-version 5 -I /Users/admin/builder/spi-builder-workspace/.derivedData/Build/Products/Debug-appletvos -I /Applications/Xcode-16.3.0.app/Contents/Developer/Platforms/AppleTVOS.platform/Developer/usr/lib -F /Users/admin/builder/spi-builder-workspace/.derivedData/Build/Products/Debug-appletvos -F /Applications/Xcode-16.3.0.app/Contents/Developer/Platforms/AppleTVOS.platform/Developer/Library/Frameworks -F /Applications/Xcode-16.3.0.app/Contents/Developer/Platforms/AppleTVOS.platform/Developer/SDKs/AppleTVOS18.4.sdk/Developer/Library/Frameworks -c -j10 -enable-batch-mode -incremental -Xcc -ivfsstatcache -Xcc /Users/admin/builder/spi-builder-workspace/.derivedData/SDKStatCaches.noindex/appletvos18.4-22L251-271d326055c85f9856fa135c41255102.sdkstatcache -output-file-map /Users/admin/builder/spi-builder-workspace/.derivedData/Build/Intermediates.noindex/Rideau.build/Debug-appletvos/Rideau.build/Objects-normal/arm64/Rideau-OutputFileMap.json -use-frontend-parseable-output -save-temps -no-color-diagnostics -serialize-diagnostics -emit-dependencies -emit-module -emit-module-path /Users/admin/builder/spi-builder-workspace/.derivedData/Build/Intermediates.noindex/Rideau.build/Debug-appletvos/Rideau.build/Objects-normal/arm64/Rideau.swiftmodule -validate-clang-modules-once -clang-build-session-file /Users/admin/builder/spi-builder-workspace/.derivedData/ModuleCache.noindex/Session.modulevalidation -Xcc -I/Users/admin/builder/spi-builder-workspace/.derivedData/Build/Intermediates.noindex/Rideau.build/Debug-appletvos/Rideau.build/swift-overrides.hmap -emit-const-values -Xfrontend -const-gather-protocols-file -Xfrontend /Users/admin/builder/spi-builder-workspace/.derivedData/Build/Intermediates.noindex/Rideau.build/Debug-appletvos/Rideau.build/Objects-normal/arm64/Rideau_const_extract_protocols.json -Xcc -I/Users/admin/builder/spi-builder-workspace/.derivedData/Build/Products/Debug-appletvos/include -Xcc -I/Users/admin/builder/spi-builder-workspace/.derivedData/Build/Intermediates.noindex/Rideau.build/Debug-appletvos/Rideau.build/DerivedSources-normal/arm64 -Xcc -I/Users/admin/builder/spi-builder-workspace/.derivedData/Build/Intermediates.noindex/Rideau.build/Debug-appletvos/Rideau.build/DerivedSources/arm64 -Xcc -I/Users/admin/builder/spi-builder-workspace/.derivedData/Build/Intermediates.noindex/Rideau.build/Debug-appletvos/Rideau.build/DerivedSources -Xcc -DSWIFT_PACKAGE -Xcc -DDEBUG\=1 -emit-objc-header -emit-objc-header-path /Users/admin/builder/spi-builder-workspace/.derivedData/Build/Intermediates.noindex/Rideau.build/Debug-appletvos/Rideau.build/Objects-normal/arm64/Rideau-Swift.h -working-directory /Users/admin/builder/spi-builder-workspace/.swiftpm/xcode -experimental-emit-module-separately -disable-cmo
PrecompileModule /Users/admin/builder/spi-builder-workspace/.derivedData/Build/Intermediates.noindex/ExplicitPrecompiledModules/Metal-7ID1B3HQSGLJT58HH52JZ0FFA.scan
cd /Users/admin/builder/spi-builder-workspace/.swiftpm/xcode
builtin-precompileModule /Users/admin/builder/spi-builder-workspace/.derivedData/Build/Intermediates.noindex/ExplicitPrecompiledModules/Metal-7ID1B3HQSGLJT58HH52JZ0FFA.scan
Copy /Users/admin/builder/spi-builder-workspace/.derivedData/Build/Products/Debug-appletvos/Rideau.swiftmodule/arm64-apple-tvos.abi.json /Users/admin/builder/spi-builder-workspace/.derivedData/Build/Intermediates.noindex/Rideau.build/Debug-appletvos/Rideau.build/Objects-normal/arm64/Rideau.abi.json (in target 'Rideau' from project 'Rideau')
cd /Users/admin/builder/spi-builder-workspace/.dependencies/checkouts/Rideau
builtin-copy -exclude .DS_Store -exclude CVS -exclude .svn -exclude .git -exclude .hg -resolve-src-symlinks -rename /Users/admin/builder/spi-builder-workspace/.derivedData/Build/Intermediates.noindex/Rideau.build/Debug-appletvos/Rideau.build/Objects-normal/arm64/Rideau.abi.json /Users/admin/builder/spi-builder-workspace/.derivedData/Build/Products/Debug-appletvos/Rideau.swiftmodule/arm64-apple-tvos.abi.json
** BUILD FAILED **
The following build commands failed:
SwiftCompile normal arm64 Compiling\ RideauTransitionController.swift,\ RideauView.swift /Users/admin/builder/spi-builder-workspace/.dependencies/checkouts/Rideau/Rideau/Core/RideauTransitionController.swift /Users/admin/builder/spi-builder-workspace/.dependencies/checkouts/Rideau/Rideau/Core/RideauView.swift (in target 'Rideau' from project 'Rideau')
SwiftCompile normal arm64 /Users/admin/builder/spi-builder-workspace/.dependencies/checkouts/Rideau/Rideau/Core/RideauView.swift (in target 'Rideau' from project 'Rideau')
Building workspace spi-builder-workspace with scheme FluidInterfaceKit-Package
(3 failures)
BUILD FAILURE 6.1 tvOS