The Swift Package Index logo.Swift Package Index

Track the adoption of Swift 6 strict concurrency checks for data race safety. How many packages are Ready for Swift 6?

Build Information

Failed to build LispKit, reference master (d39a13), with Swift 6.0 for watchOS using Xcode 16.2 on 27 Apr 2025 01:47:46 UTC.

Build Command

env DEVELOPER_DIR=/Applications/Xcode-16.2.0.app xcrun xcodebuild -IDEClonedSourcePackagesDirPathOverride=$PWD/.dependencies -skipMacroValidation -skipPackagePluginValidation -derivedDataPath $PWD/.derivedData build -scheme LispKit-Package -destination generic/platform=watchOS

Build Log

RegisterExecutionPolicyException /Users/admin/builder/spi-builder-workspace/.derivedData/Build/Products/Debug-watchos/iOS.o (in target 'iOS' from project 'OAuth2')
    cd /Users/admin/builder/spi-builder-workspace/.dependencies/checkouts/OAuth2
    builtin-RegisterExecutionPolicyException /Users/admin/builder/spi-builder-workspace/.derivedData/Build/Products/Debug-watchos/iOS.o
SwiftCompile normal arm64 Compiling\ OAuth2ImplicitGrantWithQueryParams.swift /Users/admin/builder/spi-builder-workspace/.dependencies/checkouts/OAuth2/Sources/Flows/OAuth2ImplicitGrantWithQueryParams.swift (in target 'Flows' from project 'OAuth2')
    cd /Users/admin/builder/spi-builder-workspace/.swiftpm/xcode
    builtin-swiftTaskExecution -- /Applications/Xcode-16.2.0.app/Contents/Developer/Toolchains/XcodeDefault.xctoolchain/usr/bin/swift-frontend -frontend -c /Users/admin/builder/spi-builder-workspace/.dependencies/checkouts/OAuth2/Sources/Flows/OAuth2.swift /Users/admin/builder/spi-builder-workspace/.dependencies/checkouts/OAuth2/Sources/Flows/OAuth2ClientCredentials.swift /Users/admin/builder/spi-builder-workspace/.dependencies/checkouts/OAuth2/Sources/Flows/OAuth2ClientCredentialsReddit.swift /Users/admin/builder/spi-builder-workspace/.dependencies/checkouts/OAuth2/Sources/Flows/OAuth2CodeGrant.swift /Users/admin/builder/spi-builder-workspace/.dependencies/checkouts/OAuth2/Sources/Flows/OAuth2CodeGrantAzure.swift /Users/admin/builder/spi-builder-workspace/.dependencies/checkouts/OAuth2/Sources/Flows/OAuth2CodeGrantBasicAuth.swift /Users/admin/builder/spi-builder-workspace/.dependencies/checkouts/OAuth2/Sources/Flows/OAuth2CodeGrantFacebook.swift /Users/admin/builder/spi-builder-workspace/.dependencies/checkouts/OAuth2/Sources/Flows/OAuth2CodeGrantLinkedIn.swift /Users/admin/builder/spi-builder-workspace/.dependencies/checkouts/OAuth2/Sources/Flows/OAuth2CodeGrantNoTokenType.swift /Users/admin/builder/spi-builder-workspace/.dependencies/checkouts/OAuth2/Sources/Flows/OAuth2DeviceGrant.swift /Users/admin/builder/spi-builder-workspace/.dependencies/checkouts/OAuth2/Sources/Flows/OAuth2DynReg.swift /Users/admin/builder/spi-builder-workspace/.dependencies/checkouts/OAuth2/Sources/Flows/OAuth2ImplicitGrant.swift -primary-file /Users/admin/builder/spi-builder-workspace/.dependencies/checkouts/OAuth2/Sources/Flows/OAuth2ImplicitGrantWithQueryParams.swift /Users/admin/builder/spi-builder-workspace/.dependencies/checkouts/OAuth2/Sources/Flows/OAuth2PasswordGrant.swift -emit-dependencies-path /Users/admin/builder/spi-builder-workspace/.derivedData/Build/Intermediates.noindex/OAuth2.build/Debug-watchos/Flows.build/Objects-normal/arm64/OAuth2ImplicitGrantWithQueryParams.d -emit-const-values-path /Users/admin/builder/spi-builder-workspace/.derivedData/Build/Intermediates.noindex/OAuth2.build/Debug-watchos/Flows.build/Objects-normal/arm64/OAuth2ImplicitGrantWithQueryParams.swiftconstvalues -emit-reference-dependencies-path /Users/admin/builder/spi-builder-workspace/.derivedData/Build/Intermediates.noindex/OAuth2.build/Debug-watchos/Flows.build/Objects-normal/arm64/OAuth2ImplicitGrantWithQueryParams.swiftdeps -serialize-diagnostics-path /Users/admin/builder/spi-builder-workspace/.derivedData/Build/Intermediates.noindex/OAuth2.build/Debug-watchos/Flows.build/Objects-normal/arm64/OAuth2ImplicitGrantWithQueryParams.dia -target arm64-apple-watchos5.0 -Xllvm -aarch64-use-tbi -enable-objc-interop -sdk /Applications/Xcode-16.2.0.app/Contents/Developer/Platforms/WatchOS.platform/Developer/SDKs/WatchOS11.2.sdk -I /Users/admin/builder/spi-builder-workspace/.derivedData/Build/Products/Debug-watchos -I /Applications/Xcode-16.2.0.app/Contents/Developer/Platforms/WatchOS.platform/Developer/usr/lib -F /Users/admin/builder/spi-builder-workspace/.derivedData/Build/Products/Debug-watchos/PackageFrameworks -F /Users/admin/builder/spi-builder-workspace/.derivedData/Build/Products/Debug-watchos/PackageFrameworks -F /Users/admin/builder/spi-builder-workspace/.derivedData/Build/Products/Debug-watchos/PackageFrameworks -F /Users/admin/builder/spi-builder-workspace/.derivedData/Build/Products/Debug-watchos/PackageFrameworks -F /Users/admin/builder/spi-builder-workspace/.derivedData/Build/Products/Debug-watchos/PackageFrameworks -F /Users/admin/builder/spi-builder-workspace/.derivedData/Build/Products/Debug-watchos -F /Applications/Xcode-16.2.0.app/Contents/Developer/Platforms/WatchOS.platform/Developer/Library/Frameworks -F /Applications/Xcode-16.2.0.app/Contents/Developer/Platforms/WatchOS.platform/Developer/SDKs/WatchOS11.2.sdk/Developer/Library/Frameworks -no-color-diagnostics -enable-testing -g -debug-info-format\=dwarf -dwarf-version\=4 -module-cache-path /Users/admin/builder/spi-builder-workspace/.derivedData/ModuleCache.noindex -suppress-warnings -profile-generate -profile-coverage-mapping -swift-version 5 -enforce-exclusivity\=checked -Onone -D SWIFT_PACKAGE -D DEBUG -D Xcode -serialize-debugging-options -const-gather-protocols-file /Users/admin/builder/spi-builder-workspace/.derivedData/Build/Intermediates.noindex/OAuth2.build/Debug-watchos/Flows.build/Objects-normal/arm64/Flows_const_extract_protocols.json -enable-experimental-feature DebugDescriptionMacro -enable-experimental-feature OpaqueTypeErasure -empty-abi-descriptor -plugin-path /Applications/Xcode-16.2.0.app/Contents/Developer/Toolchains/XcodeDefault.xctoolchain/usr/lib/swift/host/plugins/testing -validate-clang-modules-once -clang-build-session-file /Users/admin/builder/spi-builder-workspace/.derivedData/ModuleCache.noindex/Session.modulevalidation -Xcc -working-directory -Xcc /Users/admin/builder/spi-builder-workspace/.swiftpm/xcode -resource-dir /Applications/Xcode-16.2.0.app/Contents/Developer/Toolchains/XcodeDefault.xctoolchain/usr/lib/swift -enable-anonymous-context-mangled-names -file-compilation-dir /Users/admin/builder/spi-builder-workspace/.swiftpm/xcode -Xcc -D_LIBCPP_HARDENING_MODE\=_LIBCPP_HARDENING_MODE_DEBUG -Xcc -ivfsstatcache -Xcc /Users/admin/builder/spi-builder-workspace/.derivedData/SDKStatCaches.noindex/watchos11.2-22S97-8cb5c683f5e64b0ecfc74e8d0065fbf6.sdkstatcache -Xcc -I/Users/admin/builder/spi-builder-workspace/.derivedData/Build/Intermediates.noindex/OAuth2.build/Debug-watchos/Flows.build/swift-overrides.hmap -Xcc -I/Users/admin/builder/spi-builder-workspace/.derivedData/Build/Products/Debug-watchos/include -Xcc -I/Users/admin/builder/spi-builder-workspace/.derivedData/Build/Intermediates.noindex/OAuth2.build/Debug-watchos/Flows.build/DerivedSources-normal/arm64 -Xcc -I/Users/admin/builder/spi-builder-workspace/.derivedData/Build/Intermediates.noindex/OAuth2.build/Debug-watchos/Flows.build/DerivedSources/arm64 -Xcc -I/Users/admin/builder/spi-builder-workspace/.derivedData/Build/Intermediates.noindex/OAuth2.build/Debug-watchos/Flows.build/DerivedSources -Xcc -DSWIFT_PACKAGE -Xcc -DDEBUG\=1 -module-name Flows -frontend-parseable-output -disable-clang-spi -target-sdk-version 11.2 -target-sdk-name watchos11.2 -external-plugin-path /Applications/Xcode-16.2.0.app/Contents/Developer/Platforms/WatchOS.platform/Developer/usr/lib/swift/host/plugins\#/Applications/Xcode-16.2.0.app/Contents/Developer/Platforms/WatchOS.platform/Developer/usr/bin/swift-plugin-server -external-plugin-path /Applications/Xcode-16.2.0.app/Contents/Developer/Platforms/WatchOS.platform/Developer/usr/local/lib/swift/host/plugins\#/Applications/Xcode-16.2.0.app/Contents/Developer/Platforms/WatchOS.platform/Developer/usr/bin/swift-plugin-server -plugin-path /Applications/Xcode-16.2.0.app/Contents/Developer/Toolchains/XcodeDefault.xctoolchain/usr/lib/swift/host/plugins -plugin-path /Applications/Xcode-16.2.0.app/Contents/Developer/Toolchains/XcodeDefault.xctoolchain/usr/local/lib/swift/host/plugins -o /Users/admin/builder/spi-builder-workspace/.derivedData/Build/Intermediates.noindex/OAuth2.build/Debug-watchos/Flows.build/Objects-normal/arm64/OAuth2ImplicitGrantWithQueryParams.o -index-unit-output-path /OAuth2.build/Debug-watchos/Flows.build/Objects-normal/arm64/OAuth2ImplicitGrantWithQueryParams.o -index-store-path /Users/admin/builder/spi-builder-workspace/.derivedData/Index.noindex/DataStore -index-system-modules
SwiftCompile normal arm64 /Users/admin/builder/spi-builder-workspace/.dependencies/checkouts/OAuth2/Sources/Flows/OAuth2ImplicitGrantWithQueryParams.swift (in target 'Flows' from project 'OAuth2')
    cd /Users/admin/builder/spi-builder-workspace/.swiftpm/xcode
    /Applications/Xcode-16.2.0.app/Contents/Developer/Toolchains/XcodeDefault.xctoolchain/usr/bin/swift-frontend -c /Users/admin/builder/spi-builder-workspace/.dependencies/checkouts/OAuth2/Sources/Flows/OAuth2.swift /Users/admin/builder/spi-builder-workspace/.dependencies/checkouts/OAuth2/Sources/Flows/OAuth2ClientCredentials.swift /Users/admin/builder/spi-builder-workspace/.dependencies/checkouts/OAuth2/Sources/Flows/OAuth2ClientCredentialsReddit.swift /Users/admin/builder/spi-builder-workspace/.dependencies/checkouts/OAuth2/Sources/Flows/OAuth2CodeGrant.swift /Users/admin/builder/spi-builder-workspace/.dependencies/checkouts/OAuth2/Sources/Flows/OAuth2CodeGrantAzure.swift /Users/admin/builder/spi-builder-workspace/.dependencies/checkouts/OAuth2/Sources/Flows/OAuth2CodeGrantBasicAuth.swift /Users/admin/builder/spi-builder-workspace/.dependencies/checkouts/OAuth2/Sources/Flows/OAuth2CodeGrantFacebook.swift /Users/admin/builder/spi-builder-workspace/.dependencies/checkouts/OAuth2/Sources/Flows/OAuth2CodeGrantLinkedIn.swift /Users/admin/builder/spi-builder-workspace/.dependencies/checkouts/OAuth2/Sources/Flows/OAuth2CodeGrantNoTokenType.swift /Users/admin/builder/spi-builder-workspace/.dependencies/checkouts/OAuth2/Sources/Flows/OAuth2DeviceGrant.swift /Users/admin/builder/spi-builder-workspace/.dependencies/checkouts/OAuth2/Sources/Flows/OAuth2DynReg.swift /Users/admin/builder/spi-builder-workspace/.dependencies/checkouts/OAuth2/Sources/Flows/OAuth2ImplicitGrant.swift -primary-file /Users/admin/builder/spi-builder-workspace/.dependencies/checkouts/OAuth2/Sources/Flows/OAuth2ImplicitGrantWithQueryParams.swift /Users/admin/builder/spi-builder-workspace/.dependencies/checkouts/OAuth2/Sources/Flows/OAuth2PasswordGrant.swift -emit-dependencies-path /Users/admin/builder/spi-builder-workspace/.derivedData/Build/Intermediates.noindex/OAuth2.build/Debug-watchos/Flows.build/Objects-normal/arm64/OAuth2ImplicitGrantWithQueryParams.d -emit-const-values-path /Users/admin/builder/spi-builder-workspace/.derivedData/Build/Intermediates.noindex/OAuth2.build/Debug-watchos/Flows.build/Objects-normal/arm64/OAuth2ImplicitGrantWithQueryParams.swiftconstvalues -emit-reference-dependencies-path /Users/admin/builder/spi-builder-workspace/.derivedData/Build/Intermediates.noindex/OAuth2.build/Debug-watchos/Flows.build/Objects-normal/arm64/OAuth2ImplicitGrantWithQueryParams.swiftdeps -serialize-diagnostics-path /Users/admin/builder/spi-builder-workspace/.derivedData/Build/Intermediates.noindex/OAuth2.build/Debug-watchos/Flows.build/Objects-normal/arm64/OAuth2ImplicitGrantWithQueryParams.dia -target arm64-apple-watchos5.0 -Xllvm -aarch64-use-tbi -enable-objc-interop -sdk /Applications/Xcode-16.2.0.app/Contents/Developer/Platforms/WatchOS.platform/Developer/SDKs/WatchOS11.2.sdk -I /Users/admin/builder/spi-builder-workspace/.derivedData/Build/Products/Debug-watchos -I /Applications/Xcode-16.2.0.app/Contents/Developer/Platforms/WatchOS.platform/Developer/usr/lib -F /Users/admin/builder/spi-builder-workspace/.derivedData/Build/Products/Debug-watchos/PackageFrameworks -F /Users/admin/builder/spi-builder-workspace/.derivedData/Build/Products/Debug-watchos/PackageFrameworks -F /Users/admin/builder/spi-builder-workspace/.derivedData/Build/Products/Debug-watchos/PackageFrameworks -F /Users/admin/builder/spi-builder-workspace/.derivedData/Build/Products/Debug-watchos/PackageFrameworks -F /Users/admin/builder/spi-builder-workspace/.derivedData/Build/Products/Debug-watchos/PackageFrameworks -F /Users/admin/builder/spi-builder-workspace/.derivedData/Build/Products/Debug-watchos -F /Applications/Xcode-16.2.0.app/Contents/Developer/Platforms/WatchOS.platform/Developer/Library/Frameworks -F /Applications/Xcode-16.2.0.app/Contents/Developer/Platforms/WatchOS.platform/Developer/SDKs/WatchOS11.2.sdk/Developer/Library/Frameworks -no-color-diagnostics -enable-testing -g -debug-info-format\=dwarf -dwarf-version\=4 -module-cache-path /Users/admin/builder/spi-builder-workspace/.derivedData/ModuleCache.noindex -suppress-warnings -profile-generate -profile-coverage-mapping -swift-version 5 -enforce-exclusivity\=checked -Onone -D SWIFT_PACKAGE -D DEBUG -D Xcode -serialize-debugging-options -const-gather-protocols-file /Users/admin/builder/spi-builder-workspace/.derivedData/Build/Intermediates.noindex/OAuth2.build/Debug-watchos/Flows.build/Objects-normal/arm64/Flows_const_extract_protocols.json -enable-experimental-feature DebugDescriptionMacro -enable-experimental-feature OpaqueTypeErasure -empty-abi-descriptor -plugin-path /Applications/Xcode-16.2.0.app/Contents/Developer/Toolchains/XcodeDefault.xctoolchain/usr/lib/swift/host/plugins/testing -validate-clang-modules-once -clang-build-session-file /Users/admin/builder/spi-builder-workspace/.derivedData/ModuleCache.noindex/Session.modulevalidation -Xcc -working-directory -Xcc /Users/admin/builder/spi-builder-workspace/.swiftpm/xcode -resource-dir /Applications/Xcode-16.2.0.app/Contents/Developer/Toolchains/XcodeDefault.xctoolchain/usr/lib/swift -enable-anonymous-context-mangled-names -file-compilation-dir /Users/admin/builder/spi-builder-workspace/.swiftpm/xcode -Xcc -D_LIBCPP_HARDENING_MODE\=_LIBCPP_HARDENING_MODE_DEBUG -Xcc -ivfsstatcache -Xcc /Users/admin/builder/spi-builder-workspace/.derivedData/SDKStatCaches.noindex/watchos11.2-22S97-8cb5c683f5e64b0ecfc74e8d0065fbf6.sdkstatcache -Xcc -I/Users/admin/builder/spi-builder-workspace/.derivedData/Build/Intermediates.noindex/OAuth2.build/Debug-watchos/Flows.build/swift-overrides.hmap -Xcc -I/Users/admin/builder/spi-builder-workspace/.derivedData/Build/Products/Debug-watchos/include -Xcc -I/Users/admin/builder/spi-builder-workspace/.derivedData/Build/Intermediates.noindex/OAuth2.build/Debug-watchos/Flows.build/DerivedSources-normal/arm64 -Xcc -I/Users/admin/builder/spi-builder-workspace/.derivedData/Build/Intermediates.noindex/OAuth2.build/Debug-watchos/Flows.build/DerivedSources/arm64 -Xcc -I/Users/admin/builder/spi-builder-workspace/.derivedData/Build/Intermediates.noindex/OAuth2.build/Debug-watchos/Flows.build/DerivedSources -Xcc -DSWIFT_PACKAGE -Xcc -DDEBUG\=1 -module-name Flows -frontend-parseable-output -disable-clang-spi -target-sdk-version 11.2 -target-sdk-name watchos11.2 -external-plugin-path /Applications/Xcode-16.2.0.app/Contents/Developer/Platforms/WatchOS.platform/Developer/usr/lib/swift/host/plugins\#/Applications/Xcode-16.2.0.app/Contents/Developer/Platforms/WatchOS.platform/Developer/usr/bin/swift-plugin-server -external-plugin-path /Applications/Xcode-16.2.0.app/Contents/Developer/Platforms/WatchOS.platform/Developer/usr/local/lib/swift/host/plugins\#/Applications/Xcode-16.2.0.app/Contents/Developer/Platforms/WatchOS.platform/Developer/usr/bin/swift-plugin-server -plugin-path /Applications/Xcode-16.2.0.app/Contents/Developer/Toolchains/XcodeDefault.xctoolchain/usr/lib/swift/host/plugins -plugin-path /Applications/Xcode-16.2.0.app/Contents/Developer/Toolchains/XcodeDefault.xctoolchain/usr/local/lib/swift/host/plugins -o /Users/admin/builder/spi-builder-workspace/.derivedData/Build/Intermediates.noindex/OAuth2.build/Debug-watchos/Flows.build/Objects-normal/arm64/OAuth2ImplicitGrantWithQueryParams.o -index-unit-output-path /OAuth2.build/Debug-watchos/Flows.build/Objects-normal/arm64/OAuth2ImplicitGrantWithQueryParams.o -index-store-path /Users/admin/builder/spi-builder-workspace/.derivedData/Index.noindex/DataStore -index-system-modules
SwiftCompile normal arm64 Compiling\ OAuth2DeviceGrant.swift /Users/admin/builder/spi-builder-workspace/.dependencies/checkouts/OAuth2/Sources/Flows/OAuth2DeviceGrant.swift (in target 'Flows' from project 'OAuth2')
    cd /Users/admin/builder/spi-builder-workspace/.swiftpm/xcode
    builtin-swiftTaskExecution -- /Applications/Xcode-16.2.0.app/Contents/Developer/Toolchains/XcodeDefault.xctoolchain/usr/bin/swift-frontend -frontend -c /Users/admin/builder/spi-builder-workspace/.dependencies/checkouts/OAuth2/Sources/Flows/OAuth2.swift /Users/admin/builder/spi-builder-workspace/.dependencies/checkouts/OAuth2/Sources/Flows/OAuth2ClientCredentials.swift /Users/admin/builder/spi-builder-workspace/.dependencies/checkouts/OAuth2/Sources/Flows/OAuth2ClientCredentialsReddit.swift /Users/admin/builder/spi-builder-workspace/.dependencies/checkouts/OAuth2/Sources/Flows/OAuth2CodeGrant.swift /Users/admin/builder/spi-builder-workspace/.dependencies/checkouts/OAuth2/Sources/Flows/OAuth2CodeGrantAzure.swift /Users/admin/builder/spi-builder-workspace/.dependencies/checkouts/OAuth2/Sources/Flows/OAuth2CodeGrantBasicAuth.swift /Users/admin/builder/spi-builder-workspace/.dependencies/checkouts/OAuth2/Sources/Flows/OAuth2CodeGrantFacebook.swift /Users/admin/builder/spi-builder-workspace/.dependencies/checkouts/OAuth2/Sources/Flows/OAuth2CodeGrantLinkedIn.swift /Users/admin/builder/spi-builder-workspace/.dependencies/checkouts/OAuth2/Sources/Flows/OAuth2CodeGrantNoTokenType.swift -primary-file /Users/admin/builder/spi-builder-workspace/.dependencies/checkouts/OAuth2/Sources/Flows/OAuth2DeviceGrant.swift /Users/admin/builder/spi-builder-workspace/.dependencies/checkouts/OAuth2/Sources/Flows/OAuth2DynReg.swift /Users/admin/builder/spi-builder-workspace/.dependencies/checkouts/OAuth2/Sources/Flows/OAuth2ImplicitGrant.swift /Users/admin/builder/spi-builder-workspace/.dependencies/checkouts/OAuth2/Sources/Flows/OAuth2ImplicitGrantWithQueryParams.swift /Users/admin/builder/spi-builder-workspace/.dependencies/checkouts/OAuth2/Sources/Flows/OAuth2PasswordGrant.swift -emit-dependencies-path /Users/admin/builder/spi-builder-workspace/.derivedData/Build/Intermediates.noindex/OAuth2.build/Debug-watchos/Flows.build/Objects-normal/arm64/OAuth2DeviceGrant.d -emit-const-values-path /Users/admin/builder/spi-builder-workspace/.derivedData/Build/Intermediates.noindex/OAuth2.build/Debug-watchos/Flows.build/Objects-normal/arm64/OAuth2DeviceGrant.swiftconstvalues -emit-reference-dependencies-path /Users/admin/builder/spi-builder-workspace/.derivedData/Build/Intermediates.noindex/OAuth2.build/Debug-watchos/Flows.build/Objects-normal/arm64/OAuth2DeviceGrant.swiftdeps -serialize-diagnostics-path /Users/admin/builder/spi-builder-workspace/.derivedData/Build/Intermediates.noindex/OAuth2.build/Debug-watchos/Flows.build/Objects-normal/arm64/OAuth2DeviceGrant.dia -target arm64-apple-watchos5.0 -Xllvm -aarch64-use-tbi -enable-objc-interop -sdk /Applications/Xcode-16.2.0.app/Contents/Developer/Platforms/WatchOS.platform/Developer/SDKs/WatchOS11.2.sdk -I /Users/admin/builder/spi-builder-workspace/.derivedData/Build/Products/Debug-watchos -I /Applications/Xcode-16.2.0.app/Contents/Developer/Platforms/WatchOS.platform/Developer/usr/lib -F /Users/admin/builder/spi-builder-workspace/.derivedData/Build/Products/Debug-watchos/PackageFrameworks -F /Users/admin/builder/spi-builder-workspace/.derivedData/Build/Products/Debug-watchos/PackageFrameworks -F /Users/admin/builder/spi-builder-workspace/.derivedData/Build/Products/Debug-watchos/PackageFrameworks -F /Users/admin/builder/spi-builder-workspace/.derivedData/Build/Products/Debug-watchos/PackageFrameworks -F /Users/admin/builder/spi-builder-workspace/.derivedData/Build/Products/Debug-watchos/PackageFrameworks -F /Users/admin/builder/spi-builder-workspace/.derivedData/Build/Products/Debug-watchos -F /Applications/Xcode-16.2.0.app/Contents/Developer/Platforms/WatchOS.platform/Developer/Library/Frameworks -F /Applications/Xcode-16.2.0.app/Contents/Developer/Platforms/WatchOS.platform/Developer/SDKs/WatchOS11.2.sdk/Developer/Library/Frameworks -no-color-diagnostics -enable-testing -g -debug-info-format\=dwarf -dwarf-version\=4 -module-cache-path /Users/admin/builder/spi-builder-workspace/.derivedData/ModuleCache.noindex -suppress-warnings -profile-generate -profile-coverage-mapping -swift-version 5 -enforce-exclusivity\=checked -Onone -D SWIFT_PACKAGE -D DEBUG -D Xcode -serialize-debugging-options -const-gather-protocols-file /Users/admin/builder/spi-builder-workspace/.derivedData/Build/Intermediates.noindex/OAuth2.build/Debug-watchos/Flows.build/Objects-normal/arm64/Flows_const_extract_protocols.json -enable-experimental-feature DebugDescriptionMacro -enable-experimental-feature OpaqueTypeErasure -empty-abi-descriptor -plugin-path /Applications/Xcode-16.2.0.app/Contents/Developer/Toolchains/XcodeDefault.xctoolchain/usr/lib/swift/host/plugins/testing -validate-clang-modules-once -clang-build-session-file /Users/admin/builder/spi-builder-workspace/.derivedData/ModuleCache.noindex/Session.modulevalidation -Xcc -working-directory -Xcc /Users/admin/builder/spi-builder-workspace/.swiftpm/xcode -resource-dir /Applications/Xcode-16.2.0.app/Contents/Developer/Toolchains/XcodeDefault.xctoolchain/usr/lib/swift -enable-anonymous-context-mangled-names -file-compilation-dir /Users/admin/builder/spi-builder-workspace/.swiftpm/xcode -Xcc -D_LIBCPP_HARDENING_MODE\=_LIBCPP_HARDENING_MODE_DEBUG -Xcc -ivfsstatcache -Xcc /Users/admin/builder/spi-builder-workspace/.derivedData/SDKStatCaches.noindex/watchos11.2-22S97-8cb5c683f5e64b0ecfc74e8d0065fbf6.sdkstatcache -Xcc -I/Users/admin/builder/spi-builder-workspace/.derivedData/Build/Intermediates.noindex/OAuth2.build/Debug-watchos/Flows.build/swift-overrides.hmap -Xcc -I/Users/admin/builder/spi-builder-workspace/.derivedData/Build/Products/Debug-watchos/include -Xcc -I/Users/admin/builder/spi-builder-workspace/.derivedData/Build/Intermediates.noindex/OAuth2.build/Debug-watchos/Flows.build/DerivedSources-normal/arm64 -Xcc -I/Users/admin/builder/spi-builder-workspace/.derivedData/Build/Intermediates.noindex/OAuth2.build/Debug-watchos/Flows.build/DerivedSources/arm64 -Xcc -I/Users/admin/builder/spi-builder-workspace/.derivedData/Build/Intermediates.noindex/OAuth2.build/Debug-watchos/Flows.build/DerivedSources -Xcc -DSWIFT_PACKAGE -Xcc -DDEBUG\=1 -module-name Flows -frontend-parseable-output -disable-clang-spi -target-sdk-version 11.2 -target-sdk-name watchos11.2 -external-plugin-path /Applications/Xcode-16.2.0.app/Contents/Developer/Platforms/WatchOS.platform/Developer/usr/lib/swift/host/plugins\#/Applications/Xcode-16.2.0.app/Contents/Developer/Platforms/WatchOS.platform/Developer/usr/bin/swift-plugin-server -external-plugin-path /Applications/Xcode-16.2.0.app/Contents/Developer/Platforms/WatchOS.platform/Developer/usr/local/lib/swift/host/plugins\#/Applications/Xcode-16.2.0.app/Contents/Developer/Platforms/WatchOS.platform/Developer/usr/bin/swift-plugin-server -plugin-path /Applications/Xcode-16.2.0.app/Contents/Developer/Toolchains/XcodeDefault.xctoolchain/usr/lib/swift/host/plugins -plugin-path /Applications/Xcode-16.2.0.app/Contents/Developer/Toolchains/XcodeDefault.xctoolchain/usr/local/lib/swift/host/plugins -o /Users/admin/builder/spi-builder-workspace/.derivedData/Build/Intermediates.noindex/OAuth2.build/Debug-watchos/Flows.build/Objects-normal/arm64/OAuth2DeviceGrant.o -index-unit-output-path /OAuth2.build/Debug-watchos/Flows.build/Objects-normal/arm64/OAuth2DeviceGrant.o -index-store-path /Users/admin/builder/spi-builder-workspace/.derivedData/Index.noindex/DataStore -index-system-modules
SwiftCompile normal arm64 /Users/admin/builder/spi-builder-workspace/.dependencies/checkouts/OAuth2/Sources/Flows/OAuth2DeviceGrant.swift (in target 'Flows' from project 'OAuth2')
    cd /Users/admin/builder/spi-builder-workspace/.swiftpm/xcode
    /Applications/Xcode-16.2.0.app/Contents/Developer/Toolchains/XcodeDefault.xctoolchain/usr/bin/swift-frontend -c /Users/admin/builder/spi-builder-workspace/.dependencies/checkouts/OAuth2/Sources/Flows/OAuth2.swift /Users/admin/builder/spi-builder-workspace/.dependencies/checkouts/OAuth2/Sources/Flows/OAuth2ClientCredentials.swift /Users/admin/builder/spi-builder-workspace/.dependencies/checkouts/OAuth2/Sources/Flows/OAuth2ClientCredentialsReddit.swift /Users/admin/builder/spi-builder-workspace/.dependencies/checkouts/OAuth2/Sources/Flows/OAuth2CodeGrant.swift /Users/admin/builder/spi-builder-workspace/.dependencies/checkouts/OAuth2/Sources/Flows/OAuth2CodeGrantAzure.swift /Users/admin/builder/spi-builder-workspace/.dependencies/checkouts/OAuth2/Sources/Flows/OAuth2CodeGrantBasicAuth.swift /Users/admin/builder/spi-builder-workspace/.dependencies/checkouts/OAuth2/Sources/Flows/OAuth2CodeGrantFacebook.swift /Users/admin/builder/spi-builder-workspace/.dependencies/checkouts/OAuth2/Sources/Flows/OAuth2CodeGrantLinkedIn.swift /Users/admin/builder/spi-builder-workspace/.dependencies/checkouts/OAuth2/Sources/Flows/OAuth2CodeGrantNoTokenType.swift -primary-file /Users/admin/builder/spi-builder-workspace/.dependencies/checkouts/OAuth2/Sources/Flows/OAuth2DeviceGrant.swift /Users/admin/builder/spi-builder-workspace/.dependencies/checkouts/OAuth2/Sources/Flows/OAuth2DynReg.swift /Users/admin/builder/spi-builder-workspace/.dependencies/checkouts/OAuth2/Sources/Flows/OAuth2ImplicitGrant.swift /Users/admin/builder/spi-builder-workspace/.dependencies/checkouts/OAuth2/Sources/Flows/OAuth2ImplicitGrantWithQueryParams.swift /Users/admin/builder/spi-builder-workspace/.dependencies/checkouts/OAuth2/Sources/Flows/OAuth2PasswordGrant.swift -emit-dependencies-path /Users/admin/builder/spi-builder-workspace/.derivedData/Build/Intermediates.noindex/OAuth2.build/Debug-watchos/Flows.build/Objects-normal/arm64/OAuth2DeviceGrant.d -emit-const-values-path /Users/admin/builder/spi-builder-workspace/.derivedData/Build/Intermediates.noindex/OAuth2.build/Debug-watchos/Flows.build/Objects-normal/arm64/OAuth2DeviceGrant.swiftconstvalues -emit-reference-dependencies-path /Users/admin/builder/spi-builder-workspace/.derivedData/Build/Intermediates.noindex/OAuth2.build/Debug-watchos/Flows.build/Objects-normal/arm64/OAuth2DeviceGrant.swiftdeps -serialize-diagnostics-path /Users/admin/builder/spi-builder-workspace/.derivedData/Build/Intermediates.noindex/OAuth2.build/Debug-watchos/Flows.build/Objects-normal/arm64/OAuth2DeviceGrant.dia -target arm64-apple-watchos5.0 -Xllvm -aarch64-use-tbi -enable-objc-interop -sdk /Applications/Xcode-16.2.0.app/Contents/Developer/Platforms/WatchOS.platform/Developer/SDKs/WatchOS11.2.sdk -I /Users/admin/builder/spi-builder-workspace/.derivedData/Build/Products/Debug-watchos -I /Applications/Xcode-16.2.0.app/Contents/Developer/Platforms/WatchOS.platform/Developer/usr/lib -F /Users/admin/builder/spi-builder-workspace/.derivedData/Build/Products/Debug-watchos/PackageFrameworks -F /Users/admin/builder/spi-builder-workspace/.derivedData/Build/Products/Debug-watchos/PackageFrameworks -F /Users/admin/builder/spi-builder-workspace/.derivedData/Build/Products/Debug-watchos/PackageFrameworks -F /Users/admin/builder/spi-builder-workspace/.derivedData/Build/Products/Debug-watchos/PackageFrameworks -F /Users/admin/builder/spi-builder-workspace/.derivedData/Build/Products/Debug-watchos/PackageFrameworks -F /Users/admin/builder/spi-builder-workspace/.derivedData/Build/Products/Debug-watchos -F /Applications/Xcode-16.2.0.app/Contents/Developer/Platforms/WatchOS.platform/Developer/Library/Frameworks -F /Applications/Xcode-16.2.0.app/Contents/Developer/Platforms/WatchOS.platform/Developer/SDKs/WatchOS11.2.sdk/Developer/Library/Frameworks -no-color-diagnostics -enable-testing -g -debug-info-format\=dwarf -dwarf-version\=4 -module-cache-path /Users/admin/builder/spi-builder-workspace/.derivedData/ModuleCache.noindex -suppress-warnings -profile-generate -profile-coverage-mapping -swift-version 5 -enforce-exclusivity\=checked -Onone -D SWIFT_PACKAGE -D DEBUG -D Xcode -serialize-debugging-options -const-gather-protocols-file /Users/admin/builder/spi-builder-workspace/.derivedData/Build/Intermediates.noindex/OAuth2.build/Debug-watchos/Flows.build/Objects-normal/arm64/Flows_const_extract_protocols.json -enable-experimental-feature DebugDescriptionMacro -enable-experimental-feature OpaqueTypeErasure -empty-abi-descriptor -plugin-path /Applications/Xcode-16.2.0.app/Contents/Developer/Toolchains/XcodeDefault.xctoolchain/usr/lib/swift/host/plugins/testing -validate-clang-modules-once -clang-build-session-file /Users/admin/builder/spi-builder-workspace/.derivedData/ModuleCache.noindex/Session.modulevalidation -Xcc -working-directory -Xcc /Users/admin/builder/spi-builder-workspace/.swiftpm/xcode -resource-dir /Applications/Xcode-16.2.0.app/Contents/Developer/Toolchains/XcodeDefault.xctoolchain/usr/lib/swift -enable-anonymous-context-mangled-names -file-compilation-dir /Users/admin/builder/spi-builder-workspace/.swiftpm/xcode -Xcc -D_LIBCPP_HARDENING_MODE\=_LIBCPP_HARDENING_MODE_DEBUG -Xcc -ivfsstatcache -Xcc /Users/admin/builder/spi-builder-workspace/.derivedData/SDKStatCaches.noindex/watchos11.2-22S97-8cb5c683f5e64b0ecfc74e8d0065fbf6.sdkstatcache -Xcc -I/Users/admin/builder/spi-builder-workspace/.derivedData/Build/Intermediates.noindex/OAuth2.build/Debug-watchos/Flows.build/swift-overrides.hmap -Xcc -I/Users/admin/builder/spi-builder-workspace/.derivedData/Build/Products/Debug-watchos/include -Xcc -I/Users/admin/builder/spi-builder-workspace/.derivedData/Build/Intermediates.noindex/OAuth2.build/Debug-watchos/Flows.build/DerivedSources-normal/arm64 -Xcc -I/Users/admin/builder/spi-builder-workspace/.derivedData/Build/Intermediates.noindex/OAuth2.build/Debug-watchos/Flows.build/DerivedSources/arm64 -Xcc -I/Users/admin/builder/spi-builder-workspace/.derivedData/Build/Intermediates.noindex/OAuth2.build/Debug-watchos/Flows.build/DerivedSources -Xcc -DSWIFT_PACKAGE -Xcc -DDEBUG\=1 -module-name Flows -frontend-parseable-output -disable-clang-spi -target-sdk-version 11.2 -target-sdk-name watchos11.2 -external-plugin-path /Applications/Xcode-16.2.0.app/Contents/Developer/Platforms/WatchOS.platform/Developer/usr/lib/swift/host/plugins\#/Applications/Xcode-16.2.0.app/Contents/Developer/Platforms/WatchOS.platform/Developer/usr/bin/swift-plugin-server -external-plugin-path /Applications/Xcode-16.2.0.app/Contents/Developer/Platforms/WatchOS.platform/Developer/usr/local/lib/swift/host/plugins\#/Applications/Xcode-16.2.0.app/Contents/Developer/Platforms/WatchOS.platform/Developer/usr/bin/swift-plugin-server -plugin-path /Applications/Xcode-16.2.0.app/Contents/Developer/Toolchains/XcodeDefault.xctoolchain/usr/lib/swift/host/plugins -plugin-path /Applications/Xcode-16.2.0.app/Contents/Developer/Toolchains/XcodeDefault.xctoolchain/usr/local/lib/swift/host/plugins -o /Users/admin/builder/spi-builder-workspace/.derivedData/Build/Intermediates.noindex/OAuth2.build/Debug-watchos/Flows.build/Objects-normal/arm64/OAuth2DeviceGrant.o -index-unit-output-path /OAuth2.build/Debug-watchos/Flows.build/Objects-normal/arm64/OAuth2DeviceGrant.o -index-store-path /Users/admin/builder/spi-builder-workspace/.derivedData/Index.noindex/DataStore -index-system-modules
SwiftCompile normal arm64 Compiling\ OAuth2CodeGrantFacebook.swift,\ OAuth2CodeGrantLinkedIn.swift /Users/admin/builder/spi-builder-workspace/.dependencies/checkouts/OAuth2/Sources/Flows/OAuth2CodeGrantFacebook.swift /Users/admin/builder/spi-builder-workspace/.dependencies/checkouts/OAuth2/Sources/Flows/OAuth2CodeGrantLinkedIn.swift (in target 'Flows' from project 'OAuth2')
    cd /Users/admin/builder/spi-builder-workspace/.swiftpm/xcode
    builtin-swiftTaskExecution -- /Applications/Xcode-16.2.0.app/Contents/Developer/Toolchains/XcodeDefault.xctoolchain/usr/bin/swift-frontend -frontend -c /Users/admin/builder/spi-builder-workspace/.dependencies/checkouts/OAuth2/Sources/Flows/OAuth2.swift /Users/admin/builder/spi-builder-workspace/.dependencies/checkouts/OAuth2/Sources/Flows/OAuth2ClientCredentials.swift /Users/admin/builder/spi-builder-workspace/.dependencies/checkouts/OAuth2/Sources/Flows/OAuth2ClientCredentialsReddit.swift /Users/admin/builder/spi-builder-workspace/.dependencies/checkouts/OAuth2/Sources/Flows/OAuth2CodeGrant.swift /Users/admin/builder/spi-builder-workspace/.dependencies/checkouts/OAuth2/Sources/Flows/OAuth2CodeGrantAzure.swift /Users/admin/builder/spi-builder-workspace/.dependencies/checkouts/OAuth2/Sources/Flows/OAuth2CodeGrantBasicAuth.swift -primary-file /Users/admin/builder/spi-builder-workspace/.dependencies/checkouts/OAuth2/Sources/Flows/OAuth2CodeGrantFacebook.swift -primary-file /Users/admin/builder/spi-builder-workspace/.dependencies/checkouts/OAuth2/Sources/Flows/OAuth2CodeGrantLinkedIn.swift /Users/admin/builder/spi-builder-workspace/.dependencies/checkouts/OAuth2/Sources/Flows/OAuth2CodeGrantNoTokenType.swift /Users/admin/builder/spi-builder-workspace/.dependencies/checkouts/OAuth2/Sources/Flows/OAuth2DeviceGrant.swift /Users/admin/builder/spi-builder-workspace/.dependencies/checkouts/OAuth2/Sources/Flows/OAuth2DynReg.swift /Users/admin/builder/spi-builder-workspace/.dependencies/checkouts/OAuth2/Sources/Flows/OAuth2ImplicitGrant.swift /Users/admin/builder/spi-builder-workspace/.dependencies/checkouts/OAuth2/Sources/Flows/OAuth2ImplicitGrantWithQueryParams.swift /Users/admin/builder/spi-builder-workspace/.dependencies/checkouts/OAuth2/Sources/Flows/OAuth2PasswordGrant.swift -emit-dependencies-path /Users/admin/builder/spi-builder-workspace/.derivedData/Build/Intermediates.noindex/OAuth2.build/Debug-watchos/Flows.build/Objects-normal/arm64/OAuth2CodeGrantFacebook.d -emit-const-values-path /Users/admin/builder/spi-builder-workspace/.derivedData/Build/Intermediates.noindex/OAuth2.build/Debug-watchos/Flows.build/Objects-normal/arm64/OAuth2CodeGrantFacebook.swiftconstvalues -emit-reference-dependencies-path /Users/admin/builder/spi-builder-workspace/.derivedData/Build/Intermediates.noindex/OAuth2.build/Debug-watchos/Flows.build/Objects-normal/arm64/OAuth2CodeGrantFacebook.swiftdeps -serialize-diagnostics-path /Users/admin/builder/spi-builder-workspace/.derivedData/Build/Intermediates.noindex/OAuth2.build/Debug-watchos/Flows.build/Objects-normal/arm64/OAuth2CodeGrantFacebook.dia -emit-dependencies-path /Users/admin/builder/spi-builder-workspace/.derivedData/Build/Intermediates.noindex/OAuth2.build/Debug-watchos/Flows.build/Objects-normal/arm64/OAuth2CodeGrantLinkedIn.d -emit-const-values-path /Users/admin/builder/spi-builder-workspace/.derivedData/Build/Intermediates.noindex/OAuth2.build/Debug-watchos/Flows.build/Objects-normal/arm64/OAuth2CodeGrantLinkedIn.swiftconstvalues -emit-reference-dependencies-path /Users/admin/builder/spi-builder-workspace/.derivedData/Build/Intermediates.noindex/OAuth2.build/Debug-watchos/Flows.build/Objects-normal/arm64/OAuth2CodeGrantLinkedIn.swiftdeps -serialize-diagnostics-path /Users/admin/builder/spi-builder-workspace/.derivedData/Build/Intermediates.noindex/OAuth2.build/Debug-watchos/Flows.build/Objects-normal/arm64/OAuth2CodeGrantLinkedIn.dia -target arm64-apple-watchos5.0 -Xllvm -aarch64-use-tbi -enable-objc-interop -sdk /Applications/Xcode-16.2.0.app/Contents/Developer/Platforms/WatchOS.platform/Developer/SDKs/WatchOS11.2.sdk -I /Users/admin/builder/spi-builder-workspace/.derivedData/Build/Products/Debug-watchos -I /Applications/Xcode-16.2.0.app/Contents/Developer/Platforms/WatchOS.platform/Developer/usr/lib -F /Users/admin/builder/spi-builder-workspace/.derivedData/Build/Products/Debug-watchos/PackageFrameworks -F /Users/admin/builder/spi-builder-workspace/.derivedData/Build/Products/Debug-watchos/PackageFrameworks -F /Users/admin/builder/spi-builder-workspace/.derivedData/Build/Products/Debug-watchos/PackageFrameworks -F /Users/admin/builder/spi-builder-workspace/.derivedData/Build/Products/Debug-watchos/PackageFrameworks -F /Users/admin/builder/spi-builder-workspace/.derivedData/Build/Products/Debug-watchos/PackageFrameworks -F /Users/admin/builder/spi-builder-workspace/.derivedData/Build/Products/Debug-watchos -F /Applications/Xcode-16.2.0.app/Contents/Developer/Platforms/WatchOS.platform/Developer/Library/Frameworks -F /Applications/Xcode-16.2.0.app/Contents/Developer/Platforms/WatchOS.platform/Developer/SDKs/WatchOS11.2.sdk/Developer/Library/Frameworks -no-color-diagnostics -enable-testing -g -debug-info-format\=dwarf -dwarf-version\=4 -module-cache-path /Users/admin/builder/spi-builder-workspace/.derivedData/ModuleCache.noindex -suppress-warnings -profile-generate -profile-coverage-mapping -swift-version 5 -enforce-exclusivity\=checked -Onone -D SWIFT_PACKAGE -D DEBUG -D Xcode -serialize-debugging-options -const-gather-protocols-file /Users/admin/builder/spi-builder-workspace/.derivedData/Build/Intermediates.noindex/OAuth2.build/Debug-watchos/Flows.build/Objects-normal/arm64/Flows_const_extract_protocols.json -enable-experimental-feature DebugDescriptionMacro -enable-experimental-feature OpaqueTypeErasure -empty-abi-descriptor -plugin-path /Applications/Xcode-16.2.0.app/Contents/Developer/Toolchains/XcodeDefault.xctoolchain/usr/lib/swift/host/plugins/testing -validate-clang-modules-once -clang-build-session-file /Users/admin/builder/spi-builder-workspace/.derivedData/ModuleCache.noindex/Session.modulevalidation -Xcc -working-directory -Xcc /Users/admin/builder/spi-builder-workspace/.swiftpm/xcode -resource-dir /Applications/Xcode-16.2.0.app/Contents/Developer/Toolchains/XcodeDefault.xctoolchain/usr/lib/swift -enable-anonymous-context-mangled-names -file-compilation-dir /Users/admin/builder/spi-builder-workspace/.swiftpm/xcode -Xcc -D_LIBCPP_HARDENING_MODE\=_LIBCPP_HARDENING_MODE_DEBUG -Xcc -ivfsstatcache -Xcc /Users/admin/builder/spi-builder-workspace/.derivedData/SDKStatCaches.noindex/watchos11.2-22S97-8cb5c683f5e64b0ecfc74e8d0065fbf6.sdkstatcache -Xcc -I/Users/admin/builder/spi-builder-workspace/.derivedData/Build/Intermediates.noindex/OAuth2.build/Debug-watchos/Flows.build/swift-overrides.hmap -Xcc -I/Users/admin/builder/spi-builder-workspace/.derivedData/Build/Products/Debug-watchos/include -Xcc -I/Users/admin/builder/spi-builder-workspace/.derivedData/Build/Intermediates.noindex/OAuth2.build/Debug-watchos/Flows.build/DerivedSources-normal/arm64 -Xcc -I/Users/admin/builder/spi-builder-workspace/.derivedData/Build/Intermediates.noindex/OAuth2.build/Debug-watchos/Flows.build/DerivedSources/arm64 -Xcc -I/Users/admin/builder/spi-builder-workspace/.derivedData/Build/Intermediates.noindex/OAuth2.build/Debug-watchos/Flows.build/DerivedSources -Xcc -DSWIFT_PACKAGE -Xcc -DDEBUG\=1 -module-name Flows -frontend-parseable-output -disable-clang-spi -target-sdk-version 11.2 -target-sdk-name watchos11.2 -external-plugin-path /Applications/Xcode-16.2.0.app/Contents/Developer/Platforms/WatchOS.platform/Developer/usr/lib/swift/host/plugins\#/Applications/Xcode-16.2.0.app/Contents/Developer/Platforms/WatchOS.platform/Developer/usr/bin/swift-plugin-server -external-plugin-path /Applications/Xcode-16.2.0.app/Contents/Developer/Platforms/WatchOS.platform/Developer/usr/local/lib/swift/host/plugins\#/Applications/Xcode-16.2.0.app/Contents/Developer/Platforms/WatchOS.platform/Developer/usr/bin/swift-plugin-server -plugin-path /Applications/Xcode-16.2.0.app/Contents/Developer/Toolchains/XcodeDefault.xctoolchain/usr/lib/swift/host/plugins -plugin-path /Applications/Xcode-16.2.0.app/Contents/Developer/Toolchains/XcodeDefault.xctoolchain/usr/local/lib/swift/host/plugins -o /Users/admin/builder/spi-builder-workspace/.derivedData/Build/Intermediates.noindex/OAuth2.build/Debug-watchos/Flows.build/Objects-normal/arm64/OAuth2CodeGrantFacebook.o -o /Users/admin/builder/spi-builder-workspace/.derivedData/Build/Intermediates.noindex/OAuth2.build/Debug-watchos/Flows.build/Objects-normal/arm64/OAuth2CodeGrantLinkedIn.o -index-unit-output-path /OAuth2.build/Debug-watchos/Flows.build/Objects-normal/arm64/OAuth2CodeGrantFacebook.o -index-unit-output-path /OAuth2.build/Debug-watchos/Flows.build/Objects-normal/arm64/OAuth2CodeGrantLinkedIn.o -index-store-path /Users/admin/builder/spi-builder-workspace/.derivedData/Index.noindex/DataStore -index-system-modules
SwiftCompile normal arm64 /Users/admin/builder/spi-builder-workspace/.dependencies/checkouts/OAuth2/Sources/Flows/OAuth2CodeGrantFacebook.swift (in target 'Flows' from project 'OAuth2')
    cd /Users/admin/builder/spi-builder-workspace/.swiftpm/xcode
    /Applications/Xcode-16.2.0.app/Contents/Developer/Toolchains/XcodeDefault.xctoolchain/usr/bin/swift-frontend -c /Users/admin/builder/spi-builder-workspace/.dependencies/checkouts/OAuth2/Sources/Flows/OAuth2.swift /Users/admin/builder/spi-builder-workspace/.dependencies/checkouts/OAuth2/Sources/Flows/OAuth2ClientCredentials.swift /Users/admin/builder/spi-builder-workspace/.dependencies/checkouts/OAuth2/Sources/Flows/OAuth2ClientCredentialsReddit.swift /Users/admin/builder/spi-builder-workspace/.dependencies/checkouts/OAuth2/Sources/Flows/OAuth2CodeGrant.swift /Users/admin/builder/spi-builder-workspace/.dependencies/checkouts/OAuth2/Sources/Flows/OAuth2CodeGrantAzure.swift /Users/admin/builder/spi-builder-workspace/.dependencies/checkouts/OAuth2/Sources/Flows/OAuth2CodeGrantBasicAuth.swift -primary-file /Users/admin/builder/spi-builder-workspace/.dependencies/checkouts/OAuth2/Sources/Flows/OAuth2CodeGrantFacebook.swift -primary-file /Users/admin/builder/spi-builder-workspace/.dependencies/checkouts/OAuth2/Sources/Flows/OAuth2CodeGrantLinkedIn.swift /Users/admin/builder/spi-builder-workspace/.dependencies/checkouts/OAuth2/Sources/Flows/OAuth2CodeGrantNoTokenType.swift /Users/admin/builder/spi-builder-workspace/.dependencies/checkouts/OAuth2/Sources/Flows/OAuth2DeviceGrant.swift /Users/admin/builder/spi-builder-workspace/.dependencies/checkouts/OAuth2/Sources/Flows/OAuth2DynReg.swift /Users/admin/builder/spi-builder-workspace/.dependencies/checkouts/OAuth2/Sources/Flows/OAuth2ImplicitGrant.swift /Users/admin/builder/spi-builder-workspace/.dependencies/checkouts/OAuth2/Sources/Flows/OAuth2ImplicitGrantWithQueryParams.swift /Users/admin/builder/spi-builder-workspace/.dependencies/checkouts/OAuth2/Sources/Flows/OAuth2PasswordGrant.swift -emit-dependencies-path /Users/admin/builder/spi-builder-workspace/.derivedData/Build/Intermediates.noindex/OAuth2.build/Debug-watchos/Flows.build/Objects-normal/arm64/OAuth2CodeGrantFacebook.d -emit-const-values-path /Users/admin/builder/spi-builder-workspace/.derivedData/Build/Intermediates.noindex/OAuth2.build/Debug-watchos/Flows.build/Objects-normal/arm64/OAuth2CodeGrantFacebook.swiftconstvalues -emit-reference-dependencies-path /Users/admin/builder/spi-builder-workspace/.derivedData/Build/Intermediates.noindex/OAuth2.build/Debug-watchos/Flows.build/Objects-normal/arm64/OAuth2CodeGrantFacebook.swiftdeps -serialize-diagnostics-path /Users/admin/builder/spi-builder-workspace/.derivedData/Build/Intermediates.noindex/OAuth2.build/Debug-watchos/Flows.build/Objects-normal/arm64/OAuth2CodeGrantFacebook.dia -emit-dependencies-path /Users/admin/builder/spi-builder-workspace/.derivedData/Build/Intermediates.noindex/OAuth2.build/Debug-watchos/Flows.build/Objects-normal/arm64/OAuth2CodeGrantLinkedIn.d -emit-const-values-path /Users/admin/builder/spi-builder-workspace/.derivedData/Build/Intermediates.noindex/OAuth2.build/Debug-watchos/Flows.build/Objects-normal/arm64/OAuth2CodeGrantLinkedIn.swiftconstvalues -emit-reference-dependencies-path /Users/admin/builder/spi-builder-workspace/.derivedData/Build/Intermediates.noindex/OAuth2.build/Debug-watchos/Flows.build/Objects-normal/arm64/OAuth2CodeGrantLinkedIn.swiftdeps -serialize-diagnostics-path /Users/admin/builder/spi-builder-workspace/.derivedData/Build/Intermediates.noindex/OAuth2.build/Debug-watchos/Flows.build/Objects-normal/arm64/OAuth2CodeGrantLinkedIn.dia -target arm64-apple-watchos5.0 -Xllvm -aarch64-use-tbi -enable-objc-interop -sdk /Applications/Xcode-16.2.0.app/Contents/Developer/Platforms/WatchOS.platform/Developer/SDKs/WatchOS11.2.sdk -I /Users/admin/builder/spi-builder-workspace/.derivedData/Build/Products/Debug-watchos -I /Applications/Xcode-16.2.0.app/Contents/Developer/Platforms/WatchOS.platform/Developer/usr/lib -F /Users/admin/builder/spi-builder-workspace/.derivedData/Build/Products/Debug-watchos/PackageFrameworks -F /Users/admin/builder/spi-builder-workspace/.derivedData/Build/Products/Debug-watchos/PackageFrameworks -F /Users/admin/builder/spi-builder-workspace/.derivedData/Build/Products/Debug-watchos/PackageFrameworks -F /Users/admin/builder/spi-builder-workspace/.derivedData/Build/Products/Debug-watchos/PackageFrameworks -F /Users/admin/builder/spi-builder-workspace/.derivedData/Build/Products/Debug-watchos/PackageFrameworks -F /Users/admin/builder/spi-builder-workspace/.derivedData/Build/Products/Debug-watchos -F /Applications/Xcode-16.2.0.app/Contents/Developer/Platforms/WatchOS.platform/Developer/Library/Frameworks -F /Applications/Xcode-16.2.0.app/Contents/Developer/Platforms/WatchOS.platform/Developer/SDKs/WatchOS11.2.sdk/Developer/Library/Frameworks -no-color-diagnostics -enable-testing -g -debug-info-format\=dwarf -dwarf-version\=4 -module-cache-path /Users/admin/builder/spi-builder-workspace/.derivedData/ModuleCache.noindex -suppress-warnings -profile-generate -profile-coverage-mapping -swift-version 5 -enforce-exclusivity\=checked -Onone -D SWIFT_PACKAGE -D DEBUG -D Xcode -serialize-debugging-options -const-gather-protocols-file /Users/admin/builder/spi-builder-workspace/.derivedData/Build/Intermediates.noindex/OAuth2.build/Debug-watchos/Flows.build/Objects-normal/arm64/Flows_const_extract_protocols.json -enable-experimental-feature DebugDescriptionMacro -enable-experimental-feature OpaqueTypeErasure -empty-abi-descriptor -plugin-path /Applications/Xcode-16.2.0.app/Contents/Developer/Toolchains/XcodeDefault.xctoolchain/usr/lib/swift/host/plugins/testing -validate-clang-modules-once -clang-build-session-file /Users/admin/builder/spi-builder-workspace/.derivedData/ModuleCache.noindex/Session.modulevalidation -Xcc -working-directory -Xcc /Users/admin/builder/spi-builder-workspace/.swiftpm/xcode -resource-dir /Applications/Xcode-16.2.0.app/Contents/Developer/Toolchains/XcodeDefault.xctoolchain/usr/lib/swift -enable-anonymous-context-mangled-names -file-compilation-dir /Users/admin/builder/spi-builder-workspace/.swiftpm/xcode -Xcc -D_LIBCPP_HARDENING_MODE\=_LIBCPP_HARDENING_MODE_DEBUG -Xcc -ivfsstatcache -Xcc /Users/admin/builder/spi-builder-workspace/.derivedData/SDKStatCaches.noindex/watchos11.2-22S97-8cb5c683f5e64b0ecfc74e8d0065fbf6.sdkstatcache -Xcc -I/Users/admin/builder/spi-builder-workspace/.derivedData/Build/Intermediates.noindex/OAuth2.build/Debug-watchos/Flows.build/swift-overrides.hmap -Xcc -I/Users/admin/builder/spi-builder-workspace/.derivedData/Build/Products/Debug-watchos/include -Xcc -I/Users/admin/builder/spi-builder-workspace/.derivedData/Build/Intermediates.noindex/OAuth2.build/Debug-watchos/Flows.build/DerivedSources-normal/arm64 -Xcc -I/Users/admin/builder/spi-builder-workspace/.derivedData/Build/Intermediates.noindex/OAuth2.build/Debug-watchos/Flows.build/DerivedSources/arm64 -Xcc -I/Users/admin/builder/spi-builder-workspace/.derivedData/Build/Intermediates.noindex/OAuth2.build/Debug-watchos/Flows.build/DerivedSources -Xcc -DSWIFT_PACKAGE -Xcc -DDEBUG\=1 -module-name Flows -frontend-parseable-output -disable-clang-spi -target-sdk-version 11.2 -target-sdk-name watchos11.2 -external-plugin-path /Applications/Xcode-16.2.0.app/Contents/Developer/Platforms/WatchOS.platform/Developer/usr/lib/swift/host/plugins\#/Applications/Xcode-16.2.0.app/Contents/Developer/Platforms/WatchOS.platform/Developer/usr/bin/swift-plugin-server -external-plugin-path /Applications/Xcode-16.2.0.app/Contents/Developer/Platforms/WatchOS.platform/Developer/usr/local/lib/swift/host/plugins\#/Applications/Xcode-16.2.0.app/Contents/Developer/Platforms/WatchOS.platform/Developer/usr/bin/swift-plugin-server -plugin-path /Applications/Xcode-16.2.0.app/Contents/Developer/Toolchains/XcodeDefault.xctoolchain/usr/lib/swift/host/plugins -plugin-path /Applications/Xcode-16.2.0.app/Contents/Developer/Toolchains/XcodeDefault.xctoolchain/usr/local/lib/swift/host/plugins -o /Users/admin/builder/spi-builder-workspace/.derivedData/Build/Intermediates.noindex/OAuth2.build/Debug-watchos/Flows.build/Objects-normal/arm64/OAuth2CodeGrantFacebook.o -o /Users/admin/builder/spi-builder-workspace/.derivedData/Build/Intermediates.noindex/OAuth2.build/Debug-watchos/Flows.build/Objects-normal/arm64/OAuth2CodeGrantLinkedIn.o -index-unit-output-path /OAuth2.build/Debug-watchos/Flows.build/Objects-normal/arm64/OAuth2CodeGrantFacebook.o -index-unit-output-path /OAuth2.build/Debug-watchos/Flows.build/Objects-normal/arm64/OAuth2CodeGrantLinkedIn.o -index-store-path /Users/admin/builder/spi-builder-workspace/.derivedData/Index.noindex/DataStore -index-system-modules
SwiftCompile normal arm64 /Users/admin/builder/spi-builder-workspace/.dependencies/checkouts/OAuth2/Sources/Flows/OAuth2CodeGrantLinkedIn.swift (in target 'Flows' from project 'OAuth2')
    cd /Users/admin/builder/spi-builder-workspace/.swiftpm/xcode
    /Applications/Xcode-16.2.0.app/Contents/Developer/Toolchains/XcodeDefault.xctoolchain/usr/bin/swift-frontend -c /Users/admin/builder/spi-builder-workspace/.dependencies/checkouts/OAuth2/Sources/Flows/OAuth2.swift /Users/admin/builder/spi-builder-workspace/.dependencies/checkouts/OAuth2/Sources/Flows/OAuth2ClientCredentials.swift /Users/admin/builder/spi-builder-workspace/.dependencies/checkouts/OAuth2/Sources/Flows/OAuth2ClientCredentialsReddit.swift /Users/admin/builder/spi-builder-workspace/.dependencies/checkouts/OAuth2/Sources/Flows/OAuth2CodeGrant.swift /Users/admin/builder/spi-builder-workspace/.dependencies/checkouts/OAuth2/Sources/Flows/OAuth2CodeGrantAzure.swift /Users/admin/builder/spi-builder-workspace/.dependencies/checkouts/OAuth2/Sources/Flows/OAuth2CodeGrantBasicAuth.swift -primary-file /Users/admin/builder/spi-builder-workspace/.dependencies/checkouts/OAuth2/Sources/Flows/OAuth2CodeGrantFacebook.swift -primary-file /Users/admin/builder/spi-builder-workspace/.dependencies/checkouts/OAuth2/Sources/Flows/OAuth2CodeGrantLinkedIn.swift /Users/admin/builder/spi-builder-workspace/.dependencies/checkouts/OAuth2/Sources/Flows/OAuth2CodeGrantNoTokenType.swift /Users/admin/builder/spi-builder-workspace/.dependencies/checkouts/OAuth2/Sources/Flows/OAuth2DeviceGrant.swift /Users/admin/builder/spi-builder-workspace/.dependencies/checkouts/OAuth2/Sources/Flows/OAuth2DynReg.swift /Users/admin/builder/spi-builder-workspace/.dependencies/checkouts/OAuth2/Sources/Flows/OAuth2ImplicitGrant.swift /Users/admin/builder/spi-builder-workspace/.dependencies/checkouts/OAuth2/Sources/Flows/OAuth2ImplicitGrantWithQueryParams.swift /Users/admin/builder/spi-builder-workspace/.dependencies/checkouts/OAuth2/Sources/Flows/OAuth2PasswordGrant.swift -emit-dependencies-path /Users/admin/builder/spi-builder-workspace/.derivedData/Build/Intermediates.noindex/OAuth2.build/Debug-watchos/Flows.build/Objects-normal/arm64/OAuth2CodeGrantFacebook.d -emit-const-values-path /Users/admin/builder/spi-builder-workspace/.derivedData/Build/Intermediates.noindex/OAuth2.build/Debug-watchos/Flows.build/Objects-normal/arm64/OAuth2CodeGrantFacebook.swiftconstvalues -emit-reference-dependencies-path /Users/admin/builder/spi-builder-workspace/.derivedData/Build/Intermediates.noindex/OAuth2.build/Debug-watchos/Flows.build/Objects-normal/arm64/OAuth2CodeGrantFacebook.swiftdeps -serialize-diagnostics-path /Users/admin/builder/spi-builder-workspace/.derivedData/Build/Intermediates.noindex/OAuth2.build/Debug-watchos/Flows.build/Objects-normal/arm64/OAuth2CodeGrantFacebook.dia -emit-dependencies-path /Users/admin/builder/spi-builder-workspace/.derivedData/Build/Intermediates.noindex/OAuth2.build/Debug-watchos/Flows.build/Objects-normal/arm64/OAuth2CodeGrantLinkedIn.d -emit-const-values-path /Users/admin/builder/spi-builder-workspace/.derivedData/Build/Intermediates.noindex/OAuth2.build/Debug-watchos/Flows.build/Objects-normal/arm64/OAuth2CodeGrantLinkedIn.swiftconstvalues -emit-reference-dependencies-path /Users/admin/builder/spi-builder-workspace/.derivedData/Build/Intermediates.noindex/OAuth2.build/Debug-watchos/Flows.build/Objects-normal/arm64/OAuth2CodeGrantLinkedIn.swiftdeps -serialize-diagnostics-path /Users/admin/builder/spi-builder-workspace/.derivedData/Build/Intermediates.noindex/OAuth2.build/Debug-watchos/Flows.build/Objects-normal/arm64/OAuth2CodeGrantLinkedIn.dia -target arm64-apple-watchos5.0 -Xllvm -aarch64-use-tbi -enable-objc-interop -sdk /Applications/Xcode-16.2.0.app/Contents/Developer/Platforms/WatchOS.platform/Developer/SDKs/WatchOS11.2.sdk -I /Users/admin/builder/spi-builder-workspace/.derivedData/Build/Products/Debug-watchos -I /Applications/Xcode-16.2.0.app/Contents/Developer/Platforms/WatchOS.platform/Developer/usr/lib -F /Users/admin/builder/spi-builder-workspace/.derivedData/Build/Products/Debug-watchos/PackageFrameworks -F /Users/admin/builder/spi-builder-workspace/.derivedData/Build/Products/Debug-watchos/PackageFrameworks -F /Users/admin/builder/spi-builder-workspace/.derivedData/Build/Products/Debug-watchos/PackageFrameworks -F /Users/admin/builder/spi-builder-workspace/.derivedData/Build/Products/Debug-watchos/PackageFrameworks -F /Users/admin/builder/spi-builder-workspace/.derivedData/Build/Products/Debug-watchos/PackageFrameworks -F /Users/admin/builder/spi-builder-workspace/.derivedData/Build/Products/Debug-watchos -F /Applications/Xcode-16.2.0.app/Contents/Developer/Platforms/WatchOS.platform/Developer/Library/Frameworks -F /Applications/Xcode-16.2.0.app/Contents/Developer/Platforms/WatchOS.platform/Developer/SDKs/WatchOS11.2.sdk/Developer/Library/Frameworks -no-color-diagnostics -enable-testing -g -debug-info-format\=dwarf -dwarf-version\=4 -module-cache-path /Users/admin/builder/spi-builder-workspace/.derivedData/ModuleCache.noindex -suppress-warnings -profile-generate -profile-coverage-mapping -swift-version 5 -enforce-exclusivity\=checked -Onone -D SWIFT_PACKAGE -D DEBUG -D Xcode -serialize-debugging-options -const-gather-protocols-file /Users/admin/builder/spi-builder-workspace/.derivedData/Build/Intermediates.noindex/OAuth2.build/Debug-watchos/Flows.build/Objects-normal/arm64/Flows_const_extract_protocols.json -enable-experimental-feature DebugDescriptionMacro -enable-experimental-feature OpaqueTypeErasure -empty-abi-descriptor -plugin-path /Applications/Xcode-16.2.0.app/Contents/Developer/Toolchains/XcodeDefault.xctoolchain/usr/lib/swift/host/plugins/testing -validate-clang-modules-once -clang-build-session-file /Users/admin/builder/spi-builder-workspace/.derivedData/ModuleCache.noindex/Session.modulevalidation -Xcc -working-directory -Xcc /Users/admin/builder/spi-builder-workspace/.swiftpm/xcode -resource-dir /Applications/Xcode-16.2.0.app/Contents/Developer/Toolchains/XcodeDefault.xctoolchain/usr/lib/swift -enable-anonymous-context-mangled-names -file-compilation-dir /Users/admin/builder/spi-builder-workspace/.swiftpm/xcode -Xcc -D_LIBCPP_HARDENING_MODE\=_LIBCPP_HARDENING_MODE_DEBUG -Xcc -ivfsstatcache -Xcc /Users/admin/builder/spi-builder-workspace/.derivedData/SDKStatCaches.noindex/watchos11.2-22S97-8cb5c683f5e64b0ecfc74e8d0065fbf6.sdkstatcache -Xcc -I/Users/admin/builder/spi-builder-workspace/.derivedData/Build/Intermediates.noindex/OAuth2.build/Debug-watchos/Flows.build/swift-overrides.hmap -Xcc -I/Users/admin/builder/spi-builder-workspace/.derivedData/Build/Products/Debug-watchos/include -Xcc -I/Users/admin/builder/spi-builder-workspace/.derivedData/Build/Intermediates.noindex/OAuth2.build/Debug-watchos/Flows.build/DerivedSources-normal/arm64 -Xcc -I/Users/admin/builder/spi-builder-workspace/.derivedData/Build/Intermediates.noindex/OAuth2.build/Debug-watchos/Flows.build/DerivedSources/arm64 -Xcc -I/Users/admin/builder/spi-builder-workspace/.derivedData/Build/Intermediates.noindex/OAuth2.build/Debug-watchos/Flows.build/DerivedSources -Xcc -DSWIFT_PACKAGE -Xcc -DDEBUG\=1 -module-name Flows -frontend-parseable-output -disable-clang-spi -target-sdk-version 11.2 -target-sdk-name watchos11.2 -external-plugin-path /Applications/Xcode-16.2.0.app/Contents/Developer/Platforms/WatchOS.platform/Developer/usr/lib/swift/host/plugins\#/Applications/Xcode-16.2.0.app/Contents/Developer/Platforms/WatchOS.platform/Developer/usr/bin/swift-plugin-server -external-plugin-path /Applications/Xcode-16.2.0.app/Contents/Developer/Platforms/WatchOS.platform/Developer/usr/local/lib/swift/host/plugins\#/Applications/Xcode-16.2.0.app/Contents/Developer/Platforms/WatchOS.platform/Developer/usr/bin/swift-plugin-server -plugin-path /Applications/Xcode-16.2.0.app/Contents/Developer/Toolchains/XcodeDefault.xctoolchain/usr/lib/swift/host/plugins -plugin-path /Applications/Xcode-16.2.0.app/Contents/Developer/Toolchains/XcodeDefault.xctoolchain/usr/local/lib/swift/host/plugins -o /Users/admin/builder/spi-builder-workspace/.derivedData/Build/Intermediates.noindex/OAuth2.build/Debug-watchos/Flows.build/Objects-normal/arm64/OAuth2CodeGrantFacebook.o -o /Users/admin/builder/spi-builder-workspace/.derivedData/Build/Intermediates.noindex/OAuth2.build/Debug-watchos/Flows.build/Objects-normal/arm64/OAuth2CodeGrantLinkedIn.o -index-unit-output-path /OAuth2.build/Debug-watchos/Flows.build/Objects-normal/arm64/OAuth2CodeGrantFacebook.o -index-unit-output-path /OAuth2.build/Debug-watchos/Flows.build/Objects-normal/arm64/OAuth2CodeGrantLinkedIn.o -index-store-path /Users/admin/builder/spi-builder-workspace/.derivedData/Index.noindex/DataStore -index-system-modules
SwiftCompile normal arm64 Compiling\ OAuth2PasswordGrant.swift /Users/admin/builder/spi-builder-workspace/.dependencies/checkouts/OAuth2/Sources/Flows/OAuth2PasswordGrant.swift (in target 'Flows' from project 'OAuth2')
    cd /Users/admin/builder/spi-builder-workspace/.swiftpm/xcode
    builtin-swiftTaskExecution -- /Applications/Xcode-16.2.0.app/Contents/Developer/Toolchains/XcodeDefault.xctoolchain/usr/bin/swift-frontend -frontend -c /Users/admin/builder/spi-builder-workspace/.dependencies/checkouts/OAuth2/Sources/Flows/OAuth2.swift /Users/admin/builder/spi-builder-workspace/.dependencies/checkouts/OAuth2/Sources/Flows/OAuth2ClientCredentials.swift /Users/admin/builder/spi-builder-workspace/.dependencies/checkouts/OAuth2/Sources/Flows/OAuth2ClientCredentialsReddit.swift /Users/admin/builder/spi-builder-workspace/.dependencies/checkouts/OAuth2/Sources/Flows/OAuth2CodeGrant.swift /Users/admin/builder/spi-builder-workspace/.dependencies/checkouts/OAuth2/Sources/Flows/OAuth2CodeGrantAzure.swift /Users/admin/builder/spi-builder-workspace/.dependencies/checkouts/OAuth2/Sources/Flows/OAuth2CodeGrantBasicAuth.swift /Users/admin/builder/spi-builder-workspace/.dependencies/checkouts/OAuth2/Sources/Flows/OAuth2CodeGrantFacebook.swift /Users/admin/builder/spi-builder-workspace/.dependencies/checkouts/OAuth2/Sources/Flows/OAuth2CodeGrantLinkedIn.swift /Users/admin/builder/spi-builder-workspace/.dependencies/checkouts/OAuth2/Sources/Flows/OAuth2CodeGrantNoTokenType.swift /Users/admin/builder/spi-builder-workspace/.dependencies/checkouts/OAuth2/Sources/Flows/OAuth2DeviceGrant.swift /Users/admin/builder/spi-builder-workspace/.dependencies/checkouts/OAuth2/Sources/Flows/OAuth2DynReg.swift /Users/admin/builder/spi-builder-workspace/.dependencies/checkouts/OAuth2/Sources/Flows/OAuth2ImplicitGrant.swift /Users/admin/builder/spi-builder-workspace/.dependencies/checkouts/OAuth2/Sources/Flows/OAuth2ImplicitGrantWithQueryParams.swift -primary-file /Users/admin/builder/spi-builder-workspace/.dependencies/checkouts/OAuth2/Sources/Flows/OAuth2PasswordGrant.swift -emit-dependencies-path /Users/admin/builder/spi-builder-workspace/.derivedData/Build/Intermediates.noindex/OAuth2.build/Debug-watchos/Flows.build/Objects-normal/arm64/OAuth2PasswordGrant.d -emit-const-values-path /Users/admin/builder/spi-builder-workspace/.derivedData/Build/Intermediates.noindex/OAuth2.build/Debug-watchos/Flows.build/Objects-normal/arm64/OAuth2PasswordGrant.swiftconstvalues -emit-reference-dependencies-path /Users/admin/builder/spi-builder-workspace/.derivedData/Build/Intermediates.noindex/OAuth2.build/Debug-watchos/Flows.build/Objects-normal/arm64/OAuth2PasswordGrant.swiftdeps -serialize-diagnostics-path /Users/admin/builder/spi-builder-workspace/.derivedData/Build/Intermediates.noindex/OAuth2.build/Debug-watchos/Flows.build/Objects-normal/arm64/OAuth2PasswordGrant.dia -target arm64-apple-watchos5.0 -Xllvm -aarch64-use-tbi -enable-objc-interop -sdk /Applications/Xcode-16.2.0.app/Contents/Developer/Platforms/WatchOS.platform/Developer/SDKs/WatchOS11.2.sdk -I /Users/admin/builder/spi-builder-workspace/.derivedData/Build/Products/Debug-watchos -I /Applications/Xcode-16.2.0.app/Contents/Developer/Platforms/WatchOS.platform/Developer/usr/lib -F /Users/admin/builder/spi-builder-workspace/.derivedData/Build/Products/Debug-watchos/PackageFrameworks -F /Users/admin/builder/spi-builder-workspace/.derivedData/Build/Products/Debug-watchos/PackageFrameworks -F /Users/admin/builder/spi-builder-workspace/.derivedData/Build/Products/Debug-watchos/PackageFrameworks -F /Users/admin/builder/spi-builder-workspace/.derivedData/Build/Products/Debug-watchos/PackageFrameworks -F /Users/admin/builder/spi-builder-workspace/.derivedData/Build/Products/Debug-watchos/PackageFrameworks -F /Users/admin/builder/spi-builder-workspace/.derivedData/Build/Products/Debug-watchos -F /Applications/Xcode-16.2.0.app/Contents/Developer/Platforms/WatchOS.platform/Developer/Library/Frameworks -F /Applications/Xcode-16.2.0.app/Contents/Developer/Platforms/WatchOS.platform/Developer/SDKs/WatchOS11.2.sdk/Developer/Library/Frameworks -no-color-diagnostics -enable-testing -g -debug-info-format\=dwarf -dwarf-version\=4 -module-cache-path /Users/admin/builder/spi-builder-workspace/.derivedData/ModuleCache.noindex -suppress-warnings -profile-generate -profile-coverage-mapping -swift-version 5 -enforce-exclusivity\=checked -Onone -D SWIFT_PACKAGE -D DEBUG -D Xcode -serialize-debugging-options -const-gather-protocols-file /Users/admin/builder/spi-builder-workspace/.derivedData/Build/Intermediates.noindex/OAuth2.build/Debug-watchos/Flows.build/Objects-normal/arm64/Flows_const_extract_protocols.json -enable-experimental-feature DebugDescriptionMacro -enable-experimental-feature OpaqueTypeErasure -empty-abi-descriptor -plugin-path /Applications/Xcode-16.2.0.app/Contents/Developer/Toolchains/XcodeDefault.xctoolchain/usr/lib/swift/host/plugins/testing -validate-clang-modules-once -clang-build-session-file /Users/admin/builder/spi-builder-workspace/.derivedData/ModuleCache.noindex/Session.modulevalidation -Xcc -working-directory -Xcc /Users/admin/builder/spi-builder-workspace/.swiftpm/xcode -resource-dir /Applications/Xcode-16.2.0.app/Contents/Developer/Toolchains/XcodeDefault.xctoolchain/usr/lib/swift -enable-anonymous-context-mangled-names -file-compilation-dir /Users/admin/builder/spi-builder-workspace/.swiftpm/xcode -Xcc -D_LIBCPP_HARDENING_MODE\=_LIBCPP_HARDENING_MODE_DEBUG -Xcc -ivfsstatcache -Xcc /Users/admin/builder/spi-builder-workspace/.derivedData/SDKStatCaches.noindex/watchos11.2-22S97-8cb5c683f5e64b0ecfc74e8d0065fbf6.sdkstatcache -Xcc -I/Users/admin/builder/spi-builder-workspace/.derivedData/Build/Intermediates.noindex/OAuth2.build/Debug-watchos/Flows.build/swift-overrides.hmap -Xcc -I/Users/admin/builder/spi-builder-workspace/.derivedData/Build/Products/Debug-watchos/include -Xcc -I/Users/admin/builder/spi-builder-workspace/.derivedData/Build/Intermediates.noindex/OAuth2.build/Debug-watchos/Flows.build/DerivedSources-normal/arm64 -Xcc -I/Users/admin/builder/spi-builder-workspace/.derivedData/Build/Intermediates.noindex/OAuth2.build/Debug-watchos/Flows.build/DerivedSources/arm64 -Xcc -I/Users/admin/builder/spi-builder-workspace/.derivedData/Build/Intermediates.noindex/OAuth2.build/Debug-watchos/Flows.build/DerivedSources -Xcc -DSWIFT_PACKAGE -Xcc -DDEBUG\=1 -module-name Flows -frontend-parseable-output -disable-clang-spi -target-sdk-version 11.2 -target-sdk-name watchos11.2 -external-plugin-path /Applications/Xcode-16.2.0.app/Contents/Developer/Platforms/WatchOS.platform/Developer/usr/lib/swift/host/plugins\#/Applications/Xcode-16.2.0.app/Contents/Developer/Platforms/WatchOS.platform/Developer/usr/bin/swift-plugin-server -external-plugin-path /Applications/Xcode-16.2.0.app/Contents/Developer/Platforms/WatchOS.platform/Developer/usr/local/lib/swift/host/plugins\#/Applications/Xcode-16.2.0.app/Contents/Developer/Platforms/WatchOS.platform/Developer/usr/bin/swift-plugin-server -plugin-path /Applications/Xcode-16.2.0.app/Contents/Developer/Toolchains/XcodeDefault.xctoolchain/usr/lib/swift/host/plugins -plugin-path /Applications/Xcode-16.2.0.app/Contents/Developer/Toolchains/XcodeDefault.xctoolchain/usr/local/lib/swift/host/plugins -o /Users/admin/builder/spi-builder-workspace/.derivedData/Build/Intermediates.noindex/OAuth2.build/Debug-watchos/Flows.build/Objects-normal/arm64/OAuth2PasswordGrant.o -index-unit-output-path /OAuth2.build/Debug-watchos/Flows.build/Objects-normal/arm64/OAuth2PasswordGrant.o -index-store-path /Users/admin/builder/spi-builder-workspace/.derivedData/Index.noindex/DataStore -index-system-modules
SwiftCompile normal arm64 /Users/admin/builder/spi-builder-workspace/.dependencies/checkouts/OAuth2/Sources/Flows/OAuth2PasswordGrant.swift (in target 'Flows' from project 'OAuth2')
    cd /Users/admin/builder/spi-builder-workspace/.swiftpm/xcode
    /Applications/Xcode-16.2.0.app/Contents/Developer/Toolchains/XcodeDefault.xctoolchain/usr/bin/swift-frontend -c /Users/admin/builder/spi-builder-workspace/.dependencies/checkouts/OAuth2/Sources/Flows/OAuth2.swift /Users/admin/builder/spi-builder-workspace/.dependencies/checkouts/OAuth2/Sources/Flows/OAuth2ClientCredentials.swift /Users/admin/builder/spi-builder-workspace/.dependencies/checkouts/OAuth2/Sources/Flows/OAuth2ClientCredentialsReddit.swift /Users/admin/builder/spi-builder-workspace/.dependencies/checkouts/OAuth2/Sources/Flows/OAuth2CodeGrant.swift /Users/admin/builder/spi-builder-workspace/.dependencies/checkouts/OAuth2/Sources/Flows/OAuth2CodeGrantAzure.swift /Users/admin/builder/spi-builder-workspace/.dependencies/checkouts/OAuth2/Sources/Flows/OAuth2CodeGrantBasicAuth.swift /Users/admin/builder/spi-builder-workspace/.dependencies/checkouts/OAuth2/Sources/Flows/OAuth2CodeGrantFacebook.swift /Users/admin/builder/spi-builder-workspace/.dependencies/checkouts/OAuth2/Sources/Flows/OAuth2CodeGrantLinkedIn.swift /Users/admin/builder/spi-builder-workspace/.dependencies/checkouts/OAuth2/Sources/Flows/OAuth2CodeGrantNoTokenType.swift /Users/admin/builder/spi-builder-workspace/.dependencies/checkouts/OAuth2/Sources/Flows/OAuth2DeviceGrant.swift /Users/admin/builder/spi-builder-workspace/.dependencies/checkouts/OAuth2/Sources/Flows/OAuth2DynReg.swift /Users/admin/builder/spi-builder-workspace/.dependencies/checkouts/OAuth2/Sources/Flows/OAuth2ImplicitGrant.swift /Users/admin/builder/spi-builder-workspace/.dependencies/checkouts/OAuth2/Sources/Flows/OAuth2ImplicitGrantWithQueryParams.swift -primary-file /Users/admin/builder/spi-builder-workspace/.dependencies/checkouts/OAuth2/Sources/Flows/OAuth2PasswordGrant.swift -emit-dependencies-path /Users/admin/builder/spi-builder-workspace/.derivedData/Build/Intermediates.noindex/OAuth2.build/Debug-watchos/Flows.build/Objects-normal/arm64/OAuth2PasswordGrant.d -emit-const-values-path /Users/admin/builder/spi-builder-workspace/.derivedData/Build/Intermediates.noindex/OAuth2.build/Debug-watchos/Flows.build/Objects-normal/arm64/OAuth2PasswordGrant.swiftconstvalues -emit-reference-dependencies-path /Users/admin/builder/spi-builder-workspace/.derivedData/Build/Intermediates.noindex/OAuth2.build/Debug-watchos/Flows.build/Objects-normal/arm64/OAuth2PasswordGrant.swiftdeps -serialize-diagnostics-path /Users/admin/builder/spi-builder-workspace/.derivedData/Build/Intermediates.noindex/OAuth2.build/Debug-watchos/Flows.build/Objects-normal/arm64/OAuth2PasswordGrant.dia -target arm64-apple-watchos5.0 -Xllvm -aarch64-use-tbi -enable-objc-interop -sdk /Applications/Xcode-16.2.0.app/Contents/Developer/Platforms/WatchOS.platform/Developer/SDKs/WatchOS11.2.sdk -I /Users/admin/builder/spi-builder-workspace/.derivedData/Build/Products/Debug-watchos -I /Applications/Xcode-16.2.0.app/Contents/Developer/Platforms/WatchOS.platform/Developer/usr/lib -F /Users/admin/builder/spi-builder-workspace/.derivedData/Build/Products/Debug-watchos/PackageFrameworks -F /Users/admin/builder/spi-builder-workspace/.derivedData/Build/Products/Debug-watchos/PackageFrameworks -F /Users/admin/builder/spi-builder-workspace/.derivedData/Build/Products/Debug-watchos/PackageFrameworks -F /Users/admin/builder/spi-builder-workspace/.derivedData/Build/Products/Debug-watchos/PackageFrameworks -F /Users/admin/builder/spi-builder-workspace/.derivedData/Build/Products/Debug-watchos/PackageFrameworks -F /Users/admin/builder/spi-builder-workspace/.derivedData/Build/Products/Debug-watchos -F /Applications/Xcode-16.2.0.app/Contents/Developer/Platforms/WatchOS.platform/Developer/Library/Frameworks -F /Applications/Xcode-16.2.0.app/Contents/Developer/Platforms/WatchOS.platform/Developer/SDKs/WatchOS11.2.sdk/Developer/Library/Frameworks -no-color-diagnostics -enable-testing -g -debug-info-format\=dwarf -dwarf-version\=4 -module-cache-path /Users/admin/builder/spi-builder-workspace/.derivedData/ModuleCache.noindex -suppress-warnings -profile-generate -profile-coverage-mapping -swift-version 5 -enforce-exclusivity\=checked -Onone -D SWIFT_PACKAGE -D DEBUG -D Xcode -serialize-debugging-options -const-gather-protocols-file /Users/admin/builder/spi-builder-workspace/.derivedData/Build/Intermediates.noindex/OAuth2.build/Debug-watchos/Flows.build/Objects-normal/arm64/Flows_const_extract_protocols.json -enable-experimental-feature DebugDescriptionMacro -enable-experimental-feature OpaqueTypeErasure -empty-abi-descriptor -plugin-path /Applications/Xcode-16.2.0.app/Contents/Developer/Toolchains/XcodeDefault.xctoolchain/usr/lib/swift/host/plugins/testing -validate-clang-modules-once -clang-build-session-file /Users/admin/builder/spi-builder-workspace/.derivedData/ModuleCache.noindex/Session.modulevalidation -Xcc -working-directory -Xcc /Users/admin/builder/spi-builder-workspace/.swiftpm/xcode -resource-dir /Applications/Xcode-16.2.0.app/Contents/Developer/Toolchains/XcodeDefault.xctoolchain/usr/lib/swift -enable-anonymous-context-mangled-names -file-compilation-dir /Users/admin/builder/spi-builder-workspace/.swiftpm/xcode -Xcc -D_LIBCPP_HARDENING_MODE\=_LIBCPP_HARDENING_MODE_DEBUG -Xcc -ivfsstatcache -Xcc /Users/admin/builder/spi-builder-workspace/.derivedData/SDKStatCaches.noindex/watchos11.2-22S97-8cb5c683f5e64b0ecfc74e8d0065fbf6.sdkstatcache -Xcc -I/Users/admin/builder/spi-builder-workspace/.derivedData/Build/Intermediates.noindex/OAuth2.build/Debug-watchos/Flows.build/swift-overrides.hmap -Xcc -I/Users/admin/builder/spi-builder-workspace/.derivedData/Build/Products/Debug-watchos/include -Xcc -I/Users/admin/builder/spi-builder-workspace/.derivedData/Build/Intermediates.noindex/OAuth2.build/Debug-watchos/Flows.build/DerivedSources-normal/arm64 -Xcc -I/Users/admin/builder/spi-builder-workspace/.derivedData/Build/Intermediates.noindex/OAuth2.build/Debug-watchos/Flows.build/DerivedSources/arm64 -Xcc -I/Users/admin/builder/spi-builder-workspace/.derivedData/Build/Intermediates.noindex/OAuth2.build/Debug-watchos/Flows.build/DerivedSources -Xcc -DSWIFT_PACKAGE -Xcc -DDEBUG\=1 -module-name Flows -frontend-parseable-output -disable-clang-spi -target-sdk-version 11.2 -target-sdk-name watchos11.2 -external-plugin-path /Applications/Xcode-16.2.0.app/Contents/Developer/Platforms/WatchOS.platform/Developer/usr/lib/swift/host/plugins\#/Applications/Xcode-16.2.0.app/Contents/Developer/Platforms/WatchOS.platform/Developer/usr/bin/swift-plugin-server -external-plugin-path /Applications/Xcode-16.2.0.app/Contents/Developer/Platforms/WatchOS.platform/Developer/usr/local/lib/swift/host/plugins\#/Applications/Xcode-16.2.0.app/Contents/Developer/Platforms/WatchOS.platform/Developer/usr/bin/swift-plugin-server -plugin-path /Applications/Xcode-16.2.0.app/Contents/Developer/Toolchains/XcodeDefault.xctoolchain/usr/lib/swift/host/plugins -plugin-path /Applications/Xcode-16.2.0.app/Contents/Developer/Toolchains/XcodeDefault.xctoolchain/usr/local/lib/swift/host/plugins -o /Users/admin/builder/spi-builder-workspace/.derivedData/Build/Intermediates.noindex/OAuth2.build/Debug-watchos/Flows.build/Objects-normal/arm64/OAuth2PasswordGrant.o -index-unit-output-path /OAuth2.build/Debug-watchos/Flows.build/Objects-normal/arm64/OAuth2PasswordGrant.o -index-store-path /Users/admin/builder/spi-builder-workspace/.derivedData/Index.noindex/DataStore -index-system-modules
/Users/admin/builder/spi-builder-workspace/.dependencies/checkouts/OAuth2/Sources/Flows/OAuth2PasswordGrant.swift:70:61: error: cannot find 'OAuth2CustomAuthorizer' in scope
        open lazy var customAuthorizer: OAuth2CustomAuthorizerUI = OAuth2CustomAuthorizer()
                                                                   ^~~~~~~~~~~~~~~~~~~~~~
SwiftCompile normal arm64 Compiling\ OAuth2ImplicitGrant.swift /Users/admin/builder/spi-builder-workspace/.dependencies/checkouts/OAuth2/Sources/Flows/OAuth2ImplicitGrant.swift (in target 'Flows' from project 'OAuth2')
    cd /Users/admin/builder/spi-builder-workspace/.swiftpm/xcode
    builtin-swiftTaskExecution -- /Applications/Xcode-16.2.0.app/Contents/Developer/Toolchains/XcodeDefault.xctoolchain/usr/bin/swift-frontend -frontend -c /Users/admin/builder/spi-builder-workspace/.dependencies/checkouts/OAuth2/Sources/Flows/OAuth2.swift /Users/admin/builder/spi-builder-workspace/.dependencies/checkouts/OAuth2/Sources/Flows/OAuth2ClientCredentials.swift /Users/admin/builder/spi-builder-workspace/.dependencies/checkouts/OAuth2/Sources/Flows/OAuth2ClientCredentialsReddit.swift /Users/admin/builder/spi-builder-workspace/.dependencies/checkouts/OAuth2/Sources/Flows/OAuth2CodeGrant.swift /Users/admin/builder/spi-builder-workspace/.dependencies/checkouts/OAuth2/Sources/Flows/OAuth2CodeGrantAzure.swift /Users/admin/builder/spi-builder-workspace/.dependencies/checkouts/OAuth2/Sources/Flows/OAuth2CodeGrantBasicAuth.swift /Users/admin/builder/spi-builder-workspace/.dependencies/checkouts/OAuth2/Sources/Flows/OAuth2CodeGrantFacebook.swift /Users/admin/builder/spi-builder-workspace/.dependencies/checkouts/OAuth2/Sources/Flows/OAuth2CodeGrantLinkedIn.swift /Users/admin/builder/spi-builder-workspace/.dependencies/checkouts/OAuth2/Sources/Flows/OAuth2CodeGrantNoTokenType.swift /Users/admin/builder/spi-builder-workspace/.dependencies/checkouts/OAuth2/Sources/Flows/OAuth2DeviceGrant.swift /Users/admin/builder/spi-builder-workspace/.dependencies/checkouts/OAuth2/Sources/Flows/OAuth2DynReg.swift -primary-file /Users/admin/builder/spi-builder-workspace/.dependencies/checkouts/OAuth2/Sources/Flows/OAuth2ImplicitGrant.swift /Users/admin/builder/spi-builder-workspace/.dependencies/checkouts/OAuth2/Sources/Flows/OAuth2ImplicitGrantWithQueryParams.swift /Users/admin/builder/spi-builder-workspace/.dependencies/checkouts/OAuth2/Sources/Flows/OAuth2PasswordGrant.swift -emit-dependencies-path /Users/admin/builder/spi-builder-workspace/.derivedData/Build/Intermediates.noindex/OAuth2.build/Debug-watchos/Flows.build/Objects-normal/arm64/OAuth2ImplicitGrant.d -emit-const-values-path /Users/admin/builder/spi-builder-workspace/.derivedData/Build/Intermediates.noindex/OAuth2.build/Debug-watchos/Flows.build/Objects-normal/arm64/OAuth2ImplicitGrant.swiftconstvalues -emit-reference-dependencies-path /Users/admin/builder/spi-builder-workspace/.derivedData/Build/Intermediates.noindex/OAuth2.build/Debug-watchos/Flows.build/Objects-normal/arm64/OAuth2ImplicitGrant.swiftdeps -serialize-diagnostics-path /Users/admin/builder/spi-builder-workspace/.derivedData/Build/Intermediates.noindex/OAuth2.build/Debug-watchos/Flows.build/Objects-normal/arm64/OAuth2ImplicitGrant.dia -target arm64-apple-watchos5.0 -Xllvm -aarch64-use-tbi -enable-objc-interop -sdk /Applications/Xcode-16.2.0.app/Contents/Developer/Platforms/WatchOS.platform/Developer/SDKs/WatchOS11.2.sdk -I /Users/admin/builder/spi-builder-workspace/.derivedData/Build/Products/Debug-watchos -I /Applications/Xcode-16.2.0.app/Contents/Developer/Platforms/WatchOS.platform/Developer/usr/lib -F /Users/admin/builder/spi-builder-workspace/.derivedData/Build/Products/Debug-watchos/PackageFrameworks -F /Users/admin/builder/spi-builder-workspace/.derivedData/Build/Products/Debug-watchos/PackageFrameworks -F /Users/admin/builder/spi-builder-workspace/.derivedData/Build/Products/Debug-watchos/PackageFrameworks -F /Users/admin/builder/spi-builder-workspace/.derivedData/Build/Products/Debug-watchos/PackageFrameworks -F /Users/admin/builder/spi-builder-workspace/.derivedData/Build/Products/Debug-watchos/PackageFrameworks -F /Users/admin/builder/spi-builder-workspace/.derivedData/Build/Products/Debug-watchos -F /Applications/Xcode-16.2.0.app/Contents/Developer/Platforms/WatchOS.platform/Developer/Library/Frameworks -F /Applications/Xcode-16.2.0.app/Contents/Developer/Platforms/WatchOS.platform/Developer/SDKs/WatchOS11.2.sdk/Developer/Library/Frameworks -no-color-diagnostics -enable-testing -g -debug-info-format\=dwarf -dwarf-version\=4 -module-cache-path /Users/admin/builder/spi-builder-workspace/.derivedData/ModuleCache.noindex -suppress-warnings -profile-generate -profile-coverage-mapping -swift-version 5 -enforce-exclusivity\=checked -Onone -D SWIFT_PACKAGE -D DEBUG -D Xcode -serialize-debugging-options -const-gather-protocols-file /Users/admin/builder/spi-builder-workspace/.derivedData/Build/Intermediates.noindex/OAuth2.build/Debug-watchos/Flows.build/Objects-normal/arm64/Flows_const_extract_protocols.json -enable-experimental-feature DebugDescriptionMacro -enable-experimental-feature OpaqueTypeErasure -empty-abi-descriptor -plugin-path /Applications/Xcode-16.2.0.app/Contents/Developer/Toolchains/XcodeDefault.xctoolchain/usr/lib/swift/host/plugins/testing -validate-clang-modules-once -clang-build-session-file /Users/admin/builder/spi-builder-workspace/.derivedData/ModuleCache.noindex/Session.modulevalidation -Xcc -working-directory -Xcc /Users/admin/builder/spi-builder-workspace/.swiftpm/xcode -resource-dir /Applications/Xcode-16.2.0.app/Contents/Developer/Toolchains/XcodeDefault.xctoolchain/usr/lib/swift -enable-anonymous-context-mangled-names -file-compilation-dir /Users/admin/builder/spi-builder-workspace/.swiftpm/xcode -Xcc -D_LIBCPP_HARDENING_MODE\=_LIBCPP_HARDENING_MODE_DEBUG -Xcc -ivfsstatcache -Xcc /Users/admin/builder/spi-builder-workspace/.derivedData/SDKStatCaches.noindex/watchos11.2-22S97-8cb5c683f5e64b0ecfc74e8d0065fbf6.sdkstatcache -Xcc -I/Users/admin/builder/spi-builder-workspace/.derivedData/Build/Intermediates.noindex/OAuth2.build/Debug-watchos/Flows.build/swift-overrides.hmap -Xcc -I/Users/admin/builder/spi-builder-workspace/.derivedData/Build/Products/Debug-watchos/include -Xcc -I/Users/admin/builder/spi-builder-workspace/.derivedData/Build/Intermediates.noindex/OAuth2.build/Debug-watchos/Flows.build/DerivedSources-normal/arm64 -Xcc -I/Users/admin/builder/spi-builder-workspace/.derivedData/Build/Intermediates.noindex/OAuth2.build/Debug-watchos/Flows.build/DerivedSources/arm64 -Xcc -I/Users/admin/builder/spi-builder-workspace/.derivedData/Build/Intermediates.noindex/OAuth2.build/Debug-watchos/Flows.build/DerivedSources -Xcc -DSWIFT_PACKAGE -Xcc -DDEBUG\=1 -module-name Flows -frontend-parseable-output -disable-clang-spi -target-sdk-version 11.2 -target-sdk-name watchos11.2 -external-plugin-path /Applications/Xcode-16.2.0.app/Contents/Developer/Platforms/WatchOS.platform/Developer/usr/lib/swift/host/plugins\#/Applications/Xcode-16.2.0.app/Contents/Developer/Platforms/WatchOS.platform/Developer/usr/bin/swift-plugin-server -external-plugin-path /Applications/Xcode-16.2.0.app/Contents/Developer/Platforms/WatchOS.platform/Developer/usr/local/lib/swift/host/plugins\#/Applications/Xcode-16.2.0.app/Contents/Developer/Platforms/WatchOS.platform/Developer/usr/bin/swift-plugin-server -plugin-path /Applications/Xcode-16.2.0.app/Contents/Developer/Toolchains/XcodeDefault.xctoolchain/usr/lib/swift/host/plugins -plugin-path /Applications/Xcode-16.2.0.app/Contents/Developer/Toolchains/XcodeDefault.xctoolchain/usr/local/lib/swift/host/plugins -o /Users/admin/builder/spi-builder-workspace/.derivedData/Build/Intermediates.noindex/OAuth2.build/Debug-watchos/Flows.build/Objects-normal/arm64/OAuth2ImplicitGrant.o -index-unit-output-path /OAuth2.build/Debug-watchos/Flows.build/Objects-normal/arm64/OAuth2ImplicitGrant.o -index-store-path /Users/admin/builder/spi-builder-workspace/.derivedData/Index.noindex/DataStore -index-system-modules
SwiftCompile normal arm64 /Users/admin/builder/spi-builder-workspace/.dependencies/checkouts/OAuth2/Sources/Flows/OAuth2ImplicitGrant.swift (in target 'Flows' from project 'OAuth2')
    cd /Users/admin/builder/spi-builder-workspace/.swiftpm/xcode
    /Applications/Xcode-16.2.0.app/Contents/Developer/Toolchains/XcodeDefault.xctoolchain/usr/bin/swift-frontend -c /Users/admin/builder/spi-builder-workspace/.dependencies/checkouts/OAuth2/Sources/Flows/OAuth2.swift /Users/admin/builder/spi-builder-workspace/.dependencies/checkouts/OAuth2/Sources/Flows/OAuth2ClientCredentials.swift /Users/admin/builder/spi-builder-workspace/.dependencies/checkouts/OAuth2/Sources/Flows/OAuth2ClientCredentialsReddit.swift /Users/admin/builder/spi-builder-workspace/.dependencies/checkouts/OAuth2/Sources/Flows/OAuth2CodeGrant.swift /Users/admin/builder/spi-builder-workspace/.dependencies/checkouts/OAuth2/Sources/Flows/OAuth2CodeGrantAzure.swift /Users/admin/builder/spi-builder-workspace/.dependencies/checkouts/OAuth2/Sources/Flows/OAuth2CodeGrantBasicAuth.swift /Users/admin/builder/spi-builder-workspace/.dependencies/checkouts/OAuth2/Sources/Flows/OAuth2CodeGrantFacebook.swift /Users/admin/builder/spi-builder-workspace/.dependencies/checkouts/OAuth2/Sources/Flows/OAuth2CodeGrantLinkedIn.swift /Users/admin/builder/spi-builder-workspace/.dependencies/checkouts/OAuth2/Sources/Flows/OAuth2CodeGrantNoTokenType.swift /Users/admin/builder/spi-builder-workspace/.dependencies/checkouts/OAuth2/Sources/Flows/OAuth2DeviceGrant.swift /Users/admin/builder/spi-builder-workspace/.dependencies/checkouts/OAuth2/Sources/Flows/OAuth2DynReg.swift -primary-file /Users/admin/builder/spi-builder-workspace/.dependencies/checkouts/OAuth2/Sources/Flows/OAuth2ImplicitGrant.swift /Users/admin/builder/spi-builder-workspace/.dependencies/checkouts/OAuth2/Sources/Flows/OAuth2ImplicitGrantWithQueryParams.swift /Users/admin/builder/spi-builder-workspace/.dependencies/checkouts/OAuth2/Sources/Flows/OAuth2PasswordGrant.swift -emit-dependencies-path /Users/admin/builder/spi-builder-workspace/.derivedData/Build/Intermediates.noindex/OAuth2.build/Debug-watchos/Flows.build/Objects-normal/arm64/OAuth2ImplicitGrant.d -emit-const-values-path /Users/admin/builder/spi-builder-workspace/.derivedData/Build/Intermediates.noindex/OAuth2.build/Debug-watchos/Flows.build/Objects-normal/arm64/OAuth2ImplicitGrant.swiftconstvalues -emit-reference-dependencies-path /Users/admin/builder/spi-builder-workspace/.derivedData/Build/Intermediates.noindex/OAuth2.build/Debug-watchos/Flows.build/Objects-normal/arm64/OAuth2ImplicitGrant.swiftdeps -serialize-diagnostics-path /Users/admin/builder/spi-builder-workspace/.derivedData/Build/Intermediates.noindex/OAuth2.build/Debug-watchos/Flows.build/Objects-normal/arm64/OAuth2ImplicitGrant.dia -target arm64-apple-watchos5.0 -Xllvm -aarch64-use-tbi -enable-objc-interop -sdk /Applications/Xcode-16.2.0.app/Contents/Developer/Platforms/WatchOS.platform/Developer/SDKs/WatchOS11.2.sdk -I /Users/admin/builder/spi-builder-workspace/.derivedData/Build/Products/Debug-watchos -I /Applications/Xcode-16.2.0.app/Contents/Developer/Platforms/WatchOS.platform/Developer/usr/lib -F /Users/admin/builder/spi-builder-workspace/.derivedData/Build/Products/Debug-watchos/PackageFrameworks -F /Users/admin/builder/spi-builder-workspace/.derivedData/Build/Products/Debug-watchos/PackageFrameworks -F /Users/admin/builder/spi-builder-workspace/.derivedData/Build/Products/Debug-watchos/PackageFrameworks -F /Users/admin/builder/spi-builder-workspace/.derivedData/Build/Products/Debug-watchos/PackageFrameworks -F /Users/admin/builder/spi-builder-workspace/.derivedData/Build/Products/Debug-watchos/PackageFrameworks -F /Users/admin/builder/spi-builder-workspace/.derivedData/Build/Products/Debug-watchos -F /Applications/Xcode-16.2.0.app/Contents/Developer/Platforms/WatchOS.platform/Developer/Library/Frameworks -F /Applications/Xcode-16.2.0.app/Contents/Developer/Platforms/WatchOS.platform/Developer/SDKs/WatchOS11.2.sdk/Developer/Library/Frameworks -no-color-diagnostics -enable-testing -g -debug-info-format\=dwarf -dwarf-version\=4 -module-cache-path /Users/admin/builder/spi-builder-workspace/.derivedData/ModuleCache.noindex -suppress-warnings -profile-generate -profile-coverage-mapping -swift-version 5 -enforce-exclusivity\=checked -Onone -D SWIFT_PACKAGE -D DEBUG -D Xcode -serialize-debugging-options -const-gather-protocols-file /Users/admin/builder/spi-builder-workspace/.derivedData/Build/Intermediates.noindex/OAuth2.build/Debug-watchos/Flows.build/Objects-normal/arm64/Flows_const_extract_protocols.json -enable-experimental-feature DebugDescriptionMacro -enable-experimental-feature OpaqueTypeErasure -empty-abi-descriptor -plugin-path /Applications/Xcode-16.2.0.app/Contents/Developer/Toolchains/XcodeDefault.xctoolchain/usr/lib/swift/host/plugins/testing -validate-clang-modules-once -clang-build-session-file /Users/admin/builder/spi-builder-workspace/.derivedData/ModuleCache.noindex/Session.modulevalidation -Xcc -working-directory -Xcc /Users/admin/builder/spi-builder-workspace/.swiftpm/xcode -resource-dir /Applications/Xcode-16.2.0.app/Contents/Developer/Toolchains/XcodeDefault.xctoolchain/usr/lib/swift -enable-anonymous-context-mangled-names -file-compilation-dir /Users/admin/builder/spi-builder-workspace/.swiftpm/xcode -Xcc -D_LIBCPP_HARDENING_MODE\=_LIBCPP_HARDENING_MODE_DEBUG -Xcc -ivfsstatcache -Xcc /Users/admin/builder/spi-builder-workspace/.derivedData/SDKStatCaches.noindex/watchos11.2-22S97-8cb5c683f5e64b0ecfc74e8d0065fbf6.sdkstatcache -Xcc -I/Users/admin/builder/spi-builder-workspace/.derivedData/Build/Intermediates.noindex/OAuth2.build/Debug-watchos/Flows.build/swift-overrides.hmap -Xcc -I/Users/admin/builder/spi-builder-workspace/.derivedData/Build/Products/Debug-watchos/include -Xcc -I/Users/admin/builder/spi-builder-workspace/.derivedData/Build/Intermediates.noindex/OAuth2.build/Debug-watchos/Flows.build/DerivedSources-normal/arm64 -Xcc -I/Users/admin/builder/spi-builder-workspace/.derivedData/Build/Intermediates.noindex/OAuth2.build/Debug-watchos/Flows.build/DerivedSources/arm64 -Xcc -I/Users/admin/builder/spi-builder-workspace/.derivedData/Build/Intermediates.noindex/OAuth2.build/Debug-watchos/Flows.build/DerivedSources -Xcc -DSWIFT_PACKAGE -Xcc -DDEBUG\=1 -module-name Flows -frontend-parseable-output -disable-clang-spi -target-sdk-version 11.2 -target-sdk-name watchos11.2 -external-plugin-path /Applications/Xcode-16.2.0.app/Contents/Developer/Platforms/WatchOS.platform/Developer/usr/lib/swift/host/plugins\#/Applications/Xcode-16.2.0.app/Contents/Developer/Platforms/WatchOS.platform/Developer/usr/bin/swift-plugin-server -external-plugin-path /Applications/Xcode-16.2.0.app/Contents/Developer/Platforms/WatchOS.platform/Developer/usr/local/lib/swift/host/plugins\#/Applications/Xcode-16.2.0.app/Contents/Developer/Platforms/WatchOS.platform/Developer/usr/bin/swift-plugin-server -plugin-path /Applications/Xcode-16.2.0.app/Contents/Developer/Toolchains/XcodeDefault.xctoolchain/usr/lib/swift/host/plugins -plugin-path /Applications/Xcode-16.2.0.app/Contents/Developer/Toolchains/XcodeDefault.xctoolchain/usr/local/lib/swift/host/plugins -o /Users/admin/builder/spi-builder-workspace/.derivedData/Build/Intermediates.noindex/OAuth2.build/Debug-watchos/Flows.build/Objects-normal/arm64/OAuth2ImplicitGrant.o -index-unit-output-path /OAuth2.build/Debug-watchos/Flows.build/Objects-normal/arm64/OAuth2ImplicitGrant.o -index-store-path /Users/admin/builder/spi-builder-workspace/.derivedData/Index.noindex/DataStore -index-system-modules
SwiftCompile normal arm64 Compiling\ OAuth2DynReg.swift /Users/admin/builder/spi-builder-workspace/.dependencies/checkouts/OAuth2/Sources/Flows/OAuth2DynReg.swift (in target 'Flows' from project 'OAuth2')
    cd /Users/admin/builder/spi-builder-workspace/.swiftpm/xcode
    builtin-swiftTaskExecution -- /Applications/Xcode-16.2.0.app/Contents/Developer/Toolchains/XcodeDefault.xctoolchain/usr/bin/swift-frontend -frontend -c /Users/admin/builder/spi-builder-workspace/.dependencies/checkouts/OAuth2/Sources/Flows/OAuth2.swift /Users/admin/builder/spi-builder-workspace/.dependencies/checkouts/OAuth2/Sources/Flows/OAuth2ClientCredentials.swift /Users/admin/builder/spi-builder-workspace/.dependencies/checkouts/OAuth2/Sources/Flows/OAuth2ClientCredentialsReddit.swift /Users/admin/builder/spi-builder-workspace/.dependencies/checkouts/OAuth2/Sources/Flows/OAuth2CodeGrant.swift /Users/admin/builder/spi-builder-workspace/.dependencies/checkouts/OAuth2/Sources/Flows/OAuth2CodeGrantAzure.swift /Users/admin/builder/spi-builder-workspace/.dependencies/checkouts/OAuth2/Sources/Flows/OAuth2CodeGrantBasicAuth.swift /Users/admin/builder/spi-builder-workspace/.dependencies/checkouts/OAuth2/Sources/Flows/OAuth2CodeGrantFacebook.swift /Users/admin/builder/spi-builder-workspace/.dependencies/checkouts/OAuth2/Sources/Flows/OAuth2CodeGrantLinkedIn.swift /Users/admin/builder/spi-builder-workspace/.dependencies/checkouts/OAuth2/Sources/Flows/OAuth2CodeGrantNoTokenType.swift /Users/admin/builder/spi-builder-workspace/.dependencies/checkouts/OAuth2/Sources/Flows/OAuth2DeviceGrant.swift -primary-file /Users/admin/builder/spi-builder-workspace/.dependencies/checkouts/OAuth2/Sources/Flows/OAuth2DynReg.swift /Users/admin/builder/spi-builder-workspace/.dependencies/checkouts/OAuth2/Sources/Flows/OAuth2ImplicitGrant.swift /Users/admin/builder/spi-builder-workspace/.dependencies/checkouts/OAuth2/Sources/Flows/OAuth2ImplicitGrantWithQueryParams.swift /Users/admin/builder/spi-builder-workspace/.dependencies/checkouts/OAuth2/Sources/Flows/OAuth2PasswordGrant.swift -emit-dependencies-path /Users/admin/builder/spi-builder-workspace/.derivedData/Build/Intermediates.noindex/OAuth2.build/Debug-watchos/Flows.build/Objects-normal/arm64/OAuth2DynReg.d -emit-const-values-path /Users/admin/builder/spi-builder-workspace/.derivedData/Build/Intermediates.noindex/OAuth2.build/Debug-watchos/Flows.build/Objects-normal/arm64/OAuth2DynReg.swiftconstvalues -emit-reference-dependencies-path /Users/admin/builder/spi-builder-workspace/.derivedData/Build/Intermediates.noindex/OAuth2.build/Debug-watchos/Flows.build/Objects-normal/arm64/OAuth2DynReg.swiftdeps -serialize-diagnostics-path /Users/admin/builder/spi-builder-workspace/.derivedData/Build/Intermediates.noindex/OAuth2.build/Debug-watchos/Flows.build/Objects-normal/arm64/OAuth2DynReg.dia -target arm64-apple-watchos5.0 -Xllvm -aarch64-use-tbi -enable-objc-interop -sdk /Applications/Xcode-16.2.0.app/Contents/Developer/Platforms/WatchOS.platform/Developer/SDKs/WatchOS11.2.sdk -I /Users/admin/builder/spi-builder-workspace/.derivedData/Build/Products/Debug-watchos -I /Applications/Xcode-16.2.0.app/Contents/Developer/Platforms/WatchOS.platform/Developer/usr/lib -F /Users/admin/builder/spi-builder-workspace/.derivedData/Build/Products/Debug-watchos/PackageFrameworks -F /Users/admin/builder/spi-builder-workspace/.derivedData/Build/Products/Debug-watchos/PackageFrameworks -F /Users/admin/builder/spi-builder-workspace/.derivedData/Build/Products/Debug-watchos/PackageFrameworks -F /Users/admin/builder/spi-builder-workspace/.derivedData/Build/Products/Debug-watchos/PackageFrameworks -F /Users/admin/builder/spi-builder-workspace/.derivedData/Build/Products/Debug-watchos/PackageFrameworks -F /Users/admin/builder/spi-builder-workspace/.derivedData/Build/Products/Debug-watchos -F /Applications/Xcode-16.2.0.app/Contents/Developer/Platforms/WatchOS.platform/Developer/Library/Frameworks -F /Applications/Xcode-16.2.0.app/Contents/Developer/Platforms/WatchOS.platform/Developer/SDKs/WatchOS11.2.sdk/Developer/Library/Frameworks -no-color-diagnostics -enable-testing -g -debug-info-format\=dwarf -dwarf-version\=4 -module-cache-path /Users/admin/builder/spi-builder-workspace/.derivedData/ModuleCache.noindex -suppress-warnings -profile-generate -profile-coverage-mapping -swift-version 5 -enforce-exclusivity\=checked -Onone -D SWIFT_PACKAGE -D DEBUG -D Xcode -serialize-debugging-options -const-gather-protocols-file /Users/admin/builder/spi-builder-workspace/.derivedData/Build/Intermediates.noindex/OAuth2.build/Debug-watchos/Flows.build/Objects-normal/arm64/Flows_const_extract_protocols.json -enable-experimental-feature DebugDescriptionMacro -enable-experimental-feature OpaqueTypeErasure -empty-abi-descriptor -plugin-path /Applications/Xcode-16.2.0.app/Contents/Developer/Toolchains/XcodeDefault.xctoolchain/usr/lib/swift/host/plugins/testing -validate-clang-modules-once -clang-build-session-file /Users/admin/builder/spi-builder-workspace/.derivedData/ModuleCache.noindex/Session.modulevalidation -Xcc -working-directory -Xcc /Users/admin/builder/spi-builder-workspace/.swiftpm/xcode -resource-dir /Applications/Xcode-16.2.0.app/Contents/Developer/Toolchains/XcodeDefault.xctoolchain/usr/lib/swift -enable-anonymous-context-mangled-names -file-compilation-dir /Users/admin/builder/spi-builder-workspace/.swiftpm/xcode -Xcc -D_LIBCPP_HARDENING_MODE\=_LIBCPP_HARDENING_MODE_DEBUG -Xcc -ivfsstatcache -Xcc /Users/admin/builder/spi-builder-workspace/.derivedData/SDKStatCaches.noindex/watchos11.2-22S97-8cb5c683f5e64b0ecfc74e8d0065fbf6.sdkstatcache -Xcc -I/Users/admin/builder/spi-builder-workspace/.derivedData/Build/Intermediates.noindex/OAuth2.build/Debug-watchos/Flows.build/swift-overrides.hmap -Xcc -I/Users/admin/builder/spi-builder-workspace/.derivedData/Build/Products/Debug-watchos/include -Xcc -I/Users/admin/builder/spi-builder-workspace/.derivedData/Build/Intermediates.noindex/OAuth2.build/Debug-watchos/Flows.build/DerivedSources-normal/arm64 -Xcc -I/Users/admin/builder/spi-builder-workspace/.derivedData/Build/Intermediates.noindex/OAuth2.build/Debug-watchos/Flows.build/DerivedSources/arm64 -Xcc -I/Users/admin/builder/spi-builder-workspace/.derivedData/Build/Intermediates.noindex/OAuth2.build/Debug-watchos/Flows.build/DerivedSources -Xcc -DSWIFT_PACKAGE -Xcc -DDEBUG\=1 -module-name Flows -frontend-parseable-output -disable-clang-spi -target-sdk-version 11.2 -target-sdk-name watchos11.2 -external-plugin-path /Applications/Xcode-16.2.0.app/Contents/Developer/Platforms/WatchOS.platform/Developer/usr/lib/swift/host/plugins\#/Applications/Xcode-16.2.0.app/Contents/Developer/Platforms/WatchOS.platform/Developer/usr/bin/swift-plugin-server -external-plugin-path /Applications/Xcode-16.2.0.app/Contents/Developer/Platforms/WatchOS.platform/Developer/usr/local/lib/swift/host/plugins\#/Applications/Xcode-16.2.0.app/Contents/Developer/Platforms/WatchOS.platform/Developer/usr/bin/swift-plugin-server -plugin-path /Applications/Xcode-16.2.0.app/Contents/Developer/Toolchains/XcodeDefault.xctoolchain/usr/lib/swift/host/plugins -plugin-path /Applications/Xcode-16.2.0.app/Contents/Developer/Toolchains/XcodeDefault.xctoolchain/usr/local/lib/swift/host/plugins -o /Users/admin/builder/spi-builder-workspace/.derivedData/Build/Intermediates.noindex/OAuth2.build/Debug-watchos/Flows.build/Objects-normal/arm64/OAuth2DynReg.o -index-unit-output-path /OAuth2.build/Debug-watchos/Flows.build/Objects-normal/arm64/OAuth2DynReg.o -index-store-path /Users/admin/builder/spi-builder-workspace/.derivedData/Index.noindex/DataStore -index-system-modules
SwiftCompile normal arm64 /Users/admin/builder/spi-builder-workspace/.dependencies/checkouts/OAuth2/Sources/Flows/OAuth2DynReg.swift (in target 'Flows' from project 'OAuth2')
    cd /Users/admin/builder/spi-builder-workspace/.swiftpm/xcode
    /Applications/Xcode-16.2.0.app/Contents/Developer/Toolchains/XcodeDefault.xctoolchain/usr/bin/swift-frontend -c /Users/admin/builder/spi-builder-workspace/.dependencies/checkouts/OAuth2/Sources/Flows/OAuth2.swift /Users/admin/builder/spi-builder-workspace/.dependencies/checkouts/OAuth2/Sources/Flows/OAuth2ClientCredentials.swift /Users/admin/builder/spi-builder-workspace/.dependencies/checkouts/OAuth2/Sources/Flows/OAuth2ClientCredentialsReddit.swift /Users/admin/builder/spi-builder-workspace/.dependencies/checkouts/OAuth2/Sources/Flows/OAuth2CodeGrant.swift /Users/admin/builder/spi-builder-workspace/.dependencies/checkouts/OAuth2/Sources/Flows/OAuth2CodeGrantAzure.swift /Users/admin/builder/spi-builder-workspace/.dependencies/checkouts/OAuth2/Sources/Flows/OAuth2CodeGrantBasicAuth.swift /Users/admin/builder/spi-builder-workspace/.dependencies/checkouts/OAuth2/Sources/Flows/OAuth2CodeGrantFacebook.swift /Users/admin/builder/spi-builder-workspace/.dependencies/checkouts/OAuth2/Sources/Flows/OAuth2CodeGrantLinkedIn.swift /Users/admin/builder/spi-builder-workspace/.dependencies/checkouts/OAuth2/Sources/Flows/OAuth2CodeGrantNoTokenType.swift /Users/admin/builder/spi-builder-workspace/.dependencies/checkouts/OAuth2/Sources/Flows/OAuth2DeviceGrant.swift -primary-file /Users/admin/builder/spi-builder-workspace/.dependencies/checkouts/OAuth2/Sources/Flows/OAuth2DynReg.swift /Users/admin/builder/spi-builder-workspace/.dependencies/checkouts/OAuth2/Sources/Flows/OAuth2ImplicitGrant.swift /Users/admin/builder/spi-builder-workspace/.dependencies/checkouts/OAuth2/Sources/Flows/OAuth2ImplicitGrantWithQueryParams.swift /Users/admin/builder/spi-builder-workspace/.dependencies/checkouts/OAuth2/Sources/Flows/OAuth2PasswordGrant.swift -emit-dependencies-path /Users/admin/builder/spi-builder-workspace/.derivedData/Build/Intermediates.noindex/OAuth2.build/Debug-watchos/Flows.build/Objects-normal/arm64/OAuth2DynReg.d -emit-const-values-path /Users/admin/builder/spi-builder-workspace/.derivedData/Build/Intermediates.noindex/OAuth2.build/Debug-watchos/Flows.build/Objects-normal/arm64/OAuth2DynReg.swiftconstvalues -emit-reference-dependencies-path /Users/admin/builder/spi-builder-workspace/.derivedData/Build/Intermediates.noindex/OAuth2.build/Debug-watchos/Flows.build/Objects-normal/arm64/OAuth2DynReg.swiftdeps -serialize-diagnostics-path /Users/admin/builder/spi-builder-workspace/.derivedData/Build/Intermediates.noindex/OAuth2.build/Debug-watchos/Flows.build/Objects-normal/arm64/OAuth2DynReg.dia -target arm64-apple-watchos5.0 -Xllvm -aarch64-use-tbi -enable-objc-interop -sdk /Applications/Xcode-16.2.0.app/Contents/Developer/Platforms/WatchOS.platform/Developer/SDKs/WatchOS11.2.sdk -I /Users/admin/builder/spi-builder-workspace/.derivedData/Build/Products/Debug-watchos -I /Applications/Xcode-16.2.0.app/Contents/Developer/Platforms/WatchOS.platform/Developer/usr/lib -F /Users/admin/builder/spi-builder-workspace/.derivedData/Build/Products/Debug-watchos/PackageFrameworks -F /Users/admin/builder/spi-builder-workspace/.derivedData/Build/Products/Debug-watchos/PackageFrameworks -F /Users/admin/builder/spi-builder-workspace/.derivedData/Build/Products/Debug-watchos/PackageFrameworks -F /Users/admin/builder/spi-builder-workspace/.derivedData/Build/Products/Debug-watchos/PackageFrameworks -F /Users/admin/builder/spi-builder-workspace/.derivedData/Build/Products/Debug-watchos/PackageFrameworks -F /Users/admin/builder/spi-builder-workspace/.derivedData/Build/Products/Debug-watchos -F /Applications/Xcode-16.2.0.app/Contents/Developer/Platforms/WatchOS.platform/Developer/Library/Frameworks -F /Applications/Xcode-16.2.0.app/Contents/Developer/Platforms/WatchOS.platform/Developer/SDKs/WatchOS11.2.sdk/Developer/Library/Frameworks -no-color-diagnostics -enable-testing -g -debug-info-format\=dwarf -dwarf-version\=4 -module-cache-path /Users/admin/builder/spi-builder-workspace/.derivedData/ModuleCache.noindex -suppress-warnings -profile-generate -profile-coverage-mapping -swift-version 5 -enforce-exclusivity\=checked -Onone -D SWIFT_PACKAGE -D DEBUG -D Xcode -serialize-debugging-options -const-gather-protocols-file /Users/admin/builder/spi-builder-workspace/.derivedData/Build/Intermediates.noindex/OAuth2.build/Debug-watchos/Flows.build/Objects-normal/arm64/Flows_const_extract_protocols.json -enable-experimental-feature DebugDescriptionMacro -enable-experimental-feature OpaqueTypeErasure -empty-abi-descriptor -plugin-path /Applications/Xcode-16.2.0.app/Contents/Developer/Toolchains/XcodeDefault.xctoolchain/usr/lib/swift/host/plugins/testing -validate-clang-modules-once -clang-build-session-file /Users/admin/builder/spi-builder-workspace/.derivedData/ModuleCache.noindex/Session.modulevalidation -Xcc -working-directory -Xcc /Users/admin/builder/spi-builder-workspace/.swiftpm/xcode -resource-dir /Applications/Xcode-16.2.0.app/Contents/Developer/Toolchains/XcodeDefault.xctoolchain/usr/lib/swift -enable-anonymous-context-mangled-names -file-compilation-dir /Users/admin/builder/spi-builder-workspace/.swiftpm/xcode -Xcc -D_LIBCPP_HARDENING_MODE\=_LIBCPP_HARDENING_MODE_DEBUG -Xcc -ivfsstatcache -Xcc /Users/admin/builder/spi-builder-workspace/.derivedData/SDKStatCaches.noindex/watchos11.2-22S97-8cb5c683f5e64b0ecfc74e8d0065fbf6.sdkstatcache -Xcc -I/Users/admin/builder/spi-builder-workspace/.derivedData/Build/Intermediates.noindex/OAuth2.build/Debug-watchos/Flows.build/swift-overrides.hmap -Xcc -I/Users/admin/builder/spi-builder-workspace/.derivedData/Build/Products/Debug-watchos/include -Xcc -I/Users/admin/builder/spi-builder-workspace/.derivedData/Build/Intermediates.noindex/OAuth2.build/Debug-watchos/Flows.build/DerivedSources-normal/arm64 -Xcc -I/Users/admin/builder/spi-builder-workspace/.derivedData/Build/Intermediates.noindex/OAuth2.build/Debug-watchos/Flows.build/DerivedSources/arm64 -Xcc -I/Users/admin/builder/spi-builder-workspace/.derivedData/Build/Intermediates.noindex/OAuth2.build/Debug-watchos/Flows.build/DerivedSources -Xcc -DSWIFT_PACKAGE -Xcc -DDEBUG\=1 -module-name Flows -frontend-parseable-output -disable-clang-spi -target-sdk-version 11.2 -target-sdk-name watchos11.2 -external-plugin-path /Applications/Xcode-16.2.0.app/Contents/Developer/Platforms/WatchOS.platform/Developer/usr/lib/swift/host/plugins\#/Applications/Xcode-16.2.0.app/Contents/Developer/Platforms/WatchOS.platform/Developer/usr/bin/swift-plugin-server -external-plugin-path /Applications/Xcode-16.2.0.app/Contents/Developer/Platforms/WatchOS.platform/Developer/usr/local/lib/swift/host/plugins\#/Applications/Xcode-16.2.0.app/Contents/Developer/Platforms/WatchOS.platform/Developer/usr/bin/swift-plugin-server -plugin-path /Applications/Xcode-16.2.0.app/Contents/Developer/Toolchains/XcodeDefault.xctoolchain/usr/lib/swift/host/plugins -plugin-path /Applications/Xcode-16.2.0.app/Contents/Developer/Toolchains/XcodeDefault.xctoolchain/usr/local/lib/swift/host/plugins -o /Users/admin/builder/spi-builder-workspace/.derivedData/Build/Intermediates.noindex/OAuth2.build/Debug-watchos/Flows.build/Objects-normal/arm64/OAuth2DynReg.o -index-unit-output-path /OAuth2.build/Debug-watchos/Flows.build/Objects-normal/arm64/OAuth2DynReg.o -index-store-path /Users/admin/builder/spi-builder-workspace/.derivedData/Index.noindex/DataStore -index-system-modules
SwiftCompile normal arm64 Compiling\ OAuth2CodeGrantAzure.swift,\ OAuth2CodeGrantBasicAuth.swift /Users/admin/builder/spi-builder-workspace/.dependencies/checkouts/OAuth2/Sources/Flows/OAuth2CodeGrantAzure.swift /Users/admin/builder/spi-builder-workspace/.dependencies/checkouts/OAuth2/Sources/Flows/OAuth2CodeGrantBasicAuth.swift (in target 'Flows' from project 'OAuth2')
    cd /Users/admin/builder/spi-builder-workspace/.swiftpm/xcode
    builtin-swiftTaskExecution -- /Applications/Xcode-16.2.0.app/Contents/Developer/Toolchains/XcodeDefault.xctoolchain/usr/bin/swift-frontend -frontend -c /Users/admin/builder/spi-builder-workspace/.dependencies/checkouts/OAuth2/Sources/Flows/OAuth2.swift /Users/admin/builder/spi-builder-workspace/.dependencies/checkouts/OAuth2/Sources/Flows/OAuth2ClientCredentials.swift /Users/admin/builder/spi-builder-workspace/.dependencies/checkouts/OAuth2/Sources/Flows/OAuth2ClientCredentialsReddit.swift /Users/admin/builder/spi-builder-workspace/.dependencies/checkouts/OAuth2/Sources/Flows/OAuth2CodeGrant.swift -primary-file /Users/admin/builder/spi-builder-workspace/.dependencies/checkouts/OAuth2/Sources/Flows/OAuth2CodeGrantAzure.swift -primary-file /Users/admin/builder/spi-builder-workspace/.dependencies/checkouts/OAuth2/Sources/Flows/OAuth2CodeGrantBasicAuth.swift /Users/admin/builder/spi-builder-workspace/.dependencies/checkouts/OAuth2/Sources/Flows/OAuth2CodeGrantFacebook.swift /Users/admin/builder/spi-builder-workspace/.dependencies/checkouts/OAuth2/Sources/Flows/OAuth2CodeGrantLinkedIn.swift /Users/admin/builder/spi-builder-workspace/.dependencies/checkouts/OAuth2/Sources/Flows/OAuth2CodeGrantNoTokenType.swift /Users/admin/builder/spi-builder-workspace/.dependencies/checkouts/OAuth2/Sources/Flows/OAuth2DeviceGrant.swift /Users/admin/builder/spi-builder-workspace/.dependencies/checkouts/OAuth2/Sources/Flows/OAuth2DynReg.swift /Users/admin/builder/spi-builder-workspace/.dependencies/checkouts/OAuth2/Sources/Flows/OAuth2ImplicitGrant.swift /Users/admin/builder/spi-builder-workspace/.dependencies/checkouts/OAuth2/Sources/Flows/OAuth2ImplicitGrantWithQueryParams.swift /Users/admin/builder/spi-builder-workspace/.dependencies/checkouts/OAuth2/Sources/Flows/OAuth2PasswordGrant.swift -emit-dependencies-path /Users/admin/builder/spi-builder-workspace/.derivedData/Build/Intermediates.noindex/OAuth2.build/Debug-watchos/Flows.build/Objects-normal/arm64/OAuth2CodeGrantAzure.d -emit-const-values-path /Users/admin/builder/spi-builder-workspace/.derivedData/Build/Intermediates.noindex/OAuth2.build/Debug-watchos/Flows.build/Objects-normal/arm64/OAuth2CodeGrantAzure.swiftconstvalues -emit-reference-dependencies-path /Users/admin/builder/spi-builder-workspace/.derivedData/Build/Intermediates.noindex/OAuth2.build/Debug-watchos/Flows.build/Objects-normal/arm64/OAuth2CodeGrantAzure.swiftdeps -serialize-diagnostics-path /Users/admin/builder/spi-builder-workspace/.derivedData/Build/Intermediates.noindex/OAuth2.build/Debug-watchos/Flows.build/Objects-normal/arm64/OAuth2CodeGrantAzure.dia -emit-dependencies-path /Users/admin/builder/spi-builder-workspace/.derivedData/Build/Intermediates.noindex/OAuth2.build/Debug-watchos/Flows.build/Objects-normal/arm64/OAuth2CodeGrantBasicAuth.d -emit-const-values-path /Users/admin/builder/spi-builder-workspace/.derivedData/Build/Intermediates.noindex/OAuth2.build/Debug-watchos/Flows.build/Objects-normal/arm64/OAuth2CodeGrantBasicAuth.swiftconstvalues -emit-reference-dependencies-path /Users/admin/builder/spi-builder-workspace/.derivedData/Build/Intermediates.noindex/OAuth2.build/Debug-watchos/Flows.build/Objects-normal/arm64/OAuth2CodeGrantBasicAuth.swiftdeps -serialize-diagnostics-path /Users/admin/builder/spi-builder-workspace/.derivedData/Build/Intermediates.noindex/OAuth2.build/Debug-watchos/Flows.build/Objects-normal/arm64/OAuth2CodeGrantBasicAuth.dia -target arm64-apple-watchos5.0 -Xllvm -aarch64-use-tbi -enable-objc-interop -sdk /Applications/Xcode-16.2.0.app/Contents/Developer/Platforms/WatchOS.platform/Developer/SDKs/WatchOS11.2.sdk -I /Users/admin/builder/spi-builder-workspace/.derivedData/Build/Products/Debug-watchos -I /Applications/Xcode-16.2.0.app/Contents/Developer/Platforms/WatchOS.platform/Developer/usr/lib -F /Users/admin/builder/spi-builder-workspace/.derivedData/Build/Products/Debug-watchos/PackageFrameworks -F /Users/admin/builder/spi-builder-workspace/.derivedData/Build/Products/Debug-watchos/PackageFrameworks -F /Users/admin/builder/spi-builder-workspace/.derivedData/Build/Products/Debug-watchos/PackageFrameworks -F /Users/admin/builder/spi-builder-workspace/.derivedData/Build/Products/Debug-watchos/PackageFrameworks -F /Users/admin/builder/spi-builder-workspace/.derivedData/Build/Products/Debug-watchos/PackageFrameworks -F /Users/admin/builder/spi-builder-workspace/.derivedData/Build/Products/Debug-watchos -F /Applications/Xcode-16.2.0.app/Contents/Developer/Platforms/WatchOS.platform/Developer/Library/Frameworks -F /Applications/Xcode-16.2.0.app/Contents/Developer/Platforms/WatchOS.platform/Developer/SDKs/WatchOS11.2.sdk/Developer/Library/Frameworks -no-color-diagnostics -enable-testing -g -debug-info-format\=dwarf -dwarf-version\=4 -module-cache-path /Users/admin/builder/spi-builder-workspace/.derivedData/ModuleCache.noindex -suppress-warnings -profile-generate -profile-coverage-mapping -swift-version 5 -enforce-exclusivity\=checked -Onone -D SWIFT_PACKAGE -D DEBUG -D Xcode -serialize-debugging-options -const-gather-protocols-file /Users/admin/builder/spi-builder-workspace/.derivedData/Build/Intermediates.noindex/OAuth2.build/Debug-watchos/Flows.build/Objects-normal/arm64/Flows_const_extract_protocols.json -enable-experimental-feature DebugDescriptionMacro -enable-experimental-feature OpaqueTypeErasure -empty-abi-descriptor -plugin-path /Applications/Xcode-16.2.0.app/Contents/Developer/Toolchains/XcodeDefault.xctoolchain/usr/lib/swift/host/plugins/testing -validate-clang-modules-once -clang-build-session-file /Users/admin/builder/spi-builder-workspace/.derivedData/ModuleCache.noindex/Session.modulevalidation -Xcc -working-directory -Xcc /Users/admin/builder/spi-builder-workspace/.swiftpm/xcode -resource-dir /Applications/Xcode-16.2.0.app/Contents/Developer/Toolchains/XcodeDefault.xctoolchain/usr/lib/swift -enable-anonymous-context-mangled-names -file-compilation-dir /Users/admin/builder/spi-builder-workspace/.swiftpm/xcode -Xcc -D_LIBCPP_HARDENING_MODE\=_LIBCPP_HARDENING_MODE_DEBUG -Xcc -ivfsstatcache -Xcc /Users/admin/builder/spi-builder-workspace/.derivedData/SDKStatCaches.noindex/watchos11.2-22S97-8cb5c683f5e64b0ecfc74e8d0065fbf6.sdkstatcache -Xcc -I/Users/admin/builder/spi-builder-workspace/.derivedData/Build/Intermediates.noindex/OAuth2.build/Debug-watchos/Flows.build/swift-overrides.hmap -Xcc -I/Users/admin/builder/spi-builder-workspace/.derivedData/Build/Products/Debug-watchos/include -Xcc -I/Users/admin/builder/spi-builder-workspace/.derivedData/Build/Intermediates.noindex/OAuth2.build/Debug-watchos/Flows.build/DerivedSources-normal/arm64 -Xcc -I/Users/admin/builder/spi-builder-workspace/.derivedData/Build/Intermediates.noindex/OAuth2.build/Debug-watchos/Flows.build/DerivedSources/arm64 -Xcc -I/Users/admin/builder/spi-builder-workspace/.derivedData/Build/Intermediates.noindex/OAuth2.build/Debug-watchos/Flows.build/DerivedSources -Xcc -DSWIFT_PACKAGE -Xcc -DDEBUG\=1 -module-name Flows -frontend-parseable-output -disable-clang-spi -target-sdk-version 11.2 -target-sdk-name watchos11.2 -external-plugin-path /Applications/Xcode-16.2.0.app/Contents/Developer/Platforms/WatchOS.platform/Developer/usr/lib/swift/host/plugins\#/Applications/Xcode-16.2.0.app/Contents/Developer/Platforms/WatchOS.platform/Developer/usr/bin/swift-plugin-server -external-plugin-path /Applications/Xcode-16.2.0.app/Contents/Developer/Platforms/WatchOS.platform/Developer/usr/local/lib/swift/host/plugins\#/Applications/Xcode-16.2.0.app/Contents/Developer/Platforms/WatchOS.platform/Developer/usr/bin/swift-plugin-server -plugin-path /Applications/Xcode-16.2.0.app/Contents/Developer/Toolchains/XcodeDefault.xctoolchain/usr/lib/swift/host/plugins -plugin-path /Applications/Xcode-16.2.0.app/Contents/Developer/Toolchains/XcodeDefault.xctoolchain/usr/local/lib/swift/host/plugins -o /Users/admin/builder/spi-builder-workspace/.derivedData/Build/Intermediates.noindex/OAuth2.build/Debug-watchos/Flows.build/Objects-normal/arm64/OAuth2CodeGrantAzure.o -o /Users/admin/builder/spi-builder-workspace/.derivedData/Build/Intermediates.noindex/OAuth2.build/Debug-watchos/Flows.build/Objects-normal/arm64/OAuth2CodeGrantBasicAuth.o -index-unit-output-path /OAuth2.build/Debug-watchos/Flows.build/Objects-normal/arm64/OAuth2CodeGrantAzure.o -index-unit-output-path /OAuth2.build/Debug-watchos/Flows.build/Objects-normal/arm64/OAuth2CodeGrantBasicAuth.o -index-store-path /Users/admin/builder/spi-builder-workspace/.derivedData/Index.noindex/DataStore -index-system-modules
SwiftCompile normal arm64 /Users/admin/builder/spi-builder-workspace/.dependencies/checkouts/OAuth2/Sources/Flows/OAuth2CodeGrantAzure.swift (in target 'Flows' from project 'OAuth2')
    cd /Users/admin/builder/spi-builder-workspace/.swiftpm/xcode
    /Applications/Xcode-16.2.0.app/Contents/Developer/Toolchains/XcodeDefault.xctoolchain/usr/bin/swift-frontend -c /Users/admin/builder/spi-builder-workspace/.dependencies/checkouts/OAuth2/Sources/Flows/OAuth2.swift /Users/admin/builder/spi-builder-workspace/.dependencies/checkouts/OAuth2/Sources/Flows/OAuth2ClientCredentials.swift /Users/admin/builder/spi-builder-workspace/.dependencies/checkouts/OAuth2/Sources/Flows/OAuth2ClientCredentialsReddit.swift /Users/admin/builder/spi-builder-workspace/.dependencies/checkouts/OAuth2/Sources/Flows/OAuth2CodeGrant.swift -primary-file /Users/admin/builder/spi-builder-workspace/.dependencies/checkouts/OAuth2/Sources/Flows/OAuth2CodeGrantAzure.swift -primary-file /Users/admin/builder/spi-builder-workspace/.dependencies/checkouts/OAuth2/Sources/Flows/OAuth2CodeGrantBasicAuth.swift /Users/admin/builder/spi-builder-workspace/.dependencies/checkouts/OAuth2/Sources/Flows/OAuth2CodeGrantFacebook.swift /Users/admin/builder/spi-builder-workspace/.dependencies/checkouts/OAuth2/Sources/Flows/OAuth2CodeGrantLinkedIn.swift /Users/admin/builder/spi-builder-workspace/.dependencies/checkouts/OAuth2/Sources/Flows/OAuth2CodeGrantNoTokenType.swift /Users/admin/builder/spi-builder-workspace/.dependencies/checkouts/OAuth2/Sources/Flows/OAuth2DeviceGrant.swift /Users/admin/builder/spi-builder-workspace/.dependencies/checkouts/OAuth2/Sources/Flows/OAuth2DynReg.swift /Users/admin/builder/spi-builder-workspace/.dependencies/checkouts/OAuth2/Sources/Flows/OAuth2ImplicitGrant.swift /Users/admin/builder/spi-builder-workspace/.dependencies/checkouts/OAuth2/Sources/Flows/OAuth2ImplicitGrantWithQueryParams.swift /Users/admin/builder/spi-builder-workspace/.dependencies/checkouts/OAuth2/Sources/Flows/OAuth2PasswordGrant.swift -emit-dependencies-path /Users/admin/builder/spi-builder-workspace/.derivedData/Build/Intermediates.noindex/OAuth2.build/Debug-watchos/Flows.build/Objects-normal/arm64/OAuth2CodeGrantAzure.d -emit-const-values-path /Users/admin/builder/spi-builder-workspace/.derivedData/Build/Intermediates.noindex/OAuth2.build/Debug-watchos/Flows.build/Objects-normal/arm64/OAuth2CodeGrantAzure.swiftconstvalues -emit-reference-dependencies-path /Users/admin/builder/spi-builder-workspace/.derivedData/Build/Intermediates.noindex/OAuth2.build/Debug-watchos/Flows.build/Objects-normal/arm64/OAuth2CodeGrantAzure.swiftdeps -serialize-diagnostics-path /Users/admin/builder/spi-builder-workspace/.derivedData/Build/Intermediates.noindex/OAuth2.build/Debug-watchos/Flows.build/Objects-normal/arm64/OAuth2CodeGrantAzure.dia -emit-dependencies-path /Users/admin/builder/spi-builder-workspace/.derivedData/Build/Intermediates.noindex/OAuth2.build/Debug-watchos/Flows.build/Objects-normal/arm64/OAuth2CodeGrantBasicAuth.d -emit-const-values-path /Users/admin/builder/spi-builder-workspace/.derivedData/Build/Intermediates.noindex/OAuth2.build/Debug-watchos/Flows.build/Objects-normal/arm64/OAuth2CodeGrantBasicAuth.swiftconstvalues -emit-reference-dependencies-path /Users/admin/builder/spi-builder-workspace/.derivedData/Build/Intermediates.noindex/OAuth2.build/Debug-watchos/Flows.build/Objects-normal/arm64/OAuth2CodeGrantBasicAuth.swiftdeps -serialize-diagnostics-path /Users/admin/builder/spi-builder-workspace/.derivedData/Build/Intermediates.noindex/OAuth2.build/Debug-watchos/Flows.build/Objects-normal/arm64/OAuth2CodeGrantBasicAuth.dia -target arm64-apple-watchos5.0 -Xllvm -aarch64-use-tbi -enable-objc-interop -sdk /Applications/Xcode-16.2.0.app/Contents/Developer/Platforms/WatchOS.platform/Developer/SDKs/WatchOS11.2.sdk -I /Users/admin/builder/spi-builder-workspace/.derivedData/Build/Products/Debug-watchos -I /Applications/Xcode-16.2.0.app/Contents/Developer/Platforms/WatchOS.platform/Developer/usr/lib -F /Users/admin/builder/spi-builder-workspace/.derivedData/Build/Products/Debug-watchos/PackageFrameworks -F /Users/admin/builder/spi-builder-workspace/.derivedData/Build/Products/Debug-watchos/PackageFrameworks -F /Users/admin/builder/spi-builder-workspace/.derivedData/Build/Products/Debug-watchos/PackageFrameworks -F /Users/admin/builder/spi-builder-workspace/.derivedData/Build/Products/Debug-watchos/PackageFrameworks -F /Users/admin/builder/spi-builder-workspace/.derivedData/Build/Products/Debug-watchos/PackageFrameworks -F /Users/admin/builder/spi-builder-workspace/.derivedData/Build/Products/Debug-watchos -F /Applications/Xcode-16.2.0.app/Contents/Developer/Platforms/WatchOS.platform/Developer/Library/Frameworks -F /Applications/Xcode-16.2.0.app/Contents/Developer/Platforms/WatchOS.platform/Developer/SDKs/WatchOS11.2.sdk/Developer/Library/Frameworks -no-color-diagnostics -enable-testing -g -debug-info-format\=dwarf -dwarf-version\=4 -module-cache-path /Users/admin/builder/spi-builder-workspace/.derivedData/ModuleCache.noindex -suppress-warnings -profile-generate -profile-coverage-mapping -swift-version 5 -enforce-exclusivity\=checked -Onone -D SWIFT_PACKAGE -D DEBUG -D Xcode -serialize-debugging-options -const-gather-protocols-file /Users/admin/builder/spi-builder-workspace/.derivedData/Build/Intermediates.noindex/OAuth2.build/Debug-watchos/Flows.build/Objects-normal/arm64/Flows_const_extract_protocols.json -enable-experimental-feature DebugDescriptionMacro -enable-experimental-feature OpaqueTypeErasure -empty-abi-descriptor -plugin-path /Applications/Xcode-16.2.0.app/Contents/Developer/Toolchains/XcodeDefault.xctoolchain/usr/lib/swift/host/plugins/testing -validate-clang-modules-once -clang-build-session-file /Users/admin/builder/spi-builder-workspace/.derivedData/ModuleCache.noindex/Session.modulevalidation -Xcc -working-directory -Xcc /Users/admin/builder/spi-builder-workspace/.swiftpm/xcode -resource-dir /Applications/Xcode-16.2.0.app/Contents/Developer/Toolchains/XcodeDefault.xctoolchain/usr/lib/swift -enable-anonymous-context-mangled-names -file-compilation-dir /Users/admin/builder/spi-builder-workspace/.swiftpm/xcode -Xcc -D_LIBCPP_HARDENING_MODE\=_LIBCPP_HARDENING_MODE_DEBUG -Xcc -ivfsstatcache -Xcc /Users/admin/builder/spi-builder-workspace/.derivedData/SDKStatCaches.noindex/watchos11.2-22S97-8cb5c683f5e64b0ecfc74e8d0065fbf6.sdkstatcache -Xcc -I/Users/admin/builder/spi-builder-workspace/.derivedData/Build/Intermediates.noindex/OAuth2.build/Debug-watchos/Flows.build/swift-overrides.hmap -Xcc -I/Users/admin/builder/spi-builder-workspace/.derivedData/Build/Products/Debug-watchos/include -Xcc -I/Users/admin/builder/spi-builder-workspace/.derivedData/Build/Intermediates.noindex/OAuth2.build/Debug-watchos/Flows.build/DerivedSources-normal/arm64 -Xcc -I/Users/admin/builder/spi-builder-workspace/.derivedData/Build/Intermediates.noindex/OAuth2.build/Debug-watchos/Flows.build/DerivedSources/arm64 -Xcc -I/Users/admin/builder/spi-builder-workspace/.derivedData/Build/Intermediates.noindex/OAuth2.build/Debug-watchos/Flows.build/DerivedSources -Xcc -DSWIFT_PACKAGE -Xcc -DDEBUG\=1 -module-name Flows -frontend-parseable-output -disable-clang-spi -target-sdk-version 11.2 -target-sdk-name watchos11.2 -external-plugin-path /Applications/Xcode-16.2.0.app/Contents/Developer/Platforms/WatchOS.platform/Developer/usr/lib/swift/host/plugins\#/Applications/Xcode-16.2.0.app/Contents/Developer/Platforms/WatchOS.platform/Developer/usr/bin/swift-plugin-server -external-plugin-path /Applications/Xcode-16.2.0.app/Contents/Developer/Platforms/WatchOS.platform/Developer/usr/local/lib/swift/host/plugins\#/Applications/Xcode-16.2.0.app/Contents/Developer/Platforms/WatchOS.platform/Developer/usr/bin/swift-plugin-server -plugin-path /Applications/Xcode-16.2.0.app/Contents/Developer/Toolchains/XcodeDefault.xctoolchain/usr/lib/swift/host/plugins -plugin-path /Applications/Xcode-16.2.0.app/Contents/Developer/Toolchains/XcodeDefault.xctoolchain/usr/local/lib/swift/host/plugins -o /Users/admin/builder/spi-builder-workspace/.derivedData/Build/Intermediates.noindex/OAuth2.build/Debug-watchos/Flows.build/Objects-normal/arm64/OAuth2CodeGrantAzure.o -o /Users/admin/builder/spi-builder-workspace/.derivedData/Build/Intermediates.noindex/OAuth2.build/Debug-watchos/Flows.build/Objects-normal/arm64/OAuth2CodeGrantBasicAuth.o -index-unit-output-path /OAuth2.build/Debug-watchos/Flows.build/Objects-normal/arm64/OAuth2CodeGrantAzure.o -index-unit-output-path /OAuth2.build/Debug-watchos/Flows.build/Objects-normal/arm64/OAuth2CodeGrantBasicAuth.o -index-store-path /Users/admin/builder/spi-builder-workspace/.derivedData/Index.noindex/DataStore -index-system-modules
SwiftCompile normal arm64 /Users/admin/builder/spi-builder-workspace/.dependencies/checkouts/OAuth2/Sources/Flows/OAuth2CodeGrantBasicAuth.swift (in target 'Flows' from project 'OAuth2')
    cd /Users/admin/builder/spi-builder-workspace/.swiftpm/xcode
    /Applications/Xcode-16.2.0.app/Contents/Developer/Toolchains/XcodeDefault.xctoolchain/usr/bin/swift-frontend -c /Users/admin/builder/spi-builder-workspace/.dependencies/checkouts/OAuth2/Sources/Flows/OAuth2.swift /Users/admin/builder/spi-builder-workspace/.dependencies/checkouts/OAuth2/Sources/Flows/OAuth2ClientCredentials.swift /Users/admin/builder/spi-builder-workspace/.dependencies/checkouts/OAuth2/Sources/Flows/OAuth2ClientCredentialsReddit.swift /Users/admin/builder/spi-builder-workspace/.dependencies/checkouts/OAuth2/Sources/Flows/OAuth2CodeGrant.swift -primary-file /Users/admin/builder/spi-builder-workspace/.dependencies/checkouts/OAuth2/Sources/Flows/OAuth2CodeGrantAzure.swift -primary-file /Users/admin/builder/spi-builder-workspace/.dependencies/checkouts/OAuth2/Sources/Flows/OAuth2CodeGrantBasicAuth.swift /Users/admin/builder/spi-builder-workspace/.dependencies/checkouts/OAuth2/Sources/Flows/OAuth2CodeGrantFacebook.swift /Users/admin/builder/spi-builder-workspace/.dependencies/checkouts/OAuth2/Sources/Flows/OAuth2CodeGrantLinkedIn.swift /Users/admin/builder/spi-builder-workspace/.dependencies/checkouts/OAuth2/Sources/Flows/OAuth2CodeGrantNoTokenType.swift /Users/admin/builder/spi-builder-workspace/.dependencies/checkouts/OAuth2/Sources/Flows/OAuth2DeviceGrant.swift /Users/admin/builder/spi-builder-workspace/.dependencies/checkouts/OAuth2/Sources/Flows/OAuth2DynReg.swift /Users/admin/builder/spi-builder-workspace/.dependencies/checkouts/OAuth2/Sources/Flows/OAuth2ImplicitGrant.swift /Users/admin/builder/spi-builder-workspace/.dependencies/checkouts/OAuth2/Sources/Flows/OAuth2ImplicitGrantWithQueryParams.swift /Users/admin/builder/spi-builder-workspace/.dependencies/checkouts/OAuth2/Sources/Flows/OAuth2PasswordGrant.swift -emit-dependencies-path /Users/admin/builder/spi-builder-workspace/.derivedData/Build/Intermediates.noindex/OAuth2.build/Debug-watchos/Flows.build/Objects-normal/arm64/OAuth2CodeGrantAzure.d -emit-const-values-path /Users/admin/builder/spi-builder-workspace/.derivedData/Build/Intermediates.noindex/OAuth2.build/Debug-watchos/Flows.build/Objects-normal/arm64/OAuth2CodeGrantAzure.swiftconstvalues -emit-reference-dependencies-path /Users/admin/builder/spi-builder-workspace/.derivedData/Build/Intermediates.noindex/OAuth2.build/Debug-watchos/Flows.build/Objects-normal/arm64/OAuth2CodeGrantAzure.swiftdeps -serialize-diagnostics-path /Users/admin/builder/spi-builder-workspace/.derivedData/Build/Intermediates.noindex/OAuth2.build/Debug-watchos/Flows.build/Objects-normal/arm64/OAuth2CodeGrantAzure.dia -emit-dependencies-path /Users/admin/builder/spi-builder-workspace/.derivedData/Build/Intermediates.noindex/OAuth2.build/Debug-watchos/Flows.build/Objects-normal/arm64/OAuth2CodeGrantBasicAuth.d -emit-const-values-path /Users/admin/builder/spi-builder-workspace/.derivedData/Build/Intermediates.noindex/OAuth2.build/Debug-watchos/Flows.build/Objects-normal/arm64/OAuth2CodeGrantBasicAuth.swiftconstvalues -emit-reference-dependencies-path /Users/admin/builder/spi-builder-workspace/.derivedData/Build/Intermediates.noindex/OAuth2.build/Debug-watchos/Flows.build/Objects-normal/arm64/OAuth2CodeGrantBasicAuth.swiftdeps -serialize-diagnostics-path /Users/admin/builder/spi-builder-workspace/.derivedData/Build/Intermediates.noindex/OAuth2.build/Debug-watchos/Flows.build/Objects-normal/arm64/OAuth2CodeGrantBasicAuth.dia -target arm64-apple-watchos5.0 -Xllvm -aarch64-use-tbi -enable-objc-interop -sdk /Applications/Xcode-16.2.0.app/Contents/Developer/Platforms/WatchOS.platform/Developer/SDKs/WatchOS11.2.sdk -I /Users/admin/builder/spi-builder-workspace/.derivedData/Build/Products/Debug-watchos -I /Applications/Xcode-16.2.0.app/Contents/Developer/Platforms/WatchOS.platform/Developer/usr/lib -F /Users/admin/builder/spi-builder-workspace/.derivedData/Build/Products/Debug-watchos/PackageFrameworks -F /Users/admin/builder/spi-builder-workspace/.derivedData/Build/Products/Debug-watchos/PackageFrameworks -F /Users/admin/builder/spi-builder-workspace/.derivedData/Build/Products/Debug-watchos/PackageFrameworks -F /Users/admin/builder/spi-builder-workspace/.derivedData/Build/Products/Debug-watchos/PackageFrameworks -F /Users/admin/builder/spi-builder-workspace/.derivedData/Build/Products/Debug-watchos/PackageFrameworks -F /Users/admin/builder/spi-builder-workspace/.derivedData/Build/Products/Debug-watchos -F /Applications/Xcode-16.2.0.app/Contents/Developer/Platforms/WatchOS.platform/Developer/Library/Frameworks -F /Applications/Xcode-16.2.0.app/Contents/Developer/Platforms/WatchOS.platform/Developer/SDKs/WatchOS11.2.sdk/Developer/Library/Frameworks -no-color-diagnostics -enable-testing -g -debug-info-format\=dwarf -dwarf-version\=4 -module-cache-path /Users/admin/builder/spi-builder-workspace/.derivedData/ModuleCache.noindex -suppress-warnings -profile-generate -profile-coverage-mapping -swift-version 5 -enforce-exclusivity\=checked -Onone -D SWIFT_PACKAGE -D DEBUG -D Xcode -serialize-debugging-options -const-gather-protocols-file /Users/admin/builder/spi-builder-workspace/.derivedData/Build/Intermediates.noindex/OAuth2.build/Debug-watchos/Flows.build/Objects-normal/arm64/Flows_const_extract_protocols.json -enable-experimental-feature DebugDescriptionMacro -enable-experimental-feature OpaqueTypeErasure -empty-abi-descriptor -plugin-path /Applications/Xcode-16.2.0.app/Contents/Developer/Toolchains/XcodeDefault.xctoolchain/usr/lib/swift/host/plugins/testing -validate-clang-modules-once -clang-build-session-file /Users/admin/builder/spi-builder-workspace/.derivedData/ModuleCache.noindex/Session.modulevalidation -Xcc -working-directory -Xcc /Users/admin/builder/spi-builder-workspace/.swiftpm/xcode -resource-dir /Applications/Xcode-16.2.0.app/Contents/Developer/Toolchains/XcodeDefault.xctoolchain/usr/lib/swift -enable-anonymous-context-mangled-names -file-compilation-dir /Users/admin/builder/spi-builder-workspace/.swiftpm/xcode -Xcc -D_LIBCPP_HARDENING_MODE\=_LIBCPP_HARDENING_MODE_DEBUG -Xcc -ivfsstatcache -Xcc /Users/admin/builder/spi-builder-workspace/.derivedData/SDKStatCaches.noindex/watchos11.2-22S97-8cb5c683f5e64b0ecfc74e8d0065fbf6.sdkstatcache -Xcc -I/Users/admin/builder/spi-builder-workspace/.derivedData/Build/Intermediates.noindex/OAuth2.build/Debug-watchos/Flows.build/swift-overrides.hmap -Xcc -I/Users/admin/builder/spi-builder-workspace/.derivedData/Build/Products/Debug-watchos/include -Xcc -I/Users/admin/builder/spi-builder-workspace/.derivedData/Build/Intermediates.noindex/OAuth2.build/Debug-watchos/Flows.build/DerivedSources-normal/arm64 -Xcc -I/Users/admin/builder/spi-builder-workspace/.derivedData/Build/Intermediates.noindex/OAuth2.build/Debug-watchos/Flows.build/DerivedSources/arm64 -Xcc -I/Users/admin/builder/spi-builder-workspace/.derivedData/Build/Intermediates.noindex/OAuth2.build/Debug-watchos/Flows.build/DerivedSources -Xcc -DSWIFT_PACKAGE -Xcc -DDEBUG\=1 -module-name Flows -frontend-parseable-output -disable-clang-spi -target-sdk-version 11.2 -target-sdk-name watchos11.2 -external-plugin-path /Applications/Xcode-16.2.0.app/Contents/Developer/Platforms/WatchOS.platform/Developer/usr/lib/swift/host/plugins\#/Applications/Xcode-16.2.0.app/Contents/Developer/Platforms/WatchOS.platform/Developer/usr/bin/swift-plugin-server -external-plugin-path /Applications/Xcode-16.2.0.app/Contents/Developer/Platforms/WatchOS.platform/Developer/usr/local/lib/swift/host/plugins\#/Applications/Xcode-16.2.0.app/Contents/Developer/Platforms/WatchOS.platform/Developer/usr/bin/swift-plugin-server -plugin-path /Applications/Xcode-16.2.0.app/Contents/Developer/Toolchains/XcodeDefault.xctoolchain/usr/lib/swift/host/plugins -plugin-path /Applications/Xcode-16.2.0.app/Contents/Developer/Toolchains/XcodeDefault.xctoolchain/usr/local/lib/swift/host/plugins -o /Users/admin/builder/spi-builder-workspace/.derivedData/Build/Intermediates.noindex/OAuth2.build/Debug-watchos/Flows.build/Objects-normal/arm64/OAuth2CodeGrantAzure.o -o /Users/admin/builder/spi-builder-workspace/.derivedData/Build/Intermediates.noindex/OAuth2.build/Debug-watchos/Flows.build/Objects-normal/arm64/OAuth2CodeGrantBasicAuth.o -index-unit-output-path /OAuth2.build/Debug-watchos/Flows.build/Objects-normal/arm64/OAuth2CodeGrantAzure.o -index-unit-output-path /OAuth2.build/Debug-watchos/Flows.build/Objects-normal/arm64/OAuth2CodeGrantBasicAuth.o -index-store-path /Users/admin/builder/spi-builder-workspace/.derivedData/Index.noindex/DataStore -index-system-modules
SwiftEmitModule normal arm64 Emitting\ module\ for\ Flows (in target 'Flows' from project 'OAuth2')
    cd /Users/admin/builder/spi-builder-workspace/.swiftpm/xcode
    builtin-swiftTaskExecution -- /Applications/Xcode-16.2.0.app/Contents/Developer/Toolchains/XcodeDefault.xctoolchain/usr/bin/swift-frontend -frontend -emit-module -experimental-skip-non-inlinable-function-bodies-without-types /Users/admin/builder/spi-builder-workspace/.dependencies/checkouts/OAuth2/Sources/Flows/OAuth2.swift /Users/admin/builder/spi-builder-workspace/.dependencies/checkouts/OAuth2/Sources/Flows/OAuth2ClientCredentials.swift /Users/admin/builder/spi-builder-workspace/.dependencies/checkouts/OAuth2/Sources/Flows/OAuth2ClientCredentialsReddit.swift /Users/admin/builder/spi-builder-workspace/.dependencies/checkouts/OAuth2/Sources/Flows/OAuth2CodeGrant.swift /Users/admin/builder/spi-builder-workspace/.dependencies/checkouts/OAuth2/Sources/Flows/OAuth2CodeGrantAzure.swift /Users/admin/builder/spi-builder-workspace/.dependencies/checkouts/OAuth2/Sources/Flows/OAuth2CodeGrantBasicAuth.swift /Users/admin/builder/spi-builder-workspace/.dependencies/checkouts/OAuth2/Sources/Flows/OAuth2CodeGrantFacebook.swift /Users/admin/builder/spi-builder-workspace/.dependencies/checkouts/OAuth2/Sources/Flows/OAuth2CodeGrantLinkedIn.swift /Users/admin/builder/spi-builder-workspace/.dependencies/checkouts/OAuth2/Sources/Flows/OAuth2CodeGrantNoTokenType.swift /Users/admin/builder/spi-builder-workspace/.dependencies/checkouts/OAuth2/Sources/Flows/OAuth2DeviceGrant.swift /Users/admin/builder/spi-builder-workspace/.dependencies/checkouts/OAuth2/Sources/Flows/OAuth2DynReg.swift /Users/admin/builder/spi-builder-workspace/.dependencies/checkouts/OAuth2/Sources/Flows/OAuth2ImplicitGrant.swift /Users/admin/builder/spi-builder-workspace/.dependencies/checkouts/OAuth2/Sources/Flows/OAuth2ImplicitGrantWithQueryParams.swift /Users/admin/builder/spi-builder-workspace/.dependencies/checkouts/OAuth2/Sources/Flows/OAuth2PasswordGrant.swift -target arm64-apple-watchos5.0 -Xllvm -aarch64-use-tbi -enable-objc-interop -sdk /Applications/Xcode-16.2.0.app/Contents/Developer/Platforms/WatchOS.platform/Developer/SDKs/WatchOS11.2.sdk -I /Users/admin/builder/spi-builder-workspace/.derivedData/Build/Products/Debug-watchos -I /Applications/Xcode-16.2.0.app/Contents/Developer/Platforms/WatchOS.platform/Developer/usr/lib -F /Users/admin/builder/spi-builder-workspace/.derivedData/Build/Products/Debug-watchos/PackageFrameworks -F /Users/admin/builder/spi-builder-workspace/.derivedData/Build/Products/Debug-watchos/PackageFrameworks -F /Users/admin/builder/spi-builder-workspace/.derivedData/Build/Products/Debug-watchos/PackageFrameworks -F /Users/admin/builder/spi-builder-workspace/.derivedData/Build/Products/Debug-watchos/PackageFrameworks -F /Users/admin/builder/spi-builder-workspace/.derivedData/Build/Products/Debug-watchos/PackageFrameworks -F /Users/admin/builder/spi-builder-workspace/.derivedData/Build/Products/Debug-watchos -F /Applications/Xcode-16.2.0.app/Contents/Developer/Platforms/WatchOS.platform/Developer/Library/Frameworks -F /Applications/Xcode-16.2.0.app/Contents/Developer/Platforms/WatchOS.platform/Developer/SDKs/WatchOS11.2.sdk/Developer/Library/Frameworks -no-color-diagnostics -enable-testing -g -debug-info-format\=dwarf -dwarf-version\=4 -module-cache-path /Users/admin/builder/spi-builder-workspace/.derivedData/ModuleCache.noindex -suppress-warnings -profile-generate -profile-coverage-mapping -swift-version 5 -enforce-exclusivity\=checked -Onone -D SWIFT_PACKAGE -D DEBUG -D Xcode -serialize-debugging-options -const-gather-protocols-file /Users/admin/builder/spi-builder-workspace/.derivedData/Build/Intermediates.noindex/OAuth2.build/Debug-watchos/Flows.build/Objects-normal/arm64/Flows_const_extract_protocols.json -enable-experimental-feature DebugDescriptionMacro -enable-experimental-feature OpaqueTypeErasure -empty-abi-descriptor -plugin-path /Applications/Xcode-16.2.0.app/Contents/Developer/Toolchains/XcodeDefault.xctoolchain/usr/lib/swift/host/plugins/testing -validate-clang-modules-once -clang-build-session-file /Users/admin/builder/spi-builder-workspace/.derivedData/ModuleCache.noindex/Session.modulevalidation -Xcc -working-directory -Xcc /Users/admin/builder/spi-builder-workspace/.swiftpm/xcode -resource-dir /Applications/Xcode-16.2.0.app/Contents/Developer/Toolchains/XcodeDefault.xctoolchain/usr/lib/swift -enable-anonymous-context-mangled-names -file-compilation-dir /Users/admin/builder/spi-builder-workspace/.swiftpm/xcode -Xcc -D_LIBCPP_HARDENING_MODE\=_LIBCPP_HARDENING_MODE_DEBUG -Xcc -ivfsstatcache -Xcc /Users/admin/builder/spi-builder-workspace/.derivedData/SDKStatCaches.noindex/watchos11.2-22S97-8cb5c683f5e64b0ecfc74e8d0065fbf6.sdkstatcache -Xcc -I/Users/admin/builder/spi-builder-workspace/.derivedData/Build/Intermediates.noindex/OAuth2.build/Debug-watchos/Flows.build/swift-overrides.hmap -Xcc -I/Users/admin/builder/spi-builder-workspace/.derivedData/Build/Products/Debug-watchos/include -Xcc -I/Users/admin/builder/spi-builder-workspace/.derivedData/Build/Intermediates.noindex/OAuth2.build/Debug-watchos/Flows.build/DerivedSources-normal/arm64 -Xcc -I/Users/admin/builder/spi-builder-workspace/.derivedData/Build/Intermediates.noindex/OAuth2.build/Debug-watchos/Flows.build/DerivedSources/arm64 -Xcc -I/Users/admin/builder/spi-builder-workspace/.derivedData/Build/Intermediates.noindex/OAuth2.build/Debug-watchos/Flows.build/DerivedSources -Xcc -DSWIFT_PACKAGE -Xcc -DDEBUG\=1 -module-name Flows -frontend-parseable-output -disable-clang-spi -target-sdk-version 11.2 -target-sdk-name watchos11.2 -external-plugin-path /Applications/Xcode-16.2.0.app/Contents/Developer/Platforms/WatchOS.platform/Developer/usr/lib/swift/host/plugins\#/Applications/Xcode-16.2.0.app/Contents/Developer/Platforms/WatchOS.platform/Developer/usr/bin/swift-plugin-server -external-plugin-path /Applications/Xcode-16.2.0.app/Contents/Developer/Platforms/WatchOS.platform/Developer/usr/local/lib/swift/host/plugins\#/Applications/Xcode-16.2.0.app/Contents/Developer/Platforms/WatchOS.platform/Developer/usr/bin/swift-plugin-server -plugin-path /Applications/Xcode-16.2.0.app/Contents/Developer/Toolchains/XcodeDefault.xctoolchain/usr/lib/swift/host/plugins -plugin-path /Applications/Xcode-16.2.0.app/Contents/Developer/Toolchains/XcodeDefault.xctoolchain/usr/local/lib/swift/host/plugins -emit-module-doc-path /Users/admin/builder/spi-builder-workspace/.derivedData/Build/Intermediates.noindex/OAuth2.build/Debug-watchos/Flows.build/Objects-normal/arm64/Flows.swiftdoc -emit-module-source-info-path /Users/admin/builder/spi-builder-workspace/.derivedData/Build/Intermediates.noindex/OAuth2.build/Debug-watchos/Flows.build/Objects-normal/arm64/Flows.swiftsourceinfo -emit-objc-header-path /Users/admin/builder/spi-builder-workspace/.derivedData/Build/Intermediates.noindex/OAuth2.build/Debug-watchos/Flows.build/Objects-normal/arm64/Flows-Swift.h -serialize-diagnostics-path /Users/admin/builder/spi-builder-workspace/.derivedData/Build/Intermediates.noindex/OAuth2.build/Debug-watchos/Flows.build/Objects-normal/arm64/Flows-master-emit-module.dia -emit-dependencies-path /Users/admin/builder/spi-builder-workspace/.derivedData/Build/Intermediates.noindex/OAuth2.build/Debug-watchos/Flows.build/Objects-normal/arm64/Flows-master-emit-module.d -o /Users/admin/builder/spi-builder-workspace/.derivedData/Build/Intermediates.noindex/OAuth2.build/Debug-watchos/Flows.build/Objects-normal/arm64/Flows.swiftmodule -emit-abi-descriptor-path /Users/admin/builder/spi-builder-workspace/.derivedData/Build/Intermediates.noindex/OAuth2.build/Debug-watchos/Flows.build/Objects-normal/arm64/Flows.abi.json
EmitSwiftModule normal arm64 (in target 'Flows' from project 'OAuth2')
    cd /Users/admin/builder/spi-builder-workspace/.swiftpm/xcode
    /Applications/Xcode-16.2.0.app/Contents/Developer/Toolchains/XcodeDefault.xctoolchain/usr/bin/swift-frontend -emit-module -experimental-skip-non-inlinable-function-bodies-without-types /Users/admin/builder/spi-builder-workspace/.dependencies/checkouts/OAuth2/Sources/Flows/OAuth2.swift /Users/admin/builder/spi-builder-workspace/.dependencies/checkouts/OAuth2/Sources/Flows/OAuth2ClientCredentials.swift /Users/admin/builder/spi-builder-workspace/.dependencies/checkouts/OAuth2/Sources/Flows/OAuth2ClientCredentialsReddit.swift /Users/admin/builder/spi-builder-workspace/.dependencies/checkouts/OAuth2/Sources/Flows/OAuth2CodeGrant.swift /Users/admin/builder/spi-builder-workspace/.dependencies/checkouts/OAuth2/Sources/Flows/OAuth2CodeGrantAzure.swift /Users/admin/builder/spi-builder-workspace/.dependencies/checkouts/OAuth2/Sources/Flows/OAuth2CodeGrantBasicAuth.swift /Users/admin/builder/spi-builder-workspace/.dependencies/checkouts/OAuth2/Sources/Flows/OAuth2CodeGrantFacebook.swift /Users/admin/builder/spi-builder-workspace/.dependencies/checkouts/OAuth2/Sources/Flows/OAuth2CodeGrantLinkedIn.swift /Users/admin/builder/spi-builder-workspace/.dependencies/checkouts/OAuth2/Sources/Flows/OAuth2CodeGrantNoTokenType.swift /Users/admin/builder/spi-builder-workspace/.dependencies/checkouts/OAuth2/Sources/Flows/OAuth2DeviceGrant.swift /Users/admin/builder/spi-builder-workspace/.dependencies/checkouts/OAuth2/Sources/Flows/OAuth2DynReg.swift /Users/admin/builder/spi-builder-workspace/.dependencies/checkouts/OAuth2/Sources/Flows/OAuth2ImplicitGrant.swift /Users/admin/builder/spi-builder-workspace/.dependencies/checkouts/OAuth2/Sources/Flows/OAuth2ImplicitGrantWithQueryParams.swift /Users/admin/builder/spi-builder-workspace/.dependencies/checkouts/OAuth2/Sources/Flows/OAuth2PasswordGrant.swift -target arm64-apple-watchos5.0 -Xllvm -aarch64-use-tbi -enable-objc-interop -sdk /Applications/Xcode-16.2.0.app/Contents/Developer/Platforms/WatchOS.platform/Developer/SDKs/WatchOS11.2.sdk -I /Users/admin/builder/spi-builder-workspace/.derivedData/Build/Products/Debug-watchos -I /Applications/Xcode-16.2.0.app/Contents/Developer/Platforms/WatchOS.platform/Developer/usr/lib -F /Users/admin/builder/spi-builder-workspace/.derivedData/Build/Products/Debug-watchos/PackageFrameworks -F /Users/admin/builder/spi-builder-workspace/.derivedData/Build/Products/Debug-watchos/PackageFrameworks -F /Users/admin/builder/spi-builder-workspace/.derivedData/Build/Products/Debug-watchos/PackageFrameworks -F /Users/admin/builder/spi-builder-workspace/.derivedData/Build/Products/Debug-watchos/PackageFrameworks -F /Users/admin/builder/spi-builder-workspace/.derivedData/Build/Products/Debug-watchos/PackageFrameworks -F /Users/admin/builder/spi-builder-workspace/.derivedData/Build/Products/Debug-watchos -F /Applications/Xcode-16.2.0.app/Contents/Developer/Platforms/WatchOS.platform/Developer/Library/Frameworks -F /Applications/Xcode-16.2.0.app/Contents/Developer/Platforms/WatchOS.platform/Developer/SDKs/WatchOS11.2.sdk/Developer/Library/Frameworks -no-color-diagnostics -enable-testing -g -debug-info-format\=dwarf -dwarf-version\=4 -module-cache-path /Users/admin/builder/spi-builder-workspace/.derivedData/ModuleCache.noindex -suppress-warnings -profile-generate -profile-coverage-mapping -swift-version 5 -enforce-exclusivity\=checked -Onone -D SWIFT_PACKAGE -D DEBUG -D Xcode -serialize-debugging-options -const-gather-protocols-file /Users/admin/builder/spi-builder-workspace/.derivedData/Build/Intermediates.noindex/OAuth2.build/Debug-watchos/Flows.build/Objects-normal/arm64/Flows_const_extract_protocols.json -enable-experimental-feature DebugDescriptionMacro -enable-experimental-feature OpaqueTypeErasure -empty-abi-descriptor -plugin-path /Applications/Xcode-16.2.0.app/Contents/Developer/Toolchains/XcodeDefault.xctoolchain/usr/lib/swift/host/plugins/testing -validate-clang-modules-once -clang-build-session-file /Users/admin/builder/spi-builder-workspace/.derivedData/ModuleCache.noindex/Session.modulevalidation -Xcc -working-directory -Xcc /Users/admin/builder/spi-builder-workspace/.swiftpm/xcode -resource-dir /Applications/Xcode-16.2.0.app/Contents/Developer/Toolchains/XcodeDefault.xctoolchain/usr/lib/swift -enable-anonymous-context-mangled-names -file-compilation-dir /Users/admin/builder/spi-builder-workspace/.swiftpm/xcode -Xcc -D_LIBCPP_HARDENING_MODE\=_LIBCPP_HARDENING_MODE_DEBUG -Xcc -ivfsstatcache -Xcc /Users/admin/builder/spi-builder-workspace/.derivedData/SDKStatCaches.noindex/watchos11.2-22S97-8cb5c683f5e64b0ecfc74e8d0065fbf6.sdkstatcache -Xcc -I/Users/admin/builder/spi-builder-workspace/.derivedData/Build/Intermediates.noindex/OAuth2.build/Debug-watchos/Flows.build/swift-overrides.hmap -Xcc -I/Users/admin/builder/spi-builder-workspace/.derivedData/Build/Products/Debug-watchos/include -Xcc -I/Users/admin/builder/spi-builder-workspace/.derivedData/Build/Intermediates.noindex/OAuth2.build/Debug-watchos/Flows.build/DerivedSources-normal/arm64 -Xcc -I/Users/admin/builder/spi-builder-workspace/.derivedData/Build/Intermediates.noindex/OAuth2.build/Debug-watchos/Flows.build/DerivedSources/arm64 -Xcc -I/Users/admin/builder/spi-builder-workspace/.derivedData/Build/Intermediates.noindex/OAuth2.build/Debug-watchos/Flows.build/DerivedSources -Xcc -DSWIFT_PACKAGE -Xcc -DDEBUG\=1 -module-name Flows -frontend-parseable-output -disable-clang-spi -target-sdk-version 11.2 -target-sdk-name watchos11.2 -external-plugin-path /Applications/Xcode-16.2.0.app/Contents/Developer/Platforms/WatchOS.platform/Developer/usr/lib/swift/host/plugins\#/Applications/Xcode-16.2.0.app/Contents/Developer/Platforms/WatchOS.platform/Developer/usr/bin/swift-plugin-server -external-plugin-path /Applications/Xcode-16.2.0.app/Contents/Developer/Platforms/WatchOS.platform/Developer/usr/local/lib/swift/host/plugins\#/Applications/Xcode-16.2.0.app/Contents/Developer/Platforms/WatchOS.platform/Developer/usr/bin/swift-plugin-server -plugin-path /Applications/Xcode-16.2.0.app/Contents/Developer/Toolchains/XcodeDefault.xctoolchain/usr/lib/swift/host/plugins -plugin-path /Applications/Xcode-16.2.0.app/Contents/Developer/Toolchains/XcodeDefault.xctoolchain/usr/local/lib/swift/host/plugins -emit-module-doc-path /Users/admin/builder/spi-builder-workspace/.derivedData/Build/Intermediates.noindex/OAuth2.build/Debug-watchos/Flows.build/Objects-normal/arm64/Flows.swiftdoc -emit-module-source-info-path /Users/admin/builder/spi-builder-workspace/.derivedData/Build/Intermediates.noindex/OAuth2.build/Debug-watchos/Flows.build/Objects-normal/arm64/Flows.swiftsourceinfo -emit-objc-header-path /Users/admin/builder/spi-builder-workspace/.derivedData/Build/Intermediates.noindex/OAuth2.build/Debug-watchos/Flows.build/Objects-normal/arm64/Flows-Swift.h -serialize-diagnostics-path /Users/admin/builder/spi-builder-workspace/.derivedData/Build/Intermediates.noindex/OAuth2.build/Debug-watchos/Flows.build/Objects-normal/arm64/Flows-master-emit-module.dia -emit-dependencies-path /Users/admin/builder/spi-builder-workspace/.derivedData/Build/Intermediates.noindex/OAuth2.build/Debug-watchos/Flows.build/Objects-normal/arm64/Flows-master-emit-module.d -o /Users/admin/builder/spi-builder-workspace/.derivedData/Build/Intermediates.noindex/OAuth2.build/Debug-watchos/Flows.build/Objects-normal/arm64/Flows.swiftmodule -emit-abi-descriptor-path /Users/admin/builder/spi-builder-workspace/.derivedData/Build/Intermediates.noindex/OAuth2.build/Debug-watchos/Flows.build/Objects-normal/arm64/Flows.abi.json
/Users/admin/builder/spi-builder-workspace/.dependencies/checkouts/OAuth2/Sources/Flows/OAuth2PasswordGrant.swift:70:61: error: cannot find 'OAuth2CustomAuthorizer' in scope
        open lazy var customAuthorizer: OAuth2CustomAuthorizerUI = OAuth2CustomAuthorizer()
                                                                   ^~~~~~~~~~~~~~~~~~~~~~
SwiftEmitModule normal arm64_32 Emitting\ module\ for\ Flows (in target 'Flows' from project 'OAuth2')
    cd /Users/admin/builder/spi-builder-workspace/.swiftpm/xcode
    builtin-swiftTaskExecution -- /Applications/Xcode-16.2.0.app/Contents/Developer/Toolchains/XcodeDefault.xctoolchain/usr/bin/swift-frontend -frontend -emit-module -experimental-skip-non-inlinable-function-bodies-without-types /Users/admin/builder/spi-builder-workspace/.dependencies/checkouts/OAuth2/Sources/Flows/OAuth2.swift /Users/admin/builder/spi-builder-workspace/.dependencies/checkouts/OAuth2/Sources/Flows/OAuth2ClientCredentials.swift /Users/admin/builder/spi-builder-workspace/.dependencies/checkouts/OAuth2/Sources/Flows/OAuth2ClientCredentialsReddit.swift /Users/admin/builder/spi-builder-workspace/.dependencies/checkouts/OAuth2/Sources/Flows/OAuth2CodeGrant.swift /Users/admin/builder/spi-builder-workspace/.dependencies/checkouts/OAuth2/Sources/Flows/OAuth2CodeGrantAzure.swift /Users/admin/builder/spi-builder-workspace/.dependencies/checkouts/OAuth2/Sources/Flows/OAuth2CodeGrantBasicAuth.swift /Users/admin/builder/spi-builder-workspace/.dependencies/checkouts/OAuth2/Sources/Flows/OAuth2CodeGrantFacebook.swift /Users/admin/builder/spi-builder-workspace/.dependencies/checkouts/OAuth2/Sources/Flows/OAuth2CodeGrantLinkedIn.swift /Users/admin/builder/spi-builder-workspace/.dependencies/checkouts/OAuth2/Sources/Flows/OAuth2CodeGrantNoTokenType.swift /Users/admin/builder/spi-builder-workspace/.dependencies/checkouts/OAuth2/Sources/Flows/OAuth2DeviceGrant.swift /Users/admin/builder/spi-builder-workspace/.dependencies/checkouts/OAuth2/Sources/Flows/OAuth2DynReg.swift /Users/admin/builder/spi-builder-workspace/.dependencies/checkouts/OAuth2/Sources/Flows/OAuth2ImplicitGrant.swift /Users/admin/builder/spi-builder-workspace/.dependencies/checkouts/OAuth2/Sources/Flows/OAuth2ImplicitGrantWithQueryParams.swift /Users/admin/builder/spi-builder-workspace/.dependencies/checkouts/OAuth2/Sources/Flows/OAuth2PasswordGrant.swift -target arm64_32-apple-watchos5.0 -enable-objc-interop -sdk /Applications/Xcode-16.2.0.app/Contents/Developer/Platforms/WatchOS.platform/Developer/SDKs/WatchOS11.2.sdk -I /Users/admin/builder/spi-builder-workspace/.derivedData/Build/Products/Debug-watchos -I /Applications/Xcode-16.2.0.app/Contents/Developer/Platforms/WatchOS.platform/Developer/usr/lib -F /Users/admin/builder/spi-builder-workspace/.derivedData/Build/Products/Debug-watchos/PackageFrameworks -F /Users/admin/builder/spi-builder-workspace/.derivedData/Build/Products/Debug-watchos/PackageFrameworks -F /Users/admin/builder/spi-builder-workspace/.derivedData/Build/Products/Debug-watchos/PackageFrameworks -F /Users/admin/builder/spi-builder-workspace/.derivedData/Build/Products/Debug-watchos/PackageFrameworks -F /Users/admin/builder/spi-builder-workspace/.derivedData/Build/Products/Debug-watchos/PackageFrameworks -F /Users/admin/builder/spi-builder-workspace/.derivedData/Build/Products/Debug-watchos -F /Applications/Xcode-16.2.0.app/Contents/Developer/Platforms/WatchOS.platform/Developer/Library/Frameworks -F /Applications/Xcode-16.2.0.app/Contents/Developer/Platforms/WatchOS.platform/Developer/SDKs/WatchOS11.2.sdk/Developer/Library/Frameworks -no-color-diagnostics -enable-testing -g -debug-info-format\=dwarf -dwarf-version\=4 -module-cache-path /Users/admin/builder/spi-builder-workspace/.derivedData/ModuleCache.noindex -suppress-warnings -profile-generate -profile-coverage-mapping -swift-version 5 -enforce-exclusivity\=checked -Onone -D SWIFT_PACKAGE -D DEBUG -D Xcode -serialize-debugging-options -const-gather-protocols-file /Users/admin/builder/spi-builder-workspace/.derivedData/Build/Intermediates.noindex/OAuth2.build/Debug-watchos/Flows.build/Objects-normal/arm64_32/Flows_const_extract_protocols.json -enable-experimental-feature DebugDescriptionMacro -enable-experimental-feature OpaqueTypeErasure -empty-abi-descriptor -plugin-path /Applications/Xcode-16.2.0.app/Contents/Developer/Toolchains/XcodeDefault.xctoolchain/usr/lib/swift/host/plugins/testing -validate-clang-modules-once -clang-build-session-file /Users/admin/builder/spi-builder-workspace/.derivedData/ModuleCache.noindex/Session.modulevalidation -Xcc -working-directory -Xcc /Users/admin/builder/spi-builder-workspace/.swiftpm/xcode -resource-dir /Applications/Xcode-16.2.0.app/Contents/Developer/Toolchains/XcodeDefault.xctoolchain/usr/lib/swift -enable-anonymous-context-mangled-names -file-compilation-dir /Users/admin/builder/spi-builder-workspace/.swiftpm/xcode -Xcc -D_LIBCPP_HARDENING_MODE\=_LIBCPP_HARDENING_MODE_DEBUG -Xcc -ivfsstatcache -Xcc /Users/admin/builder/spi-builder-workspace/.derivedData/SDKStatCaches.noindex/watchos11.2-22S97-8cb5c683f5e64b0ecfc74e8d0065fbf6.sdkstatcache -Xcc -I/Users/admin/builder/spi-builder-workspace/.derivedData/Build/Intermediates.noindex/OAuth2.build/Debug-watchos/Flows.build/swift-overrides.hmap -Xcc -I/Users/admin/builder/spi-builder-workspace/.derivedData/Build/Products/Debug-watchos/include -Xcc -I/Users/admin/builder/spi-builder-workspace/.derivedData/Build/Intermediates.noindex/OAuth2.build/Debug-watchos/Flows.build/DerivedSources-normal/arm64_32 -Xcc -I/Users/admin/builder/spi-builder-workspace/.derivedData/Build/Intermediates.noindex/OAuth2.build/Debug-watchos/Flows.build/DerivedSources/arm64_32 -Xcc -I/Users/admin/builder/spi-builder-workspace/.derivedData/Build/Intermediates.noindex/OAuth2.build/Debug-watchos/Flows.build/DerivedSources -Xcc -DSWIFT_PACKAGE -Xcc -DDEBUG\=1 -module-name Flows -frontend-parseable-output -disable-clang-spi -target-sdk-version 11.2 -target-sdk-name watchos11.2 -external-plugin-path /Applications/Xcode-16.2.0.app/Contents/Developer/Platforms/WatchOS.platform/Developer/usr/lib/swift/host/plugins\#/Applications/Xcode-16.2.0.app/Contents/Developer/Platforms/WatchOS.platform/Developer/usr/bin/swift-plugin-server -external-plugin-path /Applications/Xcode-16.2.0.app/Contents/Developer/Platforms/WatchOS.platform/Developer/usr/local/lib/swift/host/plugins\#/Applications/Xcode-16.2.0.app/Contents/Developer/Platforms/WatchOS.platform/Developer/usr/bin/swift-plugin-server -plugin-path /Applications/Xcode-16.2.0.app/Contents/Developer/Toolchains/XcodeDefault.xctoolchain/usr/lib/swift/host/plugins -plugin-path /Applications/Xcode-16.2.0.app/Contents/Developer/Toolchains/XcodeDefault.xctoolchain/usr/local/lib/swift/host/plugins -emit-module-doc-path /Users/admin/builder/spi-builder-workspace/.derivedData/Build/Intermediates.noindex/OAuth2.build/Debug-watchos/Flows.build/Objects-normal/arm64_32/Flows.swiftdoc -emit-module-source-info-path /Users/admin/builder/spi-builder-workspace/.derivedData/Build/Intermediates.noindex/OAuth2.build/Debug-watchos/Flows.build/Objects-normal/arm64_32/Flows.swiftsourceinfo -emit-objc-header-path /Users/admin/builder/spi-builder-workspace/.derivedData/Build/Intermediates.noindex/OAuth2.build/Debug-watchos/Flows.build/Objects-normal/arm64_32/Flows-Swift.h -serialize-diagnostics-path /Users/admin/builder/spi-builder-workspace/.derivedData/Build/Intermediates.noindex/OAuth2.build/Debug-watchos/Flows.build/Objects-normal/arm64_32/Flows-master-emit-module.dia -emit-dependencies-path /Users/admin/builder/spi-builder-workspace/.derivedData/Build/Intermediates.noindex/OAuth2.build/Debug-watchos/Flows.build/Objects-normal/arm64_32/Flows-master-emit-module.d -o /Users/admin/builder/spi-builder-workspace/.derivedData/Build/Intermediates.noindex/OAuth2.build/Debug-watchos/Flows.build/Objects-normal/arm64_32/Flows.swiftmodule -emit-abi-descriptor-path /Users/admin/builder/spi-builder-workspace/.derivedData/Build/Intermediates.noindex/OAuth2.build/Debug-watchos/Flows.build/Objects-normal/arm64_32/Flows.abi.json
EmitSwiftModule normal arm64_32 (in target 'Flows' from project 'OAuth2')
    cd /Users/admin/builder/spi-builder-workspace/.swiftpm/xcode
    /Applications/Xcode-16.2.0.app/Contents/Developer/Toolchains/XcodeDefault.xctoolchain/usr/bin/swift-frontend -emit-module -experimental-skip-non-inlinable-function-bodies-without-types /Users/admin/builder/spi-builder-workspace/.dependencies/checkouts/OAuth2/Sources/Flows/OAuth2.swift /Users/admin/builder/spi-builder-workspace/.dependencies/checkouts/OAuth2/Sources/Flows/OAuth2ClientCredentials.swift /Users/admin/builder/spi-builder-workspace/.dependencies/checkouts/OAuth2/Sources/Flows/OAuth2ClientCredentialsReddit.swift /Users/admin/builder/spi-builder-workspace/.dependencies/checkouts/OAuth2/Sources/Flows/OAuth2CodeGrant.swift /Users/admin/builder/spi-builder-workspace/.dependencies/checkouts/OAuth2/Sources/Flows/OAuth2CodeGrantAzure.swift /Users/admin/builder/spi-builder-workspace/.dependencies/checkouts/OAuth2/Sources/Flows/OAuth2CodeGrantBasicAuth.swift /Users/admin/builder/spi-builder-workspace/.dependencies/checkouts/OAuth2/Sources/Flows/OAuth2CodeGrantFacebook.swift /Users/admin/builder/spi-builder-workspace/.dependencies/checkouts/OAuth2/Sources/Flows/OAuth2CodeGrantLinkedIn.swift /Users/admin/builder/spi-builder-workspace/.dependencies/checkouts/OAuth2/Sources/Flows/OAuth2CodeGrantNoTokenType.swift /Users/admin/builder/spi-builder-workspace/.dependencies/checkouts/OAuth2/Sources/Flows/OAuth2DeviceGrant.swift /Users/admin/builder/spi-builder-workspace/.dependencies/checkouts/OAuth2/Sources/Flows/OAuth2DynReg.swift /Users/admin/builder/spi-builder-workspace/.dependencies/checkouts/OAuth2/Sources/Flows/OAuth2ImplicitGrant.swift /Users/admin/builder/spi-builder-workspace/.dependencies/checkouts/OAuth2/Sources/Flows/OAuth2ImplicitGrantWithQueryParams.swift /Users/admin/builder/spi-builder-workspace/.dependencies/checkouts/OAuth2/Sources/Flows/OAuth2PasswordGrant.swift -target arm64_32-apple-watchos5.0 -enable-objc-interop -sdk /Applications/Xcode-16.2.0.app/Contents/Developer/Platforms/WatchOS.platform/Developer/SDKs/WatchOS11.2.sdk -I /Users/admin/builder/spi-builder-workspace/.derivedData/Build/Products/Debug-watchos -I /Applications/Xcode-16.2.0.app/Contents/Developer/Platforms/WatchOS.platform/Developer/usr/lib -F /Users/admin/builder/spi-builder-workspace/.derivedData/Build/Products/Debug-watchos/PackageFrameworks -F /Users/admin/builder/spi-builder-workspace/.derivedData/Build/Products/Debug-watchos/PackageFrameworks -F /Users/admin/builder/spi-builder-workspace/.derivedData/Build/Products/Debug-watchos/PackageFrameworks -F /Users/admin/builder/spi-builder-workspace/.derivedData/Build/Products/Debug-watchos/PackageFrameworks -F /Users/admin/builder/spi-builder-workspace/.derivedData/Build/Products/Debug-watchos/PackageFrameworks -F /Users/admin/builder/spi-builder-workspace/.derivedData/Build/Products/Debug-watchos -F /Applications/Xcode-16.2.0.app/Contents/Developer/Platforms/WatchOS.platform/Developer/Library/Frameworks -F /Applications/Xcode-16.2.0.app/Contents/Developer/Platforms/WatchOS.platform/Developer/SDKs/WatchOS11.2.sdk/Developer/Library/Frameworks -no-color-diagnostics -enable-testing -g -debug-info-format\=dwarf -dwarf-version\=4 -module-cache-path /Users/admin/builder/spi-builder-workspace/.derivedData/ModuleCache.noindex -suppress-warnings -profile-generate -profile-coverage-mapping -swift-version 5 -enforce-exclusivity\=checked -Onone -D SWIFT_PACKAGE -D DEBUG -D Xcode -serialize-debugging-options -const-gather-protocols-file /Users/admin/builder/spi-builder-workspace/.derivedData/Build/Intermediates.noindex/OAuth2.build/Debug-watchos/Flows.build/Objects-normal/arm64_32/Flows_const_extract_protocols.json -enable-experimental-feature DebugDescriptionMacro -enable-experimental-feature OpaqueTypeErasure -empty-abi-descriptor -plugin-path /Applications/Xcode-16.2.0.app/Contents/Developer/Toolchains/XcodeDefault.xctoolchain/usr/lib/swift/host/plugins/testing -validate-clang-modules-once -clang-build-session-file /Users/admin/builder/spi-builder-workspace/.derivedData/ModuleCache.noindex/Session.modulevalidation -Xcc -working-directory -Xcc /Users/admin/builder/spi-builder-workspace/.swiftpm/xcode -resource-dir /Applications/Xcode-16.2.0.app/Contents/Developer/Toolchains/XcodeDefault.xctoolchain/usr/lib/swift -enable-anonymous-context-mangled-names -file-compilation-dir /Users/admin/builder/spi-builder-workspace/.swiftpm/xcode -Xcc -D_LIBCPP_HARDENING_MODE\=_LIBCPP_HARDENING_MODE_DEBUG -Xcc -ivfsstatcache -Xcc /Users/admin/builder/spi-builder-workspace/.derivedData/SDKStatCaches.noindex/watchos11.2-22S97-8cb5c683f5e64b0ecfc74e8d0065fbf6.sdkstatcache -Xcc -I/Users/admin/builder/spi-builder-workspace/.derivedData/Build/Intermediates.noindex/OAuth2.build/Debug-watchos/Flows.build/swift-overrides.hmap -Xcc -I/Users/admin/builder/spi-builder-workspace/.derivedData/Build/Products/Debug-watchos/include -Xcc -I/Users/admin/builder/spi-builder-workspace/.derivedData/Build/Intermediates.noindex/OAuth2.build/Debug-watchos/Flows.build/DerivedSources-normal/arm64_32 -Xcc -I/Users/admin/builder/spi-builder-workspace/.derivedData/Build/Intermediates.noindex/OAuth2.build/Debug-watchos/Flows.build/DerivedSources/arm64_32 -Xcc -I/Users/admin/builder/spi-builder-workspace/.derivedData/Build/Intermediates.noindex/OAuth2.build/Debug-watchos/Flows.build/DerivedSources -Xcc -DSWIFT_PACKAGE -Xcc -DDEBUG\=1 -module-name Flows -frontend-parseable-output -disable-clang-spi -target-sdk-version 11.2 -target-sdk-name watchos11.2 -external-plugin-path /Applications/Xcode-16.2.0.app/Contents/Developer/Platforms/WatchOS.platform/Developer/usr/lib/swift/host/plugins\#/Applications/Xcode-16.2.0.app/Contents/Developer/Platforms/WatchOS.platform/Developer/usr/bin/swift-plugin-server -external-plugin-path /Applications/Xcode-16.2.0.app/Contents/Developer/Platforms/WatchOS.platform/Developer/usr/local/lib/swift/host/plugins\#/Applications/Xcode-16.2.0.app/Contents/Developer/Platforms/WatchOS.platform/Developer/usr/bin/swift-plugin-server -plugin-path /Applications/Xcode-16.2.0.app/Contents/Developer/Toolchains/XcodeDefault.xctoolchain/usr/lib/swift/host/plugins -plugin-path /Applications/Xcode-16.2.0.app/Contents/Developer/Toolchains/XcodeDefault.xctoolchain/usr/local/lib/swift/host/plugins -emit-module-doc-path /Users/admin/builder/spi-builder-workspace/.derivedData/Build/Intermediates.noindex/OAuth2.build/Debug-watchos/Flows.build/Objects-normal/arm64_32/Flows.swiftdoc -emit-module-source-info-path /Users/admin/builder/spi-builder-workspace/.derivedData/Build/Intermediates.noindex/OAuth2.build/Debug-watchos/Flows.build/Objects-normal/arm64_32/Flows.swiftsourceinfo -emit-objc-header-path /Users/admin/builder/spi-builder-workspace/.derivedData/Build/Intermediates.noindex/OAuth2.build/Debug-watchos/Flows.build/Objects-normal/arm64_32/Flows-Swift.h -serialize-diagnostics-path /Users/admin/builder/spi-builder-workspace/.derivedData/Build/Intermediates.noindex/OAuth2.build/Debug-watchos/Flows.build/Objects-normal/arm64_32/Flows-master-emit-module.dia -emit-dependencies-path /Users/admin/builder/spi-builder-workspace/.derivedData/Build/Intermediates.noindex/OAuth2.build/Debug-watchos/Flows.build/Objects-normal/arm64_32/Flows-master-emit-module.d -o /Users/admin/builder/spi-builder-workspace/.derivedData/Build/Intermediates.noindex/OAuth2.build/Debug-watchos/Flows.build/Objects-normal/arm64_32/Flows.swiftmodule -emit-abi-descriptor-path /Users/admin/builder/spi-builder-workspace/.derivedData/Build/Intermediates.noindex/OAuth2.build/Debug-watchos/Flows.build/Objects-normal/arm64_32/Flows.abi.json
/Users/admin/builder/spi-builder-workspace/.dependencies/checkouts/OAuth2/Sources/Flows/OAuth2PasswordGrant.swift:70:61: error: cannot find 'OAuth2CustomAuthorizer' in scope
        open lazy var customAuthorizer: OAuth2CustomAuthorizerUI = OAuth2CustomAuthorizer()
                                                                   ^~~~~~~~~~~~~~~~~~~~~~
SwiftCompile normal arm64 Compiling\ OAuth2.swift,\ OAuth2ClientCredentials.swift /Users/admin/builder/spi-builder-workspace/.dependencies/checkouts/OAuth2/Sources/Flows/OAuth2.swift /Users/admin/builder/spi-builder-workspace/.dependencies/checkouts/OAuth2/Sources/Flows/OAuth2ClientCredentials.swift (in target 'Flows' from project 'OAuth2')
    cd /Users/admin/builder/spi-builder-workspace/.swiftpm/xcode
    builtin-swiftTaskExecution -- /Applications/Xcode-16.2.0.app/Contents/Developer/Toolchains/XcodeDefault.xctoolchain/usr/bin/swift-frontend -frontend -c -primary-file /Users/admin/builder/spi-builder-workspace/.dependencies/checkouts/OAuth2/Sources/Flows/OAuth2.swift -primary-file /Users/admin/builder/spi-builder-workspace/.dependencies/checkouts/OAuth2/Sources/Flows/OAuth2ClientCredentials.swift /Users/admin/builder/spi-builder-workspace/.dependencies/checkouts/OAuth2/Sources/Flows/OAuth2ClientCredentialsReddit.swift /Users/admin/builder/spi-builder-workspace/.dependencies/checkouts/OAuth2/Sources/Flows/OAuth2CodeGrant.swift /Users/admin/builder/spi-builder-workspace/.dependencies/checkouts/OAuth2/Sources/Flows/OAuth2CodeGrantAzure.swift /Users/admin/builder/spi-builder-workspace/.dependencies/checkouts/OAuth2/Sources/Flows/OAuth2CodeGrantBasicAuth.swift /Users/admin/builder/spi-builder-workspace/.dependencies/checkouts/OAuth2/Sources/Flows/OAuth2CodeGrantFacebook.swift /Users/admin/builder/spi-builder-workspace/.dependencies/checkouts/OAuth2/Sources/Flows/OAuth2CodeGrantLinkedIn.swift /Users/admin/builder/spi-builder-workspace/.dependencies/checkouts/OAuth2/Sources/Flows/OAuth2CodeGrantNoTokenType.swift /Users/admin/builder/spi-builder-workspace/.dependencies/checkouts/OAuth2/Sources/Flows/OAuth2DeviceGrant.swift /Users/admin/builder/spi-builder-workspace/.dependencies/checkouts/OAuth2/Sources/Flows/OAuth2DynReg.swift /Users/admin/builder/spi-builder-workspace/.dependencies/checkouts/OAuth2/Sources/Flows/OAuth2ImplicitGrant.swift /Users/admin/builder/spi-builder-workspace/.dependencies/checkouts/OAuth2/Sources/Flows/OAuth2ImplicitGrantWithQueryParams.swift /Users/admin/builder/spi-builder-workspace/.dependencies/checkouts/OAuth2/Sources/Flows/OAuth2PasswordGrant.swift -emit-dependencies-path /Users/admin/builder/spi-builder-workspace/.derivedData/Build/Intermediates.noindex/OAuth2.build/Debug-watchos/Flows.build/Objects-normal/arm64/OAuth2.d -emit-const-values-path /Users/admin/builder/spi-builder-workspace/.derivedData/Build/Intermediates.noindex/OAuth2.build/Debug-watchos/Flows.build/Objects-normal/arm64/OAuth2.swiftconstvalues -emit-reference-dependencies-path /Users/admin/builder/spi-builder-workspace/.derivedData/Build/Intermediates.noindex/OAuth2.build/Debug-watchos/Flows.build/Objects-normal/arm64/OAuth2.swiftdeps -serialize-diagnostics-path /Users/admin/builder/spi-builder-workspace/.derivedData/Build/Intermediates.noindex/OAuth2.build/Debug-watchos/Flows.build/Objects-normal/arm64/OAuth2.dia -emit-dependencies-path /Users/admin/builder/spi-builder-workspace/.derivedData/Build/Intermediates.noindex/OAuth2.build/Debug-watchos/Flows.build/Objects-normal/arm64/OAuth2ClientCredentials.d -emit-const-values-path /Users/admin/builder/spi-builder-workspace/.derivedData/Build/Intermediates.noindex/OAuth2.build/Debug-watchos/Flows.build/Objects-normal/arm64/OAuth2ClientCredentials.swiftconstvalues -emit-reference-dependencies-path /Users/admin/builder/spi-builder-workspace/.derivedData/Build/Intermediates.noindex/OAuth2.build/Debug-watchos/Flows.build/Objects-normal/arm64/OAuth2ClientCredentials.swiftdeps -serialize-diagnostics-path /Users/admin/builder/spi-builder-workspace/.derivedData/Build/Intermediates.noindex/OAuth2.build/Debug-watchos/Flows.build/Objects-normal/arm64/OAuth2ClientCredentials.dia -target arm64-apple-watchos5.0 -Xllvm -aarch64-use-tbi -enable-objc-interop -sdk /Applications/Xcode-16.2.0.app/Contents/Developer/Platforms/WatchOS.platform/Developer/SDKs/WatchOS11.2.sdk -I /Users/admin/builder/spi-builder-workspace/.derivedData/Build/Products/Debug-watchos -I /Applications/Xcode-16.2.0.app/Contents/Developer/Platforms/WatchOS.platform/Developer/usr/lib -F /Users/admin/builder/spi-builder-workspace/.derivedData/Build/Products/Debug-watchos/PackageFrameworks -F /Users/admin/builder/spi-builder-workspace/.derivedData/Build/Products/Debug-watchos/PackageFrameworks -F /Users/admin/builder/spi-builder-workspace/.derivedData/Build/Products/Debug-watchos/PackageFrameworks -F /Users/admin/builder/spi-builder-workspace/.derivedData/Build/Products/Debug-watchos/PackageFrameworks -F /Users/admin/builder/spi-builder-workspace/.derivedData/Build/Products/Debug-watchos/PackageFrameworks -F /Users/admin/builder/spi-builder-workspace/.derivedData/Build/Products/Debug-watchos -F /Applications/Xcode-16.2.0.app/Contents/Developer/Platforms/WatchOS.platform/Developer/Library/Frameworks -F /Applications/Xcode-16.2.0.app/Contents/Developer/Platforms/WatchOS.platform/Developer/SDKs/WatchOS11.2.sdk/Developer/Library/Frameworks -no-color-diagnostics -enable-testing -g -debug-info-format\=dwarf -dwarf-version\=4 -module-cache-path /Users/admin/builder/spi-builder-workspace/.derivedData/ModuleCache.noindex -suppress-warnings -profile-generate -profile-coverage-mapping -swift-version 5 -enforce-exclusivity\=checked -Onone -D SWIFT_PACKAGE -D DEBUG -D Xcode -serialize-debugging-options -const-gather-protocols-file /Users/admin/builder/spi-builder-workspace/.derivedData/Build/Intermediates.noindex/OAuth2.build/Debug-watchos/Flows.build/Objects-normal/arm64/Flows_const_extract_protocols.json -enable-experimental-feature DebugDescriptionMacro -enable-experimental-feature OpaqueTypeErasure -empty-abi-descriptor -plugin-path /Applications/Xcode-16.2.0.app/Contents/Developer/Toolchains/XcodeDefault.xctoolchain/usr/lib/swift/host/plugins/testing -validate-clang-modules-once -clang-build-session-file /Users/admin/builder/spi-builder-workspace/.derivedData/ModuleCache.noindex/Session.modulevalidation -Xcc -working-directory -Xcc /Users/admin/builder/spi-builder-workspace/.swiftpm/xcode -resource-dir /Applications/Xcode-16.2.0.app/Contents/Developer/Toolchains/XcodeDefault.xctoolchain/usr/lib/swift -enable-anonymous-context-mangled-names -file-compilation-dir /Users/admin/builder/spi-builder-workspace/.swiftpm/xcode -Xcc -D_LIBCPP_HARDENING_MODE\=_LIBCPP_HARDENING_MODE_DEBUG -Xcc -ivfsstatcache -Xcc /Users/admin/builder/spi-builder-workspace/.derivedData/SDKStatCaches.noindex/watchos11.2-22S97-8cb5c683f5e64b0ecfc74e8d0065fbf6.sdkstatcache -Xcc -I/Users/admin/builder/spi-builder-workspace/.derivedData/Build/Intermediates.noindex/OAuth2.build/Debug-watchos/Flows.build/swift-overrides.hmap -Xcc -I/Users/admin/builder/spi-builder-workspace/.derivedData/Build/Products/Debug-watchos/include -Xcc -I/Users/admin/builder/spi-builder-workspace/.derivedData/Build/Intermediates.noindex/OAuth2.build/Debug-watchos/Flows.build/DerivedSources-normal/arm64 -Xcc -I/Users/admin/builder/spi-builder-workspace/.derivedData/Build/Intermediates.noindex/OAuth2.build/Debug-watchos/Flows.build/DerivedSources/arm64 -Xcc -I/Users/admin/builder/spi-builder-workspace/.derivedData/Build/Intermediates.noindex/OAuth2.build/Debug-watchos/Flows.build/DerivedSources -Xcc -DSWIFT_PACKAGE -Xcc -DDEBUG\=1 -module-name Flows -frontend-parseable-output -disable-clang-spi -target-sdk-version 11.2 -target-sdk-name watchos11.2 -external-plugin-path /Applications/Xcode-16.2.0.app/Contents/Developer/Platforms/WatchOS.platform/Developer/usr/lib/swift/host/plugins\#/Applications/Xcode-16.2.0.app/Contents/Developer/Platforms/WatchOS.platform/Developer/usr/bin/swift-plugin-server -external-plugin-path /Applications/Xcode-16.2.0.app/Contents/Developer/Platforms/WatchOS.platform/Developer/usr/local/lib/swift/host/plugins\#/Applications/Xcode-16.2.0.app/Contents/Developer/Platforms/WatchOS.platform/Developer/usr/bin/swift-plugin-server -plugin-path /Applications/Xcode-16.2.0.app/Contents/Developer/Toolchains/XcodeDefault.xctoolchain/usr/lib/swift/host/plugins -plugin-path /Applications/Xcode-16.2.0.app/Contents/Developer/Toolchains/XcodeDefault.xctoolchain/usr/local/lib/swift/host/plugins -o /Users/admin/builder/spi-builder-workspace/.derivedData/Build/Intermediates.noindex/OAuth2.build/Debug-watchos/Flows.build/Objects-normal/arm64/OAuth2.o -o /Users/admin/builder/spi-builder-workspace/.derivedData/Build/Intermediates.noindex/OAuth2.build/Debug-watchos/Flows.build/Objects-normal/arm64/OAuth2ClientCredentials.o -index-unit-output-path /OAuth2.build/Debug-watchos/Flows.build/Objects-normal/arm64/OAuth2.o -index-unit-output-path /OAuth2.build/Debug-watchos/Flows.build/Objects-normal/arm64/OAuth2ClientCredentials.o -index-store-path /Users/admin/builder/spi-builder-workspace/.derivedData/Index.noindex/DataStore -index-system-modules
SwiftCompile normal arm64 /Users/admin/builder/spi-builder-workspace/.dependencies/checkouts/OAuth2/Sources/Flows/OAuth2.swift (in target 'Flows' from project 'OAuth2')
    cd /Users/admin/builder/spi-builder-workspace/.swiftpm/xcode
    /Applications/Xcode-16.2.0.app/Contents/Developer/Toolchains/XcodeDefault.xctoolchain/usr/bin/swift-frontend -c -primary-file /Users/admin/builder/spi-builder-workspace/.dependencies/checkouts/OAuth2/Sources/Flows/OAuth2.swift -primary-file /Users/admin/builder/spi-builder-workspace/.dependencies/checkouts/OAuth2/Sources/Flows/OAuth2ClientCredentials.swift /Users/admin/builder/spi-builder-workspace/.dependencies/checkouts/OAuth2/Sources/Flows/OAuth2ClientCredentialsReddit.swift /Users/admin/builder/spi-builder-workspace/.dependencies/checkouts/OAuth2/Sources/Flows/OAuth2CodeGrant.swift /Users/admin/builder/spi-builder-workspace/.dependencies/checkouts/OAuth2/Sources/Flows/OAuth2CodeGrantAzure.swift /Users/admin/builder/spi-builder-workspace/.dependencies/checkouts/OAuth2/Sources/Flows/OAuth2CodeGrantBasicAuth.swift /Users/admin/builder/spi-builder-workspace/.dependencies/checkouts/OAuth2/Sources/Flows/OAuth2CodeGrantFacebook.swift /Users/admin/builder/spi-builder-workspace/.dependencies/checkouts/OAuth2/Sources/Flows/OAuth2CodeGrantLinkedIn.swift /Users/admin/builder/spi-builder-workspace/.dependencies/checkouts/OAuth2/Sources/Flows/OAuth2CodeGrantNoTokenType.swift /Users/admin/builder/spi-builder-workspace/.dependencies/checkouts/OAuth2/Sources/Flows/OAuth2DeviceGrant.swift /Users/admin/builder/spi-builder-workspace/.dependencies/checkouts/OAuth2/Sources/Flows/OAuth2DynReg.swift /Users/admin/builder/spi-builder-workspace/.dependencies/checkouts/OAuth2/Sources/Flows/OAuth2ImplicitGrant.swift /Users/admin/builder/spi-builder-workspace/.dependencies/checkouts/OAuth2/Sources/Flows/OAuth2ImplicitGrantWithQueryParams.swift /Users/admin/builder/spi-builder-workspace/.dependencies/checkouts/OAuth2/Sources/Flows/OAuth2PasswordGrant.swift -emit-dependencies-path /Users/admin/builder/spi-builder-workspace/.derivedData/Build/Intermediates.noindex/OAuth2.build/Debug-watchos/Flows.build/Objects-normal/arm64/OAuth2.d -emit-const-values-path /Users/admin/builder/spi-builder-workspace/.derivedData/Build/Intermediates.noindex/OAuth2.build/Debug-watchos/Flows.build/Objects-normal/arm64/OAuth2.swiftconstvalues -emit-reference-dependencies-path /Users/admin/builder/spi-builder-workspace/.derivedData/Build/Intermediates.noindex/OAuth2.build/Debug-watchos/Flows.build/Objects-normal/arm64/OAuth2.swiftdeps -serialize-diagnostics-path /Users/admin/builder/spi-builder-workspace/.derivedData/Build/Intermediates.noindex/OAuth2.build/Debug-watchos/Flows.build/Objects-normal/arm64/OAuth2.dia -emit-dependencies-path /Users/admin/builder/spi-builder-workspace/.derivedData/Build/Intermediates.noindex/OAuth2.build/Debug-watchos/Flows.build/Objects-normal/arm64/OAuth2ClientCredentials.d -emit-const-values-path /Users/admin/builder/spi-builder-workspace/.derivedData/Build/Intermediates.noindex/OAuth2.build/Debug-watchos/Flows.build/Objects-normal/arm64/OAuth2ClientCredentials.swiftconstvalues -emit-reference-dependencies-path /Users/admin/builder/spi-builder-workspace/.derivedData/Build/Intermediates.noindex/OAuth2.build/Debug-watchos/Flows.build/Objects-normal/arm64/OAuth2ClientCredentials.swiftdeps -serialize-diagnostics-path /Users/admin/builder/spi-builder-workspace/.derivedData/Build/Intermediates.noindex/OAuth2.build/Debug-watchos/Flows.build/Objects-normal/arm64/OAuth2ClientCredentials.dia -target arm64-apple-watchos5.0 -Xllvm -aarch64-use-tbi -enable-objc-interop -sdk /Applications/Xcode-16.2.0.app/Contents/Developer/Platforms/WatchOS.platform/Developer/SDKs/WatchOS11.2.sdk -I /Users/admin/builder/spi-builder-workspace/.derivedData/Build/Products/Debug-watchos -I /Applications/Xcode-16.2.0.app/Contents/Developer/Platforms/WatchOS.platform/Developer/usr/lib -F /Users/admin/builder/spi-builder-workspace/.derivedData/Build/Products/Debug-watchos/PackageFrameworks -F /Users/admin/builder/spi-builder-workspace/.derivedData/Build/Products/Debug-watchos/PackageFrameworks -F /Users/admin/builder/spi-builder-workspace/.derivedData/Build/Products/Debug-watchos/PackageFrameworks -F /Users/admin/builder/spi-builder-workspace/.derivedData/Build/Products/Debug-watchos/PackageFrameworks -F /Users/admin/builder/spi-builder-workspace/.derivedData/Build/Products/Debug-watchos/PackageFrameworks -F /Users/admin/builder/spi-builder-workspace/.derivedData/Build/Products/Debug-watchos -F /Applications/Xcode-16.2.0.app/Contents/Developer/Platforms/WatchOS.platform/Developer/Library/Frameworks -F /Applications/Xcode-16.2.0.app/Contents/Developer/Platforms/WatchOS.platform/Developer/SDKs/WatchOS11.2.sdk/Developer/Library/Frameworks -no-color-diagnostics -enable-testing -g -debug-info-format\=dwarf -dwarf-version\=4 -module-cache-path /Users/admin/builder/spi-builder-workspace/.derivedData/ModuleCache.noindex -suppress-warnings -profile-generate -profile-coverage-mapping -swift-version 5 -enforce-exclusivity\=checked -Onone -D SWIFT_PACKAGE -D DEBUG -D Xcode -serialize-debugging-options -const-gather-protocols-file /Users/admin/builder/spi-builder-workspace/.derivedData/Build/Intermediates.noindex/OAuth2.build/Debug-watchos/Flows.build/Objects-normal/arm64/Flows_const_extract_protocols.json -enable-experimental-feature DebugDescriptionMacro -enable-experimental-feature OpaqueTypeErasure -empty-abi-descriptor -plugin-path /Applications/Xcode-16.2.0.app/Contents/Developer/Toolchains/XcodeDefault.xctoolchain/usr/lib/swift/host/plugins/testing -validate-clang-modules-once -clang-build-session-file /Users/admin/builder/spi-builder-workspace/.derivedData/ModuleCache.noindex/Session.modulevalidation -Xcc -working-directory -Xcc /Users/admin/builder/spi-builder-workspace/.swiftpm/xcode -resource-dir /Applications/Xcode-16.2.0.app/Contents/Developer/Toolchains/XcodeDefault.xctoolchain/usr/lib/swift -enable-anonymous-context-mangled-names -file-compilation-dir /Users/admin/builder/spi-builder-workspace/.swiftpm/xcode -Xcc -D_LIBCPP_HARDENING_MODE\=_LIBCPP_HARDENING_MODE_DEBUG -Xcc -ivfsstatcache -Xcc /Users/admin/builder/spi-builder-workspace/.derivedData/SDKStatCaches.noindex/watchos11.2-22S97-8cb5c683f5e64b0ecfc74e8d0065fbf6.sdkstatcache -Xcc -I/Users/admin/builder/spi-builder-workspace/.derivedData/Build/Intermediates.noindex/OAuth2.build/Debug-watchos/Flows.build/swift-overrides.hmap -Xcc -I/Users/admin/builder/spi-builder-workspace/.derivedData/Build/Products/Debug-watchos/include -Xcc -I/Users/admin/builder/spi-builder-workspace/.derivedData/Build/Intermediates.noindex/OAuth2.build/Debug-watchos/Flows.build/DerivedSources-normal/arm64 -Xcc -I/Users/admin/builder/spi-builder-workspace/.derivedData/Build/Intermediates.noindex/OAuth2.build/Debug-watchos/Flows.build/DerivedSources/arm64 -Xcc -I/Users/admin/builder/spi-builder-workspace/.derivedData/Build/Intermediates.noindex/OAuth2.build/Debug-watchos/Flows.build/DerivedSources -Xcc -DSWIFT_PACKAGE -Xcc -DDEBUG\=1 -module-name Flows -frontend-parseable-output -disable-clang-spi -target-sdk-version 11.2 -target-sdk-name watchos11.2 -external-plugin-path /Applications/Xcode-16.2.0.app/Contents/Developer/Platforms/WatchOS.platform/Developer/usr/lib/swift/host/plugins\#/Applications/Xcode-16.2.0.app/Contents/Developer/Platforms/WatchOS.platform/Developer/usr/bin/swift-plugin-server -external-plugin-path /Applications/Xcode-16.2.0.app/Contents/Developer/Platforms/WatchOS.platform/Developer/usr/local/lib/swift/host/plugins\#/Applications/Xcode-16.2.0.app/Contents/Developer/Platforms/WatchOS.platform/Developer/usr/bin/swift-plugin-server -plugin-path /Applications/Xcode-16.2.0.app/Contents/Developer/Toolchains/XcodeDefault.xctoolchain/usr/lib/swift/host/plugins -plugin-path /Applications/Xcode-16.2.0.app/Contents/Developer/Toolchains/XcodeDefault.xctoolchain/usr/local/lib/swift/host/plugins -o /Users/admin/builder/spi-builder-workspace/.derivedData/Build/Intermediates.noindex/OAuth2.build/Debug-watchos/Flows.build/Objects-normal/arm64/OAuth2.o -o /Users/admin/builder/spi-builder-workspace/.derivedData/Build/Intermediates.noindex/OAuth2.build/Debug-watchos/Flows.build/Objects-normal/arm64/OAuth2ClientCredentials.o -index-unit-output-path /OAuth2.build/Debug-watchos/Flows.build/Objects-normal/arm64/OAuth2.o -index-unit-output-path /OAuth2.build/Debug-watchos/Flows.build/Objects-normal/arm64/OAuth2ClientCredentials.o -index-store-path /Users/admin/builder/spi-builder-workspace/.derivedData/Index.noindex/DataStore -index-system-modules
SwiftCompile normal arm64 /Users/admin/builder/spi-builder-workspace/.dependencies/checkouts/OAuth2/Sources/Flows/OAuth2ClientCredentials.swift (in target 'Flows' from project 'OAuth2')
    cd /Users/admin/builder/spi-builder-workspace/.swiftpm/xcode
    /Applications/Xcode-16.2.0.app/Contents/Developer/Toolchains/XcodeDefault.xctoolchain/usr/bin/swift-frontend -c -primary-file /Users/admin/builder/spi-builder-workspace/.dependencies/checkouts/OAuth2/Sources/Flows/OAuth2.swift -primary-file /Users/admin/builder/spi-builder-workspace/.dependencies/checkouts/OAuth2/Sources/Flows/OAuth2ClientCredentials.swift /Users/admin/builder/spi-builder-workspace/.dependencies/checkouts/OAuth2/Sources/Flows/OAuth2ClientCredentialsReddit.swift /Users/admin/builder/spi-builder-workspace/.dependencies/checkouts/OAuth2/Sources/Flows/OAuth2CodeGrant.swift /Users/admin/builder/spi-builder-workspace/.dependencies/checkouts/OAuth2/Sources/Flows/OAuth2CodeGrantAzure.swift /Users/admin/builder/spi-builder-workspace/.dependencies/checkouts/OAuth2/Sources/Flows/OAuth2CodeGrantBasicAuth.swift /Users/admin/builder/spi-builder-workspace/.dependencies/checkouts/OAuth2/Sources/Flows/OAuth2CodeGrantFacebook.swift /Users/admin/builder/spi-builder-workspace/.dependencies/checkouts/OAuth2/Sources/Flows/OAuth2CodeGrantLinkedIn.swift /Users/admin/builder/spi-builder-workspace/.dependencies/checkouts/OAuth2/Sources/Flows/OAuth2CodeGrantNoTokenType.swift /Users/admin/builder/spi-builder-workspace/.dependencies/checkouts/OAuth2/Sources/Flows/OAuth2DeviceGrant.swift /Users/admin/builder/spi-builder-workspace/.dependencies/checkouts/OAuth2/Sources/Flows/OAuth2DynReg.swift /Users/admin/builder/spi-builder-workspace/.dependencies/checkouts/OAuth2/Sources/Flows/OAuth2ImplicitGrant.swift /Users/admin/builder/spi-builder-workspace/.dependencies/checkouts/OAuth2/Sources/Flows/OAuth2ImplicitGrantWithQueryParams.swift /Users/admin/builder/spi-builder-workspace/.dependencies/checkouts/OAuth2/Sources/Flows/OAuth2PasswordGrant.swift -emit-dependencies-path /Users/admin/builder/spi-builder-workspace/.derivedData/Build/Intermediates.noindex/OAuth2.build/Debug-watchos/Flows.build/Objects-normal/arm64/OAuth2.d -emit-const-values-path /Users/admin/builder/spi-builder-workspace/.derivedData/Build/Intermediates.noindex/OAuth2.build/Debug-watchos/Flows.build/Objects-normal/arm64/OAuth2.swiftconstvalues -emit-reference-dependencies-path /Users/admin/builder/spi-builder-workspace/.derivedData/Build/Intermediates.noindex/OAuth2.build/Debug-watchos/Flows.build/Objects-normal/arm64/OAuth2.swiftdeps -serialize-diagnostics-path /Users/admin/builder/spi-builder-workspace/.derivedData/Build/Intermediates.noindex/OAuth2.build/Debug-watchos/Flows.build/Objects-normal/arm64/OAuth2.dia -emit-dependencies-path /Users/admin/builder/spi-builder-workspace/.derivedData/Build/Intermediates.noindex/OAuth2.build/Debug-watchos/Flows.build/Objects-normal/arm64/OAuth2ClientCredentials.d -emit-const-values-path /Users/admin/builder/spi-builder-workspace/.derivedData/Build/Intermediates.noindex/OAuth2.build/Debug-watchos/Flows.build/Objects-normal/arm64/OAuth2ClientCredentials.swiftconstvalues -emit-reference-dependencies-path /Users/admin/builder/spi-builder-workspace/.derivedData/Build/Intermediates.noindex/OAuth2.build/Debug-watchos/Flows.build/Objects-normal/arm64/OAuth2ClientCredentials.swiftdeps -serialize-diagnostics-path /Users/admin/builder/spi-builder-workspace/.derivedData/Build/Intermediates.noindex/OAuth2.build/Debug-watchos/Flows.build/Objects-normal/arm64/OAuth2ClientCredentials.dia -target arm64-apple-watchos5.0 -Xllvm -aarch64-use-tbi -enable-objc-interop -sdk /Applications/Xcode-16.2.0.app/Contents/Developer/Platforms/WatchOS.platform/Developer/SDKs/WatchOS11.2.sdk -I /Users/admin/builder/spi-builder-workspace/.derivedData/Build/Products/Debug-watchos -I /Applications/Xcode-16.2.0.app/Contents/Developer/Platforms/WatchOS.platform/Developer/usr/lib -F /Users/admin/builder/spi-builder-workspace/.derivedData/Build/Products/Debug-watchos/PackageFrameworks -F /Users/admin/builder/spi-builder-workspace/.derivedData/Build/Products/Debug-watchos/PackageFrameworks -F /Users/admin/builder/spi-builder-workspace/.derivedData/Build/Products/Debug-watchos/PackageFrameworks -F /Users/admin/builder/spi-builder-workspace/.derivedData/Build/Products/Debug-watchos/PackageFrameworks -F /Users/admin/builder/spi-builder-workspace/.derivedData/Build/Products/Debug-watchos/PackageFrameworks -F /Users/admin/builder/spi-builder-workspace/.derivedData/Build/Products/Debug-watchos -F /Applications/Xcode-16.2.0.app/Contents/Developer/Platforms/WatchOS.platform/Developer/Library/Frameworks -F /Applications/Xcode-16.2.0.app/Contents/Developer/Platforms/WatchOS.platform/Developer/SDKs/WatchOS11.2.sdk/Developer/Library/Frameworks -no-color-diagnostics -enable-testing -g -debug-info-format\=dwarf -dwarf-version\=4 -module-cache-path /Users/admin/builder/spi-builder-workspace/.derivedData/ModuleCache.noindex -suppress-warnings -profile-generate -profile-coverage-mapping -swift-version 5 -enforce-exclusivity\=checked -Onone -D SWIFT_PACKAGE -D DEBUG -D Xcode -serialize-debugging-options -const-gather-protocols-file /Users/admin/builder/spi-builder-workspace/.derivedData/Build/Intermediates.noindex/OAuth2.build/Debug-watchos/Flows.build/Objects-normal/arm64/Flows_const_extract_protocols.json -enable-experimental-feature DebugDescriptionMacro -enable-experimental-feature OpaqueTypeErasure -empty-abi-descriptor -plugin-path /Applications/Xcode-16.2.0.app/Contents/Developer/Toolchains/XcodeDefault.xctoolchain/usr/lib/swift/host/plugins/testing -validate-clang-modules-once -clang-build-session-file /Users/admin/builder/spi-builder-workspace/.derivedData/ModuleCache.noindex/Session.modulevalidation -Xcc -working-directory -Xcc /Users/admin/builder/spi-builder-workspace/.swiftpm/xcode -resource-dir /Applications/Xcode-16.2.0.app/Contents/Developer/Toolchains/XcodeDefault.xctoolchain/usr/lib/swift -enable-anonymous-context-mangled-names -file-compilation-dir /Users/admin/builder/spi-builder-workspace/.swiftpm/xcode -Xcc -D_LIBCPP_HARDENING_MODE\=_LIBCPP_HARDENING_MODE_DEBUG -Xcc -ivfsstatcache -Xcc /Users/admin/builder/spi-builder-workspace/.derivedData/SDKStatCaches.noindex/watchos11.2-22S97-8cb5c683f5e64b0ecfc74e8d0065fbf6.sdkstatcache -Xcc -I/Users/admin/builder/spi-builder-workspace/.derivedData/Build/Intermediates.noindex/OAuth2.build/Debug-watchos/Flows.build/swift-overrides.hmap -Xcc -I/Users/admin/builder/spi-builder-workspace/.derivedData/Build/Products/Debug-watchos/include -Xcc -I/Users/admin/builder/spi-builder-workspace/.derivedData/Build/Intermediates.noindex/OAuth2.build/Debug-watchos/Flows.build/DerivedSources-normal/arm64 -Xcc -I/Users/admin/builder/spi-builder-workspace/.derivedData/Build/Intermediates.noindex/OAuth2.build/Debug-watchos/Flows.build/DerivedSources/arm64 -Xcc -I/Users/admin/builder/spi-builder-workspace/.derivedData/Build/Intermediates.noindex/OAuth2.build/Debug-watchos/Flows.build/DerivedSources -Xcc -DSWIFT_PACKAGE -Xcc -DDEBUG\=1 -module-name Flows -frontend-parseable-output -disable-clang-spi -target-sdk-version 11.2 -target-sdk-name watchos11.2 -external-plugin-path /Applications/Xcode-16.2.0.app/Contents/Developer/Platforms/WatchOS.platform/Developer/usr/lib/swift/host/plugins\#/Applications/Xcode-16.2.0.app/Contents/Developer/Platforms/WatchOS.platform/Developer/usr/bin/swift-plugin-server -external-plugin-path /Applications/Xcode-16.2.0.app/Contents/Developer/Platforms/WatchOS.platform/Developer/usr/local/lib/swift/host/plugins\#/Applications/Xcode-16.2.0.app/Contents/Developer/Platforms/WatchOS.platform/Developer/usr/bin/swift-plugin-server -plugin-path /Applications/Xcode-16.2.0.app/Contents/Developer/Toolchains/XcodeDefault.xctoolchain/usr/lib/swift/host/plugins -plugin-path /Applications/Xcode-16.2.0.app/Contents/Developer/Toolchains/XcodeDefault.xctoolchain/usr/local/lib/swift/host/plugins -o /Users/admin/builder/spi-builder-workspace/.derivedData/Build/Intermediates.noindex/OAuth2.build/Debug-watchos/Flows.build/Objects-normal/arm64/OAuth2.o -o /Users/admin/builder/spi-builder-workspace/.derivedData/Build/Intermediates.noindex/OAuth2.build/Debug-watchos/Flows.build/Objects-normal/arm64/OAuth2ClientCredentials.o -index-unit-output-path /OAuth2.build/Debug-watchos/Flows.build/Objects-normal/arm64/OAuth2.o -index-unit-output-path /OAuth2.build/Debug-watchos/Flows.build/Objects-normal/arm64/OAuth2ClientCredentials.o -index-store-path /Users/admin/builder/spi-builder-workspace/.derivedData/Index.noindex/DataStore -index-system-modules
SwiftEmitModule normal armv7k Emitting\ module\ for\ Flows (in target 'Flows' from project 'OAuth2')
    cd /Users/admin/builder/spi-builder-workspace/.swiftpm/xcode
    builtin-swiftTaskExecution -- /Applications/Xcode-16.2.0.app/Contents/Developer/Toolchains/XcodeDefault.xctoolchain/usr/bin/swift-frontend -frontend -emit-module -experimental-skip-non-inlinable-function-bodies-without-types /Users/admin/builder/spi-builder-workspace/.dependencies/checkouts/OAuth2/Sources/Flows/OAuth2.swift /Users/admin/builder/spi-builder-workspace/.dependencies/checkouts/OAuth2/Sources/Flows/OAuth2ClientCredentials.swift /Users/admin/builder/spi-builder-workspace/.dependencies/checkouts/OAuth2/Sources/Flows/OAuth2ClientCredentialsReddit.swift /Users/admin/builder/spi-builder-workspace/.dependencies/checkouts/OAuth2/Sources/Flows/OAuth2CodeGrant.swift /Users/admin/builder/spi-builder-workspace/.dependencies/checkouts/OAuth2/Sources/Flows/OAuth2CodeGrantAzure.swift /Users/admin/builder/spi-builder-workspace/.dependencies/checkouts/OAuth2/Sources/Flows/OAuth2CodeGrantBasicAuth.swift /Users/admin/builder/spi-builder-workspace/.dependencies/checkouts/OAuth2/Sources/Flows/OAuth2CodeGrantFacebook.swift /Users/admin/builder/spi-builder-workspace/.dependencies/checkouts/OAuth2/Sources/Flows/OAuth2CodeGrantLinkedIn.swift /Users/admin/builder/spi-builder-workspace/.dependencies/checkouts/OAuth2/Sources/Flows/OAuth2CodeGrantNoTokenType.swift /Users/admin/builder/spi-builder-workspace/.dependencies/checkouts/OAuth2/Sources/Flows/OAuth2DeviceGrant.swift /Users/admin/builder/spi-builder-workspace/.dependencies/checkouts/OAuth2/Sources/Flows/OAuth2DynReg.swift /Users/admin/builder/spi-builder-workspace/.dependencies/checkouts/OAuth2/Sources/Flows/OAuth2ImplicitGrant.swift /Users/admin/builder/spi-builder-workspace/.dependencies/checkouts/OAuth2/Sources/Flows/OAuth2ImplicitGrantWithQueryParams.swift /Users/admin/builder/spi-builder-workspace/.dependencies/checkouts/OAuth2/Sources/Flows/OAuth2PasswordGrant.swift -target armv7k-apple-watchos5.0 -enable-objc-interop -sdk /Applications/Xcode-16.2.0.app/Contents/Developer/Platforms/WatchOS.platform/Developer/SDKs/WatchOS11.2.sdk -I /Users/admin/builder/spi-builder-workspace/.derivedData/Build/Products/Debug-watchos -I /Applications/Xcode-16.2.0.app/Contents/Developer/Platforms/WatchOS.platform/Developer/usr/lib -F /Users/admin/builder/spi-builder-workspace/.derivedData/Build/Products/Debug-watchos/PackageFrameworks -F /Users/admin/builder/spi-builder-workspace/.derivedData/Build/Products/Debug-watchos/PackageFrameworks -F /Users/admin/builder/spi-builder-workspace/.derivedData/Build/Products/Debug-watchos/PackageFrameworks -F /Users/admin/builder/spi-builder-workspace/.derivedData/Build/Products/Debug-watchos/PackageFrameworks -F /Users/admin/builder/spi-builder-workspace/.derivedData/Build/Products/Debug-watchos/PackageFrameworks -F /Users/admin/builder/spi-builder-workspace/.derivedData/Build/Products/Debug-watchos -F /Applications/Xcode-16.2.0.app/Contents/Developer/Platforms/WatchOS.platform/Developer/Library/Frameworks -F /Applications/Xcode-16.2.0.app/Contents/Developer/Platforms/WatchOS.platform/Developer/SDKs/WatchOS11.2.sdk/Developer/Library/Frameworks -no-color-diagnostics -enable-testing -g -debug-info-format\=dwarf -dwarf-version\=4 -module-cache-path /Users/admin/builder/spi-builder-workspace/.derivedData/ModuleCache.noindex -suppress-warnings -profile-generate -profile-coverage-mapping -swift-version 5 -enforce-exclusivity\=checked -Onone -D SWIFT_PACKAGE -D DEBUG -D Xcode -serialize-debugging-options -const-gather-protocols-file /Users/admin/builder/spi-builder-workspace/.derivedData/Build/Intermediates.noindex/OAuth2.build/Debug-watchos/Flows.build/Objects-normal/armv7k/Flows_const_extract_protocols.json -enable-experimental-feature DebugDescriptionMacro -enable-experimental-feature OpaqueTypeErasure -empty-abi-descriptor -plugin-path /Applications/Xcode-16.2.0.app/Contents/Developer/Toolchains/XcodeDefault.xctoolchain/usr/lib/swift/host/plugins/testing -validate-clang-modules-once -clang-build-session-file /Users/admin/builder/spi-builder-workspace/.derivedData/ModuleCache.noindex/Session.modulevalidation -Xcc -working-directory -Xcc /Users/admin/builder/spi-builder-workspace/.swiftpm/xcode -resource-dir /Applications/Xcode-16.2.0.app/Contents/Developer/Toolchains/XcodeDefault.xctoolchain/usr/lib/swift -enable-anonymous-context-mangled-names -file-compilation-dir /Users/admin/builder/spi-builder-workspace/.swiftpm/xcode -Xcc -D_LIBCPP_HARDENING_MODE\=_LIBCPP_HARDENING_MODE_DEBUG -Xcc -ivfsstatcache -Xcc /Users/admin/builder/spi-builder-workspace/.derivedData/SDKStatCaches.noindex/watchos11.2-22S97-8cb5c683f5e64b0ecfc74e8d0065fbf6.sdkstatcache -Xcc -I/Users/admin/builder/spi-builder-workspace/.derivedData/Build/Intermediates.noindex/OAuth2.build/Debug-watchos/Flows.build/swift-overrides.hmap -Xcc -I/Users/admin/builder/spi-builder-workspace/.derivedData/Build/Products/Debug-watchos/include -Xcc -I/Users/admin/builder/spi-builder-workspace/.derivedData/Build/Intermediates.noindex/OAuth2.build/Debug-watchos/Flows.build/DerivedSources-normal/armv7k -Xcc -I/Users/admin/builder/spi-builder-workspace/.derivedData/Build/Intermediates.noindex/OAuth2.build/Debug-watchos/Flows.build/DerivedSources/armv7k -Xcc -I/Users/admin/builder/spi-builder-workspace/.derivedData/Build/Intermediates.noindex/OAuth2.build/Debug-watchos/Flows.build/DerivedSources -Xcc -DSWIFT_PACKAGE -Xcc -DDEBUG\=1 -module-name Flows -frontend-parseable-output -disable-clang-spi -target-sdk-version 11.2 -target-sdk-name watchos11.2 -external-plugin-path /Applications/Xcode-16.2.0.app/Contents/Developer/Platforms/WatchOS.platform/Developer/usr/lib/swift/host/plugins\#/Applications/Xcode-16.2.0.app/Contents/Developer/Platforms/WatchOS.platform/Developer/usr/bin/swift-plugin-server -external-plugin-path /Applications/Xcode-16.2.0.app/Contents/Developer/Platforms/WatchOS.platform/Developer/usr/local/lib/swift/host/plugins\#/Applications/Xcode-16.2.0.app/Contents/Developer/Platforms/WatchOS.platform/Developer/usr/bin/swift-plugin-server -plugin-path /Applications/Xcode-16.2.0.app/Contents/Developer/Toolchains/XcodeDefault.xctoolchain/usr/lib/swift/host/plugins -plugin-path /Applications/Xcode-16.2.0.app/Contents/Developer/Toolchains/XcodeDefault.xctoolchain/usr/local/lib/swift/host/plugins -emit-module-doc-path /Users/admin/builder/spi-builder-workspace/.derivedData/Build/Intermediates.noindex/OAuth2.build/Debug-watchos/Flows.build/Objects-normal/armv7k/Flows.swiftdoc -emit-module-source-info-path /Users/admin/builder/spi-builder-workspace/.derivedData/Build/Intermediates.noindex/OAuth2.build/Debug-watchos/Flows.build/Objects-normal/armv7k/Flows.swiftsourceinfo -emit-objc-header-path /Users/admin/builder/spi-builder-workspace/.derivedData/Build/Intermediates.noindex/OAuth2.build/Debug-watchos/Flows.build/Objects-normal/armv7k/Flows-Swift.h -serialize-diagnostics-path /Users/admin/builder/spi-builder-workspace/.derivedData/Build/Intermediates.noindex/OAuth2.build/Debug-watchos/Flows.build/Objects-normal/armv7k/Flows-master-emit-module.dia -emit-dependencies-path /Users/admin/builder/spi-builder-workspace/.derivedData/Build/Intermediates.noindex/OAuth2.build/Debug-watchos/Flows.build/Objects-normal/armv7k/Flows-master-emit-module.d -o /Users/admin/builder/spi-builder-workspace/.derivedData/Build/Intermediates.noindex/OAuth2.build/Debug-watchos/Flows.build/Objects-normal/armv7k/Flows.swiftmodule -emit-abi-descriptor-path /Users/admin/builder/spi-builder-workspace/.derivedData/Build/Intermediates.noindex/OAuth2.build/Debug-watchos/Flows.build/Objects-normal/armv7k/Flows.abi.json
Command SwiftEmitModule failed with a nonzero exit code
** BUILD FAILED **
The following build commands failed:
	SwiftCompile normal arm64 /Users/admin/builder/spi-builder-workspace/.dependencies/checkouts/OAuth2/Sources/Flows/OAuth2PasswordGrant.swift (in target 'Flows' from project 'OAuth2')
	SwiftEmitModule normal arm64 Emitting\ module\ for\ Flows (in target 'Flows' from project 'OAuth2')
	EmitSwiftModule normal arm64 (in target 'Flows' from project 'OAuth2')
	SwiftEmitModule normal arm64_32 Emitting\ module\ for\ Flows (in target 'Flows' from project 'OAuth2')
	EmitSwiftModule normal arm64_32 (in target 'Flows' from project 'OAuth2')
	SwiftEmitModule normal armv7k Emitting\ module\ for\ Flows (in target 'Flows' from project 'OAuth2')
	Building workspace spi-builder-workspace with scheme LispKit-Package
(7 failures)
BUILD FAILURE 6.0 watchOS