Build Information
Failed to build AsyncMultiplexImage, reference 1.0.0-beta.5 (b4f81f
), with Swift 6.1 for visionOS using Xcode 16.3 on 30 Apr 2025 07:32:07 UTC.
Build Command
env DEVELOPER_DIR=/Applications/Xcode-16.3.0.app xcrun xcodebuild -IDEClonedSourcePackagesDirPathOverride=$PWD/.dependencies -skipMacroValidation -skipPackagePluginValidation -derivedDataPath $PWD/.derivedData build -scheme AsyncMultiplexImage-Package -destination generic/platform=xrOS
Build Log
Target 'AsyncMultiplexImage-Nuke' in project 'AsyncMultiplexImage'
➜ Explicit dependency on target 'AsyncMultiplexImage' in project 'AsyncMultiplexImage'
➜ Explicit dependency on target 'SwiftUISupportBackport' in project 'SwiftUISupport'
➜ Explicit dependency on target 'Nuke' in project 'Nuke'
Target 'Nuke' in project 'Nuke'
➜ Explicit dependency on target 'Nuke' in project 'Nuke'
Target 'Nuke' in project 'Nuke' (no dependencies)
Target 'AsyncMultiplexImage' in project 'AsyncMultiplexImage'
➜ Explicit dependency on target 'AsyncMultiplexImage' in project 'AsyncMultiplexImage'
➜ Explicit dependency on target 'SwiftUISupportBackport' in project 'SwiftUISupport'
Target 'AsyncMultiplexImage' in project 'AsyncMultiplexImage'
➜ Explicit dependency on target 'SwiftUISupportBackport' in project 'SwiftUISupport'
Target 'SwiftUISupportBackport' in project 'SwiftUISupport'
➜ Explicit dependency on target 'SwiftUISupportBackport' in project 'SwiftUISupport'
Target 'SwiftUISupportBackport' in project 'SwiftUISupport' (no dependencies)
GatherProvisioningInputs
CreateBuildDescription
ExecuteExternalTool /Applications/Xcode-16.3.0.app/Contents/Developer/Toolchains/XcodeDefault.xctoolchain/usr/bin/swiftc --version
ExecuteExternalTool /Applications/Xcode-16.3.0.app/Contents/Developer/Toolchains/XcodeDefault.xctoolchain/usr/bin/clang -v -E -dM -isysroot /Applications/Xcode-16.3.0.app/Contents/Developer/Platforms/XROS.platform/Developer/SDKs/XROS2.4.sdk -x c -c /dev/null
ExecuteExternalTool /Applications/Xcode-16.3.0.app/Contents/Developer/Toolchains/XcodeDefault.xctoolchain/usr/bin/ld -version_details
Build description signature: 42d366a9e1c58820a1281aa9d1cf27bb
Build description path: /Users/admin/builder/spi-builder-workspace/.derivedData/Build/Intermediates.noindex/XCBuildData/42d366a9e1c58820a1281aa9d1cf27bb.xcbuilddata
ClangStatCache /Applications/Xcode-16.3.0.app/Contents/Developer/Toolchains/XcodeDefault.xctoolchain/usr/bin/clang-stat-cache /Applications/Xcode-16.3.0.app/Contents/Developer/Platforms/XROS.platform/Developer/SDKs/XROS2.4.sdk /Users/admin/builder/spi-builder-workspace/.derivedData/SDKStatCaches.noindex/xros2.4-22O233-407b76dbb837030756cbe1ab3f0b01b6.sdkstatcache
cd /Users/admin/builder/spi-builder-workspace/.swiftpm/xcode
/Applications/Xcode-16.3.0.app/Contents/Developer/Toolchains/XcodeDefault.xctoolchain/usr/bin/clang-stat-cache /Applications/Xcode-16.3.0.app/Contents/Developer/Platforms/XROS.platform/Developer/SDKs/XROS2.4.sdk -o /Users/admin/builder/spi-builder-workspace/.derivedData/SDKStatCaches.noindex/xros2.4-22O233-407b76dbb837030756cbe1ab3f0b01b6.sdkstatcache
CreateBuildDirectory /Users/admin/builder/spi-builder-workspace/.derivedData/Build/Products
cd /Users/admin/builder/spi-builder-workspace/.swiftpm/xcode
builtin-create-build-directory /Users/admin/builder/spi-builder-workspace/.derivedData/Build/Products
CreateBuildDirectory /Users/admin/builder/spi-builder-workspace/.derivedData/Build/Intermediates.noindex
cd /Users/admin/builder/spi-builder-workspace/.swiftpm/xcode
builtin-create-build-directory /Users/admin/builder/spi-builder-workspace/.derivedData/Build/Intermediates.noindex
CreateBuildDirectory /Users/admin/builder/spi-builder-workspace/.derivedData/Build/Products/Debug-xros
cd /Users/admin/builder/spi-builder-workspace/.swiftpm/xcode
builtin-create-build-directory /Users/admin/builder/spi-builder-workspace/.derivedData/Build/Products/Debug-xros
CreateBuildDirectory /Users/admin/builder/spi-builder-workspace/.derivedData/Build/Intermediates.noindex/EagerLinkingTBDs/Debug-xros
cd /Users/admin/builder/spi-builder-workspace/.swiftpm/xcode
builtin-create-build-directory /Users/admin/builder/spi-builder-workspace/.derivedData/Build/Intermediates.noindex/EagerLinkingTBDs/Debug-xros
CreateBuildDirectory /Users/admin/builder/spi-builder-workspace/.derivedData/Build/Products/Debug-xros/PackageFrameworks
cd /Users/admin/builder/spi-builder-workspace/.swiftpm/xcode
builtin-create-build-directory /Users/admin/builder/spi-builder-workspace/.derivedData/Build/Products/Debug-xros/PackageFrameworks
WriteAuxiliaryFile /Users/admin/builder/spi-builder-workspace/.derivedData/Build/Intermediates.noindex/SwiftUISupport.build/Debug-xros/SwiftUISupportBackport.build/SwiftUISupportBackport.DependencyStaticMetadataFileList (in target 'SwiftUISupportBackport' from project 'SwiftUISupport')
cd /Users/admin/builder/spi-builder-workspace/.dependencies/checkouts/swiftui-support
write-file /Users/admin/builder/spi-builder-workspace/.derivedData/Build/Intermediates.noindex/SwiftUISupport.build/Debug-xros/SwiftUISupportBackport.build/SwiftUISupportBackport.DependencyStaticMetadataFileList
WriteAuxiliaryFile /Users/admin/builder/spi-builder-workspace/.derivedData/Build/Intermediates.noindex/SwiftUISupport.build/Debug-xros/SwiftUISupportBackport.build/SwiftUISupportBackport.modulemap (in target 'SwiftUISupportBackport' from project 'SwiftUISupport')
cd /Users/admin/builder/spi-builder-workspace/.dependencies/checkouts/swiftui-support
write-file /Users/admin/builder/spi-builder-workspace/.derivedData/Build/Intermediates.noindex/SwiftUISupport.build/Debug-xros/SwiftUISupportBackport.build/SwiftUISupportBackport.modulemap
WriteAuxiliaryFile /Users/admin/builder/spi-builder-workspace/.derivedData/Build/Intermediates.noindex/SwiftUISupport.build/Debug-xros/SwiftUISupportBackport.build/SwiftUISupportBackport.DependencyMetadataFileList (in target 'SwiftUISupportBackport' from project 'SwiftUISupport')
cd /Users/admin/builder/spi-builder-workspace/.dependencies/checkouts/swiftui-support
write-file /Users/admin/builder/spi-builder-workspace/.derivedData/Build/Intermediates.noindex/SwiftUISupport.build/Debug-xros/SwiftUISupportBackport.build/SwiftUISupportBackport.DependencyMetadataFileList
WriteAuxiliaryFile /Users/admin/builder/spi-builder-workspace/.derivedData/Build/Intermediates.noindex/SwiftUISupport.build/Debug-xros/SwiftUISupportBackport.build/Objects-normal/arm64/SwiftUISupportBackport_const_extract_protocols.json (in target 'SwiftUISupportBackport' from project 'SwiftUISupport')
cd /Users/admin/builder/spi-builder-workspace/.dependencies/checkouts/swiftui-support
write-file /Users/admin/builder/spi-builder-workspace/.derivedData/Build/Intermediates.noindex/SwiftUISupport.build/Debug-xros/SwiftUISupportBackport.build/Objects-normal/arm64/SwiftUISupportBackport_const_extract_protocols.json
WriteAuxiliaryFile /Users/admin/builder/spi-builder-workspace/.derivedData/Build/Intermediates.noindex/SwiftUISupport.build/Debug-xros/SwiftUISupportBackport.build/Objects-normal/arm64/SwiftUISupportBackport.LinkFileList (in target 'SwiftUISupportBackport' from project 'SwiftUISupport')
cd /Users/admin/builder/spi-builder-workspace/.dependencies/checkouts/swiftui-support
write-file /Users/admin/builder/spi-builder-workspace/.derivedData/Build/Intermediates.noindex/SwiftUISupport.build/Debug-xros/SwiftUISupportBackport.build/Objects-normal/arm64/SwiftUISupportBackport.LinkFileList
WriteAuxiliaryFile /Users/admin/builder/spi-builder-workspace/.derivedData/Build/Intermediates.noindex/SwiftUISupport.build/Debug-xros/SwiftUISupportBackport.build/Objects-normal/arm64/SwiftUISupportBackport-OutputFileMap.json (in target 'SwiftUISupportBackport' from project 'SwiftUISupport')
cd /Users/admin/builder/spi-builder-workspace/.dependencies/checkouts/swiftui-support
write-file /Users/admin/builder/spi-builder-workspace/.derivedData/Build/Intermediates.noindex/SwiftUISupport.build/Debug-xros/SwiftUISupportBackport.build/Objects-normal/arm64/SwiftUISupportBackport-OutputFileMap.json
WriteAuxiliaryFile /Users/admin/builder/spi-builder-workspace/.derivedData/Build/Intermediates.noindex/SwiftUISupport.build/Debug-xros/SwiftUISupportBackport.build/Objects-normal/arm64/SwiftUISupportBackport.SwiftFileList (in target 'SwiftUISupportBackport' from project 'SwiftUISupport')
cd /Users/admin/builder/spi-builder-workspace/.dependencies/checkouts/swiftui-support
write-file /Users/admin/builder/spi-builder-workspace/.derivedData/Build/Intermediates.noindex/SwiftUISupport.build/Debug-xros/SwiftUISupportBackport.build/Objects-normal/arm64/SwiftUISupportBackport.SwiftFileList
WriteAuxiliaryFile /Users/admin/builder/spi-builder-workspace/.derivedData/Build/Intermediates.noindex/SwiftUISupport.build/Debug-xros/SwiftUISupportBackport.build/Objects-normal/arm64/SwiftUISupportBackport.SwiftConstValuesFileList (in target 'SwiftUISupportBackport' from project 'SwiftUISupport')
cd /Users/admin/builder/spi-builder-workspace/.dependencies/checkouts/swiftui-support
write-file /Users/admin/builder/spi-builder-workspace/.derivedData/Build/Intermediates.noindex/SwiftUISupport.build/Debug-xros/SwiftUISupportBackport.build/Objects-normal/arm64/SwiftUISupportBackport.SwiftConstValuesFileList
WriteAuxiliaryFile /Users/admin/builder/spi-builder-workspace/.derivedData/Build/Intermediates.noindex/Nuke.build/Debug-xros/Nuke.build/Objects-normal/arm64/Nuke_const_extract_protocols.json (in target 'Nuke' from project 'Nuke')
cd /Users/admin/builder/spi-builder-workspace/.dependencies/checkouts/Nuke
write-file /Users/admin/builder/spi-builder-workspace/.derivedData/Build/Intermediates.noindex/Nuke.build/Debug-xros/Nuke.build/Objects-normal/arm64/Nuke_const_extract_protocols.json
WriteAuxiliaryFile /Users/admin/builder/spi-builder-workspace/.derivedData/Build/Intermediates.noindex/Nuke.build/Debug-xros/Nuke.build/Objects-normal/arm64/Nuke.SwiftFileList (in target 'Nuke' from project 'Nuke')
cd /Users/admin/builder/spi-builder-workspace/.dependencies/checkouts/Nuke
write-file /Users/admin/builder/spi-builder-workspace/.derivedData/Build/Intermediates.noindex/Nuke.build/Debug-xros/Nuke.build/Objects-normal/arm64/Nuke.SwiftFileList
WriteAuxiliaryFile /Users/admin/builder/spi-builder-workspace/.derivedData/Build/Intermediates.noindex/Nuke.build/Debug-xros/Nuke.build/Objects-normal/arm64/Nuke.SwiftConstValuesFileList (in target 'Nuke' from project 'Nuke')
cd /Users/admin/builder/spi-builder-workspace/.dependencies/checkouts/Nuke
write-file /Users/admin/builder/spi-builder-workspace/.derivedData/Build/Intermediates.noindex/Nuke.build/Debug-xros/Nuke.build/Objects-normal/arm64/Nuke.SwiftConstValuesFileList
WriteAuxiliaryFile /Users/admin/builder/spi-builder-workspace/.derivedData/Build/Intermediates.noindex/Nuke.build/Debug-xros/Nuke.build/Objects-normal/arm64/Nuke.LinkFileList (in target 'Nuke' from project 'Nuke')
cd /Users/admin/builder/spi-builder-workspace/.dependencies/checkouts/Nuke
write-file /Users/admin/builder/spi-builder-workspace/.derivedData/Build/Intermediates.noindex/Nuke.build/Debug-xros/Nuke.build/Objects-normal/arm64/Nuke.LinkFileList
WriteAuxiliaryFile /Users/admin/builder/spi-builder-workspace/.derivedData/Build/Intermediates.noindex/Nuke.build/Debug-xros/Nuke.build/Objects-normal/arm64/Nuke-OutputFileMap.json (in target 'Nuke' from project 'Nuke')
cd /Users/admin/builder/spi-builder-workspace/.dependencies/checkouts/Nuke
write-file /Users/admin/builder/spi-builder-workspace/.derivedData/Build/Intermediates.noindex/Nuke.build/Debug-xros/Nuke.build/Objects-normal/arm64/Nuke-OutputFileMap.json
Copy /Users/admin/builder/spi-builder-workspace/.derivedData/Build/Intermediates.noindex/GeneratedModuleMaps-xros/SwiftUISupportBackport.modulemap /Users/admin/builder/spi-builder-workspace/.derivedData/Build/Intermediates.noindex/SwiftUISupport.build/Debug-xros/SwiftUISupportBackport.build/SwiftUISupportBackport.modulemap (in target 'SwiftUISupportBackport' from project 'SwiftUISupport')
cd /Users/admin/builder/spi-builder-workspace/.dependencies/checkouts/swiftui-support
builtin-copy -exclude .DS_Store -exclude CVS -exclude .svn -exclude .git -exclude .hg -resolve-src-symlinks /Users/admin/builder/spi-builder-workspace/.derivedData/Build/Intermediates.noindex/SwiftUISupport.build/Debug-xros/SwiftUISupportBackport.build/SwiftUISupportBackport.modulemap /Users/admin/builder/spi-builder-workspace/.derivedData/Build/Intermediates.noindex/GeneratedModuleMaps-xros
WriteAuxiliaryFile /Users/admin/builder/spi-builder-workspace/.derivedData/Build/Intermediates.noindex/Nuke.build/Debug-xros/Nuke.build/Nuke.modulemap (in target 'Nuke' from project 'Nuke')
cd /Users/admin/builder/spi-builder-workspace/.dependencies/checkouts/Nuke
write-file /Users/admin/builder/spi-builder-workspace/.derivedData/Build/Intermediates.noindex/Nuke.build/Debug-xros/Nuke.build/Nuke.modulemap
WriteAuxiliaryFile /Users/admin/builder/spi-builder-workspace/.derivedData/Build/Intermediates.noindex/Nuke.build/Debug-xros/Nuke.build/Nuke.DependencyStaticMetadataFileList (in target 'Nuke' from project 'Nuke')
cd /Users/admin/builder/spi-builder-workspace/.dependencies/checkouts/Nuke
write-file /Users/admin/builder/spi-builder-workspace/.derivedData/Build/Intermediates.noindex/Nuke.build/Debug-xros/Nuke.build/Nuke.DependencyStaticMetadataFileList
WriteAuxiliaryFile /Users/admin/builder/spi-builder-workspace/.derivedData/Build/Intermediates.noindex/Nuke.build/Debug-xros/Nuke.build/Nuke.DependencyMetadataFileList (in target 'Nuke' from project 'Nuke')
cd /Users/admin/builder/spi-builder-workspace/.dependencies/checkouts/Nuke
write-file /Users/admin/builder/spi-builder-workspace/.derivedData/Build/Intermediates.noindex/Nuke.build/Debug-xros/Nuke.build/Nuke.DependencyMetadataFileList
WriteAuxiliaryFile /Users/admin/builder/spi-builder-workspace/.derivedData/Build/Intermediates.noindex/AsyncMultiplexImage.build/Debug-xros/AsyncMultiplexImage.build/Objects-normal/arm64/AsyncMultiplexImage_const_extract_protocols.json (in target 'AsyncMultiplexImage' from project 'AsyncMultiplexImage')
cd /Users/admin/builder/spi-builder-workspace
write-file /Users/admin/builder/spi-builder-workspace/.derivedData/Build/Intermediates.noindex/AsyncMultiplexImage.build/Debug-xros/AsyncMultiplexImage.build/Objects-normal/arm64/AsyncMultiplexImage_const_extract_protocols.json
WriteAuxiliaryFile /Users/admin/builder/spi-builder-workspace/.derivedData/Build/Intermediates.noindex/AsyncMultiplexImage.build/Debug-xros/AsyncMultiplexImage.build/Objects-normal/arm64/AsyncMultiplexImage.SwiftFileList (in target 'AsyncMultiplexImage' from project 'AsyncMultiplexImage')
cd /Users/admin/builder/spi-builder-workspace
write-file /Users/admin/builder/spi-builder-workspace/.derivedData/Build/Intermediates.noindex/AsyncMultiplexImage.build/Debug-xros/AsyncMultiplexImage.build/Objects-normal/arm64/AsyncMultiplexImage.SwiftFileList
WriteAuxiliaryFile /Users/admin/builder/spi-builder-workspace/.derivedData/Build/Intermediates.noindex/AsyncMultiplexImage.build/Debug-xros/AsyncMultiplexImage.build/Objects-normal/arm64/AsyncMultiplexImage.SwiftConstValuesFileList (in target 'AsyncMultiplexImage' from project 'AsyncMultiplexImage')
cd /Users/admin/builder/spi-builder-workspace
write-file /Users/admin/builder/spi-builder-workspace/.derivedData/Build/Intermediates.noindex/AsyncMultiplexImage.build/Debug-xros/AsyncMultiplexImage.build/Objects-normal/arm64/AsyncMultiplexImage.SwiftConstValuesFileList
WriteAuxiliaryFile /Users/admin/builder/spi-builder-workspace/.derivedData/Build/Intermediates.noindex/AsyncMultiplexImage.build/Debug-xros/AsyncMultiplexImage.build/Objects-normal/arm64/AsyncMultiplexImage.LinkFileList (in target 'AsyncMultiplexImage' from project 'AsyncMultiplexImage')
cd /Users/admin/builder/spi-builder-workspace
write-file /Users/admin/builder/spi-builder-workspace/.derivedData/Build/Intermediates.noindex/AsyncMultiplexImage.build/Debug-xros/AsyncMultiplexImage.build/Objects-normal/arm64/AsyncMultiplexImage.LinkFileList
WriteAuxiliaryFile /Users/admin/builder/spi-builder-workspace/.derivedData/Build/Intermediates.noindex/AsyncMultiplexImage.build/Debug-xros/AsyncMultiplexImage.build/Objects-normal/arm64/AsyncMultiplexImage-OutputFileMap.json (in target 'AsyncMultiplexImage' from project 'AsyncMultiplexImage')
cd /Users/admin/builder/spi-builder-workspace
write-file /Users/admin/builder/spi-builder-workspace/.derivedData/Build/Intermediates.noindex/AsyncMultiplexImage.build/Debug-xros/AsyncMultiplexImage.build/Objects-normal/arm64/AsyncMultiplexImage-OutputFileMap.json
WriteAuxiliaryFile /Users/admin/builder/spi-builder-workspace/.derivedData/Build/Intermediates.noindex/AsyncMultiplexImage.build/Debug-xros/AsyncMultiplexImage.build/AsyncMultiplexImage.modulemap (in target 'AsyncMultiplexImage' from project 'AsyncMultiplexImage')
cd /Users/admin/builder/spi-builder-workspace
write-file /Users/admin/builder/spi-builder-workspace/.derivedData/Build/Intermediates.noindex/AsyncMultiplexImage.build/Debug-xros/AsyncMultiplexImage.build/AsyncMultiplexImage.modulemap
Copy /Users/admin/builder/spi-builder-workspace/.derivedData/Build/Intermediates.noindex/GeneratedModuleMaps-xros/Nuke.modulemap /Users/admin/builder/spi-builder-workspace/.derivedData/Build/Intermediates.noindex/Nuke.build/Debug-xros/Nuke.build/Nuke.modulemap (in target 'Nuke' from project 'Nuke')
cd /Users/admin/builder/spi-builder-workspace/.dependencies/checkouts/Nuke
builtin-copy -exclude .DS_Store -exclude CVS -exclude .svn -exclude .git -exclude .hg -resolve-src-symlinks /Users/admin/builder/spi-builder-workspace/.derivedData/Build/Intermediates.noindex/Nuke.build/Debug-xros/Nuke.build/Nuke.modulemap /Users/admin/builder/spi-builder-workspace/.derivedData/Build/Intermediates.noindex/GeneratedModuleMaps-xros
WriteAuxiliaryFile /Users/admin/builder/spi-builder-workspace/.derivedData/Build/Intermediates.noindex/AsyncMultiplexImage.build/Debug-xros/AsyncMultiplexImage.build/AsyncMultiplexImage.DependencyStaticMetadataFileList (in target 'AsyncMultiplexImage' from project 'AsyncMultiplexImage')
cd /Users/admin/builder/spi-builder-workspace
write-file /Users/admin/builder/spi-builder-workspace/.derivedData/Build/Intermediates.noindex/AsyncMultiplexImage.build/Debug-xros/AsyncMultiplexImage.build/AsyncMultiplexImage.DependencyStaticMetadataFileList
WriteAuxiliaryFile /Users/admin/builder/spi-builder-workspace/.derivedData/Build/Intermediates.noindex/AsyncMultiplexImage.build/Debug-xros/AsyncMultiplexImage.build/AsyncMultiplexImage.DependencyMetadataFileList (in target 'AsyncMultiplexImage' from project 'AsyncMultiplexImage')
cd /Users/admin/builder/spi-builder-workspace
write-file /Users/admin/builder/spi-builder-workspace/.derivedData/Build/Intermediates.noindex/AsyncMultiplexImage.build/Debug-xros/AsyncMultiplexImage.build/AsyncMultiplexImage.DependencyMetadataFileList
WriteAuxiliaryFile /Users/admin/builder/spi-builder-workspace/.derivedData/Build/Intermediates.noindex/AsyncMultiplexImage.build/Debug-xros/AsyncMultiplexImage-Nuke.build/Objects-normal/arm64/AsyncMultiplexImage-Nuke_const_extract_protocols.json (in target 'AsyncMultiplexImage-Nuke' from project 'AsyncMultiplexImage')
cd /Users/admin/builder/spi-builder-workspace
write-file /Users/admin/builder/spi-builder-workspace/.derivedData/Build/Intermediates.noindex/AsyncMultiplexImage.build/Debug-xros/AsyncMultiplexImage-Nuke.build/Objects-normal/arm64/AsyncMultiplexImage-Nuke_const_extract_protocols.json
WriteAuxiliaryFile /Users/admin/builder/spi-builder-workspace/.derivedData/Build/Intermediates.noindex/AsyncMultiplexImage.build/Debug-xros/AsyncMultiplexImage-Nuke.build/Objects-normal/arm64/AsyncMultiplexImage-Nuke.SwiftFileList (in target 'AsyncMultiplexImage-Nuke' from project 'AsyncMultiplexImage')
cd /Users/admin/builder/spi-builder-workspace
write-file /Users/admin/builder/spi-builder-workspace/.derivedData/Build/Intermediates.noindex/AsyncMultiplexImage.build/Debug-xros/AsyncMultiplexImage-Nuke.build/Objects-normal/arm64/AsyncMultiplexImage-Nuke.SwiftFileList
WriteAuxiliaryFile /Users/admin/builder/spi-builder-workspace/.derivedData/Build/Intermediates.noindex/AsyncMultiplexImage.build/Debug-xros/AsyncMultiplexImage-Nuke.build/Objects-normal/arm64/AsyncMultiplexImage-Nuke.SwiftConstValuesFileList (in target 'AsyncMultiplexImage-Nuke' from project 'AsyncMultiplexImage')
cd /Users/admin/builder/spi-builder-workspace
write-file /Users/admin/builder/spi-builder-workspace/.derivedData/Build/Intermediates.noindex/AsyncMultiplexImage.build/Debug-xros/AsyncMultiplexImage-Nuke.build/Objects-normal/arm64/AsyncMultiplexImage-Nuke.SwiftConstValuesFileList
WriteAuxiliaryFile /Users/admin/builder/spi-builder-workspace/.derivedData/Build/Intermediates.noindex/AsyncMultiplexImage.build/Debug-xros/AsyncMultiplexImage-Nuke.build/Objects-normal/arm64/AsyncMultiplexImage-Nuke.LinkFileList (in target 'AsyncMultiplexImage-Nuke' from project 'AsyncMultiplexImage')
cd /Users/admin/builder/spi-builder-workspace
write-file /Users/admin/builder/spi-builder-workspace/.derivedData/Build/Intermediates.noindex/AsyncMultiplexImage.build/Debug-xros/AsyncMultiplexImage-Nuke.build/Objects-normal/arm64/AsyncMultiplexImage-Nuke.LinkFileList
WriteAuxiliaryFile /Users/admin/builder/spi-builder-workspace/.derivedData/Build/Intermediates.noindex/AsyncMultiplexImage.build/Debug-xros/AsyncMultiplexImage-Nuke.build/Objects-normal/arm64/AsyncMultiplexImage-Nuke-OutputFileMap.json (in target 'AsyncMultiplexImage-Nuke' from project 'AsyncMultiplexImage')
cd /Users/admin/builder/spi-builder-workspace
write-file /Users/admin/builder/spi-builder-workspace/.derivedData/Build/Intermediates.noindex/AsyncMultiplexImage.build/Debug-xros/AsyncMultiplexImage-Nuke.build/Objects-normal/arm64/AsyncMultiplexImage-Nuke-OutputFileMap.json
WriteAuxiliaryFile /Users/admin/builder/spi-builder-workspace/.derivedData/Build/Intermediates.noindex/AsyncMultiplexImage.build/Debug-xros/AsyncMultiplexImage-Nuke.build/AsyncMultiplexImage-Nuke.modulemap (in target 'AsyncMultiplexImage-Nuke' from project 'AsyncMultiplexImage')
cd /Users/admin/builder/spi-builder-workspace
write-file /Users/admin/builder/spi-builder-workspace/.derivedData/Build/Intermediates.noindex/AsyncMultiplexImage.build/Debug-xros/AsyncMultiplexImage-Nuke.build/AsyncMultiplexImage-Nuke.modulemap
Copy /Users/admin/builder/spi-builder-workspace/.derivedData/Build/Intermediates.noindex/GeneratedModuleMaps-xros/AsyncMultiplexImage.modulemap /Users/admin/builder/spi-builder-workspace/.derivedData/Build/Intermediates.noindex/AsyncMultiplexImage.build/Debug-xros/AsyncMultiplexImage.build/AsyncMultiplexImage.modulemap (in target 'AsyncMultiplexImage' from project 'AsyncMultiplexImage')
cd /Users/admin/builder/spi-builder-workspace
builtin-copy -exclude .DS_Store -exclude CVS -exclude .svn -exclude .git -exclude .hg -resolve-src-symlinks /Users/admin/builder/spi-builder-workspace/.derivedData/Build/Intermediates.noindex/AsyncMultiplexImage.build/Debug-xros/AsyncMultiplexImage.build/AsyncMultiplexImage.modulemap /Users/admin/builder/spi-builder-workspace/.derivedData/Build/Intermediates.noindex/GeneratedModuleMaps-xros
WriteAuxiliaryFile /Users/admin/builder/spi-builder-workspace/.derivedData/Build/Intermediates.noindex/AsyncMultiplexImage.build/Debug-xros/AsyncMultiplexImage-Nuke.build/AsyncMultiplexImage-Nuke.DependencyStaticMetadataFileList (in target 'AsyncMultiplexImage-Nuke' from project 'AsyncMultiplexImage')
cd /Users/admin/builder/spi-builder-workspace
write-file /Users/admin/builder/spi-builder-workspace/.derivedData/Build/Intermediates.noindex/AsyncMultiplexImage.build/Debug-xros/AsyncMultiplexImage-Nuke.build/AsyncMultiplexImage-Nuke.DependencyStaticMetadataFileList
WriteAuxiliaryFile /Users/admin/builder/spi-builder-workspace/.derivedData/Build/Intermediates.noindex/AsyncMultiplexImage.build/Debug-xros/AsyncMultiplexImage-Nuke.build/AsyncMultiplexImage-Nuke.DependencyMetadataFileList (in target 'AsyncMultiplexImage-Nuke' from project 'AsyncMultiplexImage')
cd /Users/admin/builder/spi-builder-workspace
write-file /Users/admin/builder/spi-builder-workspace/.derivedData/Build/Intermediates.noindex/AsyncMultiplexImage.build/Debug-xros/AsyncMultiplexImage-Nuke.build/AsyncMultiplexImage-Nuke.DependencyMetadataFileList
Copy /Users/admin/builder/spi-builder-workspace/.derivedData/Build/Intermediates.noindex/GeneratedModuleMaps-xros/AsyncMultiplexImage-Nuke.modulemap /Users/admin/builder/spi-builder-workspace/.derivedData/Build/Intermediates.noindex/AsyncMultiplexImage.build/Debug-xros/AsyncMultiplexImage-Nuke.build/AsyncMultiplexImage-Nuke.modulemap (in target 'AsyncMultiplexImage-Nuke' from project 'AsyncMultiplexImage')
cd /Users/admin/builder/spi-builder-workspace
builtin-copy -exclude .DS_Store -exclude CVS -exclude .svn -exclude .git -exclude .hg -resolve-src-symlinks /Users/admin/builder/spi-builder-workspace/.derivedData/Build/Intermediates.noindex/AsyncMultiplexImage.build/Debug-xros/AsyncMultiplexImage-Nuke.build/AsyncMultiplexImage-Nuke.modulemap /Users/admin/builder/spi-builder-workspace/.derivedData/Build/Intermediates.noindex/GeneratedModuleMaps-xros
SwiftDriver SwiftUISupportBackport normal arm64 com.apple.xcode.tools.swift.compiler (in target 'SwiftUISupportBackport' from project 'SwiftUISupport')
cd /Users/admin/builder/spi-builder-workspace/.swiftpm/xcode
builtin-SwiftDriver -- /Applications/Xcode-16.3.0.app/Contents/Developer/Toolchains/XcodeDefault.xctoolchain/usr/bin/swiftc -module-name SwiftUISupportBackport -Onone -enforce-exclusivity\=checked @/Users/admin/builder/spi-builder-workspace/.derivedData/Build/Intermediates.noindex/SwiftUISupport.build/Debug-xros/SwiftUISupportBackport.build/Objects-normal/arm64/SwiftUISupportBackport.SwiftFileList -DSWIFT_PACKAGE -DDEBUG -stats-output-dir .stats -plugin-path /Applications/Xcode-16.3.0.app/Contents/Developer/Toolchains/XcodeDefault.xctoolchain/usr/lib/swift/host/plugins/testing -enable-experimental-feature DebugDescriptionMacro -sdk /Applications/Xcode-16.3.0.app/Contents/Developer/Platforms/XROS.platform/Developer/SDKs/XROS2.4.sdk -target arm64-apple-xros1.0 -g -module-cache-path /Users/admin/builder/spi-builder-workspace/.derivedData/ModuleCache.noindex -Xfrontend -serialize-debugging-options -profile-coverage-mapping -profile-generate -enable-testing -suppress-warnings -index-store-path /Users/admin/builder/spi-builder-workspace/.derivedData/Index.noindex/DataStore -swift-version 6 -I /Users/admin/builder/spi-builder-workspace/.derivedData/Build/Products/Debug-xros -I /Applications/Xcode-16.3.0.app/Contents/Developer/Platforms/XROS.platform/Developer/usr/lib -F /Users/admin/builder/spi-builder-workspace/.derivedData/Build/Products/Debug-xros -F /Applications/Xcode-16.3.0.app/Contents/Developer/Platforms/XROS.platform/Developer/Library/Frameworks -F /Applications/Xcode-16.3.0.app/Contents/Developer/Platforms/XROS.platform/Developer/SDKs/XROS2.4.sdk/Developer/Library/Frameworks -c -j10 -enable-batch-mode -incremental -Xcc -ivfsstatcache -Xcc /Users/admin/builder/spi-builder-workspace/.derivedData/SDKStatCaches.noindex/xros2.4-22O233-407b76dbb837030756cbe1ab3f0b01b6.sdkstatcache -output-file-map /Users/admin/builder/spi-builder-workspace/.derivedData/Build/Intermediates.noindex/SwiftUISupport.build/Debug-xros/SwiftUISupportBackport.build/Objects-normal/arm64/SwiftUISupportBackport-OutputFileMap.json -use-frontend-parseable-output -save-temps -no-color-diagnostics -serialize-diagnostics -emit-dependencies -emit-module -emit-module-path /Users/admin/builder/spi-builder-workspace/.derivedData/Build/Intermediates.noindex/SwiftUISupport.build/Debug-xros/SwiftUISupportBackport.build/Objects-normal/arm64/SwiftUISupportBackport.swiftmodule -user-module-version 0.13.0 -validate-clang-modules-once -clang-build-session-file /Users/admin/builder/spi-builder-workspace/.derivedData/ModuleCache.noindex/Session.modulevalidation -package-name swiftui_support -Xcc -I/Users/admin/builder/spi-builder-workspace/.derivedData/Build/Intermediates.noindex/SwiftUISupport.build/Debug-xros/SwiftUISupportBackport.build/swift-overrides.hmap -emit-const-values -Xfrontend -const-gather-protocols-file -Xfrontend /Users/admin/builder/spi-builder-workspace/.derivedData/Build/Intermediates.noindex/SwiftUISupport.build/Debug-xros/SwiftUISupportBackport.build/Objects-normal/arm64/SwiftUISupportBackport_const_extract_protocols.json -Xcc -I/Users/admin/builder/spi-builder-workspace/.derivedData/Build/Products/Debug-xros/include -Xcc -I/Users/admin/builder/spi-builder-workspace/.derivedData/Build/Intermediates.noindex/SwiftUISupport.build/Debug-xros/SwiftUISupportBackport.build/DerivedSources-normal/arm64 -Xcc -I/Users/admin/builder/spi-builder-workspace/.derivedData/Build/Intermediates.noindex/SwiftUISupport.build/Debug-xros/SwiftUISupportBackport.build/DerivedSources/arm64 -Xcc -I/Users/admin/builder/spi-builder-workspace/.derivedData/Build/Intermediates.noindex/SwiftUISupport.build/Debug-xros/SwiftUISupportBackport.build/DerivedSources -Xcc -DSWIFT_PACKAGE -Xcc -DDEBUG\=1 -emit-objc-header -emit-objc-header-path /Users/admin/builder/spi-builder-workspace/.derivedData/Build/Intermediates.noindex/SwiftUISupport.build/Debug-xros/SwiftUISupportBackport.build/Objects-normal/arm64/SwiftUISupportBackport-Swift.h -working-directory /Users/admin/builder/spi-builder-workspace/.swiftpm/xcode -experimental-emit-module-separately -disable-cmo
SwiftDriver Nuke normal arm64 com.apple.xcode.tools.swift.compiler (in target 'Nuke' from project 'Nuke')
cd /Users/admin/builder/spi-builder-workspace/.swiftpm/xcode
builtin-SwiftDriver -- /Applications/Xcode-16.3.0.app/Contents/Developer/Toolchains/XcodeDefault.xctoolchain/usr/bin/swiftc -module-name Nuke -Onone -enforce-exclusivity\=checked @/Users/admin/builder/spi-builder-workspace/.derivedData/Build/Intermediates.noindex/Nuke.build/Debug-xros/Nuke.build/Objects-normal/arm64/Nuke.SwiftFileList -DSWIFT_PACKAGE -DDEBUG -stats-output-dir .stats -plugin-path /Applications/Xcode-16.3.0.app/Contents/Developer/Toolchains/XcodeDefault.xctoolchain/usr/lib/swift/host/plugins/testing -enable-experimental-feature DebugDescriptionMacro -sdk /Applications/Xcode-16.3.0.app/Contents/Developer/Platforms/XROS.platform/Developer/SDKs/XROS2.4.sdk -target arm64-apple-xros1.0 -g -module-cache-path /Users/admin/builder/spi-builder-workspace/.derivedData/ModuleCache.noindex -Xfrontend -serialize-debugging-options -profile-coverage-mapping -profile-generate -enable-testing -suppress-warnings -index-store-path /Users/admin/builder/spi-builder-workspace/.derivedData/Index.noindex/DataStore -swift-version 5 -I /Users/admin/builder/spi-builder-workspace/.derivedData/Build/Products/Debug-xros -I /Applications/Xcode-16.3.0.app/Contents/Developer/Platforms/XROS.platform/Developer/usr/lib -F /Users/admin/builder/spi-builder-workspace/.derivedData/Build/Products/Debug-xros -F /Applications/Xcode-16.3.0.app/Contents/Developer/Platforms/XROS.platform/Developer/Library/Frameworks -F /Applications/Xcode-16.3.0.app/Contents/Developer/Platforms/XROS.platform/Developer/SDKs/XROS2.4.sdk/Developer/Library/Frameworks -c -j10 -enable-batch-mode -incremental -Xcc -ivfsstatcache -Xcc /Users/admin/builder/spi-builder-workspace/.derivedData/SDKStatCaches.noindex/xros2.4-22O233-407b76dbb837030756cbe1ab3f0b01b6.sdkstatcache -output-file-map /Users/admin/builder/spi-builder-workspace/.derivedData/Build/Intermediates.noindex/Nuke.build/Debug-xros/Nuke.build/Objects-normal/arm64/Nuke-OutputFileMap.json -use-frontend-parseable-output -save-temps -no-color-diagnostics -serialize-diagnostics -emit-dependencies -emit-module -emit-module-path /Users/admin/builder/spi-builder-workspace/.derivedData/Build/Intermediates.noindex/Nuke.build/Debug-xros/Nuke.build/Objects-normal/arm64/Nuke.swiftmodule -validate-clang-modules-once -clang-build-session-file /Users/admin/builder/spi-builder-workspace/.derivedData/ModuleCache.noindex/Session.modulevalidation -package-name nuke -Xcc -I/Users/admin/builder/spi-builder-workspace/.derivedData/Build/Intermediates.noindex/Nuke.build/Debug-xros/Nuke.build/swift-overrides.hmap -emit-const-values -Xfrontend -const-gather-protocols-file -Xfrontend /Users/admin/builder/spi-builder-workspace/.derivedData/Build/Intermediates.noindex/Nuke.build/Debug-xros/Nuke.build/Objects-normal/arm64/Nuke_const_extract_protocols.json -Xcc -I/Users/admin/builder/spi-builder-workspace/.derivedData/Build/Products/Debug-xros/include -Xcc -I/Users/admin/builder/spi-builder-workspace/.derivedData/Build/Intermediates.noindex/Nuke.build/Debug-xros/Nuke.build/DerivedSources-normal/arm64 -Xcc -I/Users/admin/builder/spi-builder-workspace/.derivedData/Build/Intermediates.noindex/Nuke.build/Debug-xros/Nuke.build/DerivedSources/arm64 -Xcc -I/Users/admin/builder/spi-builder-workspace/.derivedData/Build/Intermediates.noindex/Nuke.build/Debug-xros/Nuke.build/DerivedSources -Xcc -DSWIFT_PACKAGE -Xcc -DDEBUG\=1 -emit-objc-header -emit-objc-header-path /Users/admin/builder/spi-builder-workspace/.derivedData/Build/Intermediates.noindex/Nuke.build/Debug-xros/Nuke.build/Objects-normal/arm64/Nuke-Swift.h -working-directory /Users/admin/builder/spi-builder-workspace/.swiftpm/xcode -experimental-emit-module-separately -disable-cmo
SwiftCompile normal arm64 Compiling\ OnChangeWithPrevious.swift /Users/admin/builder/spi-builder-workspace/.dependencies/checkouts/swiftui-support/Sources/SwiftUISupportBackport/OnChangeWithPrevious.swift (in target 'SwiftUISupportBackport' from project 'SwiftUISupport')
SwiftCompile normal arm64 /Users/admin/builder/spi-builder-workspace/.dependencies/checkouts/swiftui-support/Sources/SwiftUISupportBackport/OnChangeWithPrevious.swift (in target 'SwiftUISupportBackport' from project 'SwiftUISupport')
cd /Users/admin/builder/spi-builder-workspace/.swiftpm/xcode
SwiftCompile normal arm64 Compiling\ ImageView.swift /Users/admin/builder/spi-builder-workspace/.dependencies/checkouts/swiftui-support/Sources/SwiftUISupportBackport/ImageView.swift (in target 'SwiftUISupportBackport' from project 'SwiftUISupport')
SwiftCompile normal arm64 /Users/admin/builder/spi-builder-workspace/.dependencies/checkouts/swiftui-support/Sources/SwiftUISupportBackport/ImageView.swift (in target 'SwiftUISupportBackport' from project 'SwiftUISupport')
cd /Users/admin/builder/spi-builder-workspace/.swiftpm/xcode
SwiftEmitModule normal arm64 Emitting\ module\ for\ SwiftUISupportBackport (in target 'SwiftUISupportBackport' from project 'SwiftUISupport')
EmitSwiftModule normal arm64 (in target 'SwiftUISupportBackport' from project 'SwiftUISupport')
cd /Users/admin/builder/spi-builder-workspace/.swiftpm/xcode
SwiftCompile normal arm64 Compiling\ VisualEffect.swift /Users/admin/builder/spi-builder-workspace/.dependencies/checkouts/swiftui-support/Sources/SwiftUISupportBackport/VisualEffect.swift (in target 'SwiftUISupportBackport' from project 'SwiftUISupport')
SwiftCompile normal arm64 /Users/admin/builder/spi-builder-workspace/.dependencies/checkouts/swiftui-support/Sources/SwiftUISupportBackport/VisualEffect.swift (in target 'SwiftUISupportBackport' from project 'SwiftUISupport')
cd /Users/admin/builder/spi-builder-workspace/.swiftpm/xcode
SwiftCompile normal arm64 Compiling\ ImageEncoders.swift,\ ImageEncoding.swift,\ ImageContainer.swift,\ ImageRequest.swift,\ ImageResponse.swift,\ ImageTask.swift /Users/admin/builder/spi-builder-workspace/.dependencies/checkouts/Nuke/Sources/Nuke/Encoding/ImageEncoders.swift /Users/admin/builder/spi-builder-workspace/.dependencies/checkouts/Nuke/Sources/Nuke/Encoding/ImageEncoding.swift /Users/admin/builder/spi-builder-workspace/.dependencies/checkouts/Nuke/Sources/Nuke/ImageContainer.swift /Users/admin/builder/spi-builder-workspace/.dependencies/checkouts/Nuke/Sources/Nuke/ImageRequest.swift /Users/admin/builder/spi-builder-workspace/.dependencies/checkouts/Nuke/Sources/Nuke/ImageResponse.swift /Users/admin/builder/spi-builder-workspace/.dependencies/checkouts/Nuke/Sources/Nuke/ImageTask.swift (in target 'Nuke' from project 'Nuke')
SwiftCompile normal arm64 /Users/admin/builder/spi-builder-workspace/.dependencies/checkouts/Nuke/Sources/Nuke/Encoding/ImageEncoders.swift (in target 'Nuke' from project 'Nuke')
cd /Users/admin/builder/spi-builder-workspace/.swiftpm/xcode
SwiftCompile normal arm64 /Users/admin/builder/spi-builder-workspace/.dependencies/checkouts/Nuke/Sources/Nuke/Encoding/ImageEncoding.swift (in target 'Nuke' from project 'Nuke')
cd /Users/admin/builder/spi-builder-workspace/.swiftpm/xcode
SwiftCompile normal arm64 /Users/admin/builder/spi-builder-workspace/.dependencies/checkouts/Nuke/Sources/Nuke/ImageContainer.swift (in target 'Nuke' from project 'Nuke')
cd /Users/admin/builder/spi-builder-workspace/.swiftpm/xcode
SwiftCompile normal arm64 /Users/admin/builder/spi-builder-workspace/.dependencies/checkouts/Nuke/Sources/Nuke/ImageRequest.swift (in target 'Nuke' from project 'Nuke')
cd /Users/admin/builder/spi-builder-workspace/.swiftpm/xcode
SwiftCompile normal arm64 /Users/admin/builder/spi-builder-workspace/.dependencies/checkouts/Nuke/Sources/Nuke/ImageResponse.swift (in target 'Nuke' from project 'Nuke')
cd /Users/admin/builder/spi-builder-workspace/.swiftpm/xcode
SwiftCompile normal arm64 /Users/admin/builder/spi-builder-workspace/.dependencies/checkouts/Nuke/Sources/Nuke/ImageTask.swift (in target 'Nuke' from project 'Nuke')
cd /Users/admin/builder/spi-builder-workspace/.swiftpm/xcode
SwiftCompile normal arm64 Compiling\ LinkedList.swift,\ Log.swift,\ Operation.swift,\ RateLimiter.swift,\ ResumableData.swift,\ DataLoader.swift /Users/admin/builder/spi-builder-workspace/.dependencies/checkouts/Nuke/Sources/Nuke/Internal/LinkedList.swift /Users/admin/builder/spi-builder-workspace/.dependencies/checkouts/Nuke/Sources/Nuke/Internal/Log.swift /Users/admin/builder/spi-builder-workspace/.dependencies/checkouts/Nuke/Sources/Nuke/Internal/Operation.swift /Users/admin/builder/spi-builder-workspace/.dependencies/checkouts/Nuke/Sources/Nuke/Internal/RateLimiter.swift /Users/admin/builder/spi-builder-workspace/.dependencies/checkouts/Nuke/Sources/Nuke/Internal/ResumableData.swift /Users/admin/builder/spi-builder-workspace/.dependencies/checkouts/Nuke/Sources/Nuke/Loading/DataLoader.swift (in target 'Nuke' from project 'Nuke')
SwiftCompile normal arm64 /Users/admin/builder/spi-builder-workspace/.dependencies/checkouts/Nuke/Sources/Nuke/Internal/LinkedList.swift (in target 'Nuke' from project 'Nuke')
cd /Users/admin/builder/spi-builder-workspace/.swiftpm/xcode
SwiftCompile normal arm64 /Users/admin/builder/spi-builder-workspace/.dependencies/checkouts/Nuke/Sources/Nuke/Internal/Log.swift (in target 'Nuke' from project 'Nuke')
cd /Users/admin/builder/spi-builder-workspace/.swiftpm/xcode
SwiftCompile normal arm64 /Users/admin/builder/spi-builder-workspace/.dependencies/checkouts/Nuke/Sources/Nuke/Internal/Operation.swift (in target 'Nuke' from project 'Nuke')
cd /Users/admin/builder/spi-builder-workspace/.swiftpm/xcode
SwiftCompile normal arm64 /Users/admin/builder/spi-builder-workspace/.dependencies/checkouts/Nuke/Sources/Nuke/Internal/RateLimiter.swift (in target 'Nuke' from project 'Nuke')
cd /Users/admin/builder/spi-builder-workspace/.swiftpm/xcode
SwiftCompile normal arm64 /Users/admin/builder/spi-builder-workspace/.dependencies/checkouts/Nuke/Sources/Nuke/Internal/ResumableData.swift (in target 'Nuke' from project 'Nuke')
cd /Users/admin/builder/spi-builder-workspace/.swiftpm/xcode
SwiftCompile normal arm64 /Users/admin/builder/spi-builder-workspace/.dependencies/checkouts/Nuke/Sources/Nuke/Loading/DataLoader.swift (in target 'Nuke' from project 'Nuke')
cd /Users/admin/builder/spi-builder-workspace/.swiftpm/xcode
SwiftCompile normal arm64 Compiling\ Cache.swift,\ DataCache.swift,\ DataCaching.swift,\ ImageCache.swift,\ ImageCaching.swift,\ AssetType.swift /Users/admin/builder/spi-builder-workspace/.dependencies/checkouts/Nuke/Sources/Nuke/Caching/Cache.swift /Users/admin/builder/spi-builder-workspace/.dependencies/checkouts/Nuke/Sources/Nuke/Caching/DataCache.swift /Users/admin/builder/spi-builder-workspace/.dependencies/checkouts/Nuke/Sources/Nuke/Caching/DataCaching.swift /Users/admin/builder/spi-builder-workspace/.dependencies/checkouts/Nuke/Sources/Nuke/Caching/ImageCache.swift /Users/admin/builder/spi-builder-workspace/.dependencies/checkouts/Nuke/Sources/Nuke/Caching/ImageCaching.swift /Users/admin/builder/spi-builder-workspace/.dependencies/checkouts/Nuke/Sources/Nuke/Decoding/AssetType.swift (in target 'Nuke' from project 'Nuke')
SwiftCompile normal arm64 /Users/admin/builder/spi-builder-workspace/.dependencies/checkouts/Nuke/Sources/Nuke/Caching/Cache.swift (in target 'Nuke' from project 'Nuke')
cd /Users/admin/builder/spi-builder-workspace/.swiftpm/xcode
SwiftCompile normal arm64 /Users/admin/builder/spi-builder-workspace/.dependencies/checkouts/Nuke/Sources/Nuke/Caching/DataCache.swift (in target 'Nuke' from project 'Nuke')
cd /Users/admin/builder/spi-builder-workspace/.swiftpm/xcode
SwiftCompile normal arm64 /Users/admin/builder/spi-builder-workspace/.dependencies/checkouts/Nuke/Sources/Nuke/Caching/DataCaching.swift (in target 'Nuke' from project 'Nuke')
cd /Users/admin/builder/spi-builder-workspace/.swiftpm/xcode
SwiftCompile normal arm64 /Users/admin/builder/spi-builder-workspace/.dependencies/checkouts/Nuke/Sources/Nuke/Caching/ImageCache.swift (in target 'Nuke' from project 'Nuke')
cd /Users/admin/builder/spi-builder-workspace/.swiftpm/xcode
SwiftCompile normal arm64 /Users/admin/builder/spi-builder-workspace/.dependencies/checkouts/Nuke/Sources/Nuke/Caching/ImageCaching.swift (in target 'Nuke' from project 'Nuke')
cd /Users/admin/builder/spi-builder-workspace/.swiftpm/xcode
SwiftCompile normal arm64 /Users/admin/builder/spi-builder-workspace/.dependencies/checkouts/Nuke/Sources/Nuke/Decoding/AssetType.swift (in target 'Nuke' from project 'Nuke')
cd /Users/admin/builder/spi-builder-workspace/.swiftpm/xcode
SwiftCompile normal arm64 Compiling\ TaskFetchOriginalData.swift,\ TaskFetchOriginalImage.swift,\ TaskFetchWithPublisher.swift,\ TaskLoadData.swift,\ TaskLoadImage.swift /Users/admin/builder/spi-builder-workspace/.dependencies/checkouts/Nuke/Sources/Nuke/Tasks/TaskFetchOriginalData.swift /Users/admin/builder/spi-builder-workspace/.dependencies/checkouts/Nuke/Sources/Nuke/Tasks/TaskFetchOriginalImage.swift /Users/admin/builder/spi-builder-workspace/.dependencies/checkouts/Nuke/Sources/Nuke/Tasks/TaskFetchWithPublisher.swift /Users/admin/builder/spi-builder-workspace/.dependencies/checkouts/Nuke/Sources/Nuke/Tasks/TaskLoadData.swift /Users/admin/builder/spi-builder-workspace/.dependencies/checkouts/Nuke/Sources/Nuke/Tasks/TaskLoadImage.swift (in target 'Nuke' from project 'Nuke')
SwiftCompile normal arm64 /Users/admin/builder/spi-builder-workspace/.dependencies/checkouts/Nuke/Sources/Nuke/Tasks/TaskFetchOriginalData.swift (in target 'Nuke' from project 'Nuke')
cd /Users/admin/builder/spi-builder-workspace/.swiftpm/xcode
SwiftCompile normal arm64 /Users/admin/builder/spi-builder-workspace/.dependencies/checkouts/Nuke/Sources/Nuke/Tasks/TaskFetchOriginalImage.swift (in target 'Nuke' from project 'Nuke')
cd /Users/admin/builder/spi-builder-workspace/.swiftpm/xcode
SwiftCompile normal arm64 /Users/admin/builder/spi-builder-workspace/.dependencies/checkouts/Nuke/Sources/Nuke/Tasks/TaskFetchWithPublisher.swift (in target 'Nuke' from project 'Nuke')
cd /Users/admin/builder/spi-builder-workspace/.swiftpm/xcode
SwiftCompile normal arm64 /Users/admin/builder/spi-builder-workspace/.dependencies/checkouts/Nuke/Sources/Nuke/Tasks/TaskLoadData.swift (in target 'Nuke' from project 'Nuke')
cd /Users/admin/builder/spi-builder-workspace/.swiftpm/xcode
SwiftCompile normal arm64 /Users/admin/builder/spi-builder-workspace/.dependencies/checkouts/Nuke/Sources/Nuke/Tasks/TaskLoadImage.swift (in target 'Nuke' from project 'Nuke')
cd /Users/admin/builder/spi-builder-workspace/.swiftpm/xcode
SwiftCompile normal arm64 Compiling\ ImageProcessors+Anonymous.swift,\ ImageProcessors+Circle.swift,\ ImageProcessors+Composition.swift,\ ImageProcessors+CoreImage.swift,\ ImageProcessors+GaussianBlur.swift /Users/admin/builder/spi-builder-workspace/.dependencies/checkouts/Nuke/Sources/Nuke/Processing/ImageProcessors+Anonymous.swift /Users/admin/builder/spi-builder-workspace/.dependencies/checkouts/Nuke/Sources/Nuke/Processing/ImageProcessors+Circle.swift /Users/admin/builder/spi-builder-workspace/.dependencies/checkouts/Nuke/Sources/Nuke/Processing/ImageProcessors+Composition.swift /Users/admin/builder/spi-builder-workspace/.dependencies/checkouts/Nuke/Sources/Nuke/Processing/ImageProcessors+CoreImage.swift /Users/admin/builder/spi-builder-workspace/.dependencies/checkouts/Nuke/Sources/Nuke/Processing/ImageProcessors+GaussianBlur.swift (in target 'Nuke' from project 'Nuke')
SwiftCompile normal arm64 /Users/admin/builder/spi-builder-workspace/.dependencies/checkouts/Nuke/Sources/Nuke/Processing/ImageProcessors+Anonymous.swift (in target 'Nuke' from project 'Nuke')
cd /Users/admin/builder/spi-builder-workspace/.swiftpm/xcode
SwiftCompile normal arm64 /Users/admin/builder/spi-builder-workspace/.dependencies/checkouts/Nuke/Sources/Nuke/Processing/ImageProcessors+Circle.swift (in target 'Nuke' from project 'Nuke')
cd /Users/admin/builder/spi-builder-workspace/.swiftpm/xcode
SwiftCompile normal arm64 /Users/admin/builder/spi-builder-workspace/.dependencies/checkouts/Nuke/Sources/Nuke/Processing/ImageProcessors+Composition.swift (in target 'Nuke' from project 'Nuke')
cd /Users/admin/builder/spi-builder-workspace/.swiftpm/xcode
SwiftCompile normal arm64 /Users/admin/builder/spi-builder-workspace/.dependencies/checkouts/Nuke/Sources/Nuke/Processing/ImageProcessors+CoreImage.swift (in target 'Nuke' from project 'Nuke')
cd /Users/admin/builder/spi-builder-workspace/.swiftpm/xcode
SwiftCompile normal arm64 /Users/admin/builder/spi-builder-workspace/.dependencies/checkouts/Nuke/Sources/Nuke/Processing/ImageProcessors+GaussianBlur.swift (in target 'Nuke' from project 'Nuke')
cd /Users/admin/builder/spi-builder-workspace/.swiftpm/xcode
SwiftEmitModule normal arm64 Emitting\ module\ for\ Nuke (in target 'Nuke' from project 'Nuke')
EmitSwiftModule normal arm64 (in target 'Nuke' from project 'Nuke')
cd /Users/admin/builder/spi-builder-workspace/.swiftpm/xcode
SwiftCompile normal arm64 Compiling\ ImageProcessors+Resize.swift,\ ImageProcessors+RoundedCorners.swift,\ ImageProcessors.swift,\ AsyncPipelineTask.swift,\ AsyncTask.swift /Users/admin/builder/spi-builder-workspace/.dependencies/checkouts/Nuke/Sources/Nuke/Processing/ImageProcessors+Resize.swift /Users/admin/builder/spi-builder-workspace/.dependencies/checkouts/Nuke/Sources/Nuke/Processing/ImageProcessors+RoundedCorners.swift /Users/admin/builder/spi-builder-workspace/.dependencies/checkouts/Nuke/Sources/Nuke/Processing/ImageProcessors.swift /Users/admin/builder/spi-builder-workspace/.dependencies/checkouts/Nuke/Sources/Nuke/Tasks/AsyncPipelineTask.swift /Users/admin/builder/spi-builder-workspace/.dependencies/checkouts/Nuke/Sources/Nuke/Tasks/AsyncTask.swift (in target 'Nuke' from project 'Nuke')
SwiftCompile normal arm64 /Users/admin/builder/spi-builder-workspace/.dependencies/checkouts/Nuke/Sources/Nuke/Processing/ImageProcessors+Resize.swift (in target 'Nuke' from project 'Nuke')
cd /Users/admin/builder/spi-builder-workspace/.swiftpm/xcode
SwiftCompile normal arm64 /Users/admin/builder/spi-builder-workspace/.dependencies/checkouts/Nuke/Sources/Nuke/Processing/ImageProcessors+RoundedCorners.swift (in target 'Nuke' from project 'Nuke')
cd /Users/admin/builder/spi-builder-workspace/.swiftpm/xcode
SwiftCompile normal arm64 /Users/admin/builder/spi-builder-workspace/.dependencies/checkouts/Nuke/Sources/Nuke/Processing/ImageProcessors.swift (in target 'Nuke' from project 'Nuke')
cd /Users/admin/builder/spi-builder-workspace/.swiftpm/xcode
SwiftCompile normal arm64 /Users/admin/builder/spi-builder-workspace/.dependencies/checkouts/Nuke/Sources/Nuke/Tasks/AsyncPipelineTask.swift (in target 'Nuke' from project 'Nuke')
cd /Users/admin/builder/spi-builder-workspace/.swiftpm/xcode
SwiftCompile normal arm64 /Users/admin/builder/spi-builder-workspace/.dependencies/checkouts/Nuke/Sources/Nuke/Tasks/AsyncTask.swift (in target 'Nuke' from project 'Nuke')
cd /Users/admin/builder/spi-builder-workspace/.swiftpm/xcode
SwiftDriverJobDiscovery normal arm64 Emitting module for SwiftUISupportBackport (in target 'SwiftUISupportBackport' from project 'SwiftUISupport')
SwiftDriver\ Compilation\ Requirements SwiftUISupportBackport normal arm64 com.apple.xcode.tools.swift.compiler (in target 'SwiftUISupportBackport' from project 'SwiftUISupport')
cd /Users/admin/builder/spi-builder-workspace/.swiftpm/xcode
builtin-Swift-Compilation-Requirements -- /Applications/Xcode-16.3.0.app/Contents/Developer/Toolchains/XcodeDefault.xctoolchain/usr/bin/swiftc -module-name SwiftUISupportBackport -Onone -enforce-exclusivity\=checked @/Users/admin/builder/spi-builder-workspace/.derivedData/Build/Intermediates.noindex/SwiftUISupport.build/Debug-xros/SwiftUISupportBackport.build/Objects-normal/arm64/SwiftUISupportBackport.SwiftFileList -DSWIFT_PACKAGE -DDEBUG -stats-output-dir .stats -plugin-path /Applications/Xcode-16.3.0.app/Contents/Developer/Toolchains/XcodeDefault.xctoolchain/usr/lib/swift/host/plugins/testing -enable-experimental-feature DebugDescriptionMacro -sdk /Applications/Xcode-16.3.0.app/Contents/Developer/Platforms/XROS.platform/Developer/SDKs/XROS2.4.sdk -target arm64-apple-xros1.0 -g -module-cache-path /Users/admin/builder/spi-builder-workspace/.derivedData/ModuleCache.noindex -Xfrontend -serialize-debugging-options -profile-coverage-mapping -profile-generate -enable-testing -suppress-warnings -index-store-path /Users/admin/builder/spi-builder-workspace/.derivedData/Index.noindex/DataStore -swift-version 6 -I /Users/admin/builder/spi-builder-workspace/.derivedData/Build/Products/Debug-xros -I /Applications/Xcode-16.3.0.app/Contents/Developer/Platforms/XROS.platform/Developer/usr/lib -F /Users/admin/builder/spi-builder-workspace/.derivedData/Build/Products/Debug-xros -F /Applications/Xcode-16.3.0.app/Contents/Developer/Platforms/XROS.platform/Developer/Library/Frameworks -F /Applications/Xcode-16.3.0.app/Contents/Developer/Platforms/XROS.platform/Developer/SDKs/XROS2.4.sdk/Developer/Library/Frameworks -c -j10 -enable-batch-mode -incremental -Xcc -ivfsstatcache -Xcc /Users/admin/builder/spi-builder-workspace/.derivedData/SDKStatCaches.noindex/xros2.4-22O233-407b76dbb837030756cbe1ab3f0b01b6.sdkstatcache -output-file-map /Users/admin/builder/spi-builder-workspace/.derivedData/Build/Intermediates.noindex/SwiftUISupport.build/Debug-xros/SwiftUISupportBackport.build/Objects-normal/arm64/SwiftUISupportBackport-OutputFileMap.json -use-frontend-parseable-output -save-temps -no-color-diagnostics -serialize-diagnostics -emit-dependencies -emit-module -emit-module-path /Users/admin/builder/spi-builder-workspace/.derivedData/Build/Intermediates.noindex/SwiftUISupport.build/Debug-xros/SwiftUISupportBackport.build/Objects-normal/arm64/SwiftUISupportBackport.swiftmodule -user-module-version 0.13.0 -validate-clang-modules-once -clang-build-session-file /Users/admin/builder/spi-builder-workspace/.derivedData/ModuleCache.noindex/Session.modulevalidation -package-name swiftui_support -Xcc -I/Users/admin/builder/spi-builder-workspace/.derivedData/Build/Intermediates.noindex/SwiftUISupport.build/Debug-xros/SwiftUISupportBackport.build/swift-overrides.hmap -emit-const-values -Xfrontend -const-gather-protocols-file -Xfrontend /Users/admin/builder/spi-builder-workspace/.derivedData/Build/Intermediates.noindex/SwiftUISupport.build/Debug-xros/SwiftUISupportBackport.build/Objects-normal/arm64/SwiftUISupportBackport_const_extract_protocols.json -Xcc -I/Users/admin/builder/spi-builder-workspace/.derivedData/Build/Products/Debug-xros/include -Xcc -I/Users/admin/builder/spi-builder-workspace/.derivedData/Build/Intermediates.noindex/SwiftUISupport.build/Debug-xros/SwiftUISupportBackport.build/DerivedSources-normal/arm64 -Xcc -I/Users/admin/builder/spi-builder-workspace/.derivedData/Build/Intermediates.noindex/SwiftUISupport.build/Debug-xros/SwiftUISupportBackport.build/DerivedSources/arm64 -Xcc -I/Users/admin/builder/spi-builder-workspace/.derivedData/Build/Intermediates.noindex/SwiftUISupport.build/Debug-xros/SwiftUISupportBackport.build/DerivedSources -Xcc -DSWIFT_PACKAGE -Xcc -DDEBUG\=1 -emit-objc-header -emit-objc-header-path /Users/admin/builder/spi-builder-workspace/.derivedData/Build/Intermediates.noindex/SwiftUISupport.build/Debug-xros/SwiftUISupportBackport.build/Objects-normal/arm64/SwiftUISupportBackport-Swift.h -working-directory /Users/admin/builder/spi-builder-workspace/.swiftpm/xcode -experimental-emit-module-separately -disable-cmo
SwiftDriverJobDiscovery normal arm64 Emitting module for Nuke (in target 'Nuke' from project 'Nuke')
SwiftDriver\ Compilation\ Requirements Nuke normal arm64 com.apple.xcode.tools.swift.compiler (in target 'Nuke' from project 'Nuke')
cd /Users/admin/builder/spi-builder-workspace/.swiftpm/xcode
builtin-Swift-Compilation-Requirements -- /Applications/Xcode-16.3.0.app/Contents/Developer/Toolchains/XcodeDefault.xctoolchain/usr/bin/swiftc -module-name Nuke -Onone -enforce-exclusivity\=checked @/Users/admin/builder/spi-builder-workspace/.derivedData/Build/Intermediates.noindex/Nuke.build/Debug-xros/Nuke.build/Objects-normal/arm64/Nuke.SwiftFileList -DSWIFT_PACKAGE -DDEBUG -stats-output-dir .stats -plugin-path /Applications/Xcode-16.3.0.app/Contents/Developer/Toolchains/XcodeDefault.xctoolchain/usr/lib/swift/host/plugins/testing -enable-experimental-feature DebugDescriptionMacro -sdk /Applications/Xcode-16.3.0.app/Contents/Developer/Platforms/XROS.platform/Developer/SDKs/XROS2.4.sdk -target arm64-apple-xros1.0 -g -module-cache-path /Users/admin/builder/spi-builder-workspace/.derivedData/ModuleCache.noindex -Xfrontend -serialize-debugging-options -profile-coverage-mapping -profile-generate -enable-testing -suppress-warnings -index-store-path /Users/admin/builder/spi-builder-workspace/.derivedData/Index.noindex/DataStore -swift-version 5 -I /Users/admin/builder/spi-builder-workspace/.derivedData/Build/Products/Debug-xros -I /Applications/Xcode-16.3.0.app/Contents/Developer/Platforms/XROS.platform/Developer/usr/lib -F /Users/admin/builder/spi-builder-workspace/.derivedData/Build/Products/Debug-xros -F /Applications/Xcode-16.3.0.app/Contents/Developer/Platforms/XROS.platform/Developer/Library/Frameworks -F /Applications/Xcode-16.3.0.app/Contents/Developer/Platforms/XROS.platform/Developer/SDKs/XROS2.4.sdk/Developer/Library/Frameworks -c -j10 -enable-batch-mode -incremental -Xcc -ivfsstatcache -Xcc /Users/admin/builder/spi-builder-workspace/.derivedData/SDKStatCaches.noindex/xros2.4-22O233-407b76dbb837030756cbe1ab3f0b01b6.sdkstatcache -output-file-map /Users/admin/builder/spi-builder-workspace/.derivedData/Build/Intermediates.noindex/Nuke.build/Debug-xros/Nuke.build/Objects-normal/arm64/Nuke-OutputFileMap.json -use-frontend-parseable-output -save-temps -no-color-diagnostics -serialize-diagnostics -emit-dependencies -emit-module -emit-module-path /Users/admin/builder/spi-builder-workspace/.derivedData/Build/Intermediates.noindex/Nuke.build/Debug-xros/Nuke.build/Objects-normal/arm64/Nuke.swiftmodule -validate-clang-modules-once -clang-build-session-file /Users/admin/builder/spi-builder-workspace/.derivedData/ModuleCache.noindex/Session.modulevalidation -package-name nuke -Xcc -I/Users/admin/builder/spi-builder-workspace/.derivedData/Build/Intermediates.noindex/Nuke.build/Debug-xros/Nuke.build/swift-overrides.hmap -emit-const-values -Xfrontend -const-gather-protocols-file -Xfrontend /Users/admin/builder/spi-builder-workspace/.derivedData/Build/Intermediates.noindex/Nuke.build/Debug-xros/Nuke.build/Objects-normal/arm64/Nuke_const_extract_protocols.json -Xcc -I/Users/admin/builder/spi-builder-workspace/.derivedData/Build/Products/Debug-xros/include -Xcc -I/Users/admin/builder/spi-builder-workspace/.derivedData/Build/Intermediates.noindex/Nuke.build/Debug-xros/Nuke.build/DerivedSources-normal/arm64 -Xcc -I/Users/admin/builder/spi-builder-workspace/.derivedData/Build/Intermediates.noindex/Nuke.build/Debug-xros/Nuke.build/DerivedSources/arm64 -Xcc -I/Users/admin/builder/spi-builder-workspace/.derivedData/Build/Intermediates.noindex/Nuke.build/Debug-xros/Nuke.build/DerivedSources -Xcc -DSWIFT_PACKAGE -Xcc -DDEBUG\=1 -emit-objc-header -emit-objc-header-path /Users/admin/builder/spi-builder-workspace/.derivedData/Build/Intermediates.noindex/Nuke.build/Debug-xros/Nuke.build/Objects-normal/arm64/Nuke-Swift.h -working-directory /Users/admin/builder/spi-builder-workspace/.swiftpm/xcode -experimental-emit-module-separately -disable-cmo
SwiftMergeGeneratedHeaders /Users/admin/builder/spi-builder-workspace/.derivedData/Build/Intermediates.noindex/GeneratedModuleMaps-xros/SwiftUISupportBackport-Swift.h /Users/admin/builder/spi-builder-workspace/.derivedData/Build/Intermediates.noindex/SwiftUISupport.build/Debug-xros/SwiftUISupportBackport.build/Objects-normal/arm64/SwiftUISupportBackport-Swift.h (in target 'SwiftUISupportBackport' from project 'SwiftUISupport')
cd /Users/admin/builder/spi-builder-workspace/.dependencies/checkouts/swiftui-support
builtin-swiftHeaderTool -arch arm64 /Users/admin/builder/spi-builder-workspace/.derivedData/Build/Intermediates.noindex/SwiftUISupport.build/Debug-xros/SwiftUISupportBackport.build/Objects-normal/arm64/SwiftUISupportBackport-Swift.h -o /Users/admin/builder/spi-builder-workspace/.derivedData/Build/Intermediates.noindex/GeneratedModuleMaps-xros/SwiftUISupportBackport-Swift.h
Copy /Users/admin/builder/spi-builder-workspace/.derivedData/Build/Products/Debug-xros/SwiftUISupportBackport.swiftmodule/arm64-apple-xros.swiftmodule /Users/admin/builder/spi-builder-workspace/.derivedData/Build/Intermediates.noindex/SwiftUISupport.build/Debug-xros/SwiftUISupportBackport.build/Objects-normal/arm64/SwiftUISupportBackport.swiftmodule (in target 'SwiftUISupportBackport' from project 'SwiftUISupport')
cd /Users/admin/builder/spi-builder-workspace/.dependencies/checkouts/swiftui-support
builtin-copy -exclude .DS_Store -exclude CVS -exclude .svn -exclude .git -exclude .hg -resolve-src-symlinks -rename /Users/admin/builder/spi-builder-workspace/.derivedData/Build/Intermediates.noindex/SwiftUISupport.build/Debug-xros/SwiftUISupportBackport.build/Objects-normal/arm64/SwiftUISupportBackport.swiftmodule /Users/admin/builder/spi-builder-workspace/.derivedData/Build/Products/Debug-xros/SwiftUISupportBackport.swiftmodule/arm64-apple-xros.swiftmodule
Copy /Users/admin/builder/spi-builder-workspace/.derivedData/Build/Products/Debug-xros/SwiftUISupportBackport.swiftmodule/arm64-apple-xros.swiftdoc /Users/admin/builder/spi-builder-workspace/.derivedData/Build/Intermediates.noindex/SwiftUISupport.build/Debug-xros/SwiftUISupportBackport.build/Objects-normal/arm64/SwiftUISupportBackport.swiftdoc (in target 'SwiftUISupportBackport' from project 'SwiftUISupport')
cd /Users/admin/builder/spi-builder-workspace/.dependencies/checkouts/swiftui-support
builtin-copy -exclude .DS_Store -exclude CVS -exclude .svn -exclude .git -exclude .hg -resolve-src-symlinks -rename /Users/admin/builder/spi-builder-workspace/.derivedData/Build/Intermediates.noindex/SwiftUISupport.build/Debug-xros/SwiftUISupportBackport.build/Objects-normal/arm64/SwiftUISupportBackport.swiftdoc /Users/admin/builder/spi-builder-workspace/.derivedData/Build/Products/Debug-xros/SwiftUISupportBackport.swiftmodule/arm64-apple-xros.swiftdoc
Copy /Users/admin/builder/spi-builder-workspace/.derivedData/Build/Products/Debug-xros/SwiftUISupportBackport.swiftmodule/arm64-apple-xros.abi.json /Users/admin/builder/spi-builder-workspace/.derivedData/Build/Intermediates.noindex/SwiftUISupport.build/Debug-xros/SwiftUISupportBackport.build/Objects-normal/arm64/SwiftUISupportBackport.abi.json (in target 'SwiftUISupportBackport' from project 'SwiftUISupport')
cd /Users/admin/builder/spi-builder-workspace/.dependencies/checkouts/swiftui-support
builtin-copy -exclude .DS_Store -exclude CVS -exclude .svn -exclude .git -exclude .hg -resolve-src-symlinks -rename /Users/admin/builder/spi-builder-workspace/.derivedData/Build/Intermediates.noindex/SwiftUISupport.build/Debug-xros/SwiftUISupportBackport.build/Objects-normal/arm64/SwiftUISupportBackport.abi.json /Users/admin/builder/spi-builder-workspace/.derivedData/Build/Products/Debug-xros/SwiftUISupportBackport.swiftmodule/arm64-apple-xros.abi.json
Copy /Users/admin/builder/spi-builder-workspace/.derivedData/Build/Products/Debug-xros/SwiftUISupportBackport.swiftmodule/Project/arm64-apple-xros.swiftsourceinfo /Users/admin/builder/spi-builder-workspace/.derivedData/Build/Intermediates.noindex/SwiftUISupport.build/Debug-xros/SwiftUISupportBackport.build/Objects-normal/arm64/SwiftUISupportBackport.swiftsourceinfo (in target 'SwiftUISupportBackport' from project 'SwiftUISupport')
cd /Users/admin/builder/spi-builder-workspace/.dependencies/checkouts/swiftui-support
builtin-copy -exclude .DS_Store -exclude CVS -exclude .svn -exclude .git -exclude .hg -resolve-src-symlinks -rename /Users/admin/builder/spi-builder-workspace/.derivedData/Build/Intermediates.noindex/SwiftUISupport.build/Debug-xros/SwiftUISupportBackport.build/Objects-normal/arm64/SwiftUISupportBackport.swiftsourceinfo /Users/admin/builder/spi-builder-workspace/.derivedData/Build/Products/Debug-xros/SwiftUISupportBackport.swiftmodule/Project/arm64-apple-xros.swiftsourceinfo
SwiftMergeGeneratedHeaders /Users/admin/builder/spi-builder-workspace/.derivedData/Build/Intermediates.noindex/GeneratedModuleMaps-xros/Nuke-Swift.h /Users/admin/builder/spi-builder-workspace/.derivedData/Build/Intermediates.noindex/Nuke.build/Debug-xros/Nuke.build/Objects-normal/arm64/Nuke-Swift.h (in target 'Nuke' from project 'Nuke')
cd /Users/admin/builder/spi-builder-workspace/.dependencies/checkouts/Nuke
builtin-swiftHeaderTool -arch arm64 /Users/admin/builder/spi-builder-workspace/.derivedData/Build/Intermediates.noindex/Nuke.build/Debug-xros/Nuke.build/Objects-normal/arm64/Nuke-Swift.h -o /Users/admin/builder/spi-builder-workspace/.derivedData/Build/Intermediates.noindex/GeneratedModuleMaps-xros/Nuke-Swift.h
Copy /Users/admin/builder/spi-builder-workspace/.derivedData/Build/Products/Debug-xros/Nuke.swiftmodule/arm64-apple-xros.swiftmodule /Users/admin/builder/spi-builder-workspace/.derivedData/Build/Intermediates.noindex/Nuke.build/Debug-xros/Nuke.build/Objects-normal/arm64/Nuke.swiftmodule (in target 'Nuke' from project 'Nuke')
cd /Users/admin/builder/spi-builder-workspace/.dependencies/checkouts/Nuke
builtin-copy -exclude .DS_Store -exclude CVS -exclude .svn -exclude .git -exclude .hg -resolve-src-symlinks -rename /Users/admin/builder/spi-builder-workspace/.derivedData/Build/Intermediates.noindex/Nuke.build/Debug-xros/Nuke.build/Objects-normal/arm64/Nuke.swiftmodule /Users/admin/builder/spi-builder-workspace/.derivedData/Build/Products/Debug-xros/Nuke.swiftmodule/arm64-apple-xros.swiftmodule
Copy /Users/admin/builder/spi-builder-workspace/.derivedData/Build/Products/Debug-xros/Nuke.swiftmodule/arm64-apple-xros.swiftdoc /Users/admin/builder/spi-builder-workspace/.derivedData/Build/Intermediates.noindex/Nuke.build/Debug-xros/Nuke.build/Objects-normal/arm64/Nuke.swiftdoc (in target 'Nuke' from project 'Nuke')
cd /Users/admin/builder/spi-builder-workspace/.dependencies/checkouts/Nuke
builtin-copy -exclude .DS_Store -exclude CVS -exclude .svn -exclude .git -exclude .hg -resolve-src-symlinks -rename /Users/admin/builder/spi-builder-workspace/.derivedData/Build/Intermediates.noindex/Nuke.build/Debug-xros/Nuke.build/Objects-normal/arm64/Nuke.swiftdoc /Users/admin/builder/spi-builder-workspace/.derivedData/Build/Products/Debug-xros/Nuke.swiftmodule/arm64-apple-xros.swiftdoc
Copy /Users/admin/builder/spi-builder-workspace/.derivedData/Build/Products/Debug-xros/Nuke.swiftmodule/arm64-apple-xros.abi.json /Users/admin/builder/spi-builder-workspace/.derivedData/Build/Intermediates.noindex/Nuke.build/Debug-xros/Nuke.build/Objects-normal/arm64/Nuke.abi.json (in target 'Nuke' from project 'Nuke')
cd /Users/admin/builder/spi-builder-workspace/.dependencies/checkouts/Nuke
builtin-copy -exclude .DS_Store -exclude CVS -exclude .svn -exclude .git -exclude .hg -resolve-src-symlinks -rename /Users/admin/builder/spi-builder-workspace/.derivedData/Build/Intermediates.noindex/Nuke.build/Debug-xros/Nuke.build/Objects-normal/arm64/Nuke.abi.json /Users/admin/builder/spi-builder-workspace/.derivedData/Build/Products/Debug-xros/Nuke.swiftmodule/arm64-apple-xros.abi.json
Copy /Users/admin/builder/spi-builder-workspace/.derivedData/Build/Products/Debug-xros/Nuke.swiftmodule/Project/arm64-apple-xros.swiftsourceinfo /Users/admin/builder/spi-builder-workspace/.derivedData/Build/Intermediates.noindex/Nuke.build/Debug-xros/Nuke.build/Objects-normal/arm64/Nuke.swiftsourceinfo (in target 'Nuke' from project 'Nuke')
cd /Users/admin/builder/spi-builder-workspace/.dependencies/checkouts/Nuke
builtin-copy -exclude .DS_Store -exclude CVS -exclude .svn -exclude .git -exclude .hg -resolve-src-symlinks -rename /Users/admin/builder/spi-builder-workspace/.derivedData/Build/Intermediates.noindex/Nuke.build/Debug-xros/Nuke.build/Objects-normal/arm64/Nuke.swiftsourceinfo /Users/admin/builder/spi-builder-workspace/.derivedData/Build/Products/Debug-xros/Nuke.swiftmodule/Project/arm64-apple-xros.swiftsourceinfo
SwiftCompile normal arm64 Compiling\ Atomic.swift,\ DataPublisher.swift,\ Extensions.swift,\ Graphics.swift,\ ImagePublisher.swift,\ ImageRequestKeys.swift /Users/admin/builder/spi-builder-workspace/.dependencies/checkouts/Nuke/Sources/Nuke/Internal/Atomic.swift /Users/admin/builder/spi-builder-workspace/.dependencies/checkouts/Nuke/Sources/Nuke/Internal/DataPublisher.swift /Users/admin/builder/spi-builder-workspace/.dependencies/checkouts/Nuke/Sources/Nuke/Internal/Extensions.swift /Users/admin/builder/spi-builder-workspace/.dependencies/checkouts/Nuke/Sources/Nuke/Internal/Graphics.swift /Users/admin/builder/spi-builder-workspace/.dependencies/checkouts/Nuke/Sources/Nuke/Internal/ImagePublisher.swift /Users/admin/builder/spi-builder-workspace/.dependencies/checkouts/Nuke/Sources/Nuke/Internal/ImageRequestKeys.swift (in target 'Nuke' from project 'Nuke')
SwiftCompile normal arm64 /Users/admin/builder/spi-builder-workspace/.dependencies/checkouts/Nuke/Sources/Nuke/Internal/Atomic.swift (in target 'Nuke' from project 'Nuke')
cd /Users/admin/builder/spi-builder-workspace/.swiftpm/xcode
SwiftCompile normal arm64 /Users/admin/builder/spi-builder-workspace/.dependencies/checkouts/Nuke/Sources/Nuke/Internal/DataPublisher.swift (in target 'Nuke' from project 'Nuke')
cd /Users/admin/builder/spi-builder-workspace/.swiftpm/xcode
SwiftCompile normal arm64 /Users/admin/builder/spi-builder-workspace/.dependencies/checkouts/Nuke/Sources/Nuke/Internal/Extensions.swift (in target 'Nuke' from project 'Nuke')
cd /Users/admin/builder/spi-builder-workspace/.swiftpm/xcode
SwiftCompile normal arm64 /Users/admin/builder/spi-builder-workspace/.dependencies/checkouts/Nuke/Sources/Nuke/Internal/Graphics.swift (in target 'Nuke' from project 'Nuke')
cd /Users/admin/builder/spi-builder-workspace/.swiftpm/xcode
SwiftCompile normal arm64 /Users/admin/builder/spi-builder-workspace/.dependencies/checkouts/Nuke/Sources/Nuke/Internal/ImagePublisher.swift (in target 'Nuke' from project 'Nuke')
cd /Users/admin/builder/spi-builder-workspace/.swiftpm/xcode
SwiftCompile normal arm64 /Users/admin/builder/spi-builder-workspace/.dependencies/checkouts/Nuke/Sources/Nuke/Internal/ImageRequestKeys.swift (in target 'Nuke' from project 'Nuke')
cd /Users/admin/builder/spi-builder-workspace/.swiftpm/xcode
SwiftCompile normal arm64 Compiling\ ImageDecoderRegistry.swift,\ ImageDecoders+Default.swift,\ ImageDecoders+Empty.swift,\ ImageDecoding.swift,\ ImageEncoders+Default.swift,\ ImageEncoders+ImageIO.swift /Users/admin/builder/spi-builder-workspace/.dependencies/checkouts/Nuke/Sources/Nuke/Decoding/ImageDecoderRegistry.swift /Users/admin/builder/spi-builder-workspace/.dependencies/checkouts/Nuke/Sources/Nuke/Decoding/ImageDecoders+Default.swift /Users/admin/builder/spi-builder-workspace/.dependencies/checkouts/Nuke/Sources/Nuke/Decoding/ImageDecoders+Empty.swift /Users/admin/builder/spi-builder-workspace/.dependencies/checkouts/Nuke/Sources/Nuke/Decoding/ImageDecoding.swift /Users/admin/builder/spi-builder-workspace/.dependencies/checkouts/Nuke/Sources/Nuke/Encoding/ImageEncoders+Default.swift /Users/admin/builder/spi-builder-workspace/.dependencies/checkouts/Nuke/Sources/Nuke/Encoding/ImageEncoders+ImageIO.swift (in target 'Nuke' from project 'Nuke')
SwiftCompile normal arm64 /Users/admin/builder/spi-builder-workspace/.dependencies/checkouts/Nuke/Sources/Nuke/Decoding/ImageDecoderRegistry.swift (in target 'Nuke' from project 'Nuke')
cd /Users/admin/builder/spi-builder-workspace/.swiftpm/xcode
SwiftCompile normal arm64 /Users/admin/builder/spi-builder-workspace/.dependencies/checkouts/Nuke/Sources/Nuke/Decoding/ImageDecoders+Default.swift (in target 'Nuke' from project 'Nuke')
cd /Users/admin/builder/spi-builder-workspace/.swiftpm/xcode
SwiftCompile normal arm64 /Users/admin/builder/spi-builder-workspace/.dependencies/checkouts/Nuke/Sources/Nuke/Decoding/ImageDecoders+Empty.swift (in target 'Nuke' from project 'Nuke')
cd /Users/admin/builder/spi-builder-workspace/.swiftpm/xcode
SwiftCompile normal arm64 /Users/admin/builder/spi-builder-workspace/.dependencies/checkouts/Nuke/Sources/Nuke/Decoding/ImageDecoding.swift (in target 'Nuke' from project 'Nuke')
cd /Users/admin/builder/spi-builder-workspace/.swiftpm/xcode
SwiftCompile normal arm64 /Users/admin/builder/spi-builder-workspace/.dependencies/checkouts/Nuke/Sources/Nuke/Encoding/ImageEncoders+Default.swift (in target 'Nuke' from project 'Nuke')
cd /Users/admin/builder/spi-builder-workspace/.swiftpm/xcode
SwiftCompile normal arm64 /Users/admin/builder/spi-builder-workspace/.dependencies/checkouts/Nuke/Sources/Nuke/Encoding/ImageEncoders+ImageIO.swift (in target 'Nuke' from project 'Nuke')
cd /Users/admin/builder/spi-builder-workspace/.swiftpm/xcode
SwiftDriverJobDiscovery normal arm64 Compiling TaskFetchOriginalData.swift, TaskFetchOriginalImage.swift, TaskFetchWithPublisher.swift, TaskLoadData.swift, TaskLoadImage.swift (in target 'Nuke' from project 'Nuke')
SwiftCompile normal arm64 Compiling\ DataLoading.swift,\ ImagePipeline+Cache.swift,\ ImagePipeline+Configuration.swift,\ ImagePipeline+Delegate.swift,\ ImagePipeline+Error.swift /Users/admin/builder/spi-builder-workspace/.dependencies/checkouts/Nuke/Sources/Nuke/Loading/DataLoading.swift /Users/admin/builder/spi-builder-workspace/.dependencies/checkouts/Nuke/Sources/Nuke/Pipeline/ImagePipeline+Cache.swift /Users/admin/builder/spi-builder-workspace/.dependencies/checkouts/Nuke/Sources/Nuke/Pipeline/ImagePipeline+Configuration.swift /Users/admin/builder/spi-builder-workspace/.dependencies/checkouts/Nuke/Sources/Nuke/Pipeline/ImagePipeline+Delegate.swift /Users/admin/builder/spi-builder-workspace/.dependencies/checkouts/Nuke/Sources/Nuke/Pipeline/ImagePipeline+Error.swift (in target 'Nuke' from project 'Nuke')
SwiftCompile normal arm64 /Users/admin/builder/spi-builder-workspace/.dependencies/checkouts/Nuke/Sources/Nuke/Loading/DataLoading.swift (in target 'Nuke' from project 'Nuke')
cd /Users/admin/builder/spi-builder-workspace/.swiftpm/xcode
SwiftCompile normal arm64 /Users/admin/builder/spi-builder-workspace/.dependencies/checkouts/Nuke/Sources/Nuke/Pipeline/ImagePipeline+Cache.swift (in target 'Nuke' from project 'Nuke')
cd /Users/admin/builder/spi-builder-workspace/.swiftpm/xcode
SwiftCompile normal arm64 /Users/admin/builder/spi-builder-workspace/.dependencies/checkouts/Nuke/Sources/Nuke/Pipeline/ImagePipeline+Configuration.swift (in target 'Nuke' from project 'Nuke')
cd /Users/admin/builder/spi-builder-workspace/.swiftpm/xcode
SwiftCompile normal arm64 /Users/admin/builder/spi-builder-workspace/.dependencies/checkouts/Nuke/Sources/Nuke/Pipeline/ImagePipeline+Delegate.swift (in target 'Nuke' from project 'Nuke')
cd /Users/admin/builder/spi-builder-workspace/.swiftpm/xcode
SwiftCompile normal arm64 /Users/admin/builder/spi-builder-workspace/.dependencies/checkouts/Nuke/Sources/Nuke/Pipeline/ImagePipeline+Error.swift (in target 'Nuke' from project 'Nuke')
cd /Users/admin/builder/spi-builder-workspace/.swiftpm/xcode
SwiftDriverJobDiscovery normal arm64 Compiling LinkedList.swift, Log.swift, Operation.swift, RateLimiter.swift, ResumableData.swift, DataLoader.swift (in target 'Nuke' from project 'Nuke')
SwiftCompile normal arm64 Compiling\ ImagePipeline.swift,\ ImagePrefetcher.swift,\ ImageDecompression.swift,\ ImageProcessing.swift,\ ImageProcessingOptions.swift /Users/admin/builder/spi-builder-workspace/.dependencies/checkouts/Nuke/Sources/Nuke/Pipeline/ImagePipeline.swift /Users/admin/builder/spi-builder-workspace/.dependencies/checkouts/Nuke/Sources/Nuke/Prefetching/ImagePrefetcher.swift /Users/admin/builder/spi-builder-workspace/.dependencies/checkouts/Nuke/Sources/Nuke/Processing/ImageDecompression.swift /Users/admin/builder/spi-builder-workspace/.dependencies/checkouts/Nuke/Sources/Nuke/Processing/ImageProcessing.swift /Users/admin/builder/spi-builder-workspace/.dependencies/checkouts/Nuke/Sources/Nuke/Processing/ImageProcessingOptions.swift (in target 'Nuke' from project 'Nuke')
SwiftCompile normal arm64 /Users/admin/builder/spi-builder-workspace/.dependencies/checkouts/Nuke/Sources/Nuke/Pipeline/ImagePipeline.swift (in target 'Nuke' from project 'Nuke')
cd /Users/admin/builder/spi-builder-workspace/.swiftpm/xcode
SwiftCompile normal arm64 /Users/admin/builder/spi-builder-workspace/.dependencies/checkouts/Nuke/Sources/Nuke/Prefetching/ImagePrefetcher.swift (in target 'Nuke' from project 'Nuke')
cd /Users/admin/builder/spi-builder-workspace/.swiftpm/xcode
SwiftCompile normal arm64 /Users/admin/builder/spi-builder-workspace/.dependencies/checkouts/Nuke/Sources/Nuke/Processing/ImageDecompression.swift (in target 'Nuke' from project 'Nuke')
cd /Users/admin/builder/spi-builder-workspace/.swiftpm/xcode
SwiftCompile normal arm64 /Users/admin/builder/spi-builder-workspace/.dependencies/checkouts/Nuke/Sources/Nuke/Processing/ImageProcessing.swift (in target 'Nuke' from project 'Nuke')
cd /Users/admin/builder/spi-builder-workspace/.swiftpm/xcode
SwiftCompile normal arm64 /Users/admin/builder/spi-builder-workspace/.dependencies/checkouts/Nuke/Sources/Nuke/Processing/ImageProcessingOptions.swift (in target 'Nuke' from project 'Nuke')
cd /Users/admin/builder/spi-builder-workspace/.swiftpm/xcode
SwiftDriverJobDiscovery normal arm64 Compiling Atomic.swift, DataPublisher.swift, Extensions.swift, Graphics.swift, ImagePublisher.swift, ImageRequestKeys.swift (in target 'Nuke' from project 'Nuke')
SwiftDriverJobDiscovery normal arm64 Compiling Cache.swift, DataCache.swift, DataCaching.swift, ImageCache.swift, ImageCaching.swift, AssetType.swift (in target 'Nuke' from project 'Nuke')
SwiftDriverJobDiscovery normal arm64 Compiling ImageProcessors+Resize.swift, ImageProcessors+RoundedCorners.swift, ImageProcessors.swift, AsyncPipelineTask.swift, AsyncTask.swift (in target 'Nuke' from project 'Nuke')
SwiftDriverJobDiscovery normal arm64 Compiling ImageProcessors+Anonymous.swift, ImageProcessors+Circle.swift, ImageProcessors+Composition.swift, ImageProcessors+CoreImage.swift, ImageProcessors+GaussianBlur.swift (in target 'Nuke' from project 'Nuke')
SwiftDriver AsyncMultiplexImage normal arm64 com.apple.xcode.tools.swift.compiler (in target 'AsyncMultiplexImage' from project 'AsyncMultiplexImage')
cd /Users/admin/builder/spi-builder-workspace/.swiftpm/xcode
builtin-SwiftDriver -- /Applications/Xcode-16.3.0.app/Contents/Developer/Toolchains/XcodeDefault.xctoolchain/usr/bin/swiftc -module-name AsyncMultiplexImage -Onone -enforce-exclusivity\=checked @/Users/admin/builder/spi-builder-workspace/.derivedData/Build/Intermediates.noindex/AsyncMultiplexImage.build/Debug-xros/AsyncMultiplexImage.build/Objects-normal/arm64/AsyncMultiplexImage.SwiftFileList -DSWIFT_PACKAGE -DDEBUG -stats-output-dir .stats -plugin-path /Applications/Xcode-16.3.0.app/Contents/Developer/Toolchains/XcodeDefault.xctoolchain/usr/lib/swift/host/plugins/testing -enable-experimental-feature DebugDescriptionMacro -sdk /Applications/Xcode-16.3.0.app/Contents/Developer/Platforms/XROS.platform/Developer/SDKs/XROS2.4.sdk -target arm64-apple-xros1.0 -g -module-cache-path /Users/admin/builder/spi-builder-workspace/.derivedData/ModuleCache.noindex -Xfrontend -serialize-debugging-options -profile-coverage-mapping -profile-generate -enable-testing -index-store-path /Users/admin/builder/spi-builder-workspace/.derivedData/Index.noindex/DataStore -swift-version 6 -I /Users/admin/builder/spi-builder-workspace/.derivedData/Build/Products/Debug-xros -I /Applications/Xcode-16.3.0.app/Contents/Developer/Platforms/XROS.platform/Developer/usr/lib -F /Users/admin/builder/spi-builder-workspace/.derivedData/Build/Products/Debug-xros/PackageFrameworks -F /Users/admin/builder/spi-builder-workspace/.derivedData/Build/Products/Debug-xros -F /Applications/Xcode-16.3.0.app/Contents/Developer/Platforms/XROS.platform/Developer/Library/Frameworks -F /Applications/Xcode-16.3.0.app/Contents/Developer/Platforms/XROS.platform/Developer/SDKs/XROS2.4.sdk/Developer/Library/Frameworks -c -j10 -enable-batch-mode -incremental -Xcc -ivfsstatcache -Xcc /Users/admin/builder/spi-builder-workspace/.derivedData/SDKStatCaches.noindex/xros2.4-22O233-407b76dbb837030756cbe1ab3f0b01b6.sdkstatcache -output-file-map /Users/admin/builder/spi-builder-workspace/.derivedData/Build/Intermediates.noindex/AsyncMultiplexImage.build/Debug-xros/AsyncMultiplexImage.build/Objects-normal/arm64/AsyncMultiplexImage-OutputFileMap.json -use-frontend-parseable-output -save-temps -no-color-diagnostics -serialize-diagnostics -emit-dependencies -emit-module -emit-module-path /Users/admin/builder/spi-builder-workspace/.derivedData/Build/Intermediates.noindex/AsyncMultiplexImage.build/Debug-xros/AsyncMultiplexImage.build/Objects-normal/arm64/AsyncMultiplexImage.swiftmodule -validate-clang-modules-once -clang-build-session-file /Users/admin/builder/spi-builder-workspace/.derivedData/ModuleCache.noindex/Session.modulevalidation -package-name spi_builder_workspace -Xcc -I/Users/admin/builder/spi-builder-workspace/.derivedData/Build/Intermediates.noindex/AsyncMultiplexImage.build/Debug-xros/AsyncMultiplexImage.build/swift-overrides.hmap -emit-const-values -Xfrontend -const-gather-protocols-file -Xfrontend /Users/admin/builder/spi-builder-workspace/.derivedData/Build/Intermediates.noindex/AsyncMultiplexImage.build/Debug-xros/AsyncMultiplexImage.build/Objects-normal/arm64/AsyncMultiplexImage_const_extract_protocols.json -Xcc -I/Users/admin/builder/spi-builder-workspace/.derivedData/Build/Products/Debug-xros/include -Xcc -I/Users/admin/builder/spi-builder-workspace/.derivedData/Build/Intermediates.noindex/AsyncMultiplexImage.build/Debug-xros/AsyncMultiplexImage.build/DerivedSources-normal/arm64 -Xcc -I/Users/admin/builder/spi-builder-workspace/.derivedData/Build/Intermediates.noindex/AsyncMultiplexImage.build/Debug-xros/AsyncMultiplexImage.build/DerivedSources/arm64 -Xcc -I/Users/admin/builder/spi-builder-workspace/.derivedData/Build/Intermediates.noindex/AsyncMultiplexImage.build/Debug-xros/AsyncMultiplexImage.build/DerivedSources -Xcc -DSWIFT_PACKAGE -Xcc -DDEBUG\=1 -emit-objc-header -emit-objc-header-path /Users/admin/builder/spi-builder-workspace/.derivedData/Build/Intermediates.noindex/AsyncMultiplexImage.build/Debug-xros/AsyncMultiplexImage.build/Objects-normal/arm64/AsyncMultiplexImage-Swift.h -working-directory /Users/admin/builder/spi-builder-workspace/.swiftpm/xcode -experimental-emit-module-separately -disable-cmo
SwiftEmitModule normal arm64 Emitting\ module\ for\ AsyncMultiplexImage (in target 'AsyncMultiplexImage' from project 'AsyncMultiplexImage')
EmitSwiftModule normal arm64 (in target 'AsyncMultiplexImage' from project 'AsyncMultiplexImage')
cd /Users/admin/builder/spi-builder-workspace/.swiftpm/xcode
SwiftCompile normal arm64 Compiling\ MultiplexImage.swift /Users/admin/builder/spi-builder-workspace/Sources/AsyncMultiplexImage/MultiplexImage.swift (in target 'AsyncMultiplexImage' from project 'AsyncMultiplexImage')
SwiftCompile normal arm64 /Users/admin/builder/spi-builder-workspace/Sources/AsyncMultiplexImage/MultiplexImage.swift (in target 'AsyncMultiplexImage' from project 'AsyncMultiplexImage')
cd /Users/admin/builder/spi-builder-workspace/.swiftpm/xcode
SwiftCompile normal arm64 Compiling\ AsyncMultiplexImageContent.swift /Users/admin/builder/spi-builder-workspace/Sources/AsyncMultiplexImage/AsyncMultiplexImageContent.swift (in target 'AsyncMultiplexImage' from project 'AsyncMultiplexImage')
SwiftCompile normal arm64 /Users/admin/builder/spi-builder-workspace/Sources/AsyncMultiplexImage/AsyncMultiplexImageContent.swift (in target 'AsyncMultiplexImage' from project 'AsyncMultiplexImage')
cd /Users/admin/builder/spi-builder-workspace/.swiftpm/xcode
SwiftCompile normal arm64 Compiling\ DownloadManager.swift /Users/admin/builder/spi-builder-workspace/Sources/AsyncMultiplexImage/DownloadManager.swift (in target 'AsyncMultiplexImage' from project 'AsyncMultiplexImage')
SwiftCompile normal arm64 /Users/admin/builder/spi-builder-workspace/Sources/AsyncMultiplexImage/DownloadManager.swift (in target 'AsyncMultiplexImage' from project 'AsyncMultiplexImage')
cd /Users/admin/builder/spi-builder-workspace/.swiftpm/xcode
SwiftDriverJobDiscovery normal arm64 Compiling DataLoading.swift, ImagePipeline+Cache.swift, ImagePipeline+Configuration.swift, ImagePipeline+Delegate.swift, ImagePipeline+Error.swift (in target 'Nuke' from project 'Nuke')
SwiftCompile normal arm64 Compiling\ AsyncMultiplexImageView.swift /Users/admin/builder/spi-builder-workspace/Sources/AsyncMultiplexImage/AsyncMultiplexImageView.swift (in target 'AsyncMultiplexImage' from project 'AsyncMultiplexImage')
Failed frontend command:
/Applications/Xcode-16.3.0.app/Contents/Developer/Toolchains/XcodeDefault.xctoolchain/usr/bin/swift-frontend -frontend -c /Users/admin/builder/spi-builder-workspace/Sources/AsyncMultiplexImage/AsyncMultiplexImage.swift /Users/admin/builder/spi-builder-workspace/Sources/AsyncMultiplexImage/AsyncMultiplexImageContent.swift -primary-file /Users/admin/builder/spi-builder-workspace/Sources/AsyncMultiplexImage/AsyncMultiplexImageView.swift /Users/admin/builder/spi-builder-workspace/Sources/AsyncMultiplexImage/DownloadManager.swift /Users/admin/builder/spi-builder-workspace/Sources/AsyncMultiplexImage/MultiplexImage.swift -emit-dependencies-path /Users/admin/builder/spi-builder-workspace/.derivedData/Build/Intermediates.noindex/AsyncMultiplexImage.build/Debug-xros/AsyncMultiplexImage.build/Objects-normal/arm64/AsyncMultiplexImageView.d -emit-const-values-path /Users/admin/builder/spi-builder-workspace/.derivedData/Build/Intermediates.noindex/AsyncMultiplexImage.build/Debug-xros/AsyncMultiplexImage.build/Objects-normal/arm64/AsyncMultiplexImageView.swiftconstvalues -emit-reference-dependencies-path /Users/admin/builder/spi-builder-workspace/.derivedData/Build/Intermediates.noindex/AsyncMultiplexImage.build/Debug-xros/AsyncMultiplexImage.build/Objects-normal/arm64/AsyncMultiplexImageView.swiftdeps -serialize-diagnostics-path /Users/admin/builder/spi-builder-workspace/.derivedData/Build/Intermediates.noindex/AsyncMultiplexImage.build/Debug-xros/AsyncMultiplexImage.build/Objects-normal/arm64/AsyncMultiplexImageView.dia -target arm64-apple-xros1.0 -Xllvm -aarch64-use-tbi -enable-objc-interop -stack-check -sdk /Applications/Xcode-16.3.0.app/Contents/Developer/Platforms/XROS.platform/Developer/SDKs/XROS2.4.sdk -I /Users/admin/builder/spi-builder-workspace/.derivedData/Build/Products/Debug-xros -I /Applications/Xcode-16.3.0.app/Contents/Developer/Platforms/XROS.platform/Developer/usr/lib -F /Users/admin/builder/spi-builder-workspace/.derivedData/Build/Products/Debug-xros/PackageFrameworks -F /Users/admin/builder/spi-builder-workspace/.derivedData/Build/Products/Debug-xros -F /Applications/Xcode-16.3.0.app/Contents/Developer/Platforms/XROS.platform/Developer/Library/Frameworks -F /Applications/Xcode-16.3.0.app/Contents/Developer/Platforms/XROS.platform/Developer/SDKs/XROS2.4.sdk/Developer/Library/Frameworks -no-color-diagnostics -enable-testing -g -debug-info-format\=dwarf -dwarf-version\=4 -module-cache-path /Users/admin/builder/spi-builder-workspace/.derivedData/ModuleCache.noindex -profile-generate -profile-coverage-mapping -swift-version 6 -enforce-exclusivity\=checked -stats-output-dir /Users/admin/builder/spi-builder-workspace/.swiftpm/xcode/.stats -Onone -D SWIFT_PACKAGE -D DEBUG -serialize-debugging-options -const-gather-protocols-file /Users/admin/builder/spi-builder-workspace/.derivedData/Build/Intermediates.noindex/AsyncMultiplexImage.build/Debug-xros/AsyncMultiplexImage.build/Objects-normal/arm64/AsyncMultiplexImage_const_extract_protocols.json -enable-experimental-feature DebugDescriptionMacro -empty-abi-descriptor -plugin-path /Applications/Xcode-16.3.0.app/Contents/Developer/Toolchains/XcodeDefault.xctoolchain/usr/lib/swift/host/plugins/testing -validate-clang-modules-once -clang-build-session-file /Users/admin/builder/spi-builder-workspace/.derivedData/ModuleCache.noindex/Session.modulevalidation -Xcc -working-directory -Xcc /Users/admin/builder/spi-builder-workspace/.swiftpm/xcode -resource-dir /Applications/Xcode-16.3.0.app/Contents/Developer/Toolchains/XcodeDefault.xctoolchain/usr/lib/swift -enable-anonymous-context-mangled-names -file-compilation-dir /Users/admin/builder/spi-builder-workspace/.swiftpm/xcode -Xcc -ivfsstatcache -Xcc /Users/admin/builder/spi-builder-workspace/.derivedData/SDKStatCaches.noindex/xros2.4-22O233-407b76dbb837030756cbe1ab3f0b01b6.sdkstatcache -Xcc -I/Users/admin/builder/spi-builder-workspace/.derivedData/Build/Intermediates.noindex/AsyncMultiplexImage.build/Debug-xros/AsyncMultiplexImage.build/swift-overrides.hmap -Xcc -I/Users/admin/builder/spi-builder-workspace/.derivedData/Build/Products/Debug-xros/include -Xcc -I/Users/admin/builder/spi-builder-workspace/.derivedData/Build/Intermediates.noindex/AsyncMultiplexImage.build/Debug-xros/AsyncMultiplexImage.build/DerivedSources-normal/arm64 -Xcc -I/Users/admin/builder/spi-builder-workspace/.derivedData/Build/Intermediates.noindex/AsyncMultiplexImage.build/Debug-xros/AsyncMultiplexImage.build/DerivedSources/arm64 -Xcc -I/Users/admin/builder/spi-builder-workspace/.derivedData/Build/Intermediates.noindex/AsyncMultiplexImage.build/Debug-xros/AsyncMultiplexImage.build/DerivedSources -Xcc -DSWIFT_PACKAGE -Xcc -DDEBUG\=1 -module-name AsyncMultiplexImage -package-name spi_builder_workspace -frontend-parseable-output -disable-clang-spi -target-sdk-version 2.4 -target-sdk-name xros2.4 -external-plugin-path /Applications/Xcode-16.3.0.app/Contents/Developer/Platforms/XROS.platform/Developer/usr/lib/swift/host/plugins\#/Applications/Xcode-16.3.0.app/Contents/Developer/Platforms/XROS.platform/Developer/usr/bin/swift-plugin-server -external-plugin-path /Applications/Xcode-16.3.0.app/Contents/Developer/Platforms/XROS.platform/Developer/usr/local/lib/swift/host/plugins\#/Applications/Xcode-16.3.0.app/Contents/Developer/Platforms/XROS.platform/Developer/usr/bin/swift-plugin-server -in-process-plugin-server-path /Applications/Xcode-16.3.0.app/Contents/Developer/Toolchains/XcodeDefault.xctoolchain/usr/lib/swift/host/libSwiftInProcPluginServer.dylib -plugin-path /Applications/Xcode-16.3.0.app/Contents/Developer/Toolchains/XcodeDefault.xctoolchain/usr/lib/swift/host/plugins -plugin-path /Applications/Xcode-16.3.0.app/Contents/Developer/Toolchains/XcodeDefault.xctoolchain/usr/local/lib/swift/host/plugins -o /Users/admin/builder/spi-builder-workspace/.derivedData/Build/Intermediates.noindex/AsyncMultiplexImage.build/Debug-xros/AsyncMultiplexImage.build/Objects-normal/arm64/AsyncMultiplexImageView.o -index-unit-output-path /AsyncMultiplexImage.build/Debug-xros/AsyncMultiplexImage.build/Objects-normal/arm64/AsyncMultiplexImageView.o -index-store-path /Users/admin/builder/spi-builder-workspace/.derivedData/Index.noindex/DataStore -index-system-modules
SwiftCompile normal arm64 /Users/admin/builder/spi-builder-workspace/Sources/AsyncMultiplexImage/AsyncMultiplexImageView.swift (in target 'AsyncMultiplexImage' from project 'AsyncMultiplexImage')
cd /Users/admin/builder/spi-builder-workspace/.swiftpm/xcode
/Users/admin/builder/spi-builder-workspace/Sources/AsyncMultiplexImage/AsyncMultiplexImageView.swift:192:21: error: 'UIScreen' is unavailable in visionOS
displayScale: UIScreen.main.scale
^~~~~~~~
/Applications/Xcode-16.3.0.app/Contents/Developer/Platforms/XROS.platform/Developer/SDKs/XROS2.4.sdk/System/Library/Frameworks/UIKit.framework/Headers/UIScreen.h:54:12: note: 'UIScreen' has been explicitly marked unavailable here
@interface UIScreen : NSObject <UITraitEnvironment>
^
SwiftDriverJobDiscovery normal arm64 Compiling ImageDecoderRegistry.swift, ImageDecoders+Default.swift, ImageDecoders+Empty.swift, ImageDecoding.swift, ImageEncoders+Default.swift, ImageEncoders+ImageIO.swift (in target 'Nuke' from project 'Nuke')
SwiftCompile normal arm64 Compiling\ AsyncMultiplexImage.swift /Users/admin/builder/spi-builder-workspace/Sources/AsyncMultiplexImage/AsyncMultiplexImage.swift (in target 'AsyncMultiplexImage' from project 'AsyncMultiplexImage')
SwiftCompile normal arm64 /Users/admin/builder/spi-builder-workspace/Sources/AsyncMultiplexImage/AsyncMultiplexImage.swift (in target 'AsyncMultiplexImage' from project 'AsyncMultiplexImage')
cd /Users/admin/builder/spi-builder-workspace/.swiftpm/xcode
SwiftDriverJobDiscovery normal arm64 Compiling MultiplexImage.swift (in target 'AsyncMultiplexImage' from project 'AsyncMultiplexImage')
SwiftDriverJobDiscovery normal arm64 Emitting module for AsyncMultiplexImage (in target 'AsyncMultiplexImage' from project 'AsyncMultiplexImage')
SwiftDriver\ Compilation\ Requirements AsyncMultiplexImage normal arm64 com.apple.xcode.tools.swift.compiler (in target 'AsyncMultiplexImage' from project 'AsyncMultiplexImage')
cd /Users/admin/builder/spi-builder-workspace/.swiftpm/xcode
builtin-Swift-Compilation-Requirements -- /Applications/Xcode-16.3.0.app/Contents/Developer/Toolchains/XcodeDefault.xctoolchain/usr/bin/swiftc -module-name AsyncMultiplexImage -Onone -enforce-exclusivity\=checked @/Users/admin/builder/spi-builder-workspace/.derivedData/Build/Intermediates.noindex/AsyncMultiplexImage.build/Debug-xros/AsyncMultiplexImage.build/Objects-normal/arm64/AsyncMultiplexImage.SwiftFileList -DSWIFT_PACKAGE -DDEBUG -stats-output-dir .stats -plugin-path /Applications/Xcode-16.3.0.app/Contents/Developer/Toolchains/XcodeDefault.xctoolchain/usr/lib/swift/host/plugins/testing -enable-experimental-feature DebugDescriptionMacro -sdk /Applications/Xcode-16.3.0.app/Contents/Developer/Platforms/XROS.platform/Developer/SDKs/XROS2.4.sdk -target arm64-apple-xros1.0 -g -module-cache-path /Users/admin/builder/spi-builder-workspace/.derivedData/ModuleCache.noindex -Xfrontend -serialize-debugging-options -profile-coverage-mapping -profile-generate -enable-testing -index-store-path /Users/admin/builder/spi-builder-workspace/.derivedData/Index.noindex/DataStore -swift-version 6 -I /Users/admin/builder/spi-builder-workspace/.derivedData/Build/Products/Debug-xros -I /Applications/Xcode-16.3.0.app/Contents/Developer/Platforms/XROS.platform/Developer/usr/lib -F /Users/admin/builder/spi-builder-workspace/.derivedData/Build/Products/Debug-xros/PackageFrameworks -F /Users/admin/builder/spi-builder-workspace/.derivedData/Build/Products/Debug-xros -F /Applications/Xcode-16.3.0.app/Contents/Developer/Platforms/XROS.platform/Developer/Library/Frameworks -F /Applications/Xcode-16.3.0.app/Contents/Developer/Platforms/XROS.platform/Developer/SDKs/XROS2.4.sdk/Developer/Library/Frameworks -c -j10 -enable-batch-mode -incremental -Xcc -ivfsstatcache -Xcc /Users/admin/builder/spi-builder-workspace/.derivedData/SDKStatCaches.noindex/xros2.4-22O233-407b76dbb837030756cbe1ab3f0b01b6.sdkstatcache -output-file-map /Users/admin/builder/spi-builder-workspace/.derivedData/Build/Intermediates.noindex/AsyncMultiplexImage.build/Debug-xros/AsyncMultiplexImage.build/Objects-normal/arm64/AsyncMultiplexImage-OutputFileMap.json -use-frontend-parseable-output -save-temps -no-color-diagnostics -serialize-diagnostics -emit-dependencies -emit-module -emit-module-path /Users/admin/builder/spi-builder-workspace/.derivedData/Build/Intermediates.noindex/AsyncMultiplexImage.build/Debug-xros/AsyncMultiplexImage.build/Objects-normal/arm64/AsyncMultiplexImage.swiftmodule -validate-clang-modules-once -clang-build-session-file /Users/admin/builder/spi-builder-workspace/.derivedData/ModuleCache.noindex/Session.modulevalidation -package-name spi_builder_workspace -Xcc -I/Users/admin/builder/spi-builder-workspace/.derivedData/Build/Intermediates.noindex/AsyncMultiplexImage.build/Debug-xros/AsyncMultiplexImage.build/swift-overrides.hmap -emit-const-values -Xfrontend -const-gather-protocols-file -Xfrontend /Users/admin/builder/spi-builder-workspace/.derivedData/Build/Intermediates.noindex/AsyncMultiplexImage.build/Debug-xros/AsyncMultiplexImage.build/Objects-normal/arm64/AsyncMultiplexImage_const_extract_protocols.json -Xcc -I/Users/admin/builder/spi-builder-workspace/.derivedData/Build/Products/Debug-xros/include -Xcc -I/Users/admin/builder/spi-builder-workspace/.derivedData/Build/Intermediates.noindex/AsyncMultiplexImage.build/Debug-xros/AsyncMultiplexImage.build/DerivedSources-normal/arm64 -Xcc -I/Users/admin/builder/spi-builder-workspace/.derivedData/Build/Intermediates.noindex/AsyncMultiplexImage.build/Debug-xros/AsyncMultiplexImage.build/DerivedSources/arm64 -Xcc -I/Users/admin/builder/spi-builder-workspace/.derivedData/Build/Intermediates.noindex/AsyncMultiplexImage.build/Debug-xros/AsyncMultiplexImage.build/DerivedSources -Xcc -DSWIFT_PACKAGE -Xcc -DDEBUG\=1 -emit-objc-header -emit-objc-header-path /Users/admin/builder/spi-builder-workspace/.derivedData/Build/Intermediates.noindex/AsyncMultiplexImage.build/Debug-xros/AsyncMultiplexImage.build/Objects-normal/arm64/AsyncMultiplexImage-Swift.h -working-directory /Users/admin/builder/spi-builder-workspace/.swiftpm/xcode -experimental-emit-module-separately -disable-cmo
SwiftMergeGeneratedHeaders /Users/admin/builder/spi-builder-workspace/.derivedData/Build/Intermediates.noindex/GeneratedModuleMaps-xros/AsyncMultiplexImage-Swift.h /Users/admin/builder/spi-builder-workspace/.derivedData/Build/Intermediates.noindex/AsyncMultiplexImage.build/Debug-xros/AsyncMultiplexImage.build/Objects-normal/arm64/AsyncMultiplexImage-Swift.h (in target 'AsyncMultiplexImage' from project 'AsyncMultiplexImage')
cd /Users/admin/builder/spi-builder-workspace
builtin-swiftHeaderTool -arch arm64 /Users/admin/builder/spi-builder-workspace/.derivedData/Build/Intermediates.noindex/AsyncMultiplexImage.build/Debug-xros/AsyncMultiplexImage.build/Objects-normal/arm64/AsyncMultiplexImage-Swift.h -o /Users/admin/builder/spi-builder-workspace/.derivedData/Build/Intermediates.noindex/GeneratedModuleMaps-xros/AsyncMultiplexImage-Swift.h
Copy /Users/admin/builder/spi-builder-workspace/.derivedData/Build/Products/Debug-xros/AsyncMultiplexImage.swiftmodule/arm64-apple-xros.swiftmodule /Users/admin/builder/spi-builder-workspace/.derivedData/Build/Intermediates.noindex/AsyncMultiplexImage.build/Debug-xros/AsyncMultiplexImage.build/Objects-normal/arm64/AsyncMultiplexImage.swiftmodule (in target 'AsyncMultiplexImage' from project 'AsyncMultiplexImage')
cd /Users/admin/builder/spi-builder-workspace
builtin-copy -exclude .DS_Store -exclude CVS -exclude .svn -exclude .git -exclude .hg -resolve-src-symlinks -rename /Users/admin/builder/spi-builder-workspace/.derivedData/Build/Intermediates.noindex/AsyncMultiplexImage.build/Debug-xros/AsyncMultiplexImage.build/Objects-normal/arm64/AsyncMultiplexImage.swiftmodule /Users/admin/builder/spi-builder-workspace/.derivedData/Build/Products/Debug-xros/AsyncMultiplexImage.swiftmodule/arm64-apple-xros.swiftmodule
Copy /Users/admin/builder/spi-builder-workspace/.derivedData/Build/Products/Debug-xros/AsyncMultiplexImage.swiftmodule/arm64-apple-xros.swiftdoc /Users/admin/builder/spi-builder-workspace/.derivedData/Build/Intermediates.noindex/AsyncMultiplexImage.build/Debug-xros/AsyncMultiplexImage.build/Objects-normal/arm64/AsyncMultiplexImage.swiftdoc (in target 'AsyncMultiplexImage' from project 'AsyncMultiplexImage')
cd /Users/admin/builder/spi-builder-workspace
builtin-copy -exclude .DS_Store -exclude CVS -exclude .svn -exclude .git -exclude .hg -resolve-src-symlinks -rename /Users/admin/builder/spi-builder-workspace/.derivedData/Build/Intermediates.noindex/AsyncMultiplexImage.build/Debug-xros/AsyncMultiplexImage.build/Objects-normal/arm64/AsyncMultiplexImage.swiftdoc /Users/admin/builder/spi-builder-workspace/.derivedData/Build/Products/Debug-xros/AsyncMultiplexImage.swiftmodule/arm64-apple-xros.swiftdoc
Copy /Users/admin/builder/spi-builder-workspace/.derivedData/Build/Products/Debug-xros/AsyncMultiplexImage.swiftmodule/arm64-apple-xros.abi.json /Users/admin/builder/spi-builder-workspace/.derivedData/Build/Intermediates.noindex/AsyncMultiplexImage.build/Debug-xros/AsyncMultiplexImage.build/Objects-normal/arm64/AsyncMultiplexImage.abi.json (in target 'AsyncMultiplexImage' from project 'AsyncMultiplexImage')
cd /Users/admin/builder/spi-builder-workspace
builtin-copy -exclude .DS_Store -exclude CVS -exclude .svn -exclude .git -exclude .hg -resolve-src-symlinks -rename /Users/admin/builder/spi-builder-workspace/.derivedData/Build/Intermediates.noindex/AsyncMultiplexImage.build/Debug-xros/AsyncMultiplexImage.build/Objects-normal/arm64/AsyncMultiplexImage.abi.json /Users/admin/builder/spi-builder-workspace/.derivedData/Build/Products/Debug-xros/AsyncMultiplexImage.swiftmodule/arm64-apple-xros.abi.json
Copy /Users/admin/builder/spi-builder-workspace/.derivedData/Build/Products/Debug-xros/AsyncMultiplexImage.swiftmodule/Project/arm64-apple-xros.swiftsourceinfo /Users/admin/builder/spi-builder-workspace/.derivedData/Build/Intermediates.noindex/AsyncMultiplexImage.build/Debug-xros/AsyncMultiplexImage.build/Objects-normal/arm64/AsyncMultiplexImage.swiftsourceinfo (in target 'AsyncMultiplexImage' from project 'AsyncMultiplexImage')
cd /Users/admin/builder/spi-builder-workspace
builtin-copy -exclude .DS_Store -exclude CVS -exclude .svn -exclude .git -exclude .hg -resolve-src-symlinks -rename /Users/admin/builder/spi-builder-workspace/.derivedData/Build/Intermediates.noindex/AsyncMultiplexImage.build/Debug-xros/AsyncMultiplexImage.build/Objects-normal/arm64/AsyncMultiplexImage.swiftsourceinfo /Users/admin/builder/spi-builder-workspace/.derivedData/Build/Products/Debug-xros/AsyncMultiplexImage.swiftmodule/Project/arm64-apple-xros.swiftsourceinfo
SwiftDriver AsyncMultiplexImage-Nuke normal arm64 com.apple.xcode.tools.swift.compiler (in target 'AsyncMultiplexImage-Nuke' from project 'AsyncMultiplexImage')
cd /Users/admin/builder/spi-builder-workspace/.swiftpm/xcode
builtin-SwiftDriver -- /Applications/Xcode-16.3.0.app/Contents/Developer/Toolchains/XcodeDefault.xctoolchain/usr/bin/swiftc -module-name AsyncMultiplexImage_Nuke -Onone -enforce-exclusivity\=checked @/Users/admin/builder/spi-builder-workspace/.derivedData/Build/Intermediates.noindex/AsyncMultiplexImage.build/Debug-xros/AsyncMultiplexImage-Nuke.build/Objects-normal/arm64/AsyncMultiplexImage-Nuke.SwiftFileList -DSWIFT_PACKAGE -DDEBUG -stats-output-dir .stats -plugin-path /Applications/Xcode-16.3.0.app/Contents/Developer/Toolchains/XcodeDefault.xctoolchain/usr/lib/swift/host/plugins/testing -enable-experimental-feature DebugDescriptionMacro -sdk /Applications/Xcode-16.3.0.app/Contents/Developer/Platforms/XROS.platform/Developer/SDKs/XROS2.4.sdk -target arm64-apple-xros1.0 -g -module-cache-path /Users/admin/builder/spi-builder-workspace/.derivedData/ModuleCache.noindex -Xfrontend -serialize-debugging-options -profile-coverage-mapping -profile-generate -enable-testing -index-store-path /Users/admin/builder/spi-builder-workspace/.derivedData/Index.noindex/DataStore -swift-version 6 -I /Users/admin/builder/spi-builder-workspace/.derivedData/Build/Products/Debug-xros -I /Applications/Xcode-16.3.0.app/Contents/Developer/Platforms/XROS.platform/Developer/usr/lib -F /Users/admin/builder/spi-builder-workspace/.derivedData/Build/Products/Debug-xros/PackageFrameworks -F /Users/admin/builder/spi-builder-workspace/.derivedData/Build/Products/Debug-xros/PackageFrameworks -F /Users/admin/builder/spi-builder-workspace/.derivedData/Build/Products/Debug-xros/PackageFrameworks -F /Users/admin/builder/spi-builder-workspace/.derivedData/Build/Products/Debug-xros -F /Applications/Xcode-16.3.0.app/Contents/Developer/Platforms/XROS.platform/Developer/Library/Frameworks -F /Applications/Xcode-16.3.0.app/Contents/Developer/Platforms/XROS.platform/Developer/SDKs/XROS2.4.sdk/Developer/Library/Frameworks -c -j10 -enable-batch-mode -incremental -Xcc -ivfsstatcache -Xcc /Users/admin/builder/spi-builder-workspace/.derivedData/SDKStatCaches.noindex/xros2.4-22O233-407b76dbb837030756cbe1ab3f0b01b6.sdkstatcache -output-file-map /Users/admin/builder/spi-builder-workspace/.derivedData/Build/Intermediates.noindex/AsyncMultiplexImage.build/Debug-xros/AsyncMultiplexImage-Nuke.build/Objects-normal/arm64/AsyncMultiplexImage-Nuke-OutputFileMap.json -use-frontend-parseable-output -save-temps -no-color-diagnostics -serialize-diagnostics -emit-dependencies -emit-module -emit-module-path /Users/admin/builder/spi-builder-workspace/.derivedData/Build/Intermediates.noindex/AsyncMultiplexImage.build/Debug-xros/AsyncMultiplexImage-Nuke.build/Objects-normal/arm64/AsyncMultiplexImage_Nuke.swiftmodule -validate-clang-modules-once -clang-build-session-file /Users/admin/builder/spi-builder-workspace/.derivedData/ModuleCache.noindex/Session.modulevalidation -package-name spi_builder_workspace -Xcc -I/Users/admin/builder/spi-builder-workspace/.derivedData/Build/Intermediates.noindex/AsyncMultiplexImage.build/Debug-xros/AsyncMultiplexImage-Nuke.build/swift-overrides.hmap -emit-const-values -Xfrontend -const-gather-protocols-file -Xfrontend /Users/admin/builder/spi-builder-workspace/.derivedData/Build/Intermediates.noindex/AsyncMultiplexImage.build/Debug-xros/AsyncMultiplexImage-Nuke.build/Objects-normal/arm64/AsyncMultiplexImage-Nuke_const_extract_protocols.json -Xcc -I/Users/admin/builder/spi-builder-workspace/.derivedData/Build/Products/Debug-xros/include -Xcc -I/Users/admin/builder/spi-builder-workspace/.derivedData/Build/Intermediates.noindex/AsyncMultiplexImage.build/Debug-xros/AsyncMultiplexImage-Nuke.build/DerivedSources-normal/arm64 -Xcc -I/Users/admin/builder/spi-builder-workspace/.derivedData/Build/Intermediates.noindex/AsyncMultiplexImage.build/Debug-xros/AsyncMultiplexImage-Nuke.build/DerivedSources/arm64 -Xcc -I/Users/admin/builder/spi-builder-workspace/.derivedData/Build/Intermediates.noindex/AsyncMultiplexImage.build/Debug-xros/AsyncMultiplexImage-Nuke.build/DerivedSources -Xcc -DSWIFT_PACKAGE -Xcc -DDEBUG\=1 -emit-objc-header -emit-objc-header-path /Users/admin/builder/spi-builder-workspace/.derivedData/Build/Intermediates.noindex/AsyncMultiplexImage.build/Debug-xros/AsyncMultiplexImage-Nuke.build/Objects-normal/arm64/AsyncMultiplexImage-Nuke-Swift.h -working-directory /Users/admin/builder/spi-builder-workspace/.swiftpm/xcode -experimental-emit-module-separately -disable-cmo
SwiftEmitModule normal arm64 Emitting\ module\ for\ AsyncMultiplexImage_Nuke (in target 'AsyncMultiplexImage-Nuke' from project 'AsyncMultiplexImage')
SwiftCompile normal arm64 Compiling\ AsyncMultiplexImageNukeDownloader.swift /Users/admin/builder/spi-builder-workspace/Sources/AsyncMultiplexImage-Nuke/AsyncMultiplexImageNukeDownloader.swift (in target 'AsyncMultiplexImage-Nuke' from project 'AsyncMultiplexImage')
Command SwiftCompile failed with a nonzero exit code
** BUILD FAILED **
The following build commands failed:
SwiftCompile normal arm64 Compiling\ AsyncMultiplexImageView.swift /Users/admin/builder/spi-builder-workspace/Sources/AsyncMultiplexImage/AsyncMultiplexImageView.swift (in target 'AsyncMultiplexImage' from project 'AsyncMultiplexImage')
SwiftCompile normal arm64 /Users/admin/builder/spi-builder-workspace/Sources/AsyncMultiplexImage/AsyncMultiplexImageView.swift (in target 'AsyncMultiplexImage' from project 'AsyncMultiplexImage')
SwiftCompile normal arm64 Compiling\ AsyncMultiplexImageNukeDownloader.swift /Users/admin/builder/spi-builder-workspace/Sources/AsyncMultiplexImage-Nuke/AsyncMultiplexImageNukeDownloader.swift (in target 'AsyncMultiplexImage-Nuke' from project 'AsyncMultiplexImage')
Building workspace spi-builder-workspace with scheme AsyncMultiplexImage-Package
(4 failures)
Command line invocation:
/Applications/Xcode-16.3.0.app/Contents/Developer/usr/bin/xcodebuild -IDEClonedSourcePackagesDirPathOverride=/Users/admin/builder/spi-builder-workspace/.dependencies -resolvePackageDependencies
Resolve Package Graph
Resolved source packages:
SwiftUISupport: https://github.com/FluidGroup/swiftui-support.git @ 0.13.0
Nuke: https://github.com/kean/Nuke.git @ 12.8.0
AsyncMultiplexImage: /Users/admin/builder/spi-builder-workspace
resolved source packages: SwiftUISupport, Nuke, AsyncMultiplexImage
{
"dependencies" : [
{
"identity" : "nuke",
"requirement" : {
"range" : [
{
"lower_bound" : "12.0.0",
"upper_bound" : "13.0.0"
}
]
},
"type" : "sourceControl",
"url" : "https://github.com/kean/Nuke.git"
},
{
"identity" : "swiftui-support",
"requirement" : {
"range" : [
{
"lower_bound" : "0.12.0",
"upper_bound" : "1.0.0"
}
]
},
"type" : "sourceControl",
"url" : "https://github.com/FluidGroup/swiftui-support.git"
}
],
"manifest_display_name" : "AsyncMultiplexImage",
"name" : "AsyncMultiplexImage",
"path" : "/Users/admin/builder/spi-builder-workspace",
"platforms" : [
{
"name" : "ios",
"version" : "16.0"
}
],
"products" : [
{
"name" : "AsyncMultiplexImage",
"targets" : [
"AsyncMultiplexImage"
],
"type" : {
"library" : [
"automatic"
]
}
},
{
"name" : "AsyncMultiplexImage-Nuke",
"targets" : [
"AsyncMultiplexImage-Nuke"
],
"type" : {
"library" : [
"automatic"
]
}
}
],
"swift_languages_versions" : [
"6"
],
"targets" : [
{
"c99name" : "AsyncMultiplexImageTests",
"module_type" : "SwiftTarget",
"name" : "AsyncMultiplexImageTests",
"path" : "Tests/AsyncMultiplexImageTests",
"sources" : [
"AsyncMultiplexImageTests.swift"
],
"target_dependencies" : [
"AsyncMultiplexImage"
],
"type" : "test"
},
{
"c99name" : "AsyncMultiplexImage_Nuke",
"module_type" : "SwiftTarget",
"name" : "AsyncMultiplexImage-Nuke",
"path" : "Sources/AsyncMultiplexImage-Nuke",
"product_dependencies" : [
"Nuke"
],
"product_memberships" : [
"AsyncMultiplexImage-Nuke"
],
"sources" : [
"AsyncMultiplexImageNuke.swift",
"AsyncMultiplexImageNukeDownloader.swift"
],
"target_dependencies" : [
"AsyncMultiplexImage"
],
"type" : "library"
},
{
"c99name" : "AsyncMultiplexImage",
"module_type" : "SwiftTarget",
"name" : "AsyncMultiplexImage",
"path" : "Sources/AsyncMultiplexImage",
"product_dependencies" : [
"SwiftUISupportBackport"
],
"product_memberships" : [
"AsyncMultiplexImage",
"AsyncMultiplexImage-Nuke"
],
"sources" : [
"AsyncMultiplexImage.swift",
"AsyncMultiplexImageContent.swift",
"AsyncMultiplexImageView.swift",
"DownloadManager.swift",
"MultiplexImage.swift"
],
"type" : "library"
}
],
"tools_version" : "6.0"
}
{
"workspace" : {
"name" : "spi-builder-workspace",
"schemes" : [
"AsyncMultiplexImage",
"AsyncMultiplexImage-Nuke",
"AsyncMultiplexImage-Package"
]
}
}
{
"workspace" : {
"name" : "spi-builder-workspace",
"schemes" : [
"AsyncMultiplexImage",
"AsyncMultiplexImage-Nuke",
"AsyncMultiplexImage-Package"
]
}
}
Running build ...
env DEVELOPER_DIR=/Applications/Xcode-16.3.0.app xcrun xcodebuild -IDEClonedSourcePackagesDirPathOverride=$PWD/.dependencies -skipMacroValidation -skipPackagePluginValidation -derivedDataPath $PWD/.derivedData build -scheme AsyncMultiplexImage-Package -destination generic/platform=xrOS
Command line invocation:
/Applications/Xcode-16.3.0.app/Contents/Developer/usr/bin/xcodebuild -IDEClonedSourcePackagesDirPathOverride=/Users/admin/builder/spi-builder-workspace/.dependencies -skipMacroValidation -skipPackagePluginValidation -derivedDataPath /Users/admin/builder/spi-builder-workspace/.derivedData build -scheme AsyncMultiplexImage-Package -destination generic/platform=xrOS
Resolve Package Graph
Resolved source packages:
SwiftUISupport: https://github.com/FluidGroup/swiftui-support.git @ 0.13.0
AsyncMultiplexImage: /Users/admin/builder/spi-builder-workspace
Nuke: https://github.com/kean/Nuke.git @ 12.8.0
ComputePackagePrebuildTargetDependencyGraph
Prepare packages
CreateBuildRequest
SendProjectDescription
CreateBuildOperation
ComputeTargetDependencyGraph
note: Building targets in dependency order
note: Target dependency graph (8 targets)
Target 'AsyncMultiplexImage-Nuke' in project 'AsyncMultiplexImage'
➜ Explicit dependency on target 'AsyncMultiplexImage-Nuke' in project 'AsyncMultiplexImage'
➜ Explicit dependency on target 'AsyncMultiplexImage' in project 'AsyncMultiplexImage'
➜ Explicit dependency on target 'SwiftUISupportBackport' in project 'SwiftUISupport'
➜ Explicit dependency on target 'Nuke' in project 'Nuke'
Target 'AsyncMultiplexImage-Nuke' in project 'AsyncMultiplexImage'
➜ Explicit dependency on target 'AsyncMultiplexImage' in project 'AsyncMultiplexImage'
➜ Explicit dependency on target 'SwiftUISupportBackport' in project 'SwiftUISupport'
➜ Explicit dependency on target 'Nuke' in project 'Nuke'
Target 'Nuke' in project 'Nuke'
➜ Explicit dependency on target 'Nuke' in project 'Nuke'
Target 'Nuke' in project 'Nuke' (no dependencies)
Target 'AsyncMultiplexImage' in project 'AsyncMultiplexImage'
➜ Explicit dependency on target 'AsyncMultiplexImage' in project 'AsyncMultiplexImage'
➜ Explicit dependency on target 'SwiftUISupportBackport' in project 'SwiftUISupport'
Target 'AsyncMultiplexImage' in project 'AsyncMultiplexImage'
➜ Explicit dependency on target 'SwiftUISupportBackport' in project 'SwiftUISupport'
Target 'SwiftUISupportBackport' in project 'SwiftUISupport'
➜ Explicit dependency on target 'SwiftUISupportBackport' in project 'SwiftUISupport'
Target 'SwiftUISupportBackport' in project 'SwiftUISupport' (no dependencies)
GatherProvisioningInputs
CreateBuildDescription
ExecuteExternalTool /Applications/Xcode-16.3.0.app/Contents/Developer/Toolchains/XcodeDefault.xctoolchain/usr/bin/swiftc --version
ExecuteExternalTool /Applications/Xcode-16.3.0.app/Contents/Developer/Toolchains/XcodeDefault.xctoolchain/usr/bin/clang -v -E -dM -isysroot /Applications/Xcode-16.3.0.app/Contents/Developer/Platforms/XROS.platform/Developer/SDKs/XROS2.4.sdk -x c -c /dev/null
ExecuteExternalTool /Applications/Xcode-16.3.0.app/Contents/Developer/Toolchains/XcodeDefault.xctoolchain/usr/bin/ld -version_details
Build description signature: dace1863d8d8f1f1ed755a72afa6c09d
Build description path: /Users/admin/builder/spi-builder-workspace/.derivedData/Build/Intermediates.noindex/XCBuildData/dace1863d8d8f1f1ed755a72afa6c09d.xcbuilddata
ClangStatCache /Applications/Xcode-16.3.0.app/Contents/Developer/Toolchains/XcodeDefault.xctoolchain/usr/bin/clang-stat-cache /Applications/Xcode-16.3.0.app/Contents/Developer/Platforms/XROS.platform/Developer/SDKs/XROS2.4.sdk /Users/admin/builder/spi-builder-workspace/.derivedData/SDKStatCaches.noindex/xros2.4-22O233-407b76dbb837030756cbe1ab3f0b01b6.sdkstatcache
cd /Users/admin/builder/spi-builder-workspace/.swiftpm/xcode
/Applications/Xcode-16.3.0.app/Contents/Developer/Toolchains/XcodeDefault.xctoolchain/usr/bin/clang-stat-cache /Applications/Xcode-16.3.0.app/Contents/Developer/Platforms/XROS.platform/Developer/SDKs/XROS2.4.sdk -o /Users/admin/builder/spi-builder-workspace/.derivedData/SDKStatCaches.noindex/xros2.4-22O233-407b76dbb837030756cbe1ab3f0b01b6.sdkstatcache
SwiftDriver SwiftUISupportBackport normal arm64 com.apple.xcode.tools.swift.compiler (in target 'SwiftUISupportBackport' from project 'SwiftUISupport')
cd /Users/admin/builder/spi-builder-workspace/.swiftpm/xcode
builtin-SwiftDriver -- /Applications/Xcode-16.3.0.app/Contents/Developer/Toolchains/XcodeDefault.xctoolchain/usr/bin/swiftc -module-name SwiftUISupportBackport -Onone -enforce-exclusivity\=checked @/Users/admin/builder/spi-builder-workspace/.derivedData/Build/Intermediates.noindex/SwiftUISupport.build/Debug-xros/SwiftUISupportBackport.build/Objects-normal/arm64/SwiftUISupportBackport.SwiftFileList -DSWIFT_PACKAGE -DDEBUG -DXcode -plugin-path /Applications/Xcode-16.3.0.app/Contents/Developer/Toolchains/XcodeDefault.xctoolchain/usr/lib/swift/host/plugins/testing -enable-experimental-feature DebugDescriptionMacro -sdk /Applications/Xcode-16.3.0.app/Contents/Developer/Platforms/XROS.platform/Developer/SDKs/XROS2.4.sdk -target arm64-apple-xros1.0 -g -module-cache-path /Users/admin/builder/spi-builder-workspace/.derivedData/ModuleCache.noindex -Xfrontend -serialize-debugging-options -profile-coverage-mapping -profile-generate -enable-testing -suppress-warnings -index-store-path /Users/admin/builder/spi-builder-workspace/.derivedData/Index.noindex/DataStore -swift-version 6 -I /Users/admin/builder/spi-builder-workspace/.derivedData/Build/Products/Debug-xros -I /Applications/Xcode-16.3.0.app/Contents/Developer/Platforms/XROS.platform/Developer/usr/lib -F /Users/admin/builder/spi-builder-workspace/.derivedData/Build/Products/Debug-xros -F /Applications/Xcode-16.3.0.app/Contents/Developer/Platforms/XROS.platform/Developer/Library/Frameworks -F /Applications/Xcode-16.3.0.app/Contents/Developer/Platforms/XROS.platform/Developer/SDKs/XROS2.4.sdk/Developer/Library/Frameworks -c -j10 -enable-batch-mode -incremental -Xcc -ivfsstatcache -Xcc /Users/admin/builder/spi-builder-workspace/.derivedData/SDKStatCaches.noindex/xros2.4-22O233-407b76dbb837030756cbe1ab3f0b01b6.sdkstatcache -output-file-map /Users/admin/builder/spi-builder-workspace/.derivedData/Build/Intermediates.noindex/SwiftUISupport.build/Debug-xros/SwiftUISupportBackport.build/Objects-normal/arm64/SwiftUISupportBackport-OutputFileMap.json -use-frontend-parseable-output -save-temps -no-color-diagnostics -serialize-diagnostics -emit-dependencies -emit-module -emit-module-path /Users/admin/builder/spi-builder-workspace/.derivedData/Build/Intermediates.noindex/SwiftUISupport.build/Debug-xros/SwiftUISupportBackport.build/Objects-normal/arm64/SwiftUISupportBackport.swiftmodule -user-module-version 0.13.0 -validate-clang-modules-once -clang-build-session-file /Users/admin/builder/spi-builder-workspace/.derivedData/ModuleCache.noindex/Session.modulevalidation -package-name swiftui_support -Xcc -I/Users/admin/builder/spi-builder-workspace/.derivedData/Build/Intermediates.noindex/SwiftUISupport.build/Debug-xros/SwiftUISupportBackport.build/swift-overrides.hmap -emit-const-values -Xfrontend -const-gather-protocols-file -Xfrontend /Users/admin/builder/spi-builder-workspace/.derivedData/Build/Intermediates.noindex/SwiftUISupport.build/Debug-xros/SwiftUISupportBackport.build/Objects-normal/arm64/SwiftUISupportBackport_const_extract_protocols.json -Xcc -I/Users/admin/builder/spi-builder-workspace/.derivedData/Build/Products/Debug-xros/include -Xcc -I/Users/admin/builder/spi-builder-workspace/.derivedData/Build/Intermediates.noindex/SwiftUISupport.build/Debug-xros/SwiftUISupportBackport.build/DerivedSources-normal/arm64 -Xcc -I/Users/admin/builder/spi-builder-workspace/.derivedData/Build/Intermediates.noindex/SwiftUISupport.build/Debug-xros/SwiftUISupportBackport.build/DerivedSources/arm64 -Xcc -I/Users/admin/builder/spi-builder-workspace/.derivedData/Build/Intermediates.noindex/SwiftUISupport.build/Debug-xros/SwiftUISupportBackport.build/DerivedSources -Xcc -DSWIFT_PACKAGE -Xcc -DDEBUG\=1 -emit-objc-header -emit-objc-header-path /Users/admin/builder/spi-builder-workspace/.derivedData/Build/Intermediates.noindex/SwiftUISupport.build/Debug-xros/SwiftUISupportBackport.build/Objects-normal/arm64/SwiftUISupportBackport-Swift.h -working-directory /Users/admin/builder/spi-builder-workspace/.swiftpm/xcode -experimental-emit-module-separately -disable-cmo
SwiftDriver Nuke normal arm64 com.apple.xcode.tools.swift.compiler (in target 'Nuke' from project 'Nuke')
cd /Users/admin/builder/spi-builder-workspace/.swiftpm/xcode
builtin-SwiftDriver -- /Applications/Xcode-16.3.0.app/Contents/Developer/Toolchains/XcodeDefault.xctoolchain/usr/bin/swiftc -module-name Nuke -Onone -enforce-exclusivity\=checked @/Users/admin/builder/spi-builder-workspace/.derivedData/Build/Intermediates.noindex/Nuke.build/Debug-xros/Nuke.build/Objects-normal/arm64/Nuke.SwiftFileList -DSWIFT_PACKAGE -DDEBUG -DXcode -plugin-path /Applications/Xcode-16.3.0.app/Contents/Developer/Toolchains/XcodeDefault.xctoolchain/usr/lib/swift/host/plugins/testing -enable-experimental-feature DebugDescriptionMacro -sdk /Applications/Xcode-16.3.0.app/Contents/Developer/Platforms/XROS.platform/Developer/SDKs/XROS2.4.sdk -target arm64-apple-xros1.0 -g -module-cache-path /Users/admin/builder/spi-builder-workspace/.derivedData/ModuleCache.noindex -Xfrontend -serialize-debugging-options -profile-coverage-mapping -profile-generate -enable-testing -suppress-warnings -index-store-path /Users/admin/builder/spi-builder-workspace/.derivedData/Index.noindex/DataStore -swift-version 5 -I /Users/admin/builder/spi-builder-workspace/.derivedData/Build/Products/Debug-xros -I /Applications/Xcode-16.3.0.app/Contents/Developer/Platforms/XROS.platform/Developer/usr/lib -F /Users/admin/builder/spi-builder-workspace/.derivedData/Build/Products/Debug-xros -F /Applications/Xcode-16.3.0.app/Contents/Developer/Platforms/XROS.platform/Developer/Library/Frameworks -F /Applications/Xcode-16.3.0.app/Contents/Developer/Platforms/XROS.platform/Developer/SDKs/XROS2.4.sdk/Developer/Library/Frameworks -c -j10 -enable-batch-mode -incremental -Xcc -ivfsstatcache -Xcc /Users/admin/builder/spi-builder-workspace/.derivedData/SDKStatCaches.noindex/xros2.4-22O233-407b76dbb837030756cbe1ab3f0b01b6.sdkstatcache -output-file-map /Users/admin/builder/spi-builder-workspace/.derivedData/Build/Intermediates.noindex/Nuke.build/Debug-xros/Nuke.build/Objects-normal/arm64/Nuke-OutputFileMap.json -use-frontend-parseable-output -save-temps -no-color-diagnostics -serialize-diagnostics -emit-dependencies -emit-module -emit-module-path /Users/admin/builder/spi-builder-workspace/.derivedData/Build/Intermediates.noindex/Nuke.build/Debug-xros/Nuke.build/Objects-normal/arm64/Nuke.swiftmodule -validate-clang-modules-once -clang-build-session-file /Users/admin/builder/spi-builder-workspace/.derivedData/ModuleCache.noindex/Session.modulevalidation -package-name nuke -Xcc -I/Users/admin/builder/spi-builder-workspace/.derivedData/Build/Intermediates.noindex/Nuke.build/Debug-xros/Nuke.build/swift-overrides.hmap -emit-const-values -Xfrontend -const-gather-protocols-file -Xfrontend /Users/admin/builder/spi-builder-workspace/.derivedData/Build/Intermediates.noindex/Nuke.build/Debug-xros/Nuke.build/Objects-normal/arm64/Nuke_const_extract_protocols.json -Xcc -I/Users/admin/builder/spi-builder-workspace/.derivedData/Build/Products/Debug-xros/include -Xcc -I/Users/admin/builder/spi-builder-workspace/.derivedData/Build/Intermediates.noindex/Nuke.build/Debug-xros/Nuke.build/DerivedSources-normal/arm64 -Xcc -I/Users/admin/builder/spi-builder-workspace/.derivedData/Build/Intermediates.noindex/Nuke.build/Debug-xros/Nuke.build/DerivedSources/arm64 -Xcc -I/Users/admin/builder/spi-builder-workspace/.derivedData/Build/Intermediates.noindex/Nuke.build/Debug-xros/Nuke.build/DerivedSources -Xcc -DSWIFT_PACKAGE -Xcc -DDEBUG\=1 -emit-objc-header -emit-objc-header-path /Users/admin/builder/spi-builder-workspace/.derivedData/Build/Intermediates.noindex/Nuke.build/Debug-xros/Nuke.build/Objects-normal/arm64/Nuke-Swift.h -working-directory /Users/admin/builder/spi-builder-workspace/.swiftpm/xcode -experimental-emit-module-separately -disable-cmo
SwiftEmitModule normal arm64 Emitting\ module\ for\ SwiftUISupportBackport (in target 'SwiftUISupportBackport' from project 'SwiftUISupport')
EmitSwiftModule normal arm64 (in target 'SwiftUISupportBackport' from project 'SwiftUISupport')
cd /Users/admin/builder/spi-builder-workspace/.swiftpm/xcode
SwiftCompile normal arm64 Compiling\ ImageView.swift /Users/admin/builder/spi-builder-workspace/.dependencies/checkouts/swiftui-support/Sources/SwiftUISupportBackport/ImageView.swift (in target 'SwiftUISupportBackport' from project 'SwiftUISupport')
SwiftCompile normal arm64 /Users/admin/builder/spi-builder-workspace/.dependencies/checkouts/swiftui-support/Sources/SwiftUISupportBackport/ImageView.swift (in target 'SwiftUISupportBackport' from project 'SwiftUISupport')
cd /Users/admin/builder/spi-builder-workspace/.swiftpm/xcode
SwiftCompile normal arm64 Compiling\ VisualEffect.swift /Users/admin/builder/spi-builder-workspace/.dependencies/checkouts/swiftui-support/Sources/SwiftUISupportBackport/VisualEffect.swift (in target 'SwiftUISupportBackport' from project 'SwiftUISupport')
SwiftCompile normal arm64 /Users/admin/builder/spi-builder-workspace/.dependencies/checkouts/swiftui-support/Sources/SwiftUISupportBackport/VisualEffect.swift (in target 'SwiftUISupportBackport' from project 'SwiftUISupport')
cd /Users/admin/builder/spi-builder-workspace/.swiftpm/xcode
SwiftCompile normal arm64 Compiling\ OnChangeWithPrevious.swift /Users/admin/builder/spi-builder-workspace/.dependencies/checkouts/swiftui-support/Sources/SwiftUISupportBackport/OnChangeWithPrevious.swift (in target 'SwiftUISupportBackport' from project 'SwiftUISupport')
SwiftCompile normal arm64 /Users/admin/builder/spi-builder-workspace/.dependencies/checkouts/swiftui-support/Sources/SwiftUISupportBackport/OnChangeWithPrevious.swift (in target 'SwiftUISupportBackport' from project 'SwiftUISupport')
cd /Users/admin/builder/spi-builder-workspace/.swiftpm/xcode
SwiftCompile normal arm64 Compiling\ ImageDecoderRegistry.swift,\ ImageDecoders+Default.swift,\ ImageDecoders+Empty.swift,\ ImageDecoding.swift,\ ImageEncoders+Default.swift,\ ImageEncoders+ImageIO.swift /Users/admin/builder/spi-builder-workspace/.dependencies/checkouts/Nuke/Sources/Nuke/Decoding/ImageDecoderRegistry.swift /Users/admin/builder/spi-builder-workspace/.dependencies/checkouts/Nuke/Sources/Nuke/Decoding/ImageDecoders+Default.swift /Users/admin/builder/spi-builder-workspace/.dependencies/checkouts/Nuke/Sources/Nuke/Decoding/ImageDecoders+Empty.swift /Users/admin/builder/spi-builder-workspace/.dependencies/checkouts/Nuke/Sources/Nuke/Decoding/ImageDecoding.swift /Users/admin/builder/spi-builder-workspace/.dependencies/checkouts/Nuke/Sources/Nuke/Encoding/ImageEncoders+Default.swift /Users/admin/builder/spi-builder-workspace/.dependencies/checkouts/Nuke/Sources/Nuke/Encoding/ImageEncoders+ImageIO.swift (in target 'Nuke' from project 'Nuke')
SwiftCompile normal arm64 /Users/admin/builder/spi-builder-workspace/.dependencies/checkouts/Nuke/Sources/Nuke/Decoding/ImageDecoderRegistry.swift (in target 'Nuke' from project 'Nuke')
cd /Users/admin/builder/spi-builder-workspace/.swiftpm/xcode
SwiftCompile normal arm64 /Users/admin/builder/spi-builder-workspace/.dependencies/checkouts/Nuke/Sources/Nuke/Decoding/ImageDecoders+Default.swift (in target 'Nuke' from project 'Nuke')
cd /Users/admin/builder/spi-builder-workspace/.swiftpm/xcode
SwiftCompile normal arm64 /Users/admin/builder/spi-builder-workspace/.dependencies/checkouts/Nuke/Sources/Nuke/Decoding/ImageDecoders+Empty.swift (in target 'Nuke' from project 'Nuke')
cd /Users/admin/builder/spi-builder-workspace/.swiftpm/xcode
SwiftCompile normal arm64 /Users/admin/builder/spi-builder-workspace/.dependencies/checkouts/Nuke/Sources/Nuke/Decoding/ImageDecoding.swift (in target 'Nuke' from project 'Nuke')
cd /Users/admin/builder/spi-builder-workspace/.swiftpm/xcode
SwiftCompile normal arm64 /Users/admin/builder/spi-builder-workspace/.dependencies/checkouts/Nuke/Sources/Nuke/Encoding/ImageEncoders+Default.swift (in target 'Nuke' from project 'Nuke')
cd /Users/admin/builder/spi-builder-workspace/.swiftpm/xcode
SwiftCompile normal arm64 /Users/admin/builder/spi-builder-workspace/.dependencies/checkouts/Nuke/Sources/Nuke/Encoding/ImageEncoders+ImageIO.swift (in target 'Nuke' from project 'Nuke')
cd /Users/admin/builder/spi-builder-workspace/.swiftpm/xcode
SwiftCompile normal arm64 Compiling\ ImageEncoders.swift,\ ImageEncoding.swift,\ ImageContainer.swift,\ ImageRequest.swift,\ ImageResponse.swift,\ ImageTask.swift /Users/admin/builder/spi-builder-workspace/.dependencies/checkouts/Nuke/Sources/Nuke/Encoding/ImageEncoders.swift /Users/admin/builder/spi-builder-workspace/.dependencies/checkouts/Nuke/Sources/Nuke/Encoding/ImageEncoding.swift /Users/admin/builder/spi-builder-workspace/.dependencies/checkouts/Nuke/Sources/Nuke/ImageContainer.swift /Users/admin/builder/spi-builder-workspace/.dependencies/checkouts/Nuke/Sources/Nuke/ImageRequest.swift /Users/admin/builder/spi-builder-workspace/.dependencies/checkouts/Nuke/Sources/Nuke/ImageResponse.swift /Users/admin/builder/spi-builder-workspace/.dependencies/checkouts/Nuke/Sources/Nuke/ImageTask.swift (in target 'Nuke' from project 'Nuke')
SwiftCompile normal arm64 /Users/admin/builder/spi-builder-workspace/.dependencies/checkouts/Nuke/Sources/Nuke/Encoding/ImageEncoders.swift (in target 'Nuke' from project 'Nuke')
cd /Users/admin/builder/spi-builder-workspace/.swiftpm/xcode
SwiftCompile normal arm64 /Users/admin/builder/spi-builder-workspace/.dependencies/checkouts/Nuke/Sources/Nuke/Encoding/ImageEncoding.swift (in target 'Nuke' from project 'Nuke')
cd /Users/admin/builder/spi-builder-workspace/.swiftpm/xcode
SwiftCompile normal arm64 /Users/admin/builder/spi-builder-workspace/.dependencies/checkouts/Nuke/Sources/Nuke/ImageContainer.swift (in target 'Nuke' from project 'Nuke')
cd /Users/admin/builder/spi-builder-workspace/.swiftpm/xcode
SwiftCompile normal arm64 /Users/admin/builder/spi-builder-workspace/.dependencies/checkouts/Nuke/Sources/Nuke/ImageRequest.swift (in target 'Nuke' from project 'Nuke')
cd /Users/admin/builder/spi-builder-workspace/.swiftpm/xcode
SwiftCompile normal arm64 /Users/admin/builder/spi-builder-workspace/.dependencies/checkouts/Nuke/Sources/Nuke/ImageResponse.swift (in target 'Nuke' from project 'Nuke')
cd /Users/admin/builder/spi-builder-workspace/.swiftpm/xcode
SwiftCompile normal arm64 /Users/admin/builder/spi-builder-workspace/.dependencies/checkouts/Nuke/Sources/Nuke/ImageTask.swift (in target 'Nuke' from project 'Nuke')
cd /Users/admin/builder/spi-builder-workspace/.swiftpm/xcode
SwiftCompile normal arm64 Compiling\ Cache.swift,\ DataCache.swift,\ DataCaching.swift,\ ImageCache.swift,\ ImageCaching.swift,\ AssetType.swift /Users/admin/builder/spi-builder-workspace/.dependencies/checkouts/Nuke/Sources/Nuke/Caching/Cache.swift /Users/admin/builder/spi-builder-workspace/.dependencies/checkouts/Nuke/Sources/Nuke/Caching/DataCache.swift /Users/admin/builder/spi-builder-workspace/.dependencies/checkouts/Nuke/Sources/Nuke/Caching/DataCaching.swift /Users/admin/builder/spi-builder-workspace/.dependencies/checkouts/Nuke/Sources/Nuke/Caching/ImageCache.swift /Users/admin/builder/spi-builder-workspace/.dependencies/checkouts/Nuke/Sources/Nuke/Caching/ImageCaching.swift /Users/admin/builder/spi-builder-workspace/.dependencies/checkouts/Nuke/Sources/Nuke/Decoding/AssetType.swift (in target 'Nuke' from project 'Nuke')
SwiftCompile normal arm64 /Users/admin/builder/spi-builder-workspace/.dependencies/checkouts/Nuke/Sources/Nuke/Caching/Cache.swift (in target 'Nuke' from project 'Nuke')
cd /Users/admin/builder/spi-builder-workspace/.swiftpm/xcode
SwiftCompile normal arm64 /Users/admin/builder/spi-builder-workspace/.dependencies/checkouts/Nuke/Sources/Nuke/Caching/DataCache.swift (in target 'Nuke' from project 'Nuke')
cd /Users/admin/builder/spi-builder-workspace/.swiftpm/xcode
SwiftCompile normal arm64 /Users/admin/builder/spi-builder-workspace/.dependencies/checkouts/Nuke/Sources/Nuke/Caching/DataCaching.swift (in target 'Nuke' from project 'Nuke')
cd /Users/admin/builder/spi-builder-workspace/.swiftpm/xcode
SwiftCompile normal arm64 /Users/admin/builder/spi-builder-workspace/.dependencies/checkouts/Nuke/Sources/Nuke/Caching/ImageCache.swift (in target 'Nuke' from project 'Nuke')
cd /Users/admin/builder/spi-builder-workspace/.swiftpm/xcode
SwiftCompile normal arm64 /Users/admin/builder/spi-builder-workspace/.dependencies/checkouts/Nuke/Sources/Nuke/Caching/ImageCaching.swift (in target 'Nuke' from project 'Nuke')
cd /Users/admin/builder/spi-builder-workspace/.swiftpm/xcode
SwiftCompile normal arm64 /Users/admin/builder/spi-builder-workspace/.dependencies/checkouts/Nuke/Sources/Nuke/Decoding/AssetType.swift (in target 'Nuke' from project 'Nuke')
cd /Users/admin/builder/spi-builder-workspace/.swiftpm/xcode
SwiftEmitModule normal arm64 Emitting\ module\ for\ Nuke (in target 'Nuke' from project 'Nuke')
EmitSwiftModule normal arm64 (in target 'Nuke' from project 'Nuke')
cd /Users/admin/builder/spi-builder-workspace/.swiftpm/xcode
SwiftCompile normal arm64 Compiling\ ImageProcessors+Resize.swift,\ ImageProcessors+RoundedCorners.swift,\ ImageProcessors.swift,\ AsyncPipelineTask.swift,\ AsyncTask.swift /Users/admin/builder/spi-builder-workspace/.dependencies/checkouts/Nuke/Sources/Nuke/Processing/ImageProcessors+Resize.swift /Users/admin/builder/spi-builder-workspace/.dependencies/checkouts/Nuke/Sources/Nuke/Processing/ImageProcessors+RoundedCorners.swift /Users/admin/builder/spi-builder-workspace/.dependencies/checkouts/Nuke/Sources/Nuke/Processing/ImageProcessors.swift /Users/admin/builder/spi-builder-workspace/.dependencies/checkouts/Nuke/Sources/Nuke/Tasks/AsyncPipelineTask.swift /Users/admin/builder/spi-builder-workspace/.dependencies/checkouts/Nuke/Sources/Nuke/Tasks/AsyncTask.swift (in target 'Nuke' from project 'Nuke')
SwiftCompile normal arm64 /Users/admin/builder/spi-builder-workspace/.dependencies/checkouts/Nuke/Sources/Nuke/Processing/ImageProcessors+Resize.swift (in target 'Nuke' from project 'Nuke')
cd /Users/admin/builder/spi-builder-workspace/.swiftpm/xcode
SwiftCompile normal arm64 /Users/admin/builder/spi-builder-workspace/.dependencies/checkouts/Nuke/Sources/Nuke/Processing/ImageProcessors+RoundedCorners.swift (in target 'Nuke' from project 'Nuke')
cd /Users/admin/builder/spi-builder-workspace/.swiftpm/xcode
SwiftCompile normal arm64 /Users/admin/builder/spi-builder-workspace/.dependencies/checkouts/Nuke/Sources/Nuke/Processing/ImageProcessors.swift (in target 'Nuke' from project 'Nuke')
cd /Users/admin/builder/spi-builder-workspace/.swiftpm/xcode
SwiftCompile normal arm64 /Users/admin/builder/spi-builder-workspace/.dependencies/checkouts/Nuke/Sources/Nuke/Tasks/AsyncPipelineTask.swift (in target 'Nuke' from project 'Nuke')
cd /Users/admin/builder/spi-builder-workspace/.swiftpm/xcode
SwiftCompile normal arm64 /Users/admin/builder/spi-builder-workspace/.dependencies/checkouts/Nuke/Sources/Nuke/Tasks/AsyncTask.swift (in target 'Nuke' from project 'Nuke')
cd /Users/admin/builder/spi-builder-workspace/.swiftpm/xcode
SwiftCompile normal arm64 Compiling\ Atomic.swift,\ DataPublisher.swift,\ Extensions.swift,\ Graphics.swift,\ ImagePublisher.swift,\ ImageRequestKeys.swift /Users/admin/builder/spi-builder-workspace/.dependencies/checkouts/Nuke/Sources/Nuke/Internal/Atomic.swift /Users/admin/builder/spi-builder-workspace/.dependencies/checkouts/Nuke/Sources/Nuke/Internal/DataPublisher.swift /Users/admin/builder/spi-builder-workspace/.dependencies/checkouts/Nuke/Sources/Nuke/Internal/Extensions.swift /Users/admin/builder/spi-builder-workspace/.dependencies/checkouts/Nuke/Sources/Nuke/Internal/Graphics.swift /Users/admin/builder/spi-builder-workspace/.dependencies/checkouts/Nuke/Sources/Nuke/Internal/ImagePublisher.swift /Users/admin/builder/spi-builder-workspace/.dependencies/checkouts/Nuke/Sources/Nuke/Internal/ImageRequestKeys.swift (in target 'Nuke' from project 'Nuke')
SwiftCompile normal arm64 /Users/admin/builder/spi-builder-workspace/.dependencies/checkouts/Nuke/Sources/Nuke/Internal/Atomic.swift (in target 'Nuke' from project 'Nuke')
cd /Users/admin/builder/spi-builder-workspace/.swiftpm/xcode
SwiftCompile normal arm64 /Users/admin/builder/spi-builder-workspace/.dependencies/checkouts/Nuke/Sources/Nuke/Internal/DataPublisher.swift (in target 'Nuke' from project 'Nuke')
cd /Users/admin/builder/spi-builder-workspace/.swiftpm/xcode
SwiftCompile normal arm64 /Users/admin/builder/spi-builder-workspace/.dependencies/checkouts/Nuke/Sources/Nuke/Internal/Extensions.swift (in target 'Nuke' from project 'Nuke')
cd /Users/admin/builder/spi-builder-workspace/.swiftpm/xcode
SwiftCompile normal arm64 /Users/admin/builder/spi-builder-workspace/.dependencies/checkouts/Nuke/Sources/Nuke/Internal/Graphics.swift (in target 'Nuke' from project 'Nuke')
cd /Users/admin/builder/spi-builder-workspace/.swiftpm/xcode
SwiftCompile normal arm64 /Users/admin/builder/spi-builder-workspace/.dependencies/checkouts/Nuke/Sources/Nuke/Internal/ImagePublisher.swift (in target 'Nuke' from project 'Nuke')
cd /Users/admin/builder/spi-builder-workspace/.swiftpm/xcode
SwiftCompile normal arm64 /Users/admin/builder/spi-builder-workspace/.dependencies/checkouts/Nuke/Sources/Nuke/Internal/ImageRequestKeys.swift (in target 'Nuke' from project 'Nuke')
cd /Users/admin/builder/spi-builder-workspace/.swiftpm/xcode
SwiftCompile normal arm64 Compiling\ ImageProcessors+Anonymous.swift,\ ImageProcessors+Circle.swift,\ ImageProcessors+Composition.swift,\ ImageProcessors+CoreImage.swift,\ ImageProcessors+GaussianBlur.swift /Users/admin/builder/spi-builder-workspace/.dependencies/checkouts/Nuke/Sources/Nuke/Processing/ImageProcessors+Anonymous.swift /Users/admin/builder/spi-builder-workspace/.dependencies/checkouts/Nuke/Sources/Nuke/Processing/ImageProcessors+Circle.swift /Users/admin/builder/spi-builder-workspace/.dependencies/checkouts/Nuke/Sources/Nuke/Processing/ImageProcessors+Composition.swift /Users/admin/builder/spi-builder-workspace/.dependencies/checkouts/Nuke/Sources/Nuke/Processing/ImageProcessors+CoreImage.swift /Users/admin/builder/spi-builder-workspace/.dependencies/checkouts/Nuke/Sources/Nuke/Processing/ImageProcessors+GaussianBlur.swift (in target 'Nuke' from project 'Nuke')
SwiftCompile normal arm64 /Users/admin/builder/spi-builder-workspace/.dependencies/checkouts/Nuke/Sources/Nuke/Processing/ImageProcessors+Anonymous.swift (in target 'Nuke' from project 'Nuke')
cd /Users/admin/builder/spi-builder-workspace/.swiftpm/xcode
SwiftCompile normal arm64 /Users/admin/builder/spi-builder-workspace/.dependencies/checkouts/Nuke/Sources/Nuke/Processing/ImageProcessors+Circle.swift (in target 'Nuke' from project 'Nuke')
cd /Users/admin/builder/spi-builder-workspace/.swiftpm/xcode
SwiftCompile normal arm64 /Users/admin/builder/spi-builder-workspace/.dependencies/checkouts/Nuke/Sources/Nuke/Processing/ImageProcessors+Composition.swift (in target 'Nuke' from project 'Nuke')
cd /Users/admin/builder/spi-builder-workspace/.swiftpm/xcode
SwiftCompile normal arm64 /Users/admin/builder/spi-builder-workspace/.dependencies/checkouts/Nuke/Sources/Nuke/Processing/ImageProcessors+CoreImage.swift (in target 'Nuke' from project 'Nuke')
cd /Users/admin/builder/spi-builder-workspace/.swiftpm/xcode
SwiftCompile normal arm64 /Users/admin/builder/spi-builder-workspace/.dependencies/checkouts/Nuke/Sources/Nuke/Processing/ImageProcessors+GaussianBlur.swift (in target 'Nuke' from project 'Nuke')
cd /Users/admin/builder/spi-builder-workspace/.swiftpm/xcode
SwiftDriverJobDiscovery normal arm64 Emitting module for SwiftUISupportBackport (in target 'SwiftUISupportBackport' from project 'SwiftUISupport')
SwiftDriver\ Compilation\ Requirements SwiftUISupportBackport normal arm64 com.apple.xcode.tools.swift.compiler (in target 'SwiftUISupportBackport' from project 'SwiftUISupport')
cd /Users/admin/builder/spi-builder-workspace/.swiftpm/xcode
builtin-Swift-Compilation-Requirements -- /Applications/Xcode-16.3.0.app/Contents/Developer/Toolchains/XcodeDefault.xctoolchain/usr/bin/swiftc -module-name SwiftUISupportBackport -Onone -enforce-exclusivity\=checked @/Users/admin/builder/spi-builder-workspace/.derivedData/Build/Intermediates.noindex/SwiftUISupport.build/Debug-xros/SwiftUISupportBackport.build/Objects-normal/arm64/SwiftUISupportBackport.SwiftFileList -DSWIFT_PACKAGE -DDEBUG -DXcode -plugin-path /Applications/Xcode-16.3.0.app/Contents/Developer/Toolchains/XcodeDefault.xctoolchain/usr/lib/swift/host/plugins/testing -enable-experimental-feature DebugDescriptionMacro -sdk /Applications/Xcode-16.3.0.app/Contents/Developer/Platforms/XROS.platform/Developer/SDKs/XROS2.4.sdk -target arm64-apple-xros1.0 -g -module-cache-path /Users/admin/builder/spi-builder-workspace/.derivedData/ModuleCache.noindex -Xfrontend -serialize-debugging-options -profile-coverage-mapping -profile-generate -enable-testing -suppress-warnings -index-store-path /Users/admin/builder/spi-builder-workspace/.derivedData/Index.noindex/DataStore -swift-version 6 -I /Users/admin/builder/spi-builder-workspace/.derivedData/Build/Products/Debug-xros -I /Applications/Xcode-16.3.0.app/Contents/Developer/Platforms/XROS.platform/Developer/usr/lib -F /Users/admin/builder/spi-builder-workspace/.derivedData/Build/Products/Debug-xros -F /Applications/Xcode-16.3.0.app/Contents/Developer/Platforms/XROS.platform/Developer/Library/Frameworks -F /Applications/Xcode-16.3.0.app/Contents/Developer/Platforms/XROS.platform/Developer/SDKs/XROS2.4.sdk/Developer/Library/Frameworks -c -j10 -enable-batch-mode -incremental -Xcc -ivfsstatcache -Xcc /Users/admin/builder/spi-builder-workspace/.derivedData/SDKStatCaches.noindex/xros2.4-22O233-407b76dbb837030756cbe1ab3f0b01b6.sdkstatcache -output-file-map /Users/admin/builder/spi-builder-workspace/.derivedData/Build/Intermediates.noindex/SwiftUISupport.build/Debug-xros/SwiftUISupportBackport.build/Objects-normal/arm64/SwiftUISupportBackport-OutputFileMap.json -use-frontend-parseable-output -save-temps -no-color-diagnostics -serialize-diagnostics -emit-dependencies -emit-module -emit-module-path /Users/admin/builder/spi-builder-workspace/.derivedData/Build/Intermediates.noindex/SwiftUISupport.build/Debug-xros/SwiftUISupportBackport.build/Objects-normal/arm64/SwiftUISupportBackport.swiftmodule -user-module-version 0.13.0 -validate-clang-modules-once -clang-build-session-file /Users/admin/builder/spi-builder-workspace/.derivedData/ModuleCache.noindex/Session.modulevalidation -package-name swiftui_support -Xcc -I/Users/admin/builder/spi-builder-workspace/.derivedData/Build/Intermediates.noindex/SwiftUISupport.build/Debug-xros/SwiftUISupportBackport.build/swift-overrides.hmap -emit-const-values -Xfrontend -const-gather-protocols-file -Xfrontend /Users/admin/builder/spi-builder-workspace/.derivedData/Build/Intermediates.noindex/SwiftUISupport.build/Debug-xros/SwiftUISupportBackport.build/Objects-normal/arm64/SwiftUISupportBackport_const_extract_protocols.json -Xcc -I/Users/admin/builder/spi-builder-workspace/.derivedData/Build/Products/Debug-xros/include -Xcc -I/Users/admin/builder/spi-builder-workspace/.derivedData/Build/Intermediates.noindex/SwiftUISupport.build/Debug-xros/SwiftUISupportBackport.build/DerivedSources-normal/arm64 -Xcc -I/Users/admin/builder/spi-builder-workspace/.derivedData/Build/Intermediates.noindex/SwiftUISupport.build/Debug-xros/SwiftUISupportBackport.build/DerivedSources/arm64 -Xcc -I/Users/admin/builder/spi-builder-workspace/.derivedData/Build/Intermediates.noindex/SwiftUISupport.build/Debug-xros/SwiftUISupportBackport.build/DerivedSources -Xcc -DSWIFT_PACKAGE -Xcc -DDEBUG\=1 -emit-objc-header -emit-objc-header-path /Users/admin/builder/spi-builder-workspace/.derivedData/Build/Intermediates.noindex/SwiftUISupport.build/Debug-xros/SwiftUISupportBackport.build/Objects-normal/arm64/SwiftUISupportBackport-Swift.h -working-directory /Users/admin/builder/spi-builder-workspace/.swiftpm/xcode -experimental-emit-module-separately -disable-cmo
SwiftDriverJobDiscovery normal arm64 Compiling ImageDecoderRegistry.swift, ImageDecoders+Default.swift, ImageDecoders+Empty.swift, ImageDecoding.swift, ImageEncoders+Default.swift, ImageEncoders+ImageIO.swift (in target 'Nuke' from project 'Nuke')
SwiftCompile normal arm64 Compiling\ TaskFetchOriginalData.swift,\ TaskFetchOriginalImage.swift,\ TaskFetchWithPublisher.swift,\ TaskLoadData.swift,\ TaskLoadImage.swift /Users/admin/builder/spi-builder-workspace/.dependencies/checkouts/Nuke/Sources/Nuke/Tasks/TaskFetchOriginalData.swift /Users/admin/builder/spi-builder-workspace/.dependencies/checkouts/Nuke/Sources/Nuke/Tasks/TaskFetchOriginalImage.swift /Users/admin/builder/spi-builder-workspace/.dependencies/checkouts/Nuke/Sources/Nuke/Tasks/TaskFetchWithPublisher.swift /Users/admin/builder/spi-builder-workspace/.dependencies/checkouts/Nuke/Sources/Nuke/Tasks/TaskLoadData.swift /Users/admin/builder/spi-builder-workspace/.dependencies/checkouts/Nuke/Sources/Nuke/Tasks/TaskLoadImage.swift (in target 'Nuke' from project 'Nuke')
SwiftCompile normal arm64 /Users/admin/builder/spi-builder-workspace/.dependencies/checkouts/Nuke/Sources/Nuke/Tasks/TaskFetchOriginalData.swift (in target 'Nuke' from project 'Nuke')
cd /Users/admin/builder/spi-builder-workspace/.swiftpm/xcode
SwiftCompile normal arm64 /Users/admin/builder/spi-builder-workspace/.dependencies/checkouts/Nuke/Sources/Nuke/Tasks/TaskFetchOriginalImage.swift (in target 'Nuke' from project 'Nuke')
cd /Users/admin/builder/spi-builder-workspace/.swiftpm/xcode
SwiftCompile normal arm64 /Users/admin/builder/spi-builder-workspace/.dependencies/checkouts/Nuke/Sources/Nuke/Tasks/TaskFetchWithPublisher.swift (in target 'Nuke' from project 'Nuke')
cd /Users/admin/builder/spi-builder-workspace/.swiftpm/xcode
SwiftCompile normal arm64 /Users/admin/builder/spi-builder-workspace/.dependencies/checkouts/Nuke/Sources/Nuke/Tasks/TaskLoadData.swift (in target 'Nuke' from project 'Nuke')
cd /Users/admin/builder/spi-builder-workspace/.swiftpm/xcode
SwiftCompile normal arm64 /Users/admin/builder/spi-builder-workspace/.dependencies/checkouts/Nuke/Sources/Nuke/Tasks/TaskLoadImage.swift (in target 'Nuke' from project 'Nuke')
cd /Users/admin/builder/spi-builder-workspace/.swiftpm/xcode
Copy /Users/admin/builder/spi-builder-workspace/.derivedData/Build/Products/Debug-xros/SwiftUISupportBackport.swiftmodule/arm64-apple-xros.abi.json /Users/admin/builder/spi-builder-workspace/.derivedData/Build/Intermediates.noindex/SwiftUISupport.build/Debug-xros/SwiftUISupportBackport.build/Objects-normal/arm64/SwiftUISupportBackport.abi.json (in target 'SwiftUISupportBackport' from project 'SwiftUISupport')
cd /Users/admin/builder/spi-builder-workspace/.dependencies/checkouts/swiftui-support
builtin-copy -exclude .DS_Store -exclude CVS -exclude .svn -exclude .git -exclude .hg -resolve-src-symlinks -rename /Users/admin/builder/spi-builder-workspace/.derivedData/Build/Intermediates.noindex/SwiftUISupport.build/Debug-xros/SwiftUISupportBackport.build/Objects-normal/arm64/SwiftUISupportBackport.abi.json /Users/admin/builder/spi-builder-workspace/.derivedData/Build/Products/Debug-xros/SwiftUISupportBackport.swiftmodule/arm64-apple-xros.abi.json
SwiftDriverJobDiscovery normal arm64 Compiling ImageProcessors+Resize.swift, ImageProcessors+RoundedCorners.swift, ImageProcessors.swift, AsyncPipelineTask.swift, AsyncTask.swift (in target 'Nuke' from project 'Nuke')
SwiftCompile normal arm64 Compiling\ ImagePipeline.swift,\ ImagePrefetcher.swift,\ ImageDecompression.swift,\ ImageProcessing.swift,\ ImageProcessingOptions.swift /Users/admin/builder/spi-builder-workspace/.dependencies/checkouts/Nuke/Sources/Nuke/Pipeline/ImagePipeline.swift /Users/admin/builder/spi-builder-workspace/.dependencies/checkouts/Nuke/Sources/Nuke/Prefetching/ImagePrefetcher.swift /Users/admin/builder/spi-builder-workspace/.dependencies/checkouts/Nuke/Sources/Nuke/Processing/ImageDecompression.swift /Users/admin/builder/spi-builder-workspace/.dependencies/checkouts/Nuke/Sources/Nuke/Processing/ImageProcessing.swift /Users/admin/builder/spi-builder-workspace/.dependencies/checkouts/Nuke/Sources/Nuke/Processing/ImageProcessingOptions.swift (in target 'Nuke' from project 'Nuke')
SwiftCompile normal arm64 /Users/admin/builder/spi-builder-workspace/.dependencies/checkouts/Nuke/Sources/Nuke/Pipeline/ImagePipeline.swift (in target 'Nuke' from project 'Nuke')
cd /Users/admin/builder/spi-builder-workspace/.swiftpm/xcode
SwiftCompile normal arm64 /Users/admin/builder/spi-builder-workspace/.dependencies/checkouts/Nuke/Sources/Nuke/Prefetching/ImagePrefetcher.swift (in target 'Nuke' from project 'Nuke')
cd /Users/admin/builder/spi-builder-workspace/.swiftpm/xcode
SwiftCompile normal arm64 /Users/admin/builder/spi-builder-workspace/.dependencies/checkouts/Nuke/Sources/Nuke/Processing/ImageDecompression.swift (in target 'Nuke' from project 'Nuke')
cd /Users/admin/builder/spi-builder-workspace/.swiftpm/xcode
SwiftCompile normal arm64 /Users/admin/builder/spi-builder-workspace/.dependencies/checkouts/Nuke/Sources/Nuke/Processing/ImageProcessing.swift (in target 'Nuke' from project 'Nuke')
cd /Users/admin/builder/spi-builder-workspace/.swiftpm/xcode
SwiftCompile normal arm64 /Users/admin/builder/spi-builder-workspace/.dependencies/checkouts/Nuke/Sources/Nuke/Processing/ImageProcessingOptions.swift (in target 'Nuke' from project 'Nuke')
cd /Users/admin/builder/spi-builder-workspace/.swiftpm/xcode
SwiftCompile normal arm64 Compiling\ LinkedList.swift,\ Log.swift,\ Operation.swift,\ RateLimiter.swift,\ ResumableData.swift,\ DataLoader.swift /Users/admin/builder/spi-builder-workspace/.dependencies/checkouts/Nuke/Sources/Nuke/Internal/LinkedList.swift /Users/admin/builder/spi-builder-workspace/.dependencies/checkouts/Nuke/Sources/Nuke/Internal/Log.swift /Users/admin/builder/spi-builder-workspace/.dependencies/checkouts/Nuke/Sources/Nuke/Internal/Operation.swift /Users/admin/builder/spi-builder-workspace/.dependencies/checkouts/Nuke/Sources/Nuke/Internal/RateLimiter.swift /Users/admin/builder/spi-builder-workspace/.dependencies/checkouts/Nuke/Sources/Nuke/Internal/ResumableData.swift /Users/admin/builder/spi-builder-workspace/.dependencies/checkouts/Nuke/Sources/Nuke/Loading/DataLoader.swift (in target 'Nuke' from project 'Nuke')
SwiftCompile normal arm64 /Users/admin/builder/spi-builder-workspace/.dependencies/checkouts/Nuke/Sources/Nuke/Internal/LinkedList.swift (in target 'Nuke' from project 'Nuke')
cd /Users/admin/builder/spi-builder-workspace/.swiftpm/xcode
SwiftCompile normal arm64 /Users/admin/builder/spi-builder-workspace/.dependencies/checkouts/Nuke/Sources/Nuke/Internal/Log.swift (in target 'Nuke' from project 'Nuke')
cd /Users/admin/builder/spi-builder-workspace/.swiftpm/xcode
SwiftCompile normal arm64 /Users/admin/builder/spi-builder-workspace/.dependencies/checkouts/Nuke/Sources/Nuke/Internal/Operation.swift (in target 'Nuke' from project 'Nuke')
cd /Users/admin/builder/spi-builder-workspace/.swiftpm/xcode
SwiftCompile normal arm64 /Users/admin/builder/spi-builder-workspace/.dependencies/checkouts/Nuke/Sources/Nuke/Internal/RateLimiter.swift (in target 'Nuke' from project 'Nuke')
cd /Users/admin/builder/spi-builder-workspace/.swiftpm/xcode
SwiftCompile normal arm64 /Users/admin/builder/spi-builder-workspace/.dependencies/checkouts/Nuke/Sources/Nuke/Internal/ResumableData.swift (in target 'Nuke' from project 'Nuke')
cd /Users/admin/builder/spi-builder-workspace/.swiftpm/xcode
SwiftCompile normal arm64 /Users/admin/builder/spi-builder-workspace/.dependencies/checkouts/Nuke/Sources/Nuke/Loading/DataLoader.swift (in target 'Nuke' from project 'Nuke')
cd /Users/admin/builder/spi-builder-workspace/.swiftpm/xcode
SwiftDriverJobDiscovery normal arm64 Compiling ImageProcessors+Anonymous.swift, ImageProcessors+Circle.swift, ImageProcessors+Composition.swift, ImageProcessors+CoreImage.swift, ImageProcessors+GaussianBlur.swift (in target 'Nuke' from project 'Nuke')
SwiftDriver AsyncMultiplexImage normal arm64 com.apple.xcode.tools.swift.compiler (in target 'AsyncMultiplexImage' from project 'AsyncMultiplexImage')
cd /Users/admin/builder/spi-builder-workspace/.swiftpm/xcode
builtin-SwiftDriver -- /Applications/Xcode-16.3.0.app/Contents/Developer/Toolchains/XcodeDefault.xctoolchain/usr/bin/swiftc -module-name AsyncMultiplexImage -Onone -enforce-exclusivity\=checked @/Users/admin/builder/spi-builder-workspace/.derivedData/Build/Intermediates.noindex/AsyncMultiplexImage.build/Debug-xros/AsyncMultiplexImage.build/Objects-normal/arm64/AsyncMultiplexImage.SwiftFileList -DSWIFT_PACKAGE -DDEBUG -DXcode -plugin-path /Applications/Xcode-16.3.0.app/Contents/Developer/Toolchains/XcodeDefault.xctoolchain/usr/lib/swift/host/plugins/testing -enable-experimental-feature DebugDescriptionMacro -sdk /Applications/Xcode-16.3.0.app/Contents/Developer/Platforms/XROS.platform/Developer/SDKs/XROS2.4.sdk -target arm64-apple-xros1.0 -g -module-cache-path /Users/admin/builder/spi-builder-workspace/.derivedData/ModuleCache.noindex -Xfrontend -serialize-debugging-options -profile-coverage-mapping -profile-generate -enable-testing -index-store-path /Users/admin/builder/spi-builder-workspace/.derivedData/Index.noindex/DataStore -swift-version 6 -I /Users/admin/builder/spi-builder-workspace/.derivedData/Build/Products/Debug-xros -I /Applications/Xcode-16.3.0.app/Contents/Developer/Platforms/XROS.platform/Developer/usr/lib -F /Users/admin/builder/spi-builder-workspace/.derivedData/Build/Products/Debug-xros/PackageFrameworks -F /Users/admin/builder/spi-builder-workspace/.derivedData/Build/Products/Debug-xros -F /Applications/Xcode-16.3.0.app/Contents/Developer/Platforms/XROS.platform/Developer/Library/Frameworks -F /Applications/Xcode-16.3.0.app/Contents/Developer/Platforms/XROS.platform/Developer/SDKs/XROS2.4.sdk/Developer/Library/Frameworks -c -j10 -enable-batch-mode -incremental -Xcc -ivfsstatcache -Xcc /Users/admin/builder/spi-builder-workspace/.derivedData/SDKStatCaches.noindex/xros2.4-22O233-407b76dbb837030756cbe1ab3f0b01b6.sdkstatcache -output-file-map /Users/admin/builder/spi-builder-workspace/.derivedData/Build/Intermediates.noindex/AsyncMultiplexImage.build/Debug-xros/AsyncMultiplexImage.build/Objects-normal/arm64/AsyncMultiplexImage-OutputFileMap.json -use-frontend-parseable-output -save-temps -no-color-diagnostics -serialize-diagnostics -emit-dependencies -emit-module -emit-module-path /Users/admin/builder/spi-builder-workspace/.derivedData/Build/Intermediates.noindex/AsyncMultiplexImage.build/Debug-xros/AsyncMultiplexImage.build/Objects-normal/arm64/AsyncMultiplexImage.swiftmodule -validate-clang-modules-once -clang-build-session-file /Users/admin/builder/spi-builder-workspace/.derivedData/ModuleCache.noindex/Session.modulevalidation -package-name spi_builder_workspace -Xcc -I/Users/admin/builder/spi-builder-workspace/.derivedData/Build/Intermediates.noindex/AsyncMultiplexImage.build/Debug-xros/AsyncMultiplexImage.build/swift-overrides.hmap -emit-const-values -Xfrontend -const-gather-protocols-file -Xfrontend /Users/admin/builder/spi-builder-workspace/.derivedData/Build/Intermediates.noindex/AsyncMultiplexImage.build/Debug-xros/AsyncMultiplexImage.build/Objects-normal/arm64/AsyncMultiplexImage_const_extract_protocols.json -Xcc -I/Users/admin/builder/spi-builder-workspace/.derivedData/Build/Products/Debug-xros/include -Xcc -I/Users/admin/builder/spi-builder-workspace/.derivedData/Build/Intermediates.noindex/AsyncMultiplexImage.build/Debug-xros/AsyncMultiplexImage.build/DerivedSources-normal/arm64 -Xcc -I/Users/admin/builder/spi-builder-workspace/.derivedData/Build/Intermediates.noindex/AsyncMultiplexImage.build/Debug-xros/AsyncMultiplexImage.build/DerivedSources/arm64 -Xcc -I/Users/admin/builder/spi-builder-workspace/.derivedData/Build/Intermediates.noindex/AsyncMultiplexImage.build/Debug-xros/AsyncMultiplexImage.build/DerivedSources -Xcc -DSWIFT_PACKAGE -Xcc -DDEBUG\=1 -emit-objc-header -emit-objc-header-path /Users/admin/builder/spi-builder-workspace/.derivedData/Build/Intermediates.noindex/AsyncMultiplexImage.build/Debug-xros/AsyncMultiplexImage.build/Objects-normal/arm64/AsyncMultiplexImage-Swift.h -working-directory /Users/admin/builder/spi-builder-workspace/.swiftpm/xcode -experimental-emit-module-separately -disable-cmo
SwiftDriverJobDiscovery normal arm64 Emitting module for Nuke (in target 'Nuke' from project 'Nuke')
SwiftDriver\ Compilation\ Requirements Nuke normal arm64 com.apple.xcode.tools.swift.compiler (in target 'Nuke' from project 'Nuke')
cd /Users/admin/builder/spi-builder-workspace/.swiftpm/xcode
builtin-Swift-Compilation-Requirements -- /Applications/Xcode-16.3.0.app/Contents/Developer/Toolchains/XcodeDefault.xctoolchain/usr/bin/swiftc -module-name Nuke -Onone -enforce-exclusivity\=checked @/Users/admin/builder/spi-builder-workspace/.derivedData/Build/Intermediates.noindex/Nuke.build/Debug-xros/Nuke.build/Objects-normal/arm64/Nuke.SwiftFileList -DSWIFT_PACKAGE -DDEBUG -DXcode -plugin-path /Applications/Xcode-16.3.0.app/Contents/Developer/Toolchains/XcodeDefault.xctoolchain/usr/lib/swift/host/plugins/testing -enable-experimental-feature DebugDescriptionMacro -sdk /Applications/Xcode-16.3.0.app/Contents/Developer/Platforms/XROS.platform/Developer/SDKs/XROS2.4.sdk -target arm64-apple-xros1.0 -g -module-cache-path /Users/admin/builder/spi-builder-workspace/.derivedData/ModuleCache.noindex -Xfrontend -serialize-debugging-options -profile-coverage-mapping -profile-generate -enable-testing -suppress-warnings -index-store-path /Users/admin/builder/spi-builder-workspace/.derivedData/Index.noindex/DataStore -swift-version 5 -I /Users/admin/builder/spi-builder-workspace/.derivedData/Build/Products/Debug-xros -I /Applications/Xcode-16.3.0.app/Contents/Developer/Platforms/XROS.platform/Developer/usr/lib -F /Users/admin/builder/spi-builder-workspace/.derivedData/Build/Products/Debug-xros -F /Applications/Xcode-16.3.0.app/Contents/Developer/Platforms/XROS.platform/Developer/Library/Frameworks -F /Applications/Xcode-16.3.0.app/Contents/Developer/Platforms/XROS.platform/Developer/SDKs/XROS2.4.sdk/Developer/Library/Frameworks -c -j10 -enable-batch-mode -incremental -Xcc -ivfsstatcache -Xcc /Users/admin/builder/spi-builder-workspace/.derivedData/SDKStatCaches.noindex/xros2.4-22O233-407b76dbb837030756cbe1ab3f0b01b6.sdkstatcache -output-file-map /Users/admin/builder/spi-builder-workspace/.derivedData/Build/Intermediates.noindex/Nuke.build/Debug-xros/Nuke.build/Objects-normal/arm64/Nuke-OutputFileMap.json -use-frontend-parseable-output -save-temps -no-color-diagnostics -serialize-diagnostics -emit-dependencies -emit-module -emit-module-path /Users/admin/builder/spi-builder-workspace/.derivedData/Build/Intermediates.noindex/Nuke.build/Debug-xros/Nuke.build/Objects-normal/arm64/Nuke.swiftmodule -validate-clang-modules-once -clang-build-session-file /Users/admin/builder/spi-builder-workspace/.derivedData/ModuleCache.noindex/Session.modulevalidation -package-name nuke -Xcc -I/Users/admin/builder/spi-builder-workspace/.derivedData/Build/Intermediates.noindex/Nuke.build/Debug-xros/Nuke.build/swift-overrides.hmap -emit-const-values -Xfrontend -const-gather-protocols-file -Xfrontend /Users/admin/builder/spi-builder-workspace/.derivedData/Build/Intermediates.noindex/Nuke.build/Debug-xros/Nuke.build/Objects-normal/arm64/Nuke_const_extract_protocols.json -Xcc -I/Users/admin/builder/spi-builder-workspace/.derivedData/Build/Products/Debug-xros/include -Xcc -I/Users/admin/builder/spi-builder-workspace/.derivedData/Build/Intermediates.noindex/Nuke.build/Debug-xros/Nuke.build/DerivedSources-normal/arm64 -Xcc -I/Users/admin/builder/spi-builder-workspace/.derivedData/Build/Intermediates.noindex/Nuke.build/Debug-xros/Nuke.build/DerivedSources/arm64 -Xcc -I/Users/admin/builder/spi-builder-workspace/.derivedData/Build/Intermediates.noindex/Nuke.build/Debug-xros/Nuke.build/DerivedSources -Xcc -DSWIFT_PACKAGE -Xcc -DDEBUG\=1 -emit-objc-header -emit-objc-header-path /Users/admin/builder/spi-builder-workspace/.derivedData/Build/Intermediates.noindex/Nuke.build/Debug-xros/Nuke.build/Objects-normal/arm64/Nuke-Swift.h -working-directory /Users/admin/builder/spi-builder-workspace/.swiftpm/xcode -experimental-emit-module-separately -disable-cmo
SwiftCompile normal arm64 Compiling\ DataLoading.swift,\ ImagePipeline+Cache.swift,\ ImagePipeline+Configuration.swift,\ ImagePipeline+Delegate.swift,\ ImagePipeline+Error.swift /Users/admin/builder/spi-builder-workspace/.dependencies/checkouts/Nuke/Sources/Nuke/Loading/DataLoading.swift /Users/admin/builder/spi-builder-workspace/.dependencies/checkouts/Nuke/Sources/Nuke/Pipeline/ImagePipeline+Cache.swift /Users/admin/builder/spi-builder-workspace/.dependencies/checkouts/Nuke/Sources/Nuke/Pipeline/ImagePipeline+Configuration.swift /Users/admin/builder/spi-builder-workspace/.dependencies/checkouts/Nuke/Sources/Nuke/Pipeline/ImagePipeline+Delegate.swift /Users/admin/builder/spi-builder-workspace/.dependencies/checkouts/Nuke/Sources/Nuke/Pipeline/ImagePipeline+Error.swift (in target 'Nuke' from project 'Nuke')
SwiftCompile normal arm64 /Users/admin/builder/spi-builder-workspace/.dependencies/checkouts/Nuke/Sources/Nuke/Loading/DataLoading.swift (in target 'Nuke' from project 'Nuke')
cd /Users/admin/builder/spi-builder-workspace/.swiftpm/xcode
SwiftCompile normal arm64 /Users/admin/builder/spi-builder-workspace/.dependencies/checkouts/Nuke/Sources/Nuke/Pipeline/ImagePipeline+Cache.swift (in target 'Nuke' from project 'Nuke')
cd /Users/admin/builder/spi-builder-workspace/.swiftpm/xcode
SwiftCompile normal arm64 /Users/admin/builder/spi-builder-workspace/.dependencies/checkouts/Nuke/Sources/Nuke/Pipeline/ImagePipeline+Configuration.swift (in target 'Nuke' from project 'Nuke')
cd /Users/admin/builder/spi-builder-workspace/.swiftpm/xcode
SwiftCompile normal arm64 /Users/admin/builder/spi-builder-workspace/.dependencies/checkouts/Nuke/Sources/Nuke/Pipeline/ImagePipeline+Delegate.swift (in target 'Nuke' from project 'Nuke')
cd /Users/admin/builder/spi-builder-workspace/.swiftpm/xcode
SwiftCompile normal arm64 /Users/admin/builder/spi-builder-workspace/.dependencies/checkouts/Nuke/Sources/Nuke/Pipeline/ImagePipeline+Error.swift (in target 'Nuke' from project 'Nuke')
cd /Users/admin/builder/spi-builder-workspace/.swiftpm/xcode
Copy /Users/admin/builder/spi-builder-workspace/.derivedData/Build/Products/Debug-xros/Nuke.swiftmodule/arm64-apple-xros.abi.json /Users/admin/builder/spi-builder-workspace/.derivedData/Build/Intermediates.noindex/Nuke.build/Debug-xros/Nuke.build/Objects-normal/arm64/Nuke.abi.json (in target 'Nuke' from project 'Nuke')
cd /Users/admin/builder/spi-builder-workspace/.dependencies/checkouts/Nuke
builtin-copy -exclude .DS_Store -exclude CVS -exclude .svn -exclude .git -exclude .hg -resolve-src-symlinks -rename /Users/admin/builder/spi-builder-workspace/.derivedData/Build/Intermediates.noindex/Nuke.build/Debug-xros/Nuke.build/Objects-normal/arm64/Nuke.abi.json /Users/admin/builder/spi-builder-workspace/.derivedData/Build/Products/Debug-xros/Nuke.swiftmodule/arm64-apple-xros.abi.json
SwiftDriverJobDiscovery normal arm64 Compiling Cache.swift, DataCache.swift, DataCaching.swift, ImageCache.swift, ImageCaching.swift, AssetType.swift (in target 'Nuke' from project 'Nuke')
SwiftEmitModule normal arm64 Emitting\ module\ for\ AsyncMultiplexImage (in target 'AsyncMultiplexImage' from project 'AsyncMultiplexImage')
EmitSwiftModule normal arm64 (in target 'AsyncMultiplexImage' from project 'AsyncMultiplexImage')
cd /Users/admin/builder/spi-builder-workspace/.swiftpm/xcode
SwiftCompile normal arm64 Compiling\ AsyncMultiplexImageContent.swift /Users/admin/builder/spi-builder-workspace/Sources/AsyncMultiplexImage/AsyncMultiplexImageContent.swift (in target 'AsyncMultiplexImage' from project 'AsyncMultiplexImage')
SwiftCompile normal arm64 /Users/admin/builder/spi-builder-workspace/Sources/AsyncMultiplexImage/AsyncMultiplexImageContent.swift (in target 'AsyncMultiplexImage' from project 'AsyncMultiplexImage')
cd /Users/admin/builder/spi-builder-workspace/.swiftpm/xcode
SwiftDriverJobDiscovery normal arm64 Compiling Atomic.swift, DataPublisher.swift, Extensions.swift, Graphics.swift, ImagePublisher.swift, ImageRequestKeys.swift (in target 'Nuke' from project 'Nuke')
SwiftCompile normal arm64 Compiling\ AsyncMultiplexImage.swift /Users/admin/builder/spi-builder-workspace/Sources/AsyncMultiplexImage/AsyncMultiplexImage.swift (in target 'AsyncMultiplexImage' from project 'AsyncMultiplexImage')
SwiftCompile normal arm64 /Users/admin/builder/spi-builder-workspace/Sources/AsyncMultiplexImage/AsyncMultiplexImage.swift (in target 'AsyncMultiplexImage' from project 'AsyncMultiplexImage')
cd /Users/admin/builder/spi-builder-workspace/.swiftpm/xcode
SwiftDriverJobDiscovery normal arm64 Emitting module for AsyncMultiplexImage (in target 'AsyncMultiplexImage' from project 'AsyncMultiplexImage')
SwiftDriver\ Compilation\ Requirements AsyncMultiplexImage normal arm64 com.apple.xcode.tools.swift.compiler (in target 'AsyncMultiplexImage' from project 'AsyncMultiplexImage')
cd /Users/admin/builder/spi-builder-workspace/.swiftpm/xcode
builtin-Swift-Compilation-Requirements -- /Applications/Xcode-16.3.0.app/Contents/Developer/Toolchains/XcodeDefault.xctoolchain/usr/bin/swiftc -module-name AsyncMultiplexImage -Onone -enforce-exclusivity\=checked @/Users/admin/builder/spi-builder-workspace/.derivedData/Build/Intermediates.noindex/AsyncMultiplexImage.build/Debug-xros/AsyncMultiplexImage.build/Objects-normal/arm64/AsyncMultiplexImage.SwiftFileList -DSWIFT_PACKAGE -DDEBUG -DXcode -plugin-path /Applications/Xcode-16.3.0.app/Contents/Developer/Toolchains/XcodeDefault.xctoolchain/usr/lib/swift/host/plugins/testing -enable-experimental-feature DebugDescriptionMacro -sdk /Applications/Xcode-16.3.0.app/Contents/Developer/Platforms/XROS.platform/Developer/SDKs/XROS2.4.sdk -target arm64-apple-xros1.0 -g -module-cache-path /Users/admin/builder/spi-builder-workspace/.derivedData/ModuleCache.noindex -Xfrontend -serialize-debugging-options -profile-coverage-mapping -profile-generate -enable-testing -index-store-path /Users/admin/builder/spi-builder-workspace/.derivedData/Index.noindex/DataStore -swift-version 6 -I /Users/admin/builder/spi-builder-workspace/.derivedData/Build/Products/Debug-xros -I /Applications/Xcode-16.3.0.app/Contents/Developer/Platforms/XROS.platform/Developer/usr/lib -F /Users/admin/builder/spi-builder-workspace/.derivedData/Build/Products/Debug-xros/PackageFrameworks -F /Users/admin/builder/spi-builder-workspace/.derivedData/Build/Products/Debug-xros -F /Applications/Xcode-16.3.0.app/Contents/Developer/Platforms/XROS.platform/Developer/Library/Frameworks -F /Applications/Xcode-16.3.0.app/Contents/Developer/Platforms/XROS.platform/Developer/SDKs/XROS2.4.sdk/Developer/Library/Frameworks -c -j10 -enable-batch-mode -incremental -Xcc -ivfsstatcache -Xcc /Users/admin/builder/spi-builder-workspace/.derivedData/SDKStatCaches.noindex/xros2.4-22O233-407b76dbb837030756cbe1ab3f0b01b6.sdkstatcache -output-file-map /Users/admin/builder/spi-builder-workspace/.derivedData/Build/Intermediates.noindex/AsyncMultiplexImage.build/Debug-xros/AsyncMultiplexImage.build/Objects-normal/arm64/AsyncMultiplexImage-OutputFileMap.json -use-frontend-parseable-output -save-temps -no-color-diagnostics -serialize-diagnostics -emit-dependencies -emit-module -emit-module-path /Users/admin/builder/spi-builder-workspace/.derivedData/Build/Intermediates.noindex/AsyncMultiplexImage.build/Debug-xros/AsyncMultiplexImage.build/Objects-normal/arm64/AsyncMultiplexImage.swiftmodule -validate-clang-modules-once -clang-build-session-file /Users/admin/builder/spi-builder-workspace/.derivedData/ModuleCache.noindex/Session.modulevalidation -package-name spi_builder_workspace -Xcc -I/Users/admin/builder/spi-builder-workspace/.derivedData/Build/Intermediates.noindex/AsyncMultiplexImage.build/Debug-xros/AsyncMultiplexImage.build/swift-overrides.hmap -emit-const-values -Xfrontend -const-gather-protocols-file -Xfrontend /Users/admin/builder/spi-builder-workspace/.derivedData/Build/Intermediates.noindex/AsyncMultiplexImage.build/Debug-xros/AsyncMultiplexImage.build/Objects-normal/arm64/AsyncMultiplexImage_const_extract_protocols.json -Xcc -I/Users/admin/builder/spi-builder-workspace/.derivedData/Build/Products/Debug-xros/include -Xcc -I/Users/admin/builder/spi-builder-workspace/.derivedData/Build/Intermediates.noindex/AsyncMultiplexImage.build/Debug-xros/AsyncMultiplexImage.build/DerivedSources-normal/arm64 -Xcc -I/Users/admin/builder/spi-builder-workspace/.derivedData/Build/Intermediates.noindex/AsyncMultiplexImage.build/Debug-xros/AsyncMultiplexImage.build/DerivedSources/arm64 -Xcc -I/Users/admin/builder/spi-builder-workspace/.derivedData/Build/Intermediates.noindex/AsyncMultiplexImage.build/Debug-xros/AsyncMultiplexImage.build/DerivedSources -Xcc -DSWIFT_PACKAGE -Xcc -DDEBUG\=1 -emit-objc-header -emit-objc-header-path /Users/admin/builder/spi-builder-workspace/.derivedData/Build/Intermediates.noindex/AsyncMultiplexImage.build/Debug-xros/AsyncMultiplexImage.build/Objects-normal/arm64/AsyncMultiplexImage-Swift.h -working-directory /Users/admin/builder/spi-builder-workspace/.swiftpm/xcode -experimental-emit-module-separately -disable-cmo
SwiftDriverJobDiscovery normal arm64 Compiling TaskFetchOriginalData.swift, TaskFetchOriginalImage.swift, TaskFetchWithPublisher.swift, TaskLoadData.swift, TaskLoadImage.swift (in target 'Nuke' from project 'Nuke')
SwiftCompile normal arm64 Compiling\ AsyncMultiplexImageView.swift /Users/admin/builder/spi-builder-workspace/Sources/AsyncMultiplexImage/AsyncMultiplexImageView.swift (in target 'AsyncMultiplexImage' from project 'AsyncMultiplexImage')
Failed frontend command:
/Applications/Xcode-16.3.0.app/Contents/Developer/Toolchains/XcodeDefault.xctoolchain/usr/bin/swift-frontend -frontend -c /Users/admin/builder/spi-builder-workspace/Sources/AsyncMultiplexImage/AsyncMultiplexImage.swift /Users/admin/builder/spi-builder-workspace/Sources/AsyncMultiplexImage/AsyncMultiplexImageContent.swift -primary-file /Users/admin/builder/spi-builder-workspace/Sources/AsyncMultiplexImage/AsyncMultiplexImageView.swift /Users/admin/builder/spi-builder-workspace/Sources/AsyncMultiplexImage/DownloadManager.swift /Users/admin/builder/spi-builder-workspace/Sources/AsyncMultiplexImage/MultiplexImage.swift -emit-dependencies-path /Users/admin/builder/spi-builder-workspace/.derivedData/Build/Intermediates.noindex/AsyncMultiplexImage.build/Debug-xros/AsyncMultiplexImage.build/Objects-normal/arm64/AsyncMultiplexImageView.d -emit-const-values-path /Users/admin/builder/spi-builder-workspace/.derivedData/Build/Intermediates.noindex/AsyncMultiplexImage.build/Debug-xros/AsyncMultiplexImage.build/Objects-normal/arm64/AsyncMultiplexImageView.swiftconstvalues -emit-reference-dependencies-path /Users/admin/builder/spi-builder-workspace/.derivedData/Build/Intermediates.noindex/AsyncMultiplexImage.build/Debug-xros/AsyncMultiplexImage.build/Objects-normal/arm64/AsyncMultiplexImageView.swiftdeps -serialize-diagnostics-path /Users/admin/builder/spi-builder-workspace/.derivedData/Build/Intermediates.noindex/AsyncMultiplexImage.build/Debug-xros/AsyncMultiplexImage.build/Objects-normal/arm64/AsyncMultiplexImageView.dia -target arm64-apple-xros1.0 -Xllvm -aarch64-use-tbi -enable-objc-interop -stack-check -sdk /Applications/Xcode-16.3.0.app/Contents/Developer/Platforms/XROS.platform/Developer/SDKs/XROS2.4.sdk -I /Users/admin/builder/spi-builder-workspace/.derivedData/Build/Products/Debug-xros -I /Applications/Xcode-16.3.0.app/Contents/Developer/Platforms/XROS.platform/Developer/usr/lib -F /Users/admin/builder/spi-builder-workspace/.derivedData/Build/Products/Debug-xros/PackageFrameworks -F /Users/admin/builder/spi-builder-workspace/.derivedData/Build/Products/Debug-xros -F /Applications/Xcode-16.3.0.app/Contents/Developer/Platforms/XROS.platform/Developer/Library/Frameworks -F /Applications/Xcode-16.3.0.app/Contents/Developer/Platforms/XROS.platform/Developer/SDKs/XROS2.4.sdk/Developer/Library/Frameworks -no-color-diagnostics -enable-testing -g -debug-info-format\=dwarf -dwarf-version\=4 -module-cache-path /Users/admin/builder/spi-builder-workspace/.derivedData/ModuleCache.noindex -profile-generate -profile-coverage-mapping -swift-version 6 -enforce-exclusivity\=checked -Onone -D SWIFT_PACKAGE -D DEBUG -D Xcode -serialize-debugging-options -const-gather-protocols-file /Users/admin/builder/spi-builder-workspace/.derivedData/Build/Intermediates.noindex/AsyncMultiplexImage.build/Debug-xros/AsyncMultiplexImage.build/Objects-normal/arm64/AsyncMultiplexImage_const_extract_protocols.json -enable-experimental-feature DebugDescriptionMacro -empty-abi-descriptor -plugin-path /Applications/Xcode-16.3.0.app/Contents/Developer/Toolchains/XcodeDefault.xctoolchain/usr/lib/swift/host/plugins/testing -validate-clang-modules-once -clang-build-session-file /Users/admin/builder/spi-builder-workspace/.derivedData/ModuleCache.noindex/Session.modulevalidation -Xcc -working-directory -Xcc /Users/admin/builder/spi-builder-workspace/.swiftpm/xcode -resource-dir /Applications/Xcode-16.3.0.app/Contents/Developer/Toolchains/XcodeDefault.xctoolchain/usr/lib/swift -enable-anonymous-context-mangled-names -file-compilation-dir /Users/admin/builder/spi-builder-workspace/.swiftpm/xcode -Xcc -ivfsstatcache -Xcc /Users/admin/builder/spi-builder-workspace/.derivedData/SDKStatCaches.noindex/xros2.4-22O233-407b76dbb837030756cbe1ab3f0b01b6.sdkstatcache -Xcc -I/Users/admin/builder/spi-builder-workspace/.derivedData/Build/Intermediates.noindex/AsyncMultiplexImage.build/Debug-xros/AsyncMultiplexImage.build/swift-overrides.hmap -Xcc -I/Users/admin/builder/spi-builder-workspace/.derivedData/Build/Products/Debug-xros/include -Xcc -I/Users/admin/builder/spi-builder-workspace/.derivedData/Build/Intermediates.noindex/AsyncMultiplexImage.build/Debug-xros/AsyncMultiplexImage.build/DerivedSources-normal/arm64 -Xcc -I/Users/admin/builder/spi-builder-workspace/.derivedData/Build/Intermediates.noindex/AsyncMultiplexImage.build/Debug-xros/AsyncMultiplexImage.build/DerivedSources/arm64 -Xcc -I/Users/admin/builder/spi-builder-workspace/.derivedData/Build/Intermediates.noindex/AsyncMultiplexImage.build/Debug-xros/AsyncMultiplexImage.build/DerivedSources -Xcc -DSWIFT_PACKAGE -Xcc -DDEBUG\=1 -module-name AsyncMultiplexImage -package-name spi_builder_workspace -frontend-parseable-output -disable-clang-spi -target-sdk-version 2.4 -target-sdk-name xros2.4 -external-plugin-path /Applications/Xcode-16.3.0.app/Contents/Developer/Platforms/XROS.platform/Developer/usr/lib/swift/host/plugins\#/Applications/Xcode-16.3.0.app/Contents/Developer/Platforms/XROS.platform/Developer/usr/bin/swift-plugin-server -external-plugin-path /Applications/Xcode-16.3.0.app/Contents/Developer/Platforms/XROS.platform/Developer/usr/local/lib/swift/host/plugins\#/Applications/Xcode-16.3.0.app/Contents/Developer/Platforms/XROS.platform/Developer/usr/bin/swift-plugin-server -in-process-plugin-server-path /Applications/Xcode-16.3.0.app/Contents/Developer/Toolchains/XcodeDefault.xctoolchain/usr/lib/swift/host/libSwiftInProcPluginServer.dylib -plugin-path /Applications/Xcode-16.3.0.app/Contents/Developer/Toolchains/XcodeDefault.xctoolchain/usr/lib/swift/host/plugins -plugin-path /Applications/Xcode-16.3.0.app/Contents/Developer/Toolchains/XcodeDefault.xctoolchain/usr/local/lib/swift/host/plugins -o /Users/admin/builder/spi-builder-workspace/.derivedData/Build/Intermediates.noindex/AsyncMultiplexImage.build/Debug-xros/AsyncMultiplexImage.build/Objects-normal/arm64/AsyncMultiplexImageView.o -index-unit-output-path /AsyncMultiplexImage.build/Debug-xros/AsyncMultiplexImage.build/Objects-normal/arm64/AsyncMultiplexImageView.o -index-store-path /Users/admin/builder/spi-builder-workspace/.derivedData/Index.noindex/DataStore -index-system-modules
SwiftCompile normal arm64 /Users/admin/builder/spi-builder-workspace/Sources/AsyncMultiplexImage/AsyncMultiplexImageView.swift (in target 'AsyncMultiplexImage' from project 'AsyncMultiplexImage')
cd /Users/admin/builder/spi-builder-workspace/.swiftpm/xcode
/Users/admin/builder/spi-builder-workspace/Sources/AsyncMultiplexImage/AsyncMultiplexImageView.swift:192:21: error: 'UIScreen' is unavailable in visionOS
displayScale: UIScreen.main.scale
^~~~~~~~
/Applications/Xcode-16.3.0.app/Contents/Developer/Platforms/XROS.platform/Developer/SDKs/XROS2.4.sdk/System/Library/Frameworks/UIKit.framework/Headers/UIScreen.h:54:12: note: 'UIScreen' has been explicitly marked unavailable here
@interface UIScreen : NSObject <UITraitEnvironment>
^
Copy /Users/admin/builder/spi-builder-workspace/.derivedData/Build/Products/Debug-xros/AsyncMultiplexImage.swiftmodule/arm64-apple-xros.abi.json /Users/admin/builder/spi-builder-workspace/.derivedData/Build/Intermediates.noindex/AsyncMultiplexImage.build/Debug-xros/AsyncMultiplexImage.build/Objects-normal/arm64/AsyncMultiplexImage.abi.json (in target 'AsyncMultiplexImage' from project 'AsyncMultiplexImage')
cd /Users/admin/builder/spi-builder-workspace
builtin-copy -exclude .DS_Store -exclude CVS -exclude .svn -exclude .git -exclude .hg -resolve-src-symlinks -rename /Users/admin/builder/spi-builder-workspace/.derivedData/Build/Intermediates.noindex/AsyncMultiplexImage.build/Debug-xros/AsyncMultiplexImage.build/Objects-normal/arm64/AsyncMultiplexImage.abi.json /Users/admin/builder/spi-builder-workspace/.derivedData/Build/Products/Debug-xros/AsyncMultiplexImage.swiftmodule/arm64-apple-xros.abi.json
SwiftDriverJobDiscovery normal arm64 Compiling DataLoading.swift, ImagePipeline+Cache.swift, ImagePipeline+Configuration.swift, ImagePipeline+Delegate.swift, ImagePipeline+Error.swift (in target 'Nuke' from project 'Nuke')
SwiftCompile normal arm64 Compiling\ DownloadManager.swift /Users/admin/builder/spi-builder-workspace/Sources/AsyncMultiplexImage/DownloadManager.swift (in target 'AsyncMultiplexImage' from project 'AsyncMultiplexImage')
SwiftCompile normal arm64 /Users/admin/builder/spi-builder-workspace/Sources/AsyncMultiplexImage/DownloadManager.swift (in target 'AsyncMultiplexImage' from project 'AsyncMultiplexImage')
cd /Users/admin/builder/spi-builder-workspace/.swiftpm/xcode
SwiftCompile normal arm64 Compiling\ MultiplexImage.swift /Users/admin/builder/spi-builder-workspace/Sources/AsyncMultiplexImage/MultiplexImage.swift (in target 'AsyncMultiplexImage' from project 'AsyncMultiplexImage')
SwiftCompile normal arm64 /Users/admin/builder/spi-builder-workspace/Sources/AsyncMultiplexImage/MultiplexImage.swift (in target 'AsyncMultiplexImage' from project 'AsyncMultiplexImage')
cd /Users/admin/builder/spi-builder-workspace/.swiftpm/xcode
SwiftDriverJobDiscovery normal arm64 Compiling LinkedList.swift, Log.swift, Operation.swift, RateLimiter.swift, ResumableData.swift, DataLoader.swift (in target 'Nuke' from project 'Nuke')
SwiftDriver AsyncMultiplexImage-Nuke normal arm64 com.apple.xcode.tools.swift.compiler (in target 'AsyncMultiplexImage-Nuke' from project 'AsyncMultiplexImage')
cd /Users/admin/builder/spi-builder-workspace/.swiftpm/xcode
builtin-SwiftDriver -- /Applications/Xcode-16.3.0.app/Contents/Developer/Toolchains/XcodeDefault.xctoolchain/usr/bin/swiftc -module-name AsyncMultiplexImage_Nuke -Onone -enforce-exclusivity\=checked @/Users/admin/builder/spi-builder-workspace/.derivedData/Build/Intermediates.noindex/AsyncMultiplexImage.build/Debug-xros/AsyncMultiplexImage-Nuke.build/Objects-normal/arm64/AsyncMultiplexImage-Nuke.SwiftFileList -DSWIFT_PACKAGE -DDEBUG -DXcode -plugin-path /Applications/Xcode-16.3.0.app/Contents/Developer/Toolchains/XcodeDefault.xctoolchain/usr/lib/swift/host/plugins/testing -enable-experimental-feature DebugDescriptionMacro -sdk /Applications/Xcode-16.3.0.app/Contents/Developer/Platforms/XROS.platform/Developer/SDKs/XROS2.4.sdk -target arm64-apple-xros1.0 -g -module-cache-path /Users/admin/builder/spi-builder-workspace/.derivedData/ModuleCache.noindex -Xfrontend -serialize-debugging-options -profile-coverage-mapping -profile-generate -enable-testing -index-store-path /Users/admin/builder/spi-builder-workspace/.derivedData/Index.noindex/DataStore -swift-version 6 -I /Users/admin/builder/spi-builder-workspace/.derivedData/Build/Products/Debug-xros -I /Applications/Xcode-16.3.0.app/Contents/Developer/Platforms/XROS.platform/Developer/usr/lib -F /Users/admin/builder/spi-builder-workspace/.derivedData/Build/Products/Debug-xros/PackageFrameworks -F /Users/admin/builder/spi-builder-workspace/.derivedData/Build/Products/Debug-xros/PackageFrameworks -F /Users/admin/builder/spi-builder-workspace/.derivedData/Build/Products/Debug-xros/PackageFrameworks -F /Users/admin/builder/spi-builder-workspace/.derivedData/Build/Products/Debug-xros -F /Applications/Xcode-16.3.0.app/Contents/Developer/Platforms/XROS.platform/Developer/Library/Frameworks -F /Applications/Xcode-16.3.0.app/Contents/Developer/Platforms/XROS.platform/Developer/SDKs/XROS2.4.sdk/Developer/Library/Frameworks -c -j10 -enable-batch-mode -incremental -Xcc -ivfsstatcache -Xcc /Users/admin/builder/spi-builder-workspace/.derivedData/SDKStatCaches.noindex/xros2.4-22O233-407b76dbb837030756cbe1ab3f0b01b6.sdkstatcache -output-file-map /Users/admin/builder/spi-builder-workspace/.derivedData/Build/Intermediates.noindex/AsyncMultiplexImage.build/Debug-xros/AsyncMultiplexImage-Nuke.build/Objects-normal/arm64/AsyncMultiplexImage-Nuke-OutputFileMap.json -use-frontend-parseable-output -save-temps -no-color-diagnostics -serialize-diagnostics -emit-dependencies -emit-module -emit-module-path /Users/admin/builder/spi-builder-workspace/.derivedData/Build/Intermediates.noindex/AsyncMultiplexImage.build/Debug-xros/AsyncMultiplexImage-Nuke.build/Objects-normal/arm64/AsyncMultiplexImage_Nuke.swiftmodule -validate-clang-modules-once -clang-build-session-file /Users/admin/builder/spi-builder-workspace/.derivedData/ModuleCache.noindex/Session.modulevalidation -package-name spi_builder_workspace -Xcc -I/Users/admin/builder/spi-builder-workspace/.derivedData/Build/Intermediates.noindex/AsyncMultiplexImage.build/Debug-xros/AsyncMultiplexImage-Nuke.build/swift-overrides.hmap -emit-const-values -Xfrontend -const-gather-protocols-file -Xfrontend /Users/admin/builder/spi-builder-workspace/.derivedData/Build/Intermediates.noindex/AsyncMultiplexImage.build/Debug-xros/AsyncMultiplexImage-Nuke.build/Objects-normal/arm64/AsyncMultiplexImage-Nuke_const_extract_protocols.json -Xcc -I/Users/admin/builder/spi-builder-workspace/.derivedData/Build/Products/Debug-xros/include -Xcc -I/Users/admin/builder/spi-builder-workspace/.derivedData/Build/Intermediates.noindex/AsyncMultiplexImage.build/Debug-xros/AsyncMultiplexImage-Nuke.build/DerivedSources-normal/arm64 -Xcc -I/Users/admin/builder/spi-builder-workspace/.derivedData/Build/Intermediates.noindex/AsyncMultiplexImage.build/Debug-xros/AsyncMultiplexImage-Nuke.build/DerivedSources/arm64 -Xcc -I/Users/admin/builder/spi-builder-workspace/.derivedData/Build/Intermediates.noindex/AsyncMultiplexImage.build/Debug-xros/AsyncMultiplexImage-Nuke.build/DerivedSources -Xcc -DSWIFT_PACKAGE -Xcc -DDEBUG\=1 -emit-objc-header -emit-objc-header-path /Users/admin/builder/spi-builder-workspace/.derivedData/Build/Intermediates.noindex/AsyncMultiplexImage.build/Debug-xros/AsyncMultiplexImage-Nuke.build/Objects-normal/arm64/AsyncMultiplexImage-Nuke-Swift.h -working-directory /Users/admin/builder/spi-builder-workspace/.swiftpm/xcode -experimental-emit-module-separately -disable-cmo
SwiftDriverJobDiscovery normal arm64 Compiling VisualEffect.swift (in target 'SwiftUISupportBackport' from project 'SwiftUISupport')
SwiftDriverJobDiscovery normal arm64 Compiling ImageView.swift (in target 'SwiftUISupportBackport' from project 'SwiftUISupport')
SwiftDriverJobDiscovery normal arm64 Compiling OnChangeWithPrevious.swift (in target 'SwiftUISupportBackport' from project 'SwiftUISupport')
SwiftDriver\ Compilation SwiftUISupportBackport normal arm64 com.apple.xcode.tools.swift.compiler (in target 'SwiftUISupportBackport' from project 'SwiftUISupport')
cd /Users/admin/builder/spi-builder-workspace/.swiftpm/xcode
builtin-Swift-Compilation -- /Applications/Xcode-16.3.0.app/Contents/Developer/Toolchains/XcodeDefault.xctoolchain/usr/bin/swiftc -module-name SwiftUISupportBackport -Onone -enforce-exclusivity\=checked @/Users/admin/builder/spi-builder-workspace/.derivedData/Build/Intermediates.noindex/SwiftUISupport.build/Debug-xros/SwiftUISupportBackport.build/Objects-normal/arm64/SwiftUISupportBackport.SwiftFileList -DSWIFT_PACKAGE -DDEBUG -DXcode -plugin-path /Applications/Xcode-16.3.0.app/Contents/Developer/Toolchains/XcodeDefault.xctoolchain/usr/lib/swift/host/plugins/testing -enable-experimental-feature DebugDescriptionMacro -sdk /Applications/Xcode-16.3.0.app/Contents/Developer/Platforms/XROS.platform/Developer/SDKs/XROS2.4.sdk -target arm64-apple-xros1.0 -g -module-cache-path /Users/admin/builder/spi-builder-workspace/.derivedData/ModuleCache.noindex -Xfrontend -serialize-debugging-options -profile-coverage-mapping -profile-generate -enable-testing -suppress-warnings -index-store-path /Users/admin/builder/spi-builder-workspace/.derivedData/Index.noindex/DataStore -swift-version 6 -I /Users/admin/builder/spi-builder-workspace/.derivedData/Build/Products/Debug-xros -I /Applications/Xcode-16.3.0.app/Contents/Developer/Platforms/XROS.platform/Developer/usr/lib -F /Users/admin/builder/spi-builder-workspace/.derivedData/Build/Products/Debug-xros -F /Applications/Xcode-16.3.0.app/Contents/Developer/Platforms/XROS.platform/Developer/Library/Frameworks -F /Applications/Xcode-16.3.0.app/Contents/Developer/Platforms/XROS.platform/Developer/SDKs/XROS2.4.sdk/Developer/Library/Frameworks -c -j10 -enable-batch-mode -incremental -Xcc -ivfsstatcache -Xcc /Users/admin/builder/spi-builder-workspace/.derivedData/SDKStatCaches.noindex/xros2.4-22O233-407b76dbb837030756cbe1ab3f0b01b6.sdkstatcache -output-file-map /Users/admin/builder/spi-builder-workspace/.derivedData/Build/Intermediates.noindex/SwiftUISupport.build/Debug-xros/SwiftUISupportBackport.build/Objects-normal/arm64/SwiftUISupportBackport-OutputFileMap.json -use-frontend-parseable-output -save-temps -no-color-diagnostics -serialize-diagnostics -emit-dependencies -emit-module -emit-module-path /Users/admin/builder/spi-builder-workspace/.derivedData/Build/Intermediates.noindex/SwiftUISupport.build/Debug-xros/SwiftUISupportBackport.build/Objects-normal/arm64/SwiftUISupportBackport.swiftmodule -user-module-version 0.13.0 -validate-clang-modules-once -clang-build-session-file /Users/admin/builder/spi-builder-workspace/.derivedData/ModuleCache.noindex/Session.modulevalidation -package-name swiftui_support -Xcc -I/Users/admin/builder/spi-builder-workspace/.derivedData/Build/Intermediates.noindex/SwiftUISupport.build/Debug-xros/SwiftUISupportBackport.build/swift-overrides.hmap -emit-const-values -Xfrontend -const-gather-protocols-file -Xfrontend /Users/admin/builder/spi-builder-workspace/.derivedData/Build/Intermediates.noindex/SwiftUISupport.build/Debug-xros/SwiftUISupportBackport.build/Objects-normal/arm64/SwiftUISupportBackport_const_extract_protocols.json -Xcc -I/Users/admin/builder/spi-builder-workspace/.derivedData/Build/Products/Debug-xros/include -Xcc -I/Users/admin/builder/spi-builder-workspace/.derivedData/Build/Intermediates.noindex/SwiftUISupport.build/Debug-xros/SwiftUISupportBackport.build/DerivedSources-normal/arm64 -Xcc -I/Users/admin/builder/spi-builder-workspace/.derivedData/Build/Intermediates.noindex/SwiftUISupport.build/Debug-xros/SwiftUISupportBackport.build/DerivedSources/arm64 -Xcc -I/Users/admin/builder/spi-builder-workspace/.derivedData/Build/Intermediates.noindex/SwiftUISupport.build/Debug-xros/SwiftUISupportBackport.build/DerivedSources -Xcc -DSWIFT_PACKAGE -Xcc -DDEBUG\=1 -emit-objc-header -emit-objc-header-path /Users/admin/builder/spi-builder-workspace/.derivedData/Build/Intermediates.noindex/SwiftUISupport.build/Debug-xros/SwiftUISupportBackport.build/Objects-normal/arm64/SwiftUISupportBackport-Swift.h -working-directory /Users/admin/builder/spi-builder-workspace/.swiftpm/xcode -experimental-emit-module-separately -disable-cmo
Ld /Users/admin/builder/spi-builder-workspace/.derivedData/Build/Products/Debug-xros/SwiftUISupportBackport.o normal (in target 'SwiftUISupportBackport' from project 'SwiftUISupport')
cd /Users/admin/builder/spi-builder-workspace/.dependencies/checkouts/swiftui-support
/Applications/Xcode-16.3.0.app/Contents/Developer/Toolchains/XcodeDefault.xctoolchain/usr/bin/clang -Xlinker -reproducible -target arm64-apple-xros1.0 -r -isysroot /Applications/Xcode-16.3.0.app/Contents/Developer/Platforms/XROS.platform/Developer/SDKs/XROS2.4.sdk -O0 -w -L/Users/admin/builder/spi-builder-workspace/.derivedData/Build/Intermediates.noindex/EagerLinkingTBDs/Debug-xros -L/Users/admin/builder/spi-builder-workspace/.derivedData/Build/Products/Debug-xros -L/Applications/Xcode-16.3.0.app/Contents/Developer/Platforms/XROS.platform/Developer/usr/lib -F/Users/admin/builder/spi-builder-workspace/.derivedData/Build/Intermediates.noindex/EagerLinkingTBDs/Debug-xros -F/Users/admin/builder/spi-builder-workspace/.derivedData/Build/Products/Debug-xros -iframework /Applications/Xcode-16.3.0.app/Contents/Developer/Platforms/XROS.platform/Developer/Library/Frameworks -iframework /Applications/Xcode-16.3.0.app/Contents/Developer/Platforms/XROS.platform/Developer/SDKs/XROS2.4.sdk/Developer/Library/Frameworks -filelist /Users/admin/builder/spi-builder-workspace/.derivedData/Build/Intermediates.noindex/SwiftUISupport.build/Debug-xros/SwiftUISupportBackport.build/Objects-normal/arm64/SwiftUISupportBackport.LinkFileList -nostdlib -Xlinker -object_path_lto -Xlinker /Users/admin/builder/spi-builder-workspace/.derivedData/Build/Intermediates.noindex/SwiftUISupport.build/Debug-xros/SwiftUISupportBackport.build/Objects-normal/arm64/SwiftUISupportBackport_lto.o -rdynamic -Xlinker -no_deduplicate -Xlinker -debug_variant -Xlinker -dependency_info -Xlinker /Users/admin/builder/spi-builder-workspace/.derivedData/Build/Intermediates.noindex/SwiftUISupport.build/Debug-xros/SwiftUISupportBackport.build/Objects-normal/arm64/SwiftUISupportBackport_dependency_info.dat -fobjc-link-runtime -L/Applications/Xcode-16.3.0.app/Contents/Developer/Toolchains/XcodeDefault.xctoolchain/usr/lib/swift/xros -L/usr/lib/swift -Xlinker -add_ast_path -Xlinker /Users/admin/builder/spi-builder-workspace/.derivedData/Build/Intermediates.noindex/SwiftUISupport.build/Debug-xros/SwiftUISupportBackport.build/Objects-normal/arm64/SwiftUISupportBackport.swiftmodule -o /Users/admin/builder/spi-builder-workspace/.derivedData/Build/Products/Debug-xros/SwiftUISupportBackport.o
SwiftCompile normal arm64 Compiling\ AsyncMultiplexImageNuke.swift /Users/admin/builder/spi-builder-workspace/Sources/AsyncMultiplexImage-Nuke/AsyncMultiplexImageNuke.swift (in target 'AsyncMultiplexImage-Nuke' from project 'AsyncMultiplexImage')
SwiftCompile normal arm64 /Users/admin/builder/spi-builder-workspace/Sources/AsyncMultiplexImage-Nuke/AsyncMultiplexImageNuke.swift (in target 'AsyncMultiplexImage-Nuke' from project 'AsyncMultiplexImage')
cd /Users/admin/builder/spi-builder-workspace/.swiftpm/xcode
SwiftEmitModule normal arm64 Emitting\ module\ for\ AsyncMultiplexImage_Nuke (in target 'AsyncMultiplexImage-Nuke' from project 'AsyncMultiplexImage')
EmitSwiftModule normal arm64 (in target 'AsyncMultiplexImage-Nuke' from project 'AsyncMultiplexImage')
cd /Users/admin/builder/spi-builder-workspace/.swiftpm/xcode
SwiftCompile normal arm64 Compiling\ AsyncMultiplexImageNukeDownloader.swift /Users/admin/builder/spi-builder-workspace/Sources/AsyncMultiplexImage-Nuke/AsyncMultiplexImageNukeDownloader.swift (in target 'AsyncMultiplexImage-Nuke' from project 'AsyncMultiplexImage')
SwiftCompile normal arm64 /Users/admin/builder/spi-builder-workspace/Sources/AsyncMultiplexImage-Nuke/AsyncMultiplexImageNukeDownloader.swift (in target 'AsyncMultiplexImage-Nuke' from project 'AsyncMultiplexImage')
cd /Users/admin/builder/spi-builder-workspace/.swiftpm/xcode
SwiftDriverJobDiscovery normal arm64 Compiling ImagePipeline.swift, ImagePrefetcher.swift, ImageDecompression.swift, ImageProcessing.swift, ImageProcessingOptions.swift (in target 'Nuke' from project 'Nuke')
ExtractAppIntentsMetadata (in target 'SwiftUISupportBackport' from project 'SwiftUISupport')
cd /Users/admin/builder/spi-builder-workspace/.dependencies/checkouts/swiftui-support
/Applications/Xcode-16.3.0.app/Contents/Developer/Toolchains/XcodeDefault.xctoolchain/usr/bin/appintentsmetadataprocessor --toolchain-dir /Applications/Xcode-16.3.0.app/Contents/Developer/Toolchains/XcodeDefault.xctoolchain --module-name SwiftUISupportBackport --sdk-root /Applications/Xcode-16.3.0.app/Contents/Developer/Platforms/XROS.platform/Developer/SDKs/XROS2.4.sdk --xcode-version 16E140 --platform-family xrOS --deployment-target 1.0 --bundle-identifier swiftui-support.SwiftUISupportBackport --output /Users/admin/builder/spi-builder-workspace/.derivedData/Build/Products/Debug-xros/SwiftUISupportBackport.appintents --target-triple arm64-apple-xros1.0 --binary-file /Users/admin/builder/spi-builder-workspace/.derivedData/Build/Products/Debug-xros/SwiftUISupportBackport.o --dependency-file /Users/admin/builder/spi-builder-workspace/.derivedData/Build/Intermediates.noindex/SwiftUISupport.build/Debug-xros/SwiftUISupportBackport.build/Objects-normal/arm64/SwiftUISupportBackport_dependency_info.dat --stringsdata-file /Users/admin/builder/spi-builder-workspace/.derivedData/Build/Intermediates.noindex/SwiftUISupport.build/Debug-xros/SwiftUISupportBackport.build/Objects-normal/arm64/ExtractedAppShortcutsMetadata.stringsdata --source-file-list /Users/admin/builder/spi-builder-workspace/.derivedData/Build/Intermediates.noindex/SwiftUISupport.build/Debug-xros/SwiftUISupportBackport.build/Objects-normal/arm64/SwiftUISupportBackport.SwiftFileList --metadata-file-list /Users/admin/builder/spi-builder-workspace/.derivedData/Build/Intermediates.noindex/SwiftUISupport.build/Debug-xros/SwiftUISupportBackport.build/SwiftUISupportBackport.DependencyMetadataFileList --static-metadata-file-list /Users/admin/builder/spi-builder-workspace/.derivedData/Build/Intermediates.noindex/SwiftUISupport.build/Debug-xros/SwiftUISupportBackport.build/SwiftUISupportBackport.DependencyStaticMetadataFileList --swift-const-vals-list /Users/admin/builder/spi-builder-workspace/.derivedData/Build/Intermediates.noindex/SwiftUISupport.build/Debug-xros/SwiftUISupportBackport.build/Objects-normal/arm64/SwiftUISupportBackport.SwiftConstValuesFileList --force --compile-time-extraction --deployment-aware-processing --validate-assistant-intents --no-app-shortcuts-localization
SwiftDriverJobDiscovery normal arm64 Compiling ImageEncoders.swift, ImageEncoding.swift, ImageContainer.swift, ImageRequest.swift, ImageResponse.swift, ImageTask.swift (in target 'Nuke' from project 'Nuke')
SwiftDriver\ Compilation Nuke normal arm64 com.apple.xcode.tools.swift.compiler (in target 'Nuke' from project 'Nuke')
cd /Users/admin/builder/spi-builder-workspace/.swiftpm/xcode
builtin-Swift-Compilation -- /Applications/Xcode-16.3.0.app/Contents/Developer/Toolchains/XcodeDefault.xctoolchain/usr/bin/swiftc -module-name Nuke -Onone -enforce-exclusivity\=checked @/Users/admin/builder/spi-builder-workspace/.derivedData/Build/Intermediates.noindex/Nuke.build/Debug-xros/Nuke.build/Objects-normal/arm64/Nuke.SwiftFileList -DSWIFT_PACKAGE -DDEBUG -DXcode -plugin-path /Applications/Xcode-16.3.0.app/Contents/Developer/Toolchains/XcodeDefault.xctoolchain/usr/lib/swift/host/plugins/testing -enable-experimental-feature DebugDescriptionMacro -sdk /Applications/Xcode-16.3.0.app/Contents/Developer/Platforms/XROS.platform/Developer/SDKs/XROS2.4.sdk -target arm64-apple-xros1.0 -g -module-cache-path /Users/admin/builder/spi-builder-workspace/.derivedData/ModuleCache.noindex -Xfrontend -serialize-debugging-options -profile-coverage-mapping -profile-generate -enable-testing -suppress-warnings -index-store-path /Users/admin/builder/spi-builder-workspace/.derivedData/Index.noindex/DataStore -swift-version 5 -I /Users/admin/builder/spi-builder-workspace/.derivedData/Build/Products/Debug-xros -I /Applications/Xcode-16.3.0.app/Contents/Developer/Platforms/XROS.platform/Developer/usr/lib -F /Users/admin/builder/spi-builder-workspace/.derivedData/Build/Products/Debug-xros -F /Applications/Xcode-16.3.0.app/Contents/Developer/Platforms/XROS.platform/Developer/Library/Frameworks -F /Applications/Xcode-16.3.0.app/Contents/Developer/Platforms/XROS.platform/Developer/SDKs/XROS2.4.sdk/Developer/Library/Frameworks -c -j10 -enable-batch-mode -incremental -Xcc -ivfsstatcache -Xcc /Users/admin/builder/spi-builder-workspace/.derivedData/SDKStatCaches.noindex/xros2.4-22O233-407b76dbb837030756cbe1ab3f0b01b6.sdkstatcache -output-file-map /Users/admin/builder/spi-builder-workspace/.derivedData/Build/Intermediates.noindex/Nuke.build/Debug-xros/Nuke.build/Objects-normal/arm64/Nuke-OutputFileMap.json -use-frontend-parseable-output -save-temps -no-color-diagnostics -serialize-diagnostics -emit-dependencies -emit-module -emit-module-path /Users/admin/builder/spi-builder-workspace/.derivedData/Build/Intermediates.noindex/Nuke.build/Debug-xros/Nuke.build/Objects-normal/arm64/Nuke.swiftmodule -validate-clang-modules-once -clang-build-session-file /Users/admin/builder/spi-builder-workspace/.derivedData/ModuleCache.noindex/Session.modulevalidation -package-name nuke -Xcc -I/Users/admin/builder/spi-builder-workspace/.derivedData/Build/Intermediates.noindex/Nuke.build/Debug-xros/Nuke.build/swift-overrides.hmap -emit-const-values -Xfrontend -const-gather-protocols-file -Xfrontend /Users/admin/builder/spi-builder-workspace/.derivedData/Build/Intermediates.noindex/Nuke.build/Debug-xros/Nuke.build/Objects-normal/arm64/Nuke_const_extract_protocols.json -Xcc -I/Users/admin/builder/spi-builder-workspace/.derivedData/Build/Products/Debug-xros/include -Xcc -I/Users/admin/builder/spi-builder-workspace/.derivedData/Build/Intermediates.noindex/Nuke.build/Debug-xros/Nuke.build/DerivedSources-normal/arm64 -Xcc -I/Users/admin/builder/spi-builder-workspace/.derivedData/Build/Intermediates.noindex/Nuke.build/Debug-xros/Nuke.build/DerivedSources/arm64 -Xcc -I/Users/admin/builder/spi-builder-workspace/.derivedData/Build/Intermediates.noindex/Nuke.build/Debug-xros/Nuke.build/DerivedSources -Xcc -DSWIFT_PACKAGE -Xcc -DDEBUG\=1 -emit-objc-header -emit-objc-header-path /Users/admin/builder/spi-builder-workspace/.derivedData/Build/Intermediates.noindex/Nuke.build/Debug-xros/Nuke.build/Objects-normal/arm64/Nuke-Swift.h -working-directory /Users/admin/builder/spi-builder-workspace/.swiftpm/xcode -experimental-emit-module-separately -disable-cmo
Ld /Users/admin/builder/spi-builder-workspace/.derivedData/Build/Products/Debug-xros/Nuke.o normal (in target 'Nuke' from project 'Nuke')
cd /Users/admin/builder/spi-builder-workspace/.dependencies/checkouts/Nuke
/Applications/Xcode-16.3.0.app/Contents/Developer/Toolchains/XcodeDefault.xctoolchain/usr/bin/clang -Xlinker -reproducible -target arm64-apple-xros1.0 -r -isysroot /Applications/Xcode-16.3.0.app/Contents/Developer/Platforms/XROS.platform/Developer/SDKs/XROS2.4.sdk -O0 -w -L/Users/admin/builder/spi-builder-workspace/.derivedData/Build/Intermediates.noindex/EagerLinkingTBDs/Debug-xros -L/Users/admin/builder/spi-builder-workspace/.derivedData/Build/Products/Debug-xros -L/Applications/Xcode-16.3.0.app/Contents/Developer/Platforms/XROS.platform/Developer/usr/lib -F/Users/admin/builder/spi-builder-workspace/.derivedData/Build/Intermediates.noindex/EagerLinkingTBDs/Debug-xros -F/Users/admin/builder/spi-builder-workspace/.derivedData/Build/Products/Debug-xros -iframework /Applications/Xcode-16.3.0.app/Contents/Developer/Platforms/XROS.platform/Developer/Library/Frameworks -iframework /Applications/Xcode-16.3.0.app/Contents/Developer/Platforms/XROS.platform/Developer/SDKs/XROS2.4.sdk/Developer/Library/Frameworks -filelist /Users/admin/builder/spi-builder-workspace/.derivedData/Build/Intermediates.noindex/Nuke.build/Debug-xros/Nuke.build/Objects-normal/arm64/Nuke.LinkFileList -nostdlib -Xlinker -object_path_lto -Xlinker /Users/admin/builder/spi-builder-workspace/.derivedData/Build/Intermediates.noindex/Nuke.build/Debug-xros/Nuke.build/Objects-normal/arm64/Nuke_lto.o -rdynamic -Xlinker -no_deduplicate -Xlinker -debug_variant -Xlinker -dependency_info -Xlinker /Users/admin/builder/spi-builder-workspace/.derivedData/Build/Intermediates.noindex/Nuke.build/Debug-xros/Nuke.build/Objects-normal/arm64/Nuke_dependency_info.dat -fobjc-link-runtime -L/Applications/Xcode-16.3.0.app/Contents/Developer/Toolchains/XcodeDefault.xctoolchain/usr/lib/swift/xros -L/usr/lib/swift -Xlinker -add_ast_path -Xlinker /Users/admin/builder/spi-builder-workspace/.derivedData/Build/Intermediates.noindex/Nuke.build/Debug-xros/Nuke.build/Objects-normal/arm64/Nuke.swiftmodule -o /Users/admin/builder/spi-builder-workspace/.derivedData/Build/Products/Debug-xros/Nuke.o
** BUILD FAILED **
The following build commands failed:
SwiftCompile normal arm64 Compiling\ AsyncMultiplexImageView.swift /Users/admin/builder/spi-builder-workspace/Sources/AsyncMultiplexImage/AsyncMultiplexImageView.swift (in target 'AsyncMultiplexImage' from project 'AsyncMultiplexImage')
SwiftCompile normal arm64 /Users/admin/builder/spi-builder-workspace/Sources/AsyncMultiplexImage/AsyncMultiplexImageView.swift (in target 'AsyncMultiplexImage' from project 'AsyncMultiplexImage')
Building workspace spi-builder-workspace with scheme AsyncMultiplexImage-Package
(3 failures)
BUILD FAILURE 6.1 visionOS