Build Information
Failed to build swift-composable-environment, reference 0.5.3 (757dd9
), with Swift 6.0 for tvOS using Xcode 16.2 on 28 Nov 2024 23:06:26 UTC.
Build Command
env DEVELOPER_DIR=/Applications/Xcode-16.1.0.app xcrun xcodebuild -IDEClonedSourcePackagesDirPathOverride=$PWD/.dependencies -skipMacroValidation -skipPackagePluginValidation -derivedDataPath $PWD/.derivedData build -scheme swift-composable-environment-Package -destination generic/platform=tvOS OTHER_SWIFT_FLAGS=-stats-output-dir .stats -strict-concurrency=complete -enable-upcoming-feature StrictConcurrency -enable-upcoming-feature DisableOutwardActorInference -enable-upcoming-feature GlobalActorIsolatedTypesUsability -enable-upcoming-feature InferSendableFromCaptures
Build Log
Error opening -stats-output-dir file '/Users/admin/builder/spi-builder-workspace/.stats/stats-1732835185909249-swift-frontend-ComposableEnvironment-GlobalEnvironment_Migration.swift-arm64_apple_tvos13.0-o-Onone-395747050.json' for writing
===-------------------------------------------------------------------------===
Swift compilation
===-------------------------------------------------------------------------===
Total Execution Time: 0.6016 seconds (0.6286 wall clock)
---User Time--- --System Time-- --User+System-- ---Wall Time--- --- Name ---
0.0537 ( 29.0%) 0.1637 ( 39.3%) 0.2174 ( 36.1%) 0.2272 ( 36.1%) parse-and-resolve-imports
0.0533 ( 28.9%) 0.1632 ( 39.2%) 0.2165 ( 36.0%) 0.2263 ( 36.0%) Import resolution
0.0091 ( 4.9%) 0.0105 ( 2.5%) 0.0196 ( 3.3%) 0.0212 ( 3.4%) ASTLoweringRequest
0.0091 ( 4.9%) 0.0104 ( 2.5%) 0.0195 ( 3.2%) 0.0212 ( 3.4%) SILgen-decl
0.0049 ( 2.7%) 0.0066 ( 1.6%) 0.0115 ( 1.9%) 0.0117 ( 1.9%) IRGenRequest
0.0040 ( 2.2%) 0.0057 ( 1.4%) 0.0097 ( 1.6%) 0.0099 ( 1.6%) IRGen
0.0041 ( 2.2%) 0.0032 ( 0.8%) 0.0074 ( 1.2%) 0.0077 ( 1.2%) ExecuteSILPipelineRequest
0.0027 ( 1.5%) 0.0029 ( 0.7%) 0.0056 ( 0.9%) 0.0057 ( 0.9%) LookupConformanceInModuleRequest
0.0026 ( 1.4%) 0.0024 ( 0.6%) 0.0050 ( 0.8%) 0.0050 ( 0.8%) TypeCheckFunctionBodyRequest
0.0027 ( 1.4%) 0.0024 ( 0.6%) 0.0050 ( 0.8%) 0.0050 ( 0.8%) typecheck-expr
0.0024 ( 1.3%) 0.0020 ( 0.5%) 0.0044 ( 0.7%) 0.0044 ( 0.7%) IsAccessorTransparentRequest
0.0024 ( 1.3%) 0.0020 ( 0.5%) 0.0044 ( 0.7%) 0.0044 ( 0.7%) SimpleDidSetRequest
0.0022 ( 1.2%) 0.0018 ( 0.4%) 0.0040 ( 0.7%) 0.0040 ( 0.6%) typecheck-stmt
0.0015 ( 0.8%) 0.0025 ( 0.6%) 0.0040 ( 0.7%) 0.0040 ( 0.6%) perform-sema
0.0014 ( 0.8%) 0.0025 ( 0.6%) 0.0039 ( 0.7%) 0.0039 ( 0.6%) TypeCheckSourceFileRequest
0.0011 ( 0.6%) 0.0028 ( 0.7%) 0.0039 ( 0.6%) 0.0039 ( 0.6%) load-stdlib
0.0014 ( 0.8%) 0.0024 ( 0.6%) 0.0038 ( 0.6%) 0.0038 ( 0.6%) Type checking and Semantic analysis
0.0017 ( 0.9%) 0.0021 ( 0.5%) 0.0038 ( 0.6%) 0.0038 ( 0.6%) InterfaceTypeRequest
0.0020 ( 1.1%) 0.0016 ( 0.4%) 0.0036 ( 0.6%) 0.0036 ( 0.6%) DirectLookupRequest
0.0016 ( 0.9%) 0.0020 ( 0.5%) 0.0036 ( 0.6%) 0.0036 ( 0.6%) OpaqueReadOwnershipRequest
0.0018 ( 1.0%) 0.0014 ( 0.3%) 0.0032 ( 0.5%) 0.0032 ( 0.5%) QualifiedLookupRequest
0.0015 ( 0.8%) 0.0017 ( 0.4%) 0.0032 ( 0.5%) 0.0032 ( 0.5%) UnqualifiedLookupRequest
0.0007 ( 0.4%) 0.0008 ( 0.2%) 0.0015 ( 0.2%) 0.0031 ( 0.5%) GenericSignatureRequest
0.0011 ( 0.6%) 0.0019 ( 0.5%) 0.0030 ( 0.5%) 0.0030 ( 0.5%) typecheck-decl
0.0016 ( 0.9%) 0.0013 ( 0.3%) 0.0030 ( 0.5%) 0.0030 ( 0.5%) LookupInModuleRequest
0.0014 ( 0.7%) 0.0015 ( 0.4%) 0.0029 ( 0.5%) 0.0029 ( 0.5%) performUnqualifiedLookup
0.0012 ( 0.7%) 0.0014 ( 0.3%) 0.0027 ( 0.4%) 0.0027 ( 0.4%) ResolveTypeRequest
0.0009 ( 0.5%) 0.0016 ( 0.4%) 0.0025 ( 0.4%) 0.0025 ( 0.4%) import-clang-decl
0.0002 ( 0.1%) 0.0001 ( 0.0%) 0.0003 ( 0.0%) 0.0019 ( 0.3%) InferredGenericSignatureRequest
0.0009 ( 0.5%) 0.0010 ( 0.3%) 0.0019 ( 0.3%) 0.0019 ( 0.3%) NamingPatternRequest
0.0009 ( 0.5%) 0.0010 ( 0.2%) 0.0019 ( 0.3%) 0.0019 ( 0.3%) PatternBindingEntryRequest
0.0006 ( 0.3%) 0.0011 ( 0.3%) 0.0017 ( 0.3%) 0.0017 ( 0.3%) ABIMembersRequest
0.0007 ( 0.4%) 0.0008 ( 0.2%) 0.0015 ( 0.3%) 0.0015 ( 0.2%) ModuleQualifiedLookupRequest
0.0006 ( 0.3%) 0.0009 ( 0.2%) 0.0015 ( 0.2%) 0.0015 ( 0.2%) ActorIsolationRequest
0.0012 ( 0.7%) 0.0001 ( 0.0%) 0.0013 ( 0.2%) 0.0014 ( 0.2%) SIL optimization
0.0005 ( 0.3%) 0.0008 ( 0.2%) 0.0013 ( 0.2%) 0.0013 ( 0.2%) StoredPropertiesRequest
0.0005 ( 0.3%) 0.0007 ( 0.2%) 0.0012 ( 0.2%) 0.0012 ( 0.2%) PatternTypeRequest
0.0005 ( 0.3%) 0.0005 ( 0.1%) 0.0010 ( 0.2%) 0.0010 ( 0.2%) ResultTypeRequest
0.0004 ( 0.2%) 0.0004 ( 0.1%) 0.0008 ( 0.1%) 0.0008 ( 0.1%) SILGen-function
0.0003 ( 0.2%) 0.0005 ( 0.1%) 0.0007 ( 0.1%) 0.0007 ( 0.1%) ExtendedNominalRequest
0.0002 ( 0.1%) 0.0005 ( 0.1%) 0.0007 ( 0.1%) 0.0007 ( 0.1%) PotentialMacroExpansionsInContextRequest
0.0004 ( 0.2%) 0.0003 ( 0.1%) 0.0007 ( 0.1%) 0.0007 ( 0.1%) ParseTopLevelDeclsRequest
0.0004 ( 0.2%) 0.0002 ( 0.1%) 0.0007 ( 0.1%) 0.0007 ( 0.1%) ParseSourceFileRequest
0.0002 ( 0.1%) 0.0003 ( 0.1%) 0.0004 ( 0.1%) 0.0005 ( 0.1%) OverriddenDeclsRequest
0.0002 ( 0.1%) 0.0002 ( 0.1%) 0.0004 ( 0.1%) 0.0004 ( 0.1%) ResolveImplicitMemberRequest
0.0001 ( 0.1%) 0.0003 ( 0.1%) 0.0004 ( 0.1%) 0.0004 ( 0.1%) InheritedDeclsReferencedRequest
0.0001 ( 0.1%) 0.0003 ( 0.1%) 0.0004 ( 0.1%) 0.0004 ( 0.1%) ExpandPeerMacroRequest
0.0001 ( 0.1%) 0.0002 ( 0.1%) 0.0003 ( 0.1%) 0.0003 ( 0.1%) NeedsNewVTableEntryRequest
0.0001 ( 0.1%) 0.0002 ( 0.0%) 0.0003 ( 0.0%) 0.0003 ( 0.0%) IsObjCRequest
0.0002 ( 0.1%) 0.0001 ( 0.0%) 0.0002 ( 0.0%) 0.0002 ( 0.0%) precheck-expr
0.0001 ( 0.0%) 0.0001 ( 0.0%) 0.0002 ( 0.0%) 0.0002 ( 0.0%) ImplicitKnownProtocolConformanceRequest
0.0001 ( 0.1%) 0.0001 ( 0.0%) 0.0002 ( 0.0%) 0.0002 ( 0.0%) build-rewrite-system
0.0001 ( 0.0%) 0.0001 ( 0.0%) 0.0002 ( 0.0%) 0.0002 ( 0.0%) LookupAllConformancesInContextRequest
0.0001 ( 0.0%) 0.0001 ( 0.0%) 0.0002 ( 0.0%) 0.0002 ( 0.0%) SynthesizeAccessorRequest
0.0001 ( 0.0%) 0.0000 ( 0.0%) 0.0001 ( 0.0%) 0.0001 ( 0.0%) ExpandMemberAttributeMacros
0.0001 ( 0.0%) 0.0001 ( 0.0%) 0.0001 ( 0.0%) 0.0001 ( 0.0%) AllMembersRequest
0.0000 ( 0.0%) 0.0001 ( 0.0%) 0.0001 ( 0.0%) 0.0001 ( 0.0%) SuperclassDeclRequest
0.0000 ( 0.0%) 0.0001 ( 0.0%) 0.0001 ( 0.0%) 0.0001 ( 0.0%) AttachedPropertyWrappersRequest
0.0000 ( 0.0%) 0.0001 ( 0.0%) 0.0001 ( 0.0%) 0.0001 ( 0.0%) AbstractGenericSignatureRequest
0.0000 ( 0.0%) 0.0001 ( 0.0%) 0.0001 ( 0.0%) 0.0001 ( 0.0%) HasInitAccessorRequest
0.0000 ( 0.0%) 0.0001 ( 0.0%) 0.0001 ( 0.0%) 0.0001 ( 0.0%) InheritedProtocolsRequest
0.0000 ( 0.0%) 0.0000 ( 0.0%) 0.0001 ( 0.0%) 0.0001 ( 0.0%) SuperclassTypeRequest
0.0000 ( 0.0%) 0.0000 ( 0.0%) 0.0001 ( 0.0%) 0.0001 ( 0.0%) InheritsSuperclassInitializersRequest
0.0001 ( 0.0%) 0.0000 ( 0.0%) 0.0001 ( 0.0%) 0.0001 ( 0.0%) ParseMembersRequest
0.0000 ( 0.0%) 0.0001 ( 0.0%) 0.0001 ( 0.0%) 0.0001 ( 0.0%) ExpandExtensionMacros
0.0000 ( 0.0%) 0.0000 ( 0.0%) 0.0001 ( 0.0%) 0.0001 ( 0.0%) ParseAbstractFunctionBodyRequest
0.0000 ( 0.0%) 0.0000 ( 0.0%) 0.0001 ( 0.0%) 0.0001 ( 0.0%) InheritedTypeRequest
0.0000 ( 0.0%) 0.0000 ( 0.0%) 0.0001 ( 0.0%) 0.0001 ( 0.0%) RequiresOpaqueAccessorsRequest
0.0000 ( 0.0%) 0.0000 ( 0.0%) 0.0001 ( 0.0%) 0.0001 ( 0.0%) HasUserDefinedDesignatedInitRequest
0.0000 ( 0.0%) 0.0000 ( 0.0%) 0.0001 ( 0.0%) 0.0001 ( 0.0%) AreAllStoredPropertiesDefaultInitableRequest
0.0000 ( 0.0%) 0.0000 ( 0.0%) 0.0001 ( 0.0%) 0.0001 ( 0.0%) GetDestructorRequest
0.0000 ( 0.0%) 0.0000 ( 0.0%) 0.0001 ( 0.0%) 0.0001 ( 0.0%) HasIsolatedSelfRequest
0.0000 ( 0.0%) 0.0000 ( 0.0%) 0.0000 ( 0.0%) 0.0000 ( 0.0%) IsGetterMutatingRequest
0.0000 ( 0.0%) 0.0000 ( 0.0%) 0.0000 ( 0.0%) 0.0000 ( 0.0%) ProtocolDependenciesRequest
0.0000 ( 0.0%) 0.0000 ( 0.0%) 0.0000 ( 0.0%) 0.0000 ( 0.0%) CheckInconsistentWeakLinkedImportsRequest
0.0000 ( 0.0%) 0.0000 ( 0.0%) 0.0000 ( 0.0%) 0.0000 ( 0.0%) CheckRedeclarationRequest
0.0000 ( 0.0%) 0.0000 ( 0.0%) 0.0000 ( 0.0%) 0.0000 ( 0.0%) HasDynamicMemberLookupAttributeRequest
0.0000 ( 0.0%) 0.0000 ( 0.0%) 0.0000 ( 0.0%) 0.0000 ( 0.0%) InitAccessorPropertiesRequest
0.0000 ( 0.0%) 0.0000 ( 0.0%) 0.0000 ( 0.0%) 0.0000 ( 0.0%) USRGenerationRequest
0.0000 ( 0.0%) 0.0000 ( 0.0%) 0.0000 ( 0.0%) 0.0000 ( 0.0%) SPIGroupsRequest
0.0000 ( 0.0%) 0.0000 ( 0.0%) 0.0000 ( 0.0%) 0.0000 ( 0.0%) AllInheritedProtocolsRequest
0.0000 ( 0.0%) 0.0000 ( 0.0%) 0.0000 ( 0.0%) 0.0000 ( 0.0%) StorageImplInfoRequest
0.0000 ( 0.0%) 0.0000 ( 0.0%) 0.0000 ( 0.0%) 0.0000 ( 0.0%) CollectOverriddenDeclsRequest
0.0000 ( 0.0%) 0.0000 ( 0.0%) 0.0000 ( 0.0%) 0.0000 ( 0.0%) IsDynamicRequest
0.0000 ( 0.0%) 0.0000 ( 0.0%) 0.0000 ( 0.0%) 0.0000 ( 0.0%) GenericParamListRequest
0.0000 ( 0.0%) 0.0000 ( 0.0%) 0.0000 ( 0.0%) 0.0000 ( 0.0%) ParamSpecifierRequest
0.0000 ( 0.0%) 0.0000 ( 0.0%) 0.0000 ( 0.0%) 0.0000 ( 0.0%) HasDefaultInitRequest
0.0000 ( 0.0%) 0.0000 ( 0.0%) 0.0000 ( 0.0%) 0.0000 ( 0.0%) AccessLevelRequest
0.0000 ( 0.0%) 0.0000 ( 0.0%) 0.0000 ( 0.0%) 0.0000 ( 0.0%) RequiresOpaqueModifyCoroutineRequest
0.0000 ( 0.0%) 0.0000 ( 0.0%) 0.0000 ( 0.0%) 0.0000 ( 0.0%) DynamicallyReplacedDeclRequest
0.0000 ( 0.0%) 0.0000 ( 0.0%) 0.0000 ( 0.0%) 0.0000 ( 0.0%) MemberwiseInitPropertiesRequest
0.0000 ( 0.0%) 0.0000 ( 0.0%) 0.0000 ( 0.0%) 0.0000 ( 0.0%) GlobalActorAttributeRequest
0.0000 ( 0.0%) 0.0000 ( 0.0%) 0.0000 ( 0.0%) 0.0000 ( 0.0%) ClassAncestryFlagsRequest
0.0000 ( 0.0%) 0.0000 ( 0.0%) 0.0000 ( 0.0%) 0.0000 ( 0.0%) SemanticUnavailableAttrRequest
0.0000 ( 0.0%) 0.0000 ( 0.0%) 0.0000 ( 0.0%) 0.0000 ( 0.0%) FragileFunctionKindRequest
0.0000 ( 0.0%) 0.0000 ( 0.0%) 0.0000 ( 0.0%) 0.0000 ( 0.0%) IsFinalRequest
0.0000 ( 0.0%) 0.0000 ( 0.0%) 0.0000 ( 0.0%) 0.0000 ( 0.0%) PreCheckFunctionBodyRequest
0.0000 ( 0.0%) 0.0000 ( 0.0%) 0.0000 ( 0.0%) 0.0000 ( 0.0%) ConditionalRequirementsRequest
0.0000 ( 0.0%) 0.0000 ( 0.0%) 0.0000 ( 0.0%) 0.0000 ( 0.0%) IsSetterMutatingRequest
0.0000 ( 0.0%) 0.0000 ( 0.0%) 0.0000 ( 0.0%) 0.0000 ( 0.0%) ApplyAccessNoteRequest
0.0000 ( 0.0%) 0.0000 ( 0.0%) 0.0000 ( 0.0%) 0.0000 ( 0.0%) IsNonUserModuleRequest
0.0000 ( 0.0%) 0.0000 ( 0.0%) 0.0000 ( 0.0%) 0.0000 ( 0.0%) LifetimeDependenceInfoRequest
0.0000 ( 0.0%) 0.0000 ( 0.0%) 0.0000 ( 0.0%) 0.0000 ( 0.0%) IsFunctionBodySkippedRequest
0.0000 ( 0.0%) 0.0000 ( 0.0%) 0.0000 ( 0.0%) 0.0000 ( 0.0%) SelfAccessKindRequest
0.0000 ( 0.0%) 0.0000 ( 0.0%) 0.0000 ( 0.0%) 0.0000 ( 0.0%) CheckInconsistentImplementationOnlyImportsRequest
0.0000 ( 0.0%) 0.0000 ( 0.0%) 0.0000 ( 0.0%) 0.0000 ( 0.0%) SemanticDeclAttrsRequest
0.0000 ( 0.0%) 0.0000 ( 0.0%) 0.0000 ( 0.0%) 0.0000 ( 0.0%) ExpandChildTypeRefinementContextsRequest
0.0000 ( 0.0%) 0.0000 ( 0.0%) 0.0000 ( 0.0%) 0.0000 ( 0.0%) IsStaticRequest
0.0000 ( 0.0%) 0.0000 ( 0.0%) 0.0000 ( 0.0%) 0.0000 ( 0.0%) StoredPropertiesAndMissingMembersRequest
0.0000 ( 0.0%) 0.0000 ( 0.0%) 0.0000 ( 0.0%) 0.0000 ( 0.0%) module-populate-cache
0.0000 ( 0.0%) 0.0000 ( 0.0%) 0.0000 ( 0.0%) 0.0000 ( 0.0%) InitKindRequest
0.0000 ( 0.0%) 0.0000 ( 0.0%) 0.0000 ( 0.0%) 0.0000 ( 0.0%) SIL verification, post-optimization
0.0000 ( 0.0%) 0.0000 ( 0.0%) 0.0000 ( 0.0%) 0.0000 ( 0.0%) IsDistributedActorRequest
0.0000 ( 0.0%) 0.0000 ( 0.0%) 0.0000 ( 0.0%) 0.0000 ( 0.0%) SIL verification, pre-optimization
0.0000 ( 0.0%) 0.0000 ( 0.0%) 0.0000 ( 0.0%) 0.0000 ( 0.0%) IsABICompatibleOverrideRequest
0.0000 ( 0.0%) 0.0000 ( 0.0%) 0.0000 ( 0.0%) 0.0000 ( 0.0%) ResultBuilderTypeRequest
0.0000 ( 0.0%) 0.0000 ( 0.0%) 0.0000 ( 0.0%) 0.0000 ( 0.0%) ModuleImplicitImportsRequest
0.0000 ( 0.0%) 0.0000 ( 0.0%) 0.0000 ( 0.0%) 0.0000 ( 0.0%) PublicSymbolsRequest
0.0000 ( 0.0%) 0.0000 ( 0.0%) 0.0000 ( 0.0%) 0.0000 ( 0.0%) IsActorRequest
0.0000 ( 0.0%) 0.0000 ( 0.0%) 0.0000 ( 0.0%) 0.0000 ( 0.0%) source-file-populate-cache
0.0000 ( 0.0%) 0.0000 ( 0.0%) 0.0000 ( 0.0%) 0.0000 ( 0.0%) RequirementSignatureRequest
0.0000 ( 0.0%) 0.0000 ( 0.0%) 0.0000 ( 0.0%) 0.0000 ( 0.0%) ExpandBodyMacroRequest
0.0000 ( 0.0%) 0.0000 ( 0.0%) 0.0000 ( 0.0%) 0.0000 ( 0.0%) ExpandAccessorMacros
0.0000 ( 0.0%) 0.0000 ( 0.0%) 0.0000 ( 0.0%) 0.0000 ( 0.0%) HasCircularInheritedProtocolsRequest
0.0000 ( 0.0%) 0.0000 ( 0.0%) 0.0000 ( 0.0%) 0.0000 ( 0.0%) SelfBoundsFromWhereClauseRequest
0.0000 ( 0.0%) 0.0000 ( 0.0%) 0.0000 ( 0.0%) 0.0000 ( 0.0%) IsImplicitlyUnwrappedOptionalRequest
0.0000 ( 0.0%) 0.0000 ( 0.0%) 0.0000 ( 0.0%) 0.0000 ( 0.0%) LocalTypeDeclsRequest
0.0000 ( 0.0%) 0.0000 ( 0.0%) 0.0000 ( 0.0%) 0.0000 ( 0.0%) perform-whole-module-type-checking
0.0000 ( 0.0%) 0.0000 ( 0.0%) 0.0000 ( 0.0%) 0.0000 ( 0.0%) ExpandSynthesizedMemberMacroRequest
0.0000 ( 0.0%) 0.0000 ( 0.0%) 0.0000 ( 0.0%) 0.0000 ( 0.0%) ObjCInterfaceAndImplementationRequest
0.0000 ( 0.0%) 0.0000 ( 0.0%) 0.0000 ( 0.0%) 0.0000 ( 0.0%) PropertyWrapperMutabilityRequest
0.0000 ( 0.0%) 0.0000 ( 0.0%) 0.0000 ( 0.0%) 0.0000 ( 0.0%) HasStorageRequest
0.0000 ( 0.0%) 0.0000 ( 0.0%) 0.0000 ( 0.0%) 0.0000 ( 0.0%) SynthesizeMainFunctionRequest
0.0000 ( 0.0%) 0.0000 ( 0.0%) 0.0000 ( 0.0%) 0.0000 ( 0.0%) PolymorphicEffectKindRequest
0.0000 ( 0.0%) 0.0000 ( 0.0%) 0.0000 ( 0.0%) 0.0000 ( 0.0%) HasImportsMatchingFlagRequest
0.0000 ( 0.0%) 0.0000 ( 0.0%) 0.0000 ( 0.0%) 0.0000 ( 0.0%) PropertyWrapperAuxiliaryVariablesRequest
0.0000 ( 0.0%) 0.0000 ( 0.0%) 0.0000 ( 0.0%) 0.0000 ( 0.0%) SetterAccessLevelRequest
0.0000 ( 0.0%) 0.0000 ( 0.0%) 0.0000 ( 0.0%) 0.0000 ( 0.0%) CheckInconsistentAccessLevelOnImport
0.0000 ( 0.0%) 0.0000 ( 0.0%) 0.0000 ( 0.0%) 0.0000 ( 0.0%) BodyInitKindRequest
0.0000 ( 0.0%) 0.0000 ( 0.0%) 0.0000 ( 0.0%) 0.0000 ( 0.0%) IsDefaultActorRequest
0.0000 ( 0.0%) 0.0000 ( 0.0%) 0.0000 ( 0.0%) 0.0000 ( 0.0%) ProvideDefaultImplForRequest
0.0000 ( 0.0%) 0.0000 ( 0.0%) 0.0000 ( 0.0%) 0.0000 ( 0.0%) ExpandPreambleMacroRequest
0.0000 ( 0.0%) 0.0000 ( 0.0%) 0.0000 ( 0.0%) 0.0000 ( 0.0%) populate-source-file-class-member-cache
0.0000 ( 0.0%) 0.0000 ( 0.0%) 0.0000 ( 0.0%) 0.0000 ( 0.0%) CheckInconsistentSPIOnlyImportsRequest
0.0000 ( 0.0%) 0.0000 ( 0.0%) 0.0000 ( 0.0%) 0.0000 ( 0.0%) UnderlyingTypeDeclsReferencedRequest
0.0000 ( 0.0%) 0.0000 ( 0.0%) 0.0000 ( 0.0%) 0.0000 ( 0.0%) PreCheckReturnStmtRequest
0.0000 ( 0.0%) 0.0000 ( 0.0%) 0.0000 ( 0.0%) 0.0000 ( 0.0%) PrimarySourceFilesRequest
0.0000 ( 0.0%) 0.0000 ( 0.0%) 0.0000 ( 0.0%) 0.0000 ( 0.0%) ResolvePatternRequest
0.0000 ( 0.0%) 0.0000 ( 0.0%) 0.0000 ( 0.0%) 0.0000 ( 0.0%) RawCommentRequest
0.0000 ( 0.0%) 0.0000 ( 0.0%) 0.0000 ( 0.0%) 0.0000 ( 0.0%) CheckInconsistentAccessLevelOnImportSameFileRequest
0.0000 ( 0.0%) 0.0000 ( 0.0%) 0.0000 ( 0.0%) 0.0000 ( 0.0%) AttachedResultBuilderRequest
0.0000 ( 0.0%) 0.0000 ( 0.0%) 0.0000 ( 0.0%) 0.0000 ( 0.0%) AST verification
0.1849 (100.0%) 0.4167 (100.0%) 0.6016 (100.0%) 0.6286 (100.0%) Total
===-------------------------------------------------------------------------===
Running Program
===-------------------------------------------------------------------------===
Total Execution Time: 0.2711 seconds (0.2831 wall clock)
---User Time--- --System Time-- --User+System-- ---Wall Time--- --- Name ---
0.0780 (100.0%) 0.1931 (100.0%) 0.2711 (100.0%) 0.2831 (100.0%) Building Target
0.0780 (100.0%) 0.1931 (100.0%) 0.2711 (100.0%) 0.2831 (100.0%) Total
SwiftCompile normal arm64 /Users/admin/builder/spi-builder-workspace/Sources/ComposableEnvironment/Deprecations/GlobalEnvironment+Migration.swift (in target 'ComposableEnvironment' from project 'swift-composable-environment')
cd /Users/admin/builder/spi-builder-workspace
/Applications/Xcode-16.1.0.app/Contents/Developer/Toolchains/XcodeDefault.xctoolchain/usr/bin/swift-frontend -c /Users/admin/builder/spi-builder-workspace/Sources/ComposableEnvironment/ComposableEnvironment.swift /Users/admin/builder/spi-builder-workspace/Sources/ComposableEnvironment/Dependency.swift -primary-file /Users/admin/builder/spi-builder-workspace/Sources/ComposableEnvironment/Deprecations/GlobalEnvironment+Migration.swift /Users/admin/builder/spi-builder-workspace/Sources/ComposableEnvironment/Deprecations/Reducers+Deprecations.swift /Users/admin/builder/spi-builder-workspace/Sources/ComposableEnvironment/DerivedEnvironment.swift /Users/admin/builder/spi-builder-workspace/Sources/ComposableEnvironment/Reducer+ComposableEnvironment.swift -emit-dependencies-path /Users/admin/builder/spi-builder-workspace/.derivedData/Build/Intermediates.noindex/swift-composable-environment.build/Debug-appletvos/ComposableEnvironment.build/Objects-normal/arm64/GlobalEnvironment+Migration.d -emit-const-values-path /Users/admin/builder/spi-builder-workspace/.derivedData/Build/Intermediates.noindex/swift-composable-environment.build/Debug-appletvos/ComposableEnvironment.build/Objects-normal/arm64/GlobalEnvironment+Migration.swiftconstvalues -emit-reference-dependencies-path /Users/admin/builder/spi-builder-workspace/.derivedData/Build/Intermediates.noindex/swift-composable-environment.build/Debug-appletvos/ComposableEnvironment.build/Objects-normal/arm64/GlobalEnvironment+Migration.swiftdeps -serialize-diagnostics-path /Users/admin/builder/spi-builder-workspace/.derivedData/Build/Intermediates.noindex/swift-composable-environment.build/Debug-appletvos/ComposableEnvironment.build/Objects-normal/arm64/GlobalEnvironment+Migration.dia -target arm64-apple-tvos13.0 -Xllvm -aarch64-use-tbi -enable-objc-interop -stack-check -sdk /Applications/Xcode-16.1.0.app/Contents/Developer/Platforms/AppleTVOS.platform/Developer/SDKs/AppleTVOS18.1.sdk -I /Users/admin/builder/spi-builder-workspace/.derivedData/Build/Products/Debug-appletvos -I /Applications/Xcode-16.1.0.app/Contents/Developer/Platforms/AppleTVOS.platform/Developer/usr/lib -F /Users/admin/builder/spi-builder-workspace/.derivedData/Build/Products/Debug-appletvos/PackageFrameworks -F /Users/admin/builder/spi-builder-workspace/.derivedData/Build/Products/Debug-appletvos/PackageFrameworks -F /Users/admin/builder/spi-builder-workspace/.derivedData/Build/Products/Debug-appletvos/PackageFrameworks -F /Users/admin/builder/spi-builder-workspace/.derivedData/Build/Products/Debug-appletvos/PackageFrameworks -F /Users/admin/builder/spi-builder-workspace/.derivedData/Build/Products/Debug-appletvos/PackageFrameworks -F /Users/admin/builder/spi-builder-workspace/.derivedData/Build/Products/Debug-appletvos/PackageFrameworks -F /Users/admin/builder/spi-builder-workspace/.derivedData/Build/Products/Debug-appletvos/PackageFrameworks -F /Users/admin/builder/spi-builder-workspace/.derivedData/Build/Products/Debug-appletvos/PackageFrameworks -F /Users/admin/builder/spi-builder-workspace/.derivedData/Build/Products/Debug-appletvos/PackageFrameworks -F /Users/admin/builder/spi-builder-workspace/.derivedData/Build/Products/Debug-appletvos/PackageFrameworks -F /Users/admin/builder/spi-builder-workspace/.derivedData/Build/Products/Debug-appletvos/PackageFrameworks -F /Users/admin/builder/spi-builder-workspace/.derivedData/Build/Products/Debug-appletvos/PackageFrameworks -F /Users/admin/builder/spi-builder-workspace/.derivedData/Build/Products/Debug-appletvos/PackageFrameworks -F /Users/admin/builder/spi-builder-workspace/.derivedData/Build/Products/Debug-appletvos/PackageFrameworks -F /Users/admin/builder/spi-builder-workspace/.derivedData/Build/Products/Debug-appletvos/PackageFrameworks -F /Users/admin/builder/spi-builder-workspace/.derivedData/Build/Products/Debug-appletvos -F /Applications/Xcode-16.1.0.app/Contents/Developer/Platforms/AppleTVOS.platform/Developer/Library/Frameworks -F /Applications/Xcode-16.1.0.app/Contents/Developer/Platforms/AppleTVOS.platform/Developer/SDKs/AppleTVOS18.1.sdk/Developer/Library/Frameworks -no-color-diagnostics -enable-testing -g -debug-info-format\=dwarf -dwarf-version\=4 -module-cache-path /Users/admin/builder/spi-builder-workspace/.derivedData/ModuleCache.noindex -swift-version 5 -enforce-exclusivity\=checked -stats-output-dir /Users/admin/builder/spi-builder-workspace/.stats -Onone -D SWIFT_PACKAGE -D DEBUG -serialize-debugging-options -const-gather-protocols-file /Users/admin/builder/spi-builder-workspace/.derivedData/Build/Intermediates.noindex/swift-composable-environment.build/Debug-appletvos/ComposableEnvironment.build/Objects-normal/arm64/ComposableEnvironment_const_extract_protocols.json -enable-experimental-feature DebugDescriptionMacro -enable-experimental-feature OpaqueTypeErasure -enable-upcoming-feature StrictConcurrency -enable-upcoming-feature DisableOutwardActorInference -enable-upcoming-feature GlobalActorIsolatedTypesUsability -enable-upcoming-feature InferSendableFromCaptures -strict-concurrency\=complete -empty-abi-descriptor -plugin-path /Applications/Xcode-16.1.0.app/Contents/Developer/Toolchains/XcodeDefault.xctoolchain/usr/lib/swift/host/plugins/testing -validate-clang-modules-once -clang-build-session-file /Users/admin/builder/spi-builder-workspace/.derivedData/ModuleCache.noindex/Session.modulevalidation -Xcc -working-directory -Xcc /Users/admin/builder/spi-builder-workspace -resource-dir /Applications/Xcode-16.1.0.app/Contents/Developer/Toolchains/XcodeDefault.xctoolchain/usr/lib/swift -enable-anonymous-context-mangled-names -file-compilation-dir /Users/admin/builder/spi-builder-workspace -Xcc -D_LIBCPP_HARDENING_MODE\=_LIBCPP_HARDENING_MODE_DEBUG -Xcc -ivfsstatcache -Xcc /Users/admin/builder/spi-builder-workspace/.derivedData/SDKStatCaches.noindex/appletvos18.1-22J572-e7fdd8cf9ffd4d4af20823079b51a726.sdkstatcache -Xcc -I/Users/admin/builder/spi-builder-workspace/.derivedData/Build/Intermediates.noindex/swift-composable-environment.build/Debug-appletvos/ComposableEnvironment.build/swift-overrides.hmap -Xcc -I/Users/admin/builder/spi-builder-workspace/.derivedData/Build/Products/Debug-appletvos/include -Xcc -I/Users/admin/builder/spi-builder-workspace/.derivedData/Build/Intermediates.noindex/swift-composable-environment.build/Debug-appletvos/ComposableEnvironment.build/DerivedSources-normal/arm64 -Xcc -I/Users/admin/builder/spi-builder-workspace/.derivedData/Build/Intermediates.noindex/swift-composable-environment.build/Debug-appletvos/ComposableEnvironment.build/DerivedSources/arm64 -Xcc -I/Users/admin/builder/spi-builder-workspace/.derivedData/Build/Intermediates.noindex/swift-composable-environment.build/Debug-appletvos/ComposableEnvironment.build/DerivedSources -Xcc -DSWIFT_PACKAGE -Xcc -DDEBUG\=1 -module-name ComposableEnvironment -frontend-parseable-output -disable-clang-spi -target-sdk-version 18.1 -target-sdk-name appletvos18.1 -external-plugin-path /Applications/Xcode-16.1.0.app/Contents/Developer/Platforms/AppleTVOS.platform/Developer/usr/lib/swift/host/plugins\#/Applications/Xcode-16.1.0.app/Contents/Developer/Platforms/AppleTVOS.platform/Developer/usr/bin/swift-plugin-server -external-plugin-path /Applications/Xcode-16.1.0.app/Contents/Developer/Platforms/AppleTVOS.platform/Developer/usr/local/lib/swift/host/plugins\#/Applications/Xcode-16.1.0.app/Contents/Developer/Platforms/AppleTVOS.platform/Developer/usr/bin/swift-plugin-server -plugin-path /Applications/Xcode-16.1.0.app/Contents/Developer/Toolchains/XcodeDefault.xctoolchain/usr/lib/swift/host/plugins -plugin-path /Applications/Xcode-16.1.0.app/Contents/Developer/Toolchains/XcodeDefault.xctoolchain/usr/local/lib/swift/host/plugins -o /Users/admin/builder/spi-builder-workspace/.derivedData/Build/Intermediates.noindex/swift-composable-environment.build/Debug-appletvos/ComposableEnvironment.build/Objects-normal/arm64/GlobalEnvironment+Migration.o -index-unit-output-path /swift-composable-environment.build/Debug-appletvos/ComposableEnvironment.build/Objects-normal/arm64/GlobalEnvironment+Migration.o -index-store-path /Users/admin/builder/spi-builder-workspace/.derivedData/Index.noindex/DataStore -index-system-modules
SwiftCompile normal arm64 Compiling\ Dependency.swift /Users/admin/builder/spi-builder-workspace/Sources/ComposableEnvironment/Dependency.swift (in target 'ComposableEnvironment' from project 'swift-composable-environment')
cd /Users/admin/builder/spi-builder-workspace
builtin-swiftTaskExecution -- /Applications/Xcode-16.1.0.app/Contents/Developer/Toolchains/XcodeDefault.xctoolchain/usr/bin/swift-frontend -frontend -c /Users/admin/builder/spi-builder-workspace/Sources/ComposableEnvironment/ComposableEnvironment.swift -primary-file /Users/admin/builder/spi-builder-workspace/Sources/ComposableEnvironment/Dependency.swift /Users/admin/builder/spi-builder-workspace/Sources/ComposableEnvironment/Deprecations/GlobalEnvironment+Migration.swift /Users/admin/builder/spi-builder-workspace/Sources/ComposableEnvironment/Deprecations/Reducers+Deprecations.swift /Users/admin/builder/spi-builder-workspace/Sources/ComposableEnvironment/DerivedEnvironment.swift /Users/admin/builder/spi-builder-workspace/Sources/ComposableEnvironment/Reducer+ComposableEnvironment.swift -emit-dependencies-path /Users/admin/builder/spi-builder-workspace/.derivedData/Build/Intermediates.noindex/swift-composable-environment.build/Debug-appletvos/ComposableEnvironment.build/Objects-normal/arm64/Dependency.d -emit-const-values-path /Users/admin/builder/spi-builder-workspace/.derivedData/Build/Intermediates.noindex/swift-composable-environment.build/Debug-appletvos/ComposableEnvironment.build/Objects-normal/arm64/Dependency.swiftconstvalues -emit-reference-dependencies-path /Users/admin/builder/spi-builder-workspace/.derivedData/Build/Intermediates.noindex/swift-composable-environment.build/Debug-appletvos/ComposableEnvironment.build/Objects-normal/arm64/Dependency.swiftdeps -serialize-diagnostics-path /Users/admin/builder/spi-builder-workspace/.derivedData/Build/Intermediates.noindex/swift-composable-environment.build/Debug-appletvos/ComposableEnvironment.build/Objects-normal/arm64/Dependency.dia -target arm64-apple-tvos13.0 -Xllvm -aarch64-use-tbi -enable-objc-interop -stack-check -sdk /Applications/Xcode-16.1.0.app/Contents/Developer/Platforms/AppleTVOS.platform/Developer/SDKs/AppleTVOS18.1.sdk -I /Users/admin/builder/spi-builder-workspace/.derivedData/Build/Products/Debug-appletvos -I /Applications/Xcode-16.1.0.app/Contents/Developer/Platforms/AppleTVOS.platform/Developer/usr/lib -F /Users/admin/builder/spi-builder-workspace/.derivedData/Build/Products/Debug-appletvos/PackageFrameworks -F /Users/admin/builder/spi-builder-workspace/.derivedData/Build/Products/Debug-appletvos/PackageFrameworks -F /Users/admin/builder/spi-builder-workspace/.derivedData/Build/Products/Debug-appletvos/PackageFrameworks -F /Users/admin/builder/spi-builder-workspace/.derivedData/Build/Products/Debug-appletvos/PackageFrameworks -F /Users/admin/builder/spi-builder-workspace/.derivedData/Build/Products/Debug-appletvos/PackageFrameworks -F /Users/admin/builder/spi-builder-workspace/.derivedData/Build/Products/Debug-appletvos/PackageFrameworks -F /Users/admin/builder/spi-builder-workspace/.derivedData/Build/Products/Debug-appletvos/PackageFrameworks -F /Users/admin/builder/spi-builder-workspace/.derivedData/Build/Products/Debug-appletvos/PackageFrameworks -F /Users/admin/builder/spi-builder-workspace/.derivedData/Build/Products/Debug-appletvos/PackageFrameworks -F /Users/admin/builder/spi-builder-workspace/.derivedData/Build/Products/Debug-appletvos/PackageFrameworks -F /Users/admin/builder/spi-builder-workspace/.derivedData/Build/Products/Debug-appletvos/PackageFrameworks -F /Users/admin/builder/spi-builder-workspace/.derivedData/Build/Products/Debug-appletvos/PackageFrameworks -F /Users/admin/builder/spi-builder-workspace/.derivedData/Build/Products/Debug-appletvos/PackageFrameworks -F /Users/admin/builder/spi-builder-workspace/.derivedData/Build/Products/Debug-appletvos/PackageFrameworks -F /Users/admin/builder/spi-builder-workspace/.derivedData/Build/Products/Debug-appletvos/PackageFrameworks -F /Users/admin/builder/spi-builder-workspace/.derivedData/Build/Products/Debug-appletvos -F /Applications/Xcode-16.1.0.app/Contents/Developer/Platforms/AppleTVOS.platform/Developer/Library/Frameworks -F /Applications/Xcode-16.1.0.app/Contents/Developer/Platforms/AppleTVOS.platform/Developer/SDKs/AppleTVOS18.1.sdk/Developer/Library/Frameworks -no-color-diagnostics -enable-testing -g -debug-info-format\=dwarf -dwarf-version\=4 -module-cache-path /Users/admin/builder/spi-builder-workspace/.derivedData/ModuleCache.noindex -swift-version 5 -enforce-exclusivity\=checked -stats-output-dir /Users/admin/builder/spi-builder-workspace/.stats -Onone -D SWIFT_PACKAGE -D DEBUG -serialize-debugging-options -const-gather-protocols-file /Users/admin/builder/spi-builder-workspace/.derivedData/Build/Intermediates.noindex/swift-composable-environment.build/Debug-appletvos/ComposableEnvironment.build/Objects-normal/arm64/ComposableEnvironment_const_extract_protocols.json -enable-experimental-feature DebugDescriptionMacro -enable-experimental-feature OpaqueTypeErasure -enable-upcoming-feature StrictConcurrency -enable-upcoming-feature DisableOutwardActorInference -enable-upcoming-feature GlobalActorIsolatedTypesUsability -enable-upcoming-feature InferSendableFromCaptures -strict-concurrency\=complete -empty-abi-descriptor -plugin-path /Applications/Xcode-16.1.0.app/Contents/Developer/Toolchains/XcodeDefault.xctoolchain/usr/lib/swift/host/plugins/testing -validate-clang-modules-once -clang-build-session-file /Users/admin/builder/spi-builder-workspace/.derivedData/ModuleCache.noindex/Session.modulevalidation -Xcc -working-directory -Xcc /Users/admin/builder/spi-builder-workspace -resource-dir /Applications/Xcode-16.1.0.app/Contents/Developer/Toolchains/XcodeDefault.xctoolchain/usr/lib/swift -enable-anonymous-context-mangled-names -file-compilation-dir /Users/admin/builder/spi-builder-workspace -Xcc -D_LIBCPP_HARDENING_MODE\=_LIBCPP_HARDENING_MODE_DEBUG -Xcc -ivfsstatcache -Xcc /Users/admin/builder/spi-builder-workspace/.derivedData/SDKStatCaches.noindex/appletvos18.1-22J572-e7fdd8cf9ffd4d4af20823079b51a726.sdkstatcache -Xcc -I/Users/admin/builder/spi-builder-workspace/.derivedData/Build/Intermediates.noindex/swift-composable-environment.build/Debug-appletvos/ComposableEnvironment.build/swift-overrides.hmap -Xcc -I/Users/admin/builder/spi-builder-workspace/.derivedData/Build/Products/Debug-appletvos/include -Xcc -I/Users/admin/builder/spi-builder-workspace/.derivedData/Build/Intermediates.noindex/swift-composable-environment.build/Debug-appletvos/ComposableEnvironment.build/DerivedSources-normal/arm64 -Xcc -I/Users/admin/builder/spi-builder-workspace/.derivedData/Build/Intermediates.noindex/swift-composable-environment.build/Debug-appletvos/ComposableEnvironment.build/DerivedSources/arm64 -Xcc -I/Users/admin/builder/spi-builder-workspace/.derivedData/Build/Intermediates.noindex/swift-composable-environment.build/Debug-appletvos/ComposableEnvironment.build/DerivedSources -Xcc -DSWIFT_PACKAGE -Xcc -DDEBUG\=1 -module-name ComposableEnvironment -frontend-parseable-output -disable-clang-spi -target-sdk-version 18.1 -target-sdk-name appletvos18.1 -external-plugin-path /Applications/Xcode-16.1.0.app/Contents/Developer/Platforms/AppleTVOS.platform/Developer/usr/lib/swift/host/plugins\#/Applications/Xcode-16.1.0.app/Contents/Developer/Platforms/AppleTVOS.platform/Developer/usr/bin/swift-plugin-server -external-plugin-path /Applications/Xcode-16.1.0.app/Contents/Developer/Platforms/AppleTVOS.platform/Developer/usr/local/lib/swift/host/plugins\#/Applications/Xcode-16.1.0.app/Contents/Developer/Platforms/AppleTVOS.platform/Developer/usr/bin/swift-plugin-server -plugin-path /Applications/Xcode-16.1.0.app/Contents/Developer/Toolchains/XcodeDefault.xctoolchain/usr/lib/swift/host/plugins -plugin-path /Applications/Xcode-16.1.0.app/Contents/Developer/Toolchains/XcodeDefault.xctoolchain/usr/local/lib/swift/host/plugins -o /Users/admin/builder/spi-builder-workspace/.derivedData/Build/Intermediates.noindex/swift-composable-environment.build/Debug-appletvos/ComposableEnvironment.build/Objects-normal/arm64/Dependency.o -index-unit-output-path /swift-composable-environment.build/Debug-appletvos/ComposableEnvironment.build/Objects-normal/arm64/Dependency.o -index-store-path /Users/admin/builder/spi-builder-workspace/.derivedData/Index.noindex/DataStore -index-system-modules
SwiftCompile normal arm64 /Users/admin/builder/spi-builder-workspace/Sources/ComposableEnvironment/Dependency.swift (in target 'ComposableEnvironment' from project 'swift-composable-environment')
cd /Users/admin/builder/spi-builder-workspace
/Applications/Xcode-16.1.0.app/Contents/Developer/Toolchains/XcodeDefault.xctoolchain/usr/bin/swift-frontend -c /Users/admin/builder/spi-builder-workspace/Sources/ComposableEnvironment/ComposableEnvironment.swift -primary-file /Users/admin/builder/spi-builder-workspace/Sources/ComposableEnvironment/Dependency.swift /Users/admin/builder/spi-builder-workspace/Sources/ComposableEnvironment/Deprecations/GlobalEnvironment+Migration.swift /Users/admin/builder/spi-builder-workspace/Sources/ComposableEnvironment/Deprecations/Reducers+Deprecations.swift /Users/admin/builder/spi-builder-workspace/Sources/ComposableEnvironment/DerivedEnvironment.swift /Users/admin/builder/spi-builder-workspace/Sources/ComposableEnvironment/Reducer+ComposableEnvironment.swift -emit-dependencies-path /Users/admin/builder/spi-builder-workspace/.derivedData/Build/Intermediates.noindex/swift-composable-environment.build/Debug-appletvos/ComposableEnvironment.build/Objects-normal/arm64/Dependency.d -emit-const-values-path /Users/admin/builder/spi-builder-workspace/.derivedData/Build/Intermediates.noindex/swift-composable-environment.build/Debug-appletvos/ComposableEnvironment.build/Objects-normal/arm64/Dependency.swiftconstvalues -emit-reference-dependencies-path /Users/admin/builder/spi-builder-workspace/.derivedData/Build/Intermediates.noindex/swift-composable-environment.build/Debug-appletvos/ComposableEnvironment.build/Objects-normal/arm64/Dependency.swiftdeps -serialize-diagnostics-path /Users/admin/builder/spi-builder-workspace/.derivedData/Build/Intermediates.noindex/swift-composable-environment.build/Debug-appletvos/ComposableEnvironment.build/Objects-normal/arm64/Dependency.dia -target arm64-apple-tvos13.0 -Xllvm -aarch64-use-tbi -enable-objc-interop -stack-check -sdk /Applications/Xcode-16.1.0.app/Contents/Developer/Platforms/AppleTVOS.platform/Developer/SDKs/AppleTVOS18.1.sdk -I /Users/admin/builder/spi-builder-workspace/.derivedData/Build/Products/Debug-appletvos -I /Applications/Xcode-16.1.0.app/Contents/Developer/Platforms/AppleTVOS.platform/Developer/usr/lib -F /Users/admin/builder/spi-builder-workspace/.derivedData/Build/Products/Debug-appletvos/PackageFrameworks -F /Users/admin/builder/spi-builder-workspace/.derivedData/Build/Products/Debug-appletvos/PackageFrameworks -F /Users/admin/builder/spi-builder-workspace/.derivedData/Build/Products/Debug-appletvos/PackageFrameworks -F /Users/admin/builder/spi-builder-workspace/.derivedData/Build/Products/Debug-appletvos/PackageFrameworks -F /Users/admin/builder/spi-builder-workspace/.derivedData/Build/Products/Debug-appletvos/PackageFrameworks -F /Users/admin/builder/spi-builder-workspace/.derivedData/Build/Products/Debug-appletvos/PackageFrameworks -F /Users/admin/builder/spi-builder-workspace/.derivedData/Build/Products/Debug-appletvos/PackageFrameworks -F /Users/admin/builder/spi-builder-workspace/.derivedData/Build/Products/Debug-appletvos/PackageFrameworks -F /Users/admin/builder/spi-builder-workspace/.derivedData/Build/Products/Debug-appletvos/PackageFrameworks -F /Users/admin/builder/spi-builder-workspace/.derivedData/Build/Products/Debug-appletvos/PackageFrameworks -F /Users/admin/builder/spi-builder-workspace/.derivedData/Build/Products/Debug-appletvos/PackageFrameworks -F /Users/admin/builder/spi-builder-workspace/.derivedData/Build/Products/Debug-appletvos/PackageFrameworks -F /Users/admin/builder/spi-builder-workspace/.derivedData/Build/Products/Debug-appletvos/PackageFrameworks -F /Users/admin/builder/spi-builder-workspace/.derivedData/Build/Products/Debug-appletvos/PackageFrameworks -F /Users/admin/builder/spi-builder-workspace/.derivedData/Build/Products/Debug-appletvos/PackageFrameworks -F /Users/admin/builder/spi-builder-workspace/.derivedData/Build/Products/Debug-appletvos -F /Applications/Xcode-16.1.0.app/Contents/Developer/Platforms/AppleTVOS.platform/Developer/Library/Frameworks -F /Applications/Xcode-16.1.0.app/Contents/Developer/Platforms/AppleTVOS.platform/Developer/SDKs/AppleTVOS18.1.sdk/Developer/Library/Frameworks -no-color-diagnostics -enable-testing -g -debug-info-format\=dwarf -dwarf-version\=4 -module-cache-path /Users/admin/builder/spi-builder-workspace/.derivedData/ModuleCache.noindex -swift-version 5 -enforce-exclusivity\=checked -stats-output-dir /Users/admin/builder/spi-builder-workspace/.stats -Onone -D SWIFT_PACKAGE -D DEBUG -serialize-debugging-options -const-gather-protocols-file /Users/admin/builder/spi-builder-workspace/.derivedData/Build/Intermediates.noindex/swift-composable-environment.build/Debug-appletvos/ComposableEnvironment.build/Objects-normal/arm64/ComposableEnvironment_const_extract_protocols.json -enable-experimental-feature DebugDescriptionMacro -enable-experimental-feature OpaqueTypeErasure -enable-upcoming-feature StrictConcurrency -enable-upcoming-feature DisableOutwardActorInference -enable-upcoming-feature GlobalActorIsolatedTypesUsability -enable-upcoming-feature InferSendableFromCaptures -strict-concurrency\=complete -empty-abi-descriptor -plugin-path /Applications/Xcode-16.1.0.app/Contents/Developer/Toolchains/XcodeDefault.xctoolchain/usr/lib/swift/host/plugins/testing -validate-clang-modules-once -clang-build-session-file /Users/admin/builder/spi-builder-workspace/.derivedData/ModuleCache.noindex/Session.modulevalidation -Xcc -working-directory -Xcc /Users/admin/builder/spi-builder-workspace -resource-dir /Applications/Xcode-16.1.0.app/Contents/Developer/Toolchains/XcodeDefault.xctoolchain/usr/lib/swift -enable-anonymous-context-mangled-names -file-compilation-dir /Users/admin/builder/spi-builder-workspace -Xcc -D_LIBCPP_HARDENING_MODE\=_LIBCPP_HARDENING_MODE_DEBUG -Xcc -ivfsstatcache -Xcc /Users/admin/builder/spi-builder-workspace/.derivedData/SDKStatCaches.noindex/appletvos18.1-22J572-e7fdd8cf9ffd4d4af20823079b51a726.sdkstatcache -Xcc -I/Users/admin/builder/spi-builder-workspace/.derivedData/Build/Intermediates.noindex/swift-composable-environment.build/Debug-appletvos/ComposableEnvironment.build/swift-overrides.hmap -Xcc -I/Users/admin/builder/spi-builder-workspace/.derivedData/Build/Products/Debug-appletvos/include -Xcc -I/Users/admin/builder/spi-builder-workspace/.derivedData/Build/Intermediates.noindex/swift-composable-environment.build/Debug-appletvos/ComposableEnvironment.build/DerivedSources-normal/arm64 -Xcc -I/Users/admin/builder/spi-builder-workspace/.derivedData/Build/Intermediates.noindex/swift-composable-environment.build/Debug-appletvos/ComposableEnvironment.build/DerivedSources/arm64 -Xcc -I/Users/admin/builder/spi-builder-workspace/.derivedData/Build/Intermediates.noindex/swift-composable-environment.build/Debug-appletvos/ComposableEnvironment.build/DerivedSources -Xcc -DSWIFT_PACKAGE -Xcc -DDEBUG\=1 -module-name ComposableEnvironment -frontend-parseable-output -disable-clang-spi -target-sdk-version 18.1 -target-sdk-name appletvos18.1 -external-plugin-path /Applications/Xcode-16.1.0.app/Contents/Developer/Platforms/AppleTVOS.platform/Developer/usr/lib/swift/host/plugins\#/Applications/Xcode-16.1.0.app/Contents/Developer/Platforms/AppleTVOS.platform/Developer/usr/bin/swift-plugin-server -external-plugin-path /Applications/Xcode-16.1.0.app/Contents/Developer/Platforms/AppleTVOS.platform/Developer/usr/local/lib/swift/host/plugins\#/Applications/Xcode-16.1.0.app/Contents/Developer/Platforms/AppleTVOS.platform/Developer/usr/bin/swift-plugin-server -plugin-path /Applications/Xcode-16.1.0.app/Contents/Developer/Toolchains/XcodeDefault.xctoolchain/usr/lib/swift/host/plugins -plugin-path /Applications/Xcode-16.1.0.app/Contents/Developer/Toolchains/XcodeDefault.xctoolchain/usr/local/lib/swift/host/plugins -o /Users/admin/builder/spi-builder-workspace/.derivedData/Build/Intermediates.noindex/swift-composable-environment.build/Debug-appletvos/ComposableEnvironment.build/Objects-normal/arm64/Dependency.o -index-unit-output-path /swift-composable-environment.build/Debug-appletvos/ComposableEnvironment.build/Objects-normal/arm64/Dependency.o -index-store-path /Users/admin/builder/spi-builder-workspace/.derivedData/Index.noindex/DataStore -index-system-modules
SwiftCompile normal arm64 Compiling\ ComposableEnvironment.swift /Users/admin/builder/spi-builder-workspace/Sources/ComposableEnvironment/ComposableEnvironment.swift (in target 'ComposableEnvironment' from project 'swift-composable-environment')
cd /Users/admin/builder/spi-builder-workspace
builtin-swiftTaskExecution -- /Applications/Xcode-16.1.0.app/Contents/Developer/Toolchains/XcodeDefault.xctoolchain/usr/bin/swift-frontend -frontend -c -primary-file /Users/admin/builder/spi-builder-workspace/Sources/ComposableEnvironment/ComposableEnvironment.swift /Users/admin/builder/spi-builder-workspace/Sources/ComposableEnvironment/Dependency.swift /Users/admin/builder/spi-builder-workspace/Sources/ComposableEnvironment/Deprecations/GlobalEnvironment+Migration.swift /Users/admin/builder/spi-builder-workspace/Sources/ComposableEnvironment/Deprecations/Reducers+Deprecations.swift /Users/admin/builder/spi-builder-workspace/Sources/ComposableEnvironment/DerivedEnvironment.swift /Users/admin/builder/spi-builder-workspace/Sources/ComposableEnvironment/Reducer+ComposableEnvironment.swift -emit-dependencies-path /Users/admin/builder/spi-builder-workspace/.derivedData/Build/Intermediates.noindex/swift-composable-environment.build/Debug-appletvos/ComposableEnvironment.build/Objects-normal/arm64/ComposableEnvironment.d -emit-const-values-path /Users/admin/builder/spi-builder-workspace/.derivedData/Build/Intermediates.noindex/swift-composable-environment.build/Debug-appletvos/ComposableEnvironment.build/Objects-normal/arm64/ComposableEnvironment.swiftconstvalues -emit-reference-dependencies-path /Users/admin/builder/spi-builder-workspace/.derivedData/Build/Intermediates.noindex/swift-composable-environment.build/Debug-appletvos/ComposableEnvironment.build/Objects-normal/arm64/ComposableEnvironment.swiftdeps -serialize-diagnostics-path /Users/admin/builder/spi-builder-workspace/.derivedData/Build/Intermediates.noindex/swift-composable-environment.build/Debug-appletvos/ComposableEnvironment.build/Objects-normal/arm64/ComposableEnvironment.dia -target arm64-apple-tvos13.0 -Xllvm -aarch64-use-tbi -enable-objc-interop -stack-check -sdk /Applications/Xcode-16.1.0.app/Contents/Developer/Platforms/AppleTVOS.platform/Developer/SDKs/AppleTVOS18.1.sdk -I /Users/admin/builder/spi-builder-workspace/.derivedData/Build/Products/Debug-appletvos -I /Applications/Xcode-16.1.0.app/Contents/Developer/Platforms/AppleTVOS.platform/Developer/usr/lib -F /Users/admin/builder/spi-builder-workspace/.derivedData/Build/Products/Debug-appletvos/PackageFrameworks -F /Users/admin/builder/spi-builder-workspace/.derivedData/Build/Products/Debug-appletvos/PackageFrameworks -F /Users/admin/builder/spi-builder-workspace/.derivedData/Build/Products/Debug-appletvos/PackageFrameworks -F /Users/admin/builder/spi-builder-workspace/.derivedData/Build/Products/Debug-appletvos/PackageFrameworks -F /Users/admin/builder/spi-builder-workspace/.derivedData/Build/Products/Debug-appletvos/PackageFrameworks -F /Users/admin/builder/spi-builder-workspace/.derivedData/Build/Products/Debug-appletvos/PackageFrameworks -F /Users/admin/builder/spi-builder-workspace/.derivedData/Build/Products/Debug-appletvos/PackageFrameworks -F /Users/admin/builder/spi-builder-workspace/.derivedData/Build/Products/Debug-appletvos/PackageFrameworks -F /Users/admin/builder/spi-builder-workspace/.derivedData/Build/Products/Debug-appletvos/PackageFrameworks -F /Users/admin/builder/spi-builder-workspace/.derivedData/Build/Products/Debug-appletvos/PackageFrameworks -F /Users/admin/builder/spi-builder-workspace/.derivedData/Build/Products/Debug-appletvos/PackageFrameworks -F /Users/admin/builder/spi-builder-workspace/.derivedData/Build/Products/Debug-appletvos/PackageFrameworks -F /Users/admin/builder/spi-builder-workspace/.derivedData/Build/Products/Debug-appletvos/PackageFrameworks -F /Users/admin/builder/spi-builder-workspace/.derivedData/Build/Products/Debug-appletvos/PackageFrameworks -F /Users/admin/builder/spi-builder-workspace/.derivedData/Build/Products/Debug-appletvos/PackageFrameworks -F /Users/admin/builder/spi-builder-workspace/.derivedData/Build/Products/Debug-appletvos -F /Applications/Xcode-16.1.0.app/Contents/Developer/Platforms/AppleTVOS.platform/Developer/Library/Frameworks -F /Applications/Xcode-16.1.0.app/Contents/Developer/Platforms/AppleTVOS.platform/Developer/SDKs/AppleTVOS18.1.sdk/Developer/Library/Frameworks -no-color-diagnostics -enable-testing -g -debug-info-format\=dwarf -dwarf-version\=4 -module-cache-path /Users/admin/builder/spi-builder-workspace/.derivedData/ModuleCache.noindex -swift-version 5 -enforce-exclusivity\=checked -stats-output-dir /Users/admin/builder/spi-builder-workspace/.stats -Onone -D SWIFT_PACKAGE -D DEBUG -serialize-debugging-options -const-gather-protocols-file /Users/admin/builder/spi-builder-workspace/.derivedData/Build/Intermediates.noindex/swift-composable-environment.build/Debug-appletvos/ComposableEnvironment.build/Objects-normal/arm64/ComposableEnvironment_const_extract_protocols.json -enable-experimental-feature DebugDescriptionMacro -enable-experimental-feature OpaqueTypeErasure -enable-upcoming-feature StrictConcurrency -enable-upcoming-feature DisableOutwardActorInference -enable-upcoming-feature GlobalActorIsolatedTypesUsability -enable-upcoming-feature InferSendableFromCaptures -strict-concurrency\=complete -empty-abi-descriptor -plugin-path /Applications/Xcode-16.1.0.app/Contents/Developer/Toolchains/XcodeDefault.xctoolchain/usr/lib/swift/host/plugins/testing -validate-clang-modules-once -clang-build-session-file /Users/admin/builder/spi-builder-workspace/.derivedData/ModuleCache.noindex/Session.modulevalidation -Xcc -working-directory -Xcc /Users/admin/builder/spi-builder-workspace -resource-dir /Applications/Xcode-16.1.0.app/Contents/Developer/Toolchains/XcodeDefault.xctoolchain/usr/lib/swift -enable-anonymous-context-mangled-names -file-compilation-dir /Users/admin/builder/spi-builder-workspace -Xcc -D_LIBCPP_HARDENING_MODE\=_LIBCPP_HARDENING_MODE_DEBUG -Xcc -ivfsstatcache -Xcc /Users/admin/builder/spi-builder-workspace/.derivedData/SDKStatCaches.noindex/appletvos18.1-22J572-e7fdd8cf9ffd4d4af20823079b51a726.sdkstatcache -Xcc -I/Users/admin/builder/spi-builder-workspace/.derivedData/Build/Intermediates.noindex/swift-composable-environment.build/Debug-appletvos/ComposableEnvironment.build/swift-overrides.hmap -Xcc -I/Users/admin/builder/spi-builder-workspace/.derivedData/Build/Products/Debug-appletvos/include -Xcc -I/Users/admin/builder/spi-builder-workspace/.derivedData/Build/Intermediates.noindex/swift-composable-environment.build/Debug-appletvos/ComposableEnvironment.build/DerivedSources-normal/arm64 -Xcc -I/Users/admin/builder/spi-builder-workspace/.derivedData/Build/Intermediates.noindex/swift-composable-environment.build/Debug-appletvos/ComposableEnvironment.build/DerivedSources/arm64 -Xcc -I/Users/admin/builder/spi-builder-workspace/.derivedData/Build/Intermediates.noindex/swift-composable-environment.build/Debug-appletvos/ComposableEnvironment.build/DerivedSources -Xcc -DSWIFT_PACKAGE -Xcc -DDEBUG\=1 -module-name ComposableEnvironment -frontend-parseable-output -disable-clang-spi -target-sdk-version 18.1 -target-sdk-name appletvos18.1 -external-plugin-path /Applications/Xcode-16.1.0.app/Contents/Developer/Platforms/AppleTVOS.platform/Developer/usr/lib/swift/host/plugins\#/Applications/Xcode-16.1.0.app/Contents/Developer/Platforms/AppleTVOS.platform/Developer/usr/bin/swift-plugin-server -external-plugin-path /Applications/Xcode-16.1.0.app/Contents/Developer/Platforms/AppleTVOS.platform/Developer/usr/local/lib/swift/host/plugins\#/Applications/Xcode-16.1.0.app/Contents/Developer/Platforms/AppleTVOS.platform/Developer/usr/bin/swift-plugin-server -plugin-path /Applications/Xcode-16.1.0.app/Contents/Developer/Toolchains/XcodeDefault.xctoolchain/usr/lib/swift/host/plugins -plugin-path /Applications/Xcode-16.1.0.app/Contents/Developer/Toolchains/XcodeDefault.xctoolchain/usr/local/lib/swift/host/plugins -o /Users/admin/builder/spi-builder-workspace/.derivedData/Build/Intermediates.noindex/swift-composable-environment.build/Debug-appletvos/ComposableEnvironment.build/Objects-normal/arm64/ComposableEnvironment.o -index-unit-output-path /swift-composable-environment.build/Debug-appletvos/ComposableEnvironment.build/Objects-normal/arm64/ComposableEnvironment.o -index-store-path /Users/admin/builder/spi-builder-workspace/.derivedData/Index.noindex/DataStore -index-system-modules
SwiftCompile normal arm64 /Users/admin/builder/spi-builder-workspace/Sources/ComposableEnvironment/ComposableEnvironment.swift (in target 'ComposableEnvironment' from project 'swift-composable-environment')
cd /Users/admin/builder/spi-builder-workspace
/Applications/Xcode-16.1.0.app/Contents/Developer/Toolchains/XcodeDefault.xctoolchain/usr/bin/swift-frontend -c -primary-file /Users/admin/builder/spi-builder-workspace/Sources/ComposableEnvironment/ComposableEnvironment.swift /Users/admin/builder/spi-builder-workspace/Sources/ComposableEnvironment/Dependency.swift /Users/admin/builder/spi-builder-workspace/Sources/ComposableEnvironment/Deprecations/GlobalEnvironment+Migration.swift /Users/admin/builder/spi-builder-workspace/Sources/ComposableEnvironment/Deprecations/Reducers+Deprecations.swift /Users/admin/builder/spi-builder-workspace/Sources/ComposableEnvironment/DerivedEnvironment.swift /Users/admin/builder/spi-builder-workspace/Sources/ComposableEnvironment/Reducer+ComposableEnvironment.swift -emit-dependencies-path /Users/admin/builder/spi-builder-workspace/.derivedData/Build/Intermediates.noindex/swift-composable-environment.build/Debug-appletvos/ComposableEnvironment.build/Objects-normal/arm64/ComposableEnvironment.d -emit-const-values-path /Users/admin/builder/spi-builder-workspace/.derivedData/Build/Intermediates.noindex/swift-composable-environment.build/Debug-appletvos/ComposableEnvironment.build/Objects-normal/arm64/ComposableEnvironment.swiftconstvalues -emit-reference-dependencies-path /Users/admin/builder/spi-builder-workspace/.derivedData/Build/Intermediates.noindex/swift-composable-environment.build/Debug-appletvos/ComposableEnvironment.build/Objects-normal/arm64/ComposableEnvironment.swiftdeps -serialize-diagnostics-path /Users/admin/builder/spi-builder-workspace/.derivedData/Build/Intermediates.noindex/swift-composable-environment.build/Debug-appletvos/ComposableEnvironment.build/Objects-normal/arm64/ComposableEnvironment.dia -target arm64-apple-tvos13.0 -Xllvm -aarch64-use-tbi -enable-objc-interop -stack-check -sdk /Applications/Xcode-16.1.0.app/Contents/Developer/Platforms/AppleTVOS.platform/Developer/SDKs/AppleTVOS18.1.sdk -I /Users/admin/builder/spi-builder-workspace/.derivedData/Build/Products/Debug-appletvos -I /Applications/Xcode-16.1.0.app/Contents/Developer/Platforms/AppleTVOS.platform/Developer/usr/lib -F /Users/admin/builder/spi-builder-workspace/.derivedData/Build/Products/Debug-appletvos/PackageFrameworks -F /Users/admin/builder/spi-builder-workspace/.derivedData/Build/Products/Debug-appletvos/PackageFrameworks -F /Users/admin/builder/spi-builder-workspace/.derivedData/Build/Products/Debug-appletvos/PackageFrameworks -F /Users/admin/builder/spi-builder-workspace/.derivedData/Build/Products/Debug-appletvos/PackageFrameworks -F /Users/admin/builder/spi-builder-workspace/.derivedData/Build/Products/Debug-appletvos/PackageFrameworks -F /Users/admin/builder/spi-builder-workspace/.derivedData/Build/Products/Debug-appletvos/PackageFrameworks -F /Users/admin/builder/spi-builder-workspace/.derivedData/Build/Products/Debug-appletvos/PackageFrameworks -F /Users/admin/builder/spi-builder-workspace/.derivedData/Build/Products/Debug-appletvos/PackageFrameworks -F /Users/admin/builder/spi-builder-workspace/.derivedData/Build/Products/Debug-appletvos/PackageFrameworks -F /Users/admin/builder/spi-builder-workspace/.derivedData/Build/Products/Debug-appletvos/PackageFrameworks -F /Users/admin/builder/spi-builder-workspace/.derivedData/Build/Products/Debug-appletvos/PackageFrameworks -F /Users/admin/builder/spi-builder-workspace/.derivedData/Build/Products/Debug-appletvos/PackageFrameworks -F /Users/admin/builder/spi-builder-workspace/.derivedData/Build/Products/Debug-appletvos/PackageFrameworks -F /Users/admin/builder/spi-builder-workspace/.derivedData/Build/Products/Debug-appletvos/PackageFrameworks -F /Users/admin/builder/spi-builder-workspace/.derivedData/Build/Products/Debug-appletvos/PackageFrameworks -F /Users/admin/builder/spi-builder-workspace/.derivedData/Build/Products/Debug-appletvos -F /Applications/Xcode-16.1.0.app/Contents/Developer/Platforms/AppleTVOS.platform/Developer/Library/Frameworks -F /Applications/Xcode-16.1.0.app/Contents/Developer/Platforms/AppleTVOS.platform/Developer/SDKs/AppleTVOS18.1.sdk/Developer/Library/Frameworks -no-color-diagnostics -enable-testing -g -debug-info-format\=dwarf -dwarf-version\=4 -module-cache-path /Users/admin/builder/spi-builder-workspace/.derivedData/ModuleCache.noindex -swift-version 5 -enforce-exclusivity\=checked -stats-output-dir /Users/admin/builder/spi-builder-workspace/.stats -Onone -D SWIFT_PACKAGE -D DEBUG -serialize-debugging-options -const-gather-protocols-file /Users/admin/builder/spi-builder-workspace/.derivedData/Build/Intermediates.noindex/swift-composable-environment.build/Debug-appletvos/ComposableEnvironment.build/Objects-normal/arm64/ComposableEnvironment_const_extract_protocols.json -enable-experimental-feature DebugDescriptionMacro -enable-experimental-feature OpaqueTypeErasure -enable-upcoming-feature StrictConcurrency -enable-upcoming-feature DisableOutwardActorInference -enable-upcoming-feature GlobalActorIsolatedTypesUsability -enable-upcoming-feature InferSendableFromCaptures -strict-concurrency\=complete -empty-abi-descriptor -plugin-path /Applications/Xcode-16.1.0.app/Contents/Developer/Toolchains/XcodeDefault.xctoolchain/usr/lib/swift/host/plugins/testing -validate-clang-modules-once -clang-build-session-file /Users/admin/builder/spi-builder-workspace/.derivedData/ModuleCache.noindex/Session.modulevalidation -Xcc -working-directory -Xcc /Users/admin/builder/spi-builder-workspace -resource-dir /Applications/Xcode-16.1.0.app/Contents/Developer/Toolchains/XcodeDefault.xctoolchain/usr/lib/swift -enable-anonymous-context-mangled-names -file-compilation-dir /Users/admin/builder/spi-builder-workspace -Xcc -D_LIBCPP_HARDENING_MODE\=_LIBCPP_HARDENING_MODE_DEBUG -Xcc -ivfsstatcache -Xcc /Users/admin/builder/spi-builder-workspace/.derivedData/SDKStatCaches.noindex/appletvos18.1-22J572-e7fdd8cf9ffd4d4af20823079b51a726.sdkstatcache -Xcc -I/Users/admin/builder/spi-builder-workspace/.derivedData/Build/Intermediates.noindex/swift-composable-environment.build/Debug-appletvos/ComposableEnvironment.build/swift-overrides.hmap -Xcc -I/Users/admin/builder/spi-builder-workspace/.derivedData/Build/Products/Debug-appletvos/include -Xcc -I/Users/admin/builder/spi-builder-workspace/.derivedData/Build/Intermediates.noindex/swift-composable-environment.build/Debug-appletvos/ComposableEnvironment.build/DerivedSources-normal/arm64 -Xcc -I/Users/admin/builder/spi-builder-workspace/.derivedData/Build/Intermediates.noindex/swift-composable-environment.build/Debug-appletvos/ComposableEnvironment.build/DerivedSources/arm64 -Xcc -I/Users/admin/builder/spi-builder-workspace/.derivedData/Build/Intermediates.noindex/swift-composable-environment.build/Debug-appletvos/ComposableEnvironment.build/DerivedSources -Xcc -DSWIFT_PACKAGE -Xcc -DDEBUG\=1 -module-name ComposableEnvironment -frontend-parseable-output -disable-clang-spi -target-sdk-version 18.1 -target-sdk-name appletvos18.1 -external-plugin-path /Applications/Xcode-16.1.0.app/Contents/Developer/Platforms/AppleTVOS.platform/Developer/usr/lib/swift/host/plugins\#/Applications/Xcode-16.1.0.app/Contents/Developer/Platforms/AppleTVOS.platform/Developer/usr/bin/swift-plugin-server -external-plugin-path /Applications/Xcode-16.1.0.app/Contents/Developer/Platforms/AppleTVOS.platform/Developer/usr/local/lib/swift/host/plugins\#/Applications/Xcode-16.1.0.app/Contents/Developer/Platforms/AppleTVOS.platform/Developer/usr/bin/swift-plugin-server -plugin-path /Applications/Xcode-16.1.0.app/Contents/Developer/Toolchains/XcodeDefault.xctoolchain/usr/lib/swift/host/plugins -plugin-path /Applications/Xcode-16.1.0.app/Contents/Developer/Toolchains/XcodeDefault.xctoolchain/usr/local/lib/swift/host/plugins -o /Users/admin/builder/spi-builder-workspace/.derivedData/Build/Intermediates.noindex/swift-composable-environment.build/Debug-appletvos/ComposableEnvironment.build/Objects-normal/arm64/ComposableEnvironment.o -index-unit-output-path /swift-composable-environment.build/Debug-appletvos/ComposableEnvironment.build/Objects-normal/arm64/ComposableEnvironment.o -index-store-path /Users/admin/builder/spi-builder-workspace/.derivedData/Index.noindex/DataStore -index-system-modules
SwiftCompile normal arm64 Compiling\ DerivedEnvironment.swift /Users/admin/builder/spi-builder-workspace/Sources/ComposableEnvironment/DerivedEnvironment.swift (in target 'ComposableEnvironment' from project 'swift-composable-environment')
cd /Users/admin/builder/spi-builder-workspace
builtin-swiftTaskExecution -- /Applications/Xcode-16.1.0.app/Contents/Developer/Toolchains/XcodeDefault.xctoolchain/usr/bin/swift-frontend -frontend -c /Users/admin/builder/spi-builder-workspace/Sources/ComposableEnvironment/ComposableEnvironment.swift /Users/admin/builder/spi-builder-workspace/Sources/ComposableEnvironment/Dependency.swift /Users/admin/builder/spi-builder-workspace/Sources/ComposableEnvironment/Deprecations/GlobalEnvironment+Migration.swift /Users/admin/builder/spi-builder-workspace/Sources/ComposableEnvironment/Deprecations/Reducers+Deprecations.swift -primary-file /Users/admin/builder/spi-builder-workspace/Sources/ComposableEnvironment/DerivedEnvironment.swift /Users/admin/builder/spi-builder-workspace/Sources/ComposableEnvironment/Reducer+ComposableEnvironment.swift -emit-dependencies-path /Users/admin/builder/spi-builder-workspace/.derivedData/Build/Intermediates.noindex/swift-composable-environment.build/Debug-appletvos/ComposableEnvironment.build/Objects-normal/arm64/DerivedEnvironment.d -emit-const-values-path /Users/admin/builder/spi-builder-workspace/.derivedData/Build/Intermediates.noindex/swift-composable-environment.build/Debug-appletvos/ComposableEnvironment.build/Objects-normal/arm64/DerivedEnvironment.swiftconstvalues -emit-reference-dependencies-path /Users/admin/builder/spi-builder-workspace/.derivedData/Build/Intermediates.noindex/swift-composable-environment.build/Debug-appletvos/ComposableEnvironment.build/Objects-normal/arm64/DerivedEnvironment.swiftdeps -serialize-diagnostics-path /Users/admin/builder/spi-builder-workspace/.derivedData/Build/Intermediates.noindex/swift-composable-environment.build/Debug-appletvos/ComposableEnvironment.build/Objects-normal/arm64/DerivedEnvironment.dia -target arm64-apple-tvos13.0 -Xllvm -aarch64-use-tbi -enable-objc-interop -stack-check -sdk /Applications/Xcode-16.1.0.app/Contents/Developer/Platforms/AppleTVOS.platform/Developer/SDKs/AppleTVOS18.1.sdk -I /Users/admin/builder/spi-builder-workspace/.derivedData/Build/Products/Debug-appletvos -I /Applications/Xcode-16.1.0.app/Contents/Developer/Platforms/AppleTVOS.platform/Developer/usr/lib -F /Users/admin/builder/spi-builder-workspace/.derivedData/Build/Products/Debug-appletvos/PackageFrameworks -F /Users/admin/builder/spi-builder-workspace/.derivedData/Build/Products/Debug-appletvos/PackageFrameworks -F /Users/admin/builder/spi-builder-workspace/.derivedData/Build/Products/Debug-appletvos/PackageFrameworks -F /Users/admin/builder/spi-builder-workspace/.derivedData/Build/Products/Debug-appletvos/PackageFrameworks -F /Users/admin/builder/spi-builder-workspace/.derivedData/Build/Products/Debug-appletvos/PackageFrameworks -F /Users/admin/builder/spi-builder-workspace/.derivedData/Build/Products/Debug-appletvos/PackageFrameworks -F /Users/admin/builder/spi-builder-workspace/.derivedData/Build/Products/Debug-appletvos/PackageFrameworks -F /Users/admin/builder/spi-builder-workspace/.derivedData/Build/Products/Debug-appletvos/PackageFrameworks -F /Users/admin/builder/spi-builder-workspace/.derivedData/Build/Products/Debug-appletvos/PackageFrameworks -F /Users/admin/builder/spi-builder-workspace/.derivedData/Build/Products/Debug-appletvos/PackageFrameworks -F /Users/admin/builder/spi-builder-workspace/.derivedData/Build/Products/Debug-appletvos/PackageFrameworks -F /Users/admin/builder/spi-builder-workspace/.derivedData/Build/Products/Debug-appletvos/PackageFrameworks -F /Users/admin/builder/spi-builder-workspace/.derivedData/Build/Products/Debug-appletvos/PackageFrameworks -F /Users/admin/builder/spi-builder-workspace/.derivedData/Build/Products/Debug-appletvos/PackageFrameworks -F /Users/admin/builder/spi-builder-workspace/.derivedData/Build/Products/Debug-appletvos/PackageFrameworks -F /Users/admin/builder/spi-builder-workspace/.derivedData/Build/Products/Debug-appletvos -F /Applications/Xcode-16.1.0.app/Contents/Developer/Platforms/AppleTVOS.platform/Developer/Library/Frameworks -F /Applications/Xcode-16.1.0.app/Contents/Developer/Platforms/AppleTVOS.platform/Developer/SDKs/AppleTVOS18.1.sdk/Developer/Library/Frameworks -no-color-diagnostics -enable-testing -g -debug-info-format\=dwarf -dwarf-version\=4 -module-cache-path /Users/admin/builder/spi-builder-workspace/.derivedData/ModuleCache.noindex -swift-version 5 -enforce-exclusivity\=checked -stats-output-dir /Users/admin/builder/spi-builder-workspace/.stats -Onone -D SWIFT_PACKAGE -D DEBUG -serialize-debugging-options -const-gather-protocols-file /Users/admin/builder/spi-builder-workspace/.derivedData/Build/Intermediates.noindex/swift-composable-environment.build/Debug-appletvos/ComposableEnvironment.build/Objects-normal/arm64/ComposableEnvironment_const_extract_protocols.json -enable-experimental-feature DebugDescriptionMacro -enable-experimental-feature OpaqueTypeErasure -enable-upcoming-feature StrictConcurrency -enable-upcoming-feature DisableOutwardActorInference -enable-upcoming-feature GlobalActorIsolatedTypesUsability -enable-upcoming-feature InferSendableFromCaptures -strict-concurrency\=complete -empty-abi-descriptor -plugin-path /Applications/Xcode-16.1.0.app/Contents/Developer/Toolchains/XcodeDefault.xctoolchain/usr/lib/swift/host/plugins/testing -validate-clang-modules-once -clang-build-session-file /Users/admin/builder/spi-builder-workspace/.derivedData/ModuleCache.noindex/Session.modulevalidation -Xcc -working-directory -Xcc /Users/admin/builder/spi-builder-workspace -resource-dir /Applications/Xcode-16.1.0.app/Contents/Developer/Toolchains/XcodeDefault.xctoolchain/usr/lib/swift -enable-anonymous-context-mangled-names -file-compilation-dir /Users/admin/builder/spi-builder-workspace -Xcc -D_LIBCPP_HARDENING_MODE\=_LIBCPP_HARDENING_MODE_DEBUG -Xcc -ivfsstatcache -Xcc /Users/admin/builder/spi-builder-workspace/.derivedData/SDKStatCaches.noindex/appletvos18.1-22J572-e7fdd8cf9ffd4d4af20823079b51a726.sdkstatcache -Xcc -I/Users/admin/builder/spi-builder-workspace/.derivedData/Build/Intermediates.noindex/swift-composable-environment.build/Debug-appletvos/ComposableEnvironment.build/swift-overrides.hmap -Xcc -I/Users/admin/builder/spi-builder-workspace/.derivedData/Build/Products/Debug-appletvos/include -Xcc -I/Users/admin/builder/spi-builder-workspace/.derivedData/Build/Intermediates.noindex/swift-composable-environment.build/Debug-appletvos/ComposableEnvironment.build/DerivedSources-normal/arm64 -Xcc -I/Users/admin/builder/spi-builder-workspace/.derivedData/Build/Intermediates.noindex/swift-composable-environment.build/Debug-appletvos/ComposableEnvironment.build/DerivedSources/arm64 -Xcc -I/Users/admin/builder/spi-builder-workspace/.derivedData/Build/Intermediates.noindex/swift-composable-environment.build/Debug-appletvos/ComposableEnvironment.build/DerivedSources -Xcc -DSWIFT_PACKAGE -Xcc -DDEBUG\=1 -module-name ComposableEnvironment -frontend-parseable-output -disable-clang-spi -target-sdk-version 18.1 -target-sdk-name appletvos18.1 -external-plugin-path /Applications/Xcode-16.1.0.app/Contents/Developer/Platforms/AppleTVOS.platform/Developer/usr/lib/swift/host/plugins\#/Applications/Xcode-16.1.0.app/Contents/Developer/Platforms/AppleTVOS.platform/Developer/usr/bin/swift-plugin-server -external-plugin-path /Applications/Xcode-16.1.0.app/Contents/Developer/Platforms/AppleTVOS.platform/Developer/usr/local/lib/swift/host/plugins\#/Applications/Xcode-16.1.0.app/Contents/Developer/Platforms/AppleTVOS.platform/Developer/usr/bin/swift-plugin-server -plugin-path /Applications/Xcode-16.1.0.app/Contents/Developer/Toolchains/XcodeDefault.xctoolchain/usr/lib/swift/host/plugins -plugin-path /Applications/Xcode-16.1.0.app/Contents/Developer/Toolchains/XcodeDefault.xctoolchain/usr/local/lib/swift/host/plugins -o /Users/admin/builder/spi-builder-workspace/.derivedData/Build/Intermediates.noindex/swift-composable-environment.build/Debug-appletvos/ComposableEnvironment.build/Objects-normal/arm64/DerivedEnvironment.o -index-unit-output-path /swift-composable-environment.build/Debug-appletvos/ComposableEnvironment.build/Objects-normal/arm64/DerivedEnvironment.o -index-store-path /Users/admin/builder/spi-builder-workspace/.derivedData/Index.noindex/DataStore -index-system-modules
SwiftCompile normal arm64 /Users/admin/builder/spi-builder-workspace/Sources/ComposableEnvironment/DerivedEnvironment.swift (in target 'ComposableEnvironment' from project 'swift-composable-environment')
cd /Users/admin/builder/spi-builder-workspace
/Applications/Xcode-16.1.0.app/Contents/Developer/Toolchains/XcodeDefault.xctoolchain/usr/bin/swift-frontend -c /Users/admin/builder/spi-builder-workspace/Sources/ComposableEnvironment/ComposableEnvironment.swift /Users/admin/builder/spi-builder-workspace/Sources/ComposableEnvironment/Dependency.swift /Users/admin/builder/spi-builder-workspace/Sources/ComposableEnvironment/Deprecations/GlobalEnvironment+Migration.swift /Users/admin/builder/spi-builder-workspace/Sources/ComposableEnvironment/Deprecations/Reducers+Deprecations.swift -primary-file /Users/admin/builder/spi-builder-workspace/Sources/ComposableEnvironment/DerivedEnvironment.swift /Users/admin/builder/spi-builder-workspace/Sources/ComposableEnvironment/Reducer+ComposableEnvironment.swift -emit-dependencies-path /Users/admin/builder/spi-builder-workspace/.derivedData/Build/Intermediates.noindex/swift-composable-environment.build/Debug-appletvos/ComposableEnvironment.build/Objects-normal/arm64/DerivedEnvironment.d -emit-const-values-path /Users/admin/builder/spi-builder-workspace/.derivedData/Build/Intermediates.noindex/swift-composable-environment.build/Debug-appletvos/ComposableEnvironment.build/Objects-normal/arm64/DerivedEnvironment.swiftconstvalues -emit-reference-dependencies-path /Users/admin/builder/spi-builder-workspace/.derivedData/Build/Intermediates.noindex/swift-composable-environment.build/Debug-appletvos/ComposableEnvironment.build/Objects-normal/arm64/DerivedEnvironment.swiftdeps -serialize-diagnostics-path /Users/admin/builder/spi-builder-workspace/.derivedData/Build/Intermediates.noindex/swift-composable-environment.build/Debug-appletvos/ComposableEnvironment.build/Objects-normal/arm64/DerivedEnvironment.dia -target arm64-apple-tvos13.0 -Xllvm -aarch64-use-tbi -enable-objc-interop -stack-check -sdk /Applications/Xcode-16.1.0.app/Contents/Developer/Platforms/AppleTVOS.platform/Developer/SDKs/AppleTVOS18.1.sdk -I /Users/admin/builder/spi-builder-workspace/.derivedData/Build/Products/Debug-appletvos -I /Applications/Xcode-16.1.0.app/Contents/Developer/Platforms/AppleTVOS.platform/Developer/usr/lib -F /Users/admin/builder/spi-builder-workspace/.derivedData/Build/Products/Debug-appletvos/PackageFrameworks -F /Users/admin/builder/spi-builder-workspace/.derivedData/Build/Products/Debug-appletvos/PackageFrameworks -F /Users/admin/builder/spi-builder-workspace/.derivedData/Build/Products/Debug-appletvos/PackageFrameworks -F /Users/admin/builder/spi-builder-workspace/.derivedData/Build/Products/Debug-appletvos/PackageFrameworks -F /Users/admin/builder/spi-builder-workspace/.derivedData/Build/Products/Debug-appletvos/PackageFrameworks -F /Users/admin/builder/spi-builder-workspace/.derivedData/Build/Products/Debug-appletvos/PackageFrameworks -F /Users/admin/builder/spi-builder-workspace/.derivedData/Build/Products/Debug-appletvos/PackageFrameworks -F /Users/admin/builder/spi-builder-workspace/.derivedData/Build/Products/Debug-appletvos/PackageFrameworks -F /Users/admin/builder/spi-builder-workspace/.derivedData/Build/Products/Debug-appletvos/PackageFrameworks -F /Users/admin/builder/spi-builder-workspace/.derivedData/Build/Products/Debug-appletvos/PackageFrameworks -F /Users/admin/builder/spi-builder-workspace/.derivedData/Build/Products/Debug-appletvos/PackageFrameworks -F /Users/admin/builder/spi-builder-workspace/.derivedData/Build/Products/Debug-appletvos/PackageFrameworks -F /Users/admin/builder/spi-builder-workspace/.derivedData/Build/Products/Debug-appletvos/PackageFrameworks -F /Users/admin/builder/spi-builder-workspace/.derivedData/Build/Products/Debug-appletvos/PackageFrameworks -F /Users/admin/builder/spi-builder-workspace/.derivedData/Build/Products/Debug-appletvos/PackageFrameworks -F /Users/admin/builder/spi-builder-workspace/.derivedData/Build/Products/Debug-appletvos -F /Applications/Xcode-16.1.0.app/Contents/Developer/Platforms/AppleTVOS.platform/Developer/Library/Frameworks -F /Applications/Xcode-16.1.0.app/Contents/Developer/Platforms/AppleTVOS.platform/Developer/SDKs/AppleTVOS18.1.sdk/Developer/Library/Frameworks -no-color-diagnostics -enable-testing -g -debug-info-format\=dwarf -dwarf-version\=4 -module-cache-path /Users/admin/builder/spi-builder-workspace/.derivedData/ModuleCache.noindex -swift-version 5 -enforce-exclusivity\=checked -stats-output-dir /Users/admin/builder/spi-builder-workspace/.stats -Onone -D SWIFT_PACKAGE -D DEBUG -serialize-debugging-options -const-gather-protocols-file /Users/admin/builder/spi-builder-workspace/.derivedData/Build/Intermediates.noindex/swift-composable-environment.build/Debug-appletvos/ComposableEnvironment.build/Objects-normal/arm64/ComposableEnvironment_const_extract_protocols.json -enable-experimental-feature DebugDescriptionMacro -enable-experimental-feature OpaqueTypeErasure -enable-upcoming-feature StrictConcurrency -enable-upcoming-feature DisableOutwardActorInference -enable-upcoming-feature GlobalActorIsolatedTypesUsability -enable-upcoming-feature InferSendableFromCaptures -strict-concurrency\=complete -empty-abi-descriptor -plugin-path /Applications/Xcode-16.1.0.app/Contents/Developer/Toolchains/XcodeDefault.xctoolchain/usr/lib/swift/host/plugins/testing -validate-clang-modules-once -clang-build-session-file /Users/admin/builder/spi-builder-workspace/.derivedData/ModuleCache.noindex/Session.modulevalidation -Xcc -working-directory -Xcc /Users/admin/builder/spi-builder-workspace -resource-dir /Applications/Xcode-16.1.0.app/Contents/Developer/Toolchains/XcodeDefault.xctoolchain/usr/lib/swift -enable-anonymous-context-mangled-names -file-compilation-dir /Users/admin/builder/spi-builder-workspace -Xcc -D_LIBCPP_HARDENING_MODE\=_LIBCPP_HARDENING_MODE_DEBUG -Xcc -ivfsstatcache -Xcc /Users/admin/builder/spi-builder-workspace/.derivedData/SDKStatCaches.noindex/appletvos18.1-22J572-e7fdd8cf9ffd4d4af20823079b51a726.sdkstatcache -Xcc -I/Users/admin/builder/spi-builder-workspace/.derivedData/Build/Intermediates.noindex/swift-composable-environment.build/Debug-appletvos/ComposableEnvironment.build/swift-overrides.hmap -Xcc -I/Users/admin/builder/spi-builder-workspace/.derivedData/Build/Products/Debug-appletvos/include -Xcc -I/Users/admin/builder/spi-builder-workspace/.derivedData/Build/Intermediates.noindex/swift-composable-environment.build/Debug-appletvos/ComposableEnvironment.build/DerivedSources-normal/arm64 -Xcc -I/Users/admin/builder/spi-builder-workspace/.derivedData/Build/Intermediates.noindex/swift-composable-environment.build/Debug-appletvos/ComposableEnvironment.build/DerivedSources/arm64 -Xcc -I/Users/admin/builder/spi-builder-workspace/.derivedData/Build/Intermediates.noindex/swift-composable-environment.build/Debug-appletvos/ComposableEnvironment.build/DerivedSources -Xcc -DSWIFT_PACKAGE -Xcc -DDEBUG\=1 -module-name ComposableEnvironment -frontend-parseable-output -disable-clang-spi -target-sdk-version 18.1 -target-sdk-name appletvos18.1 -external-plugin-path /Applications/Xcode-16.1.0.app/Contents/Developer/Platforms/AppleTVOS.platform/Developer/usr/lib/swift/host/plugins\#/Applications/Xcode-16.1.0.app/Contents/Developer/Platforms/AppleTVOS.platform/Developer/usr/bin/swift-plugin-server -external-plugin-path /Applications/Xcode-16.1.0.app/Contents/Developer/Platforms/AppleTVOS.platform/Developer/usr/local/lib/swift/host/plugins\#/Applications/Xcode-16.1.0.app/Contents/Developer/Platforms/AppleTVOS.platform/Developer/usr/bin/swift-plugin-server -plugin-path /Applications/Xcode-16.1.0.app/Contents/Developer/Toolchains/XcodeDefault.xctoolchain/usr/lib/swift/host/plugins -plugin-path /Applications/Xcode-16.1.0.app/Contents/Developer/Toolchains/XcodeDefault.xctoolchain/usr/local/lib/swift/host/plugins -o /Users/admin/builder/spi-builder-workspace/.derivedData/Build/Intermediates.noindex/swift-composable-environment.build/Debug-appletvos/ComposableEnvironment.build/Objects-normal/arm64/DerivedEnvironment.o -index-unit-output-path /swift-composable-environment.build/Debug-appletvos/ComposableEnvironment.build/Objects-normal/arm64/DerivedEnvironment.o -index-store-path /Users/admin/builder/spi-builder-workspace/.derivedData/Index.noindex/DataStore -index-system-modules
SwiftCompile normal arm64 Compiling\ Reducer+ComposableEnvironment.swift /Users/admin/builder/spi-builder-workspace/Sources/ComposableEnvironment/Reducer+ComposableEnvironment.swift (in target 'ComposableEnvironment' from project 'swift-composable-environment')
cd /Users/admin/builder/spi-builder-workspace
builtin-swiftTaskExecution -- /Applications/Xcode-16.1.0.app/Contents/Developer/Toolchains/XcodeDefault.xctoolchain/usr/bin/swift-frontend -frontend -c /Users/admin/builder/spi-builder-workspace/Sources/ComposableEnvironment/ComposableEnvironment.swift /Users/admin/builder/spi-builder-workspace/Sources/ComposableEnvironment/Dependency.swift /Users/admin/builder/spi-builder-workspace/Sources/ComposableEnvironment/Deprecations/GlobalEnvironment+Migration.swift /Users/admin/builder/spi-builder-workspace/Sources/ComposableEnvironment/Deprecations/Reducers+Deprecations.swift /Users/admin/builder/spi-builder-workspace/Sources/ComposableEnvironment/DerivedEnvironment.swift -primary-file /Users/admin/builder/spi-builder-workspace/Sources/ComposableEnvironment/Reducer+ComposableEnvironment.swift -emit-dependencies-path /Users/admin/builder/spi-builder-workspace/.derivedData/Build/Intermediates.noindex/swift-composable-environment.build/Debug-appletvos/ComposableEnvironment.build/Objects-normal/arm64/Reducer+ComposableEnvironment.d -emit-const-values-path /Users/admin/builder/spi-builder-workspace/.derivedData/Build/Intermediates.noindex/swift-composable-environment.build/Debug-appletvos/ComposableEnvironment.build/Objects-normal/arm64/Reducer+ComposableEnvironment.swiftconstvalues -emit-reference-dependencies-path /Users/admin/builder/spi-builder-workspace/.derivedData/Build/Intermediates.noindex/swift-composable-environment.build/Debug-appletvos/ComposableEnvironment.build/Objects-normal/arm64/Reducer+ComposableEnvironment.swiftdeps -serialize-diagnostics-path /Users/admin/builder/spi-builder-workspace/.derivedData/Build/Intermediates.noindex/swift-composable-environment.build/Debug-appletvos/ComposableEnvironment.build/Objects-normal/arm64/Reducer+ComposableEnvironment.dia -target arm64-apple-tvos13.0 -Xllvm -aarch64-use-tbi -enable-objc-interop -stack-check -sdk /Applications/Xcode-16.1.0.app/Contents/Developer/Platforms/AppleTVOS.platform/Developer/SDKs/AppleTVOS18.1.sdk -I /Users/admin/builder/spi-builder-workspace/.derivedData/Build/Products/Debug-appletvos -I /Applications/Xcode-16.1.0.app/Contents/Developer/Platforms/AppleTVOS.platform/Developer/usr/lib -F /Users/admin/builder/spi-builder-workspace/.derivedData/Build/Products/Debug-appletvos/PackageFrameworks -F /Users/admin/builder/spi-builder-workspace/.derivedData/Build/Products/Debug-appletvos/PackageFrameworks -F /Users/admin/builder/spi-builder-workspace/.derivedData/Build/Products/Debug-appletvos/PackageFrameworks -F /Users/admin/builder/spi-builder-workspace/.derivedData/Build/Products/Debug-appletvos/PackageFrameworks -F /Users/admin/builder/spi-builder-workspace/.derivedData/Build/Products/Debug-appletvos/PackageFrameworks -F /Users/admin/builder/spi-builder-workspace/.derivedData/Build/Products/Debug-appletvos/PackageFrameworks -F /Users/admin/builder/spi-builder-workspace/.derivedData/Build/Products/Debug-appletvos/PackageFrameworks -F /Users/admin/builder/spi-builder-workspace/.derivedData/Build/Products/Debug-appletvos/PackageFrameworks -F /Users/admin/builder/spi-builder-workspace/.derivedData/Build/Products/Debug-appletvos/PackageFrameworks -F /Users/admin/builder/spi-builder-workspace/.derivedData/Build/Products/Debug-appletvos/PackageFrameworks -F /Users/admin/builder/spi-builder-workspace/.derivedData/Build/Products/Debug-appletvos/PackageFrameworks -F /Users/admin/builder/spi-builder-workspace/.derivedData/Build/Products/Debug-appletvos/PackageFrameworks -F /Users/admin/builder/spi-builder-workspace/.derivedData/Build/Products/Debug-appletvos/PackageFrameworks -F /Users/admin/builder/spi-builder-workspace/.derivedData/Build/Products/Debug-appletvos/PackageFrameworks -F /Users/admin/builder/spi-builder-workspace/.derivedData/Build/Products/Debug-appletvos/PackageFrameworks -F /Users/admin/builder/spi-builder-workspace/.derivedData/Build/Products/Debug-appletvos -F /Applications/Xcode-16.1.0.app/Contents/Developer/Platforms/AppleTVOS.platform/Developer/Library/Frameworks -F /Applications/Xcode-16.1.0.app/Contents/Developer/Platforms/AppleTVOS.platform/Developer/SDKs/AppleTVOS18.1.sdk/Developer/Library/Frameworks -no-color-diagnostics -enable-testing -g -debug-info-format\=dwarf -dwarf-version\=4 -module-cache-path /Users/admin/builder/spi-builder-workspace/.derivedData/ModuleCache.noindex -swift-version 5 -enforce-exclusivity\=checked -stats-output-dir /Users/admin/builder/spi-builder-workspace/.stats -Onone -D SWIFT_PACKAGE -D DEBUG -serialize-debugging-options -const-gather-protocols-file /Users/admin/builder/spi-builder-workspace/.derivedData/Build/Intermediates.noindex/swift-composable-environment.build/Debug-appletvos/ComposableEnvironment.build/Objects-normal/arm64/ComposableEnvironment_const_extract_protocols.json -enable-experimental-feature DebugDescriptionMacro -enable-experimental-feature OpaqueTypeErasure -enable-upcoming-feature StrictConcurrency -enable-upcoming-feature DisableOutwardActorInference -enable-upcoming-feature GlobalActorIsolatedTypesUsability -enable-upcoming-feature InferSendableFromCaptures -strict-concurrency\=complete -empty-abi-descriptor -plugin-path /Applications/Xcode-16.1.0.app/Contents/Developer/Toolchains/XcodeDefault.xctoolchain/usr/lib/swift/host/plugins/testing -validate-clang-modules-once -clang-build-session-file /Users/admin/builder/spi-builder-workspace/.derivedData/ModuleCache.noindex/Session.modulevalidation -Xcc -working-directory -Xcc /Users/admin/builder/spi-builder-workspace -resource-dir /Applications/Xcode-16.1.0.app/Contents/Developer/Toolchains/XcodeDefault.xctoolchain/usr/lib/swift -enable-anonymous-context-mangled-names -file-compilation-dir /Users/admin/builder/spi-builder-workspace -Xcc -D_LIBCPP_HARDENING_MODE\=_LIBCPP_HARDENING_MODE_DEBUG -Xcc -ivfsstatcache -Xcc /Users/admin/builder/spi-builder-workspace/.derivedData/SDKStatCaches.noindex/appletvos18.1-22J572-e7fdd8cf9ffd4d4af20823079b51a726.sdkstatcache -Xcc -I/Users/admin/builder/spi-builder-workspace/.derivedData/Build/Intermediates.noindex/swift-composable-environment.build/Debug-appletvos/ComposableEnvironment.build/swift-overrides.hmap -Xcc -I/Users/admin/builder/spi-builder-workspace/.derivedData/Build/Products/Debug-appletvos/include -Xcc -I/Users/admin/builder/spi-builder-workspace/.derivedData/Build/Intermediates.noindex/swift-composable-environment.build/Debug-appletvos/ComposableEnvironment.build/DerivedSources-normal/arm64 -Xcc -I/Users/admin/builder/spi-builder-workspace/.derivedData/Build/Intermediates.noindex/swift-composable-environment.build/Debug-appletvos/ComposableEnvironment.build/DerivedSources/arm64 -Xcc -I/Users/admin/builder/spi-builder-workspace/.derivedData/Build/Intermediates.noindex/swift-composable-environment.build/Debug-appletvos/ComposableEnvironment.build/DerivedSources -Xcc -DSWIFT_PACKAGE -Xcc -DDEBUG\=1 -module-name ComposableEnvironment -frontend-parseable-output -disable-clang-spi -target-sdk-version 18.1 -target-sdk-name appletvos18.1 -external-plugin-path /Applications/Xcode-16.1.0.app/Contents/Developer/Platforms/AppleTVOS.platform/Developer/usr/lib/swift/host/plugins\#/Applications/Xcode-16.1.0.app/Contents/Developer/Platforms/AppleTVOS.platform/Developer/usr/bin/swift-plugin-server -external-plugin-path /Applications/Xcode-16.1.0.app/Contents/Developer/Platforms/AppleTVOS.platform/Developer/usr/local/lib/swift/host/plugins\#/Applications/Xcode-16.1.0.app/Contents/Developer/Platforms/AppleTVOS.platform/Developer/usr/bin/swift-plugin-server -plugin-path /Applications/Xcode-16.1.0.app/Contents/Developer/Toolchains/XcodeDefault.xctoolchain/usr/lib/swift/host/plugins -plugin-path /Applications/Xcode-16.1.0.app/Contents/Developer/Toolchains/XcodeDefault.xctoolchain/usr/local/lib/swift/host/plugins -o /Users/admin/builder/spi-builder-workspace/.derivedData/Build/Intermediates.noindex/swift-composable-environment.build/Debug-appletvos/ComposableEnvironment.build/Objects-normal/arm64/Reducer+ComposableEnvironment.o -index-unit-output-path /swift-composable-environment.build/Debug-appletvos/ComposableEnvironment.build/Objects-normal/arm64/Reducer+ComposableEnvironment.o -index-store-path /Users/admin/builder/spi-builder-workspace/.derivedData/Index.noindex/DataStore -index-system-modules
Error opening -stats-output-dir file '/Users/admin/builder/spi-builder-workspace/.stats/stats-1732835185914767-swift-frontend-ComposableEnvironment-Reducer_ComposableEnvironment.swift-arm64_apple_tvos13.0-o-Onone-2300994758.json' for writing
===-------------------------------------------------------------------------===
Swift compilation
===-------------------------------------------------------------------------===
Total Execution Time: 0.5830 seconds (0.6080 wall clock)
---User Time--- --System Time-- --User+System-- ---Wall Time--- --- Name ---
0.0537 ( 31.3%) 0.1604 ( 39.0%) 0.2141 ( 36.7%) 0.2252 ( 37.0%) parse-and-resolve-imports
0.0533 ( 31.1%) 0.1599 ( 38.9%) 0.2132 ( 36.6%) 0.2243 ( 36.9%) Import resolution
0.0078 ( 4.5%) 0.0109 ( 2.7%) 0.0187 ( 3.2%) 0.0190 ( 3.1%) perform-sema
0.0077 ( 4.5%) 0.0109 ( 2.7%) 0.0186 ( 3.2%) 0.0190 ( 3.1%) TypeCheckSourceFileRequest
0.0077 ( 4.5%) 0.0108 ( 2.6%) 0.0185 ( 3.2%) 0.0189 ( 3.1%) Type checking and Semantic analysis
0.0075 ( 4.4%) 0.0106 ( 2.6%) 0.0180 ( 3.1%) 0.0184 ( 3.0%) typecheck-decl
0.0049 ( 2.9%) 0.0067 ( 1.6%) 0.0117 ( 2.0%) 0.0120 ( 2.0%) InterfaceTypeRequest
0.0043 ( 2.5%) 0.0059 ( 1.4%) 0.0102 ( 1.8%) 0.0105 ( 1.7%) GenericSignatureRequest
0.0035 ( 2.0%) 0.0042 ( 1.0%) 0.0076 ( 1.3%) 0.0080 ( 1.3%) InferredGenericSignatureRequest
0.0030 ( 1.7%) 0.0032 ( 0.8%) 0.0062 ( 1.1%) 0.0065 ( 1.1%) LookupConformanceInModuleRequest
0.0014 ( 0.8%) 0.0032 ( 0.8%) 0.0046 ( 0.8%) 0.0046 ( 0.8%) ResolveTypeRequest
0.0013 ( 0.8%) 0.0027 ( 0.7%) 0.0040 ( 0.7%) 0.0040 ( 0.7%) UnqualifiedLookupRequest
0.0012 ( 0.7%) 0.0023 ( 0.6%) 0.0035 ( 0.6%) 0.0035 ( 0.6%) performUnqualifiedLookup
0.0010 ( 0.6%) 0.0022 ( 0.5%) 0.0033 ( 0.6%) 0.0033 ( 0.5%) load-stdlib
0.0012 ( 0.7%) 0.0012 ( 0.3%) 0.0024 ( 0.4%) 0.0024 ( 0.4%) LookupInModuleRequest
0.0010 ( 0.6%) 0.0013 ( 0.3%) 0.0023 ( 0.4%) 0.0023 ( 0.4%) typecheck-expr
0.0009 ( 0.5%) 0.0013 ( 0.3%) 0.0022 ( 0.4%) 0.0022 ( 0.4%) ModuleQualifiedLookupRequest
0.0010 ( 0.6%) 0.0012 ( 0.3%) 0.0022 ( 0.4%) 0.0022 ( 0.4%) TypeCheckFunctionBodyRequest
0.0009 ( 0.5%) 0.0011 ( 0.3%) 0.0020 ( 0.3%) 0.0020 ( 0.3%) typecheck-stmt
0.0007 ( 0.4%) 0.0011 ( 0.3%) 0.0019 ( 0.3%) 0.0019 ( 0.3%) import-clang-decl
0.0006 ( 0.4%) 0.0013 ( 0.3%) 0.0019 ( 0.3%) 0.0019 ( 0.3%) QualifiedLookupRequest
0.0005 ( 0.3%) 0.0012 ( 0.3%) 0.0016 ( 0.3%) 0.0016 ( 0.3%) RequirementRequest
0.0006 ( 0.3%) 0.0008 ( 0.2%) 0.0014 ( 0.2%) 0.0014 ( 0.2%) DefaultArgumentExprRequest
0.0003 ( 0.2%) 0.0010 ( 0.2%) 0.0013 ( 0.2%) 0.0013 ( 0.2%) SemanticDeclAttrsRequest
0.0006 ( 0.3%) 0.0005 ( 0.1%) 0.0011 ( 0.2%) 0.0011 ( 0.2%) PatternBindingEntryRequest
0.0005 ( 0.3%) 0.0006 ( 0.2%) 0.0011 ( 0.2%) 0.0011 ( 0.2%) DirectLookupRequest
0.0003 ( 0.2%) 0.0007 ( 0.2%) 0.0010 ( 0.2%) 0.0010 ( 0.2%) ActorIsolationRequest
0.0003 ( 0.2%) 0.0005 ( 0.1%) 0.0008 ( 0.1%) 0.0008 ( 0.1%) ExtendedNominalRequest
0.0004 ( 0.2%) 0.0003 ( 0.1%) 0.0006 ( 0.1%) 0.0007 ( 0.1%) USRGenerationRequest
0.0003 ( 0.2%) 0.0004 ( 0.1%) 0.0007 ( 0.1%) 0.0007 ( 0.1%) CollectOverriddenDeclsRequest
0.0003 ( 0.2%) 0.0003 ( 0.1%) 0.0007 ( 0.1%) 0.0007 ( 0.1%) precheck-expr
0.0004 ( 0.2%) 0.0003 ( 0.1%) 0.0006 ( 0.1%) 0.0006 ( 0.1%) build-rewrite-system
0.0003 ( 0.2%) 0.0003 ( 0.1%) 0.0006 ( 0.1%) 0.0006 ( 0.1%) ProvideDefaultImplForRequest
0.0004 ( 0.2%) 0.0001 ( 0.0%) 0.0005 ( 0.1%) 0.0005 ( 0.1%) ParseTopLevelDeclsRequest
0.0004 ( 0.2%) 0.0001 ( 0.0%) 0.0005 ( 0.1%) 0.0005 ( 0.1%) ParseSourceFileRequest
0.0002 ( 0.1%) 0.0001 ( 0.0%) 0.0003 ( 0.1%) 0.0003 ( 0.0%) IsNonUserModuleRequest
0.0001 ( 0.1%) 0.0001 ( 0.0%) 0.0002 ( 0.0%) 0.0002 ( 0.0%) HasIsolatedSelfRequest
0.0001 ( 0.0%) 0.0001 ( 0.0%) 0.0002 ( 0.0%) 0.0002 ( 0.0%) IsActorRequest
0.0001 ( 0.1%) 0.0001 ( 0.0%) 0.0002 ( 0.0%) 0.0002 ( 0.0%) DefaultInitializerIsolation
0.0000 ( 0.0%) 0.0001 ( 0.0%) 0.0002 ( 0.0%) 0.0002 ( 0.0%) PotentialMacroExpansionsInContextRequest
0.0001 ( 0.0%) 0.0001 ( 0.0%) 0.0002 ( 0.0%) 0.0002 ( 0.0%) LocalDiscriminatorsRequest
0.0000 ( 0.0%) 0.0001 ( 0.0%) 0.0002 ( 0.0%) 0.0001 ( 0.0%) AttachedPropertyWrappersRequest
0.0000 ( 0.0%) 0.0001 ( 0.0%) 0.0001 ( 0.0%) 0.0001 ( 0.0%) DefaultAndMaxAccessLevelRequest
0.0000 ( 0.0%) 0.0001 ( 0.0%) 0.0001 ( 0.0%) 0.0001 ( 0.0%) DefaultTypeRequest
0.0000 ( 0.0%) 0.0001 ( 0.0%) 0.0001 ( 0.0%) 0.0001 ( 0.0%) TypeDeclsFromWhereClauseRequest
0.0000 ( 0.0%) 0.0001 ( 0.0%) 0.0001 ( 0.0%) 0.0001 ( 0.0%) IsGetterMutatingRequest
0.0000 ( 0.0%) 0.0001 ( 0.0%) 0.0001 ( 0.0%) 0.0001 ( 0.0%) IsDynamicRequest
0.0000 ( 0.0%) 0.0000 ( 0.0%) 0.0001 ( 0.0%) 0.0001 ( 0.0%) InheritedProtocolsRequest
0.0000 ( 0.0%) 0.0000 ( 0.0%) 0.0001 ( 0.0%) 0.0001 ( 0.0%) ExpandExtensionMacros
0.0000 ( 0.0%) 0.0000 ( 0.0%) 0.0001 ( 0.0%) 0.0001 ( 0.0%) ExtendedTypeRequest
0.0000 ( 0.0%) 0.0000 ( 0.0%) 0.0001 ( 0.0%) 0.0001 ( 0.0%) ExpandPeerMacroRequest
0.0000 ( 0.0%) 0.0000 ( 0.0%) 0.0001 ( 0.0%) 0.0001 ( 0.0%) ExpandChildTypeRefinementContextsRequest
0.0000 ( 0.0%) 0.0000 ( 0.0%) 0.0001 ( 0.0%) 0.0001 ( 0.0%) PropertyWrapperAuxiliaryVariablesRequest
0.0000 ( 0.0%) 0.0000 ( 0.0%) 0.0000 ( 0.0%) 0.0001 ( 0.0%) ExpandMemberAttributeMacros
0.0000 ( 0.0%) 0.0000 ( 0.0%) 0.0001 ( 0.0%) 0.0001 ( 0.0%) AllInheritedProtocolsRequest
0.0000 ( 0.0%) 0.0000 ( 0.0%) 0.0000 ( 0.0%) 0.0000 ( 0.0%) ResultTypeRequest
0.0000 ( 0.0%) 0.0000 ( 0.0%) 0.0000 ( 0.0%) 0.0000 ( 0.0%) CheckInconsistentWeakLinkedImportsRequest
0.0000 ( 0.0%) 0.0000 ( 0.0%) 0.0000 ( 0.0%) 0.0000 ( 0.0%) SPIGroupsRequest
0.0000 ( 0.0%) 0.0000 ( 0.0%) 0.0000 ( 0.0%) 0.0000 ( 0.0%) ProtocolDependenciesRequest
0.0000 ( 0.0%) 0.0000 ( 0.0%) 0.0000 ( 0.0%) 0.0000 ( 0.0%) StorageImplInfoRequest
0.0000 ( 0.0%) 0.0000 ( 0.0%) 0.0000 ( 0.0%) 0.0000 ( 0.0%) FragileFunctionKindRequest
0.0000 ( 0.0%) 0.0000 ( 0.0%) 0.0000 ( 0.0%) 0.0000 ( 0.0%) CheckRedeclarationRequest
0.0000 ( 0.0%) 0.0000 ( 0.0%) 0.0000 ( 0.0%) 0.0000 ( 0.0%) GenericParamListRequest
0.0000 ( 0.0%) 0.0000 ( 0.0%) 0.0000 ( 0.0%) 0.0000 ( 0.0%) GlobalActorAttributeRequest
0.0000 ( 0.0%) 0.0000 ( 0.0%) 0.0000 ( 0.0%) 0.0000 ( 0.0%) SelfBoundsFromWhereClauseRequest
0.0000 ( 0.0%) 0.0000 ( 0.0%) 0.0000 ( 0.0%) 0.0000 ( 0.0%) ConditionalRequirementsRequest
0.0000 ( 0.0%) 0.0000 ( 0.0%) 0.0000 ( 0.0%) 0.0000 ( 0.0%) IsFinalRequest
0.0000 ( 0.0%) 0.0000 ( 0.0%) 0.0000 ( 0.0%) 0.0000 ( 0.0%) DynamicallyReplacedDeclRequest
0.0000 ( 0.0%) 0.0000 ( 0.0%) 0.0000 ( 0.0%) 0.0000 ( 0.0%) InheritedDeclsReferencedRequest
0.0000 ( 0.0%) 0.0000 ( 0.0%) 0.0000 ( 0.0%) 0.0000 ( 0.0%) OverriddenDeclsRequest
0.0000 ( 0.0%) 0.0000 ( 0.0%) 0.0000 ( 0.0%) 0.0000 ( 0.0%) ApplyAccessNoteRequest
0.0000 ( 0.0%) 0.0000 ( 0.0%) 0.0000 ( 0.0%) 0.0000 ( 0.0%) IsObjCRequest
0.0000 ( 0.0%) 0.0000 ( 0.0%) 0.0000 ( 0.0%) 0.0000 ( 0.0%) RawCommentRequest
0.0000 ( 0.0%) 0.0000 ( 0.0%) 0.0000 ( 0.0%) 0.0000 ( 0.0%) CheckInconsistentImplementationOnlyImportsRequest
0.0000 ( 0.0%) 0.0000 ( 0.0%) 0.0000 ( 0.0%) 0.0000 ( 0.0%) RequirementSignatureRequest
0.0000 ( 0.0%) 0.0000 ( 0.0%) 0.0000 ( 0.0%) 0.0000 ( 0.0%) HasStorageRequest
0.0000 ( 0.0%) 0.0000 ( 0.0%) 0.0000 ( 0.0%) 0.0000 ( 0.0%) ResultBuilderTypeRequest
0.0000 ( 0.0%) 0.0000 ( 0.0%) 0.0000 ( 0.0%) 0.0000 ( 0.0%) AttachedResultBuilderRequest
0.0000 ( 0.0%) 0.0000 ( 0.0%) 0.0000 ( 0.0%) 0.0000 ( 0.0%) IsDistributedActorRequest
0.0000 ( 0.0%) 0.0000 ( 0.0%) 0.0000 ( 0.0%) 0.0000 ( 0.0%) ParamSpecifierRequest
0.0000 ( 0.0%) 0.0000 ( 0.0%) 0.0000 ( 0.0%) 0.0000 ( 0.0%) LocalTypeDeclsRequest
0.0000 ( 0.0%) 0.0000 ( 0.0%) 0.0000 ( 0.0%) 0.0000 ( 0.0%) PropertyWrapperMutabilityRequest
0.0000 ( 0.0%) 0.0000 ( 0.0%) 0.0000 ( 0.0%) 0.0000 ( 0.0%) PrimaryAssociatedTypesRequest
0.0000 ( 0.0%) 0.0000 ( 0.0%) 0.0000 ( 0.0%) 0.0000 ( 0.0%) LifetimeDependenceInfoRequest
0.0000 ( 0.0%) 0.0000 ( 0.0%) 0.0000 ( 0.0%) 0.0000 ( 0.0%) HasImportsMatchingFlagRequest
0.0000 ( 0.0%) 0.0000 ( 0.0%) 0.0000 ( 0.0%) 0.0000 ( 0.0%) ExpandAccessorMacros
0.0000 ( 0.0%) 0.0000 ( 0.0%) 0.0000 ( 0.0%) 0.0000 ( 0.0%) ExpandPreambleMacroRequest
0.0000 ( 0.0%) 0.0000 ( 0.0%) 0.0000 ( 0.0%) 0.0000 ( 0.0%) AccessLevelRequest
0.0000 ( 0.0%) 0.0000 ( 0.0%) 0.0000 ( 0.0%) 0.0000 ( 0.0%) IsFunctionBodySkippedRequest
0.0000 ( 0.0%) 0.0000 ( 0.0%) 0.0000 ( 0.0%) 0.0000 ( 0.0%) HasCircularInheritedProtocolsRequest
0.0000 ( 0.0%) 0.0000 ( 0.0%) 0.0000 ( 0.0%) 0.0000 ( 0.0%) source-file-populate-cache
0.0000 ( 0.0%) 0.0000 ( 0.0%) 0.0000 ( 0.0%) 0.0000 ( 0.0%) module-populate-cache
0.0000 ( 0.0%) 0.0000 ( 0.0%) 0.0000 ( 0.0%) 0.0000 ( 0.0%) SelfAccessKindRequest
0.0000 ( 0.0%) 0.0000 ( 0.0%) 0.0000 ( 0.0%) 0.0000 ( 0.0%) ObjCInterfaceAndImplementationRequest
0.0000 ( 0.0%) 0.0000 ( 0.0%) 0.0000 ( 0.0%) 0.0000 ( 0.0%) ExpandBodyMacroRequest
0.0000 ( 0.0%) 0.0000 ( 0.0%) 0.0000 ( 0.0%) 0.0000 ( 0.0%) IsSetterMutatingRequest
0.0000 ( 0.0%) 0.0000 ( 0.0%) 0.0000 ( 0.0%) 0.0000 ( 0.0%) IsStaticRequest
0.0000 ( 0.0%) 0.0000 ( 0.0%) 0.0000 ( 0.0%) 0.0000 ( 0.0%) PreCheckFunctionBodyRequest
0.0000 ( 0.0%) 0.0000 ( 0.0%) 0.0000 ( 0.0%) 0.0000 ( 0.0%) PreCheckReturnStmtRequest
0.0000 ( 0.0%) 0.0000 ( 0.0%) 0.0000 ( 0.0%) 0.0000 ( 0.0%) perform-whole-module-type-checking
0.0000 ( 0.0%) 0.0000 ( 0.0%) 0.0000 ( 0.0%) 0.0000 ( 0.0%) UnderlyingTypeDeclsReferencedRequest
0.0000 ( 0.0%) 0.0000 ( 0.0%) 0.0000 ( 0.0%) 0.0000 ( 0.0%) PatternTypeRequest
0.0000 ( 0.0%) 0.0000 ( 0.0%) 0.0000 ( 0.0%) 0.0000 ( 0.0%) CheckInconsistentAccessLevelOnImportSameFileRequest
0.0000 ( 0.0%) 0.0000 ( 0.0%) 0.0000 ( 0.0%) 0.0000 ( 0.0%) ResolvePatternRequest
0.0000 ( 0.0%) 0.0000 ( 0.0%) 0.0000 ( 0.0%) 0.0000 ( 0.0%) PropertyWrapperInitializerInfoRequest
0.0000 ( 0.0%) 0.0000 ( 0.0%) 0.0000 ( 0.0%) 0.0000 ( 0.0%) RequiresOpaqueAccessorsRequest
0.0000 ( 0.0%) 0.0000 ( 0.0%) 0.0000 ( 0.0%) 0.0000 ( 0.0%) ClassAncestryFlagsRequest
0.0000 ( 0.0%) 0.0000 ( 0.0%) 0.0000 ( 0.0%) 0.0000 ( 0.0%) CheckInconsistentAccessLevelOnImport
0.0000 ( 0.0%) 0.0000 ( 0.0%) 0.0000 ( 0.0%) 0.0000 ( 0.0%) IsImplicitlyUnwrappedOptionalRequest
0.0000 ( 0.0%) 0.0000 ( 0.0%) 0.0000 ( 0.0%) 0.0000 ( 0.0%) CheckInconsistentSPIOnlyImportsRequest
0.0000 ( 0.0%) 0.0000 ( 0.0%) 0.0000 ( 0.0%) 0.0000 ( 0.0%) ModuleImplicitImportsRequest
0.0000 ( 0.0%) 0.0000 ( 0.0%) 0.0000 ( 0.0%) 0.0000 ( 0.0%) AST verification
0.0000 ( 0.0%) 0.0000 ( 0.0%) 0.0000 ( 0.0%) 0.0000 ( 0.0%) LookupAllConformancesInContextRequest
0.0000 ( 0.0%) 0.0000 ( 0.0%) 0.0000 ( 0.0%) 0.0000 ( 0.0%) PrimarySourceFilesRequest
0.0000 ( 0.0%) 0.0000 ( 0.0%) 0.0000 ( 0.0%) 0.0000 ( 0.0%) SuperclassDeclRequest
0.1716 (100.0%) 0.4114 (100.0%) 0.5830 (100.0%) 0.6080 (100.0%) Total
===-------------------------------------------------------------------------===
Running Program
===-------------------------------------------------------------------------===
Total Execution Time: 0.2447 seconds (0.2562 wall clock)
---User Time--- --System Time-- --User+System-- ---Wall Time--- --- Name ---
0.0650 (100.0%) 0.1797 (100.0%) 0.2447 (100.0%) 0.2562 (100.0%) Building Target
0.0650 (100.0%) 0.1797 (100.0%) 0.2447 (100.0%) 0.2562 (100.0%) Total
SwiftCompile normal arm64 /Users/admin/builder/spi-builder-workspace/Sources/ComposableEnvironment/Reducer+ComposableEnvironment.swift (in target 'ComposableEnvironment' from project 'swift-composable-environment')
cd /Users/admin/builder/spi-builder-workspace
/Applications/Xcode-16.1.0.app/Contents/Developer/Toolchains/XcodeDefault.xctoolchain/usr/bin/swift-frontend -c /Users/admin/builder/spi-builder-workspace/Sources/ComposableEnvironment/ComposableEnvironment.swift /Users/admin/builder/spi-builder-workspace/Sources/ComposableEnvironment/Dependency.swift /Users/admin/builder/spi-builder-workspace/Sources/ComposableEnvironment/Deprecations/GlobalEnvironment+Migration.swift /Users/admin/builder/spi-builder-workspace/Sources/ComposableEnvironment/Deprecations/Reducers+Deprecations.swift /Users/admin/builder/spi-builder-workspace/Sources/ComposableEnvironment/DerivedEnvironment.swift -primary-file /Users/admin/builder/spi-builder-workspace/Sources/ComposableEnvironment/Reducer+ComposableEnvironment.swift -emit-dependencies-path /Users/admin/builder/spi-builder-workspace/.derivedData/Build/Intermediates.noindex/swift-composable-environment.build/Debug-appletvos/ComposableEnvironment.build/Objects-normal/arm64/Reducer+ComposableEnvironment.d -emit-const-values-path /Users/admin/builder/spi-builder-workspace/.derivedData/Build/Intermediates.noindex/swift-composable-environment.build/Debug-appletvos/ComposableEnvironment.build/Objects-normal/arm64/Reducer+ComposableEnvironment.swiftconstvalues -emit-reference-dependencies-path /Users/admin/builder/spi-builder-workspace/.derivedData/Build/Intermediates.noindex/swift-composable-environment.build/Debug-appletvos/ComposableEnvironment.build/Objects-normal/arm64/Reducer+ComposableEnvironment.swiftdeps -serialize-diagnostics-path /Users/admin/builder/spi-builder-workspace/.derivedData/Build/Intermediates.noindex/swift-composable-environment.build/Debug-appletvos/ComposableEnvironment.build/Objects-normal/arm64/Reducer+ComposableEnvironment.dia -target arm64-apple-tvos13.0 -Xllvm -aarch64-use-tbi -enable-objc-interop -stack-check -sdk /Applications/Xcode-16.1.0.app/Contents/Developer/Platforms/AppleTVOS.platform/Developer/SDKs/AppleTVOS18.1.sdk -I /Users/admin/builder/spi-builder-workspace/.derivedData/Build/Products/Debug-appletvos -I /Applications/Xcode-16.1.0.app/Contents/Developer/Platforms/AppleTVOS.platform/Developer/usr/lib -F /Users/admin/builder/spi-builder-workspace/.derivedData/Build/Products/Debug-appletvos/PackageFrameworks -F /Users/admin/builder/spi-builder-workspace/.derivedData/Build/Products/Debug-appletvos/PackageFrameworks -F /Users/admin/builder/spi-builder-workspace/.derivedData/Build/Products/Debug-appletvos/PackageFrameworks -F /Users/admin/builder/spi-builder-workspace/.derivedData/Build/Products/Debug-appletvos/PackageFrameworks -F /Users/admin/builder/spi-builder-workspace/.derivedData/Build/Products/Debug-appletvos/PackageFrameworks -F /Users/admin/builder/spi-builder-workspace/.derivedData/Build/Products/Debug-appletvos/PackageFrameworks -F /Users/admin/builder/spi-builder-workspace/.derivedData/Build/Products/Debug-appletvos/PackageFrameworks -F /Users/admin/builder/spi-builder-workspace/.derivedData/Build/Products/Debug-appletvos/PackageFrameworks -F /Users/admin/builder/spi-builder-workspace/.derivedData/Build/Products/Debug-appletvos/PackageFrameworks -F /Users/admin/builder/spi-builder-workspace/.derivedData/Build/Products/Debug-appletvos/PackageFrameworks -F /Users/admin/builder/spi-builder-workspace/.derivedData/Build/Products/Debug-appletvos/PackageFrameworks -F /Users/admin/builder/spi-builder-workspace/.derivedData/Build/Products/Debug-appletvos/PackageFrameworks -F /Users/admin/builder/spi-builder-workspace/.derivedData/Build/Products/Debug-appletvos/PackageFrameworks -F /Users/admin/builder/spi-builder-workspace/.derivedData/Build/Products/Debug-appletvos/PackageFrameworks -F /Users/admin/builder/spi-builder-workspace/.derivedData/Build/Products/Debug-appletvos/PackageFrameworks -F /Users/admin/builder/spi-builder-workspace/.derivedData/Build/Products/Debug-appletvos -F /Applications/Xcode-16.1.0.app/Contents/Developer/Platforms/AppleTVOS.platform/Developer/Library/Frameworks -F /Applications/Xcode-16.1.0.app/Contents/Developer/Platforms/AppleTVOS.platform/Developer/SDKs/AppleTVOS18.1.sdk/Developer/Library/Frameworks -no-color-diagnostics -enable-testing -g -debug-info-format\=dwarf -dwarf-version\=4 -module-cache-path /Users/admin/builder/spi-builder-workspace/.derivedData/ModuleCache.noindex -swift-version 5 -enforce-exclusivity\=checked -stats-output-dir /Users/admin/builder/spi-builder-workspace/.stats -Onone -D SWIFT_PACKAGE -D DEBUG -serialize-debugging-options -const-gather-protocols-file /Users/admin/builder/spi-builder-workspace/.derivedData/Build/Intermediates.noindex/swift-composable-environment.build/Debug-appletvos/ComposableEnvironment.build/Objects-normal/arm64/ComposableEnvironment_const_extract_protocols.json -enable-experimental-feature DebugDescriptionMacro -enable-experimental-feature OpaqueTypeErasure -enable-upcoming-feature StrictConcurrency -enable-upcoming-feature DisableOutwardActorInference -enable-upcoming-feature GlobalActorIsolatedTypesUsability -enable-upcoming-feature InferSendableFromCaptures -strict-concurrency\=complete -empty-abi-descriptor -plugin-path /Applications/Xcode-16.1.0.app/Contents/Developer/Toolchains/XcodeDefault.xctoolchain/usr/lib/swift/host/plugins/testing -validate-clang-modules-once -clang-build-session-file /Users/admin/builder/spi-builder-workspace/.derivedData/ModuleCache.noindex/Session.modulevalidation -Xcc -working-directory -Xcc /Users/admin/builder/spi-builder-workspace -resource-dir /Applications/Xcode-16.1.0.app/Contents/Developer/Toolchains/XcodeDefault.xctoolchain/usr/lib/swift -enable-anonymous-context-mangled-names -file-compilation-dir /Users/admin/builder/spi-builder-workspace -Xcc -D_LIBCPP_HARDENING_MODE\=_LIBCPP_HARDENING_MODE_DEBUG -Xcc -ivfsstatcache -Xcc /Users/admin/builder/spi-builder-workspace/.derivedData/SDKStatCaches.noindex/appletvos18.1-22J572-e7fdd8cf9ffd4d4af20823079b51a726.sdkstatcache -Xcc -I/Users/admin/builder/spi-builder-workspace/.derivedData/Build/Intermediates.noindex/swift-composable-environment.build/Debug-appletvos/ComposableEnvironment.build/swift-overrides.hmap -Xcc -I/Users/admin/builder/spi-builder-workspace/.derivedData/Build/Products/Debug-appletvos/include -Xcc -I/Users/admin/builder/spi-builder-workspace/.derivedData/Build/Intermediates.noindex/swift-composable-environment.build/Debug-appletvos/ComposableEnvironment.build/DerivedSources-normal/arm64 -Xcc -I/Users/admin/builder/spi-builder-workspace/.derivedData/Build/Intermediates.noindex/swift-composable-environment.build/Debug-appletvos/ComposableEnvironment.build/DerivedSources/arm64 -Xcc -I/Users/admin/builder/spi-builder-workspace/.derivedData/Build/Intermediates.noindex/swift-composable-environment.build/Debug-appletvos/ComposableEnvironment.build/DerivedSources -Xcc -DSWIFT_PACKAGE -Xcc -DDEBUG\=1 -module-name ComposableEnvironment -frontend-parseable-output -disable-clang-spi -target-sdk-version 18.1 -target-sdk-name appletvos18.1 -external-plugin-path /Applications/Xcode-16.1.0.app/Contents/Developer/Platforms/AppleTVOS.platform/Developer/usr/lib/swift/host/plugins\#/Applications/Xcode-16.1.0.app/Contents/Developer/Platforms/AppleTVOS.platform/Developer/usr/bin/swift-plugin-server -external-plugin-path /Applications/Xcode-16.1.0.app/Contents/Developer/Platforms/AppleTVOS.platform/Developer/usr/local/lib/swift/host/plugins\#/Applications/Xcode-16.1.0.app/Contents/Developer/Platforms/AppleTVOS.platform/Developer/usr/bin/swift-plugin-server -plugin-path /Applications/Xcode-16.1.0.app/Contents/Developer/Toolchains/XcodeDefault.xctoolchain/usr/lib/swift/host/plugins -plugin-path /Applications/Xcode-16.1.0.app/Contents/Developer/Toolchains/XcodeDefault.xctoolchain/usr/local/lib/swift/host/plugins -o /Users/admin/builder/spi-builder-workspace/.derivedData/Build/Intermediates.noindex/swift-composable-environment.build/Debug-appletvos/ComposableEnvironment.build/Objects-normal/arm64/Reducer+ComposableEnvironment.o -index-unit-output-path /swift-composable-environment.build/Debug-appletvos/ComposableEnvironment.build/Objects-normal/arm64/Reducer+ComposableEnvironment.o -index-store-path /Users/admin/builder/spi-builder-workspace/.derivedData/Index.noindex/DataStore -index-system-modules
/Users/admin/builder/spi-builder-workspace/Sources/ComposableEnvironment/Reducer+ComposableEnvironment.swift:3:25: error: cannot find type 'Environment' in scope
extension Reducer where Environment: ComposableEnvironment {
^~~~~~~~~~~
/Users/admin/builder/spi-builder-workspace/Sources/ComposableEnvironment/Reducer+ComposableEnvironment.swift:24:8: error: protocol type 'Reducer' specialized with too many type arguments (got 3, but expected 2)
) -> Reducer<GlobalState, GlobalAction, GlobalEnvironment>
^
/Users/admin/builder/spi-builder-workspace/Sources/ComposableEnvironment/Reducer+ComposableEnvironment.swift:58:8: error: protocol type 'Reducer' specialized with too many type arguments (got 3, but expected 2)
) -> Reducer<GlobalState, GlobalAction, GlobalEnvironment>
^
/Users/admin/builder/spi-builder-workspace/Sources/ComposableEnvironment/Reducer+ComposableEnvironment.swift:90:8: error: protocol type 'Reducer' specialized with too many type arguments (got 3, but expected 2)
) -> Reducer<GlobalState, GlobalAction, GlobalEnvironment>
^
/Users/admin/builder/spi-builder-workspace/Sources/ComposableEnvironment/Reducer+ComposableEnvironment.swift:121:8: error: protocol type 'Reducer' specialized with too many type arguments (got 3, but expected 2)
) -> Reducer<GlobalState, GlobalAction, GlobalEnvironment>
^
/Users/admin/builder/spi-builder-workspace/Sources/ComposableEnvironment/Reducer+ComposableEnvironment.swift:26:17: error: cannot find 'Environment' in scope
let local = Environment()
^~~~~~~~~~~
/Users/admin/builder/spi-builder-workspace/Sources/ComposableEnvironment/Reducer+ComposableEnvironment.swift:60:17: error: cannot find 'Environment' in scope
let local = Environment()
^~~~~~~~~~~
/Users/admin/builder/spi-builder-workspace/Sources/ComposableEnvironment/Reducer+ComposableEnvironment.swift:92:17: error: cannot find 'Environment' in scope
let local = Environment()
^~~~~~~~~~~
/Users/admin/builder/spi-builder-workspace/Sources/ComposableEnvironment/Reducer+ComposableEnvironment.swift:123:17: error: cannot find 'Environment' in scope
let local = Environment()
^~~~~~~~~~~
SwiftEmitModule normal arm64 Emitting\ module\ for\ GlobalEnvironment (in target 'GlobalEnvironment' from project 'swift-composable-environment')
cd /Users/admin/builder/spi-builder-workspace
builtin-swiftTaskExecution -- /Applications/Xcode-16.1.0.app/Contents/Developer/Toolchains/XcodeDefault.xctoolchain/usr/bin/swift-frontend -frontend -emit-module -experimental-skip-non-inlinable-function-bodies-without-types /Users/admin/builder/spi-builder-workspace/Sources/GlobalEnvironment/Dependency.swift /Users/admin/builder/spi-builder-workspace/Sources/GlobalEnvironment/Deprecations/ComposableEnvironment+Migration.swift /Users/admin/builder/spi-builder-workspace/Sources/GlobalEnvironment/Deprecations/Reducers+Deprecations.swift /Users/admin/builder/spi-builder-workspace/Sources/GlobalEnvironment/DerivedEnvironment.swift /Users/admin/builder/spi-builder-workspace/Sources/GlobalEnvironment/GlobalEnvironment.swift /Users/admin/builder/spi-builder-workspace/Sources/GlobalEnvironment/Reducer+GlobalEnvironment.swift -target arm64-apple-tvos13.0 -Xllvm -aarch64-use-tbi -enable-objc-interop -stack-check -sdk /Applications/Xcode-16.1.0.app/Contents/Developer/Platforms/AppleTVOS.platform/Developer/SDKs/AppleTVOS18.1.sdk -I /Users/admin/builder/spi-builder-workspace/.derivedData/Build/Products/Debug-appletvos -I /Applications/Xcode-16.1.0.app/Contents/Developer/Platforms/AppleTVOS.platform/Developer/usr/lib -F /Users/admin/builder/spi-builder-workspace/.derivedData/Build/Products/Debug-appletvos/PackageFrameworks -F /Users/admin/builder/spi-builder-workspace/.derivedData/Build/Products/Debug-appletvos/PackageFrameworks -F /Users/admin/builder/spi-builder-workspace/.derivedData/Build/Products/Debug-appletvos/PackageFrameworks -F /Users/admin/builder/spi-builder-workspace/.derivedData/Build/Products/Debug-appletvos/PackageFrameworks -F /Users/admin/builder/spi-builder-workspace/.derivedData/Build/Products/Debug-appletvos/PackageFrameworks -F /Users/admin/builder/spi-builder-workspace/.derivedData/Build/Products/Debug-appletvos/PackageFrameworks -F /Users/admin/builder/spi-builder-workspace/.derivedData/Build/Products/Debug-appletvos/PackageFrameworks -F /Users/admin/builder/spi-builder-workspace/.derivedData/Build/Products/Debug-appletvos/PackageFrameworks -F /Users/admin/builder/spi-builder-workspace/.derivedData/Build/Products/Debug-appletvos/PackageFrameworks -F /Users/admin/builder/spi-builder-workspace/.derivedData/Build/Products/Debug-appletvos/PackageFrameworks -F /Users/admin/builder/spi-builder-workspace/.derivedData/Build/Products/Debug-appletvos/PackageFrameworks -F /Users/admin/builder/spi-builder-workspace/.derivedData/Build/Products/Debug-appletvos/PackageFrameworks -F /Users/admin/builder/spi-builder-workspace/.derivedData/Build/Products/Debug-appletvos/PackageFrameworks -F /Users/admin/builder/spi-builder-workspace/.derivedData/Build/Products/Debug-appletvos/PackageFrameworks -F /Users/admin/builder/spi-builder-workspace/.derivedData/Build/Products/Debug-appletvos/PackageFrameworks -F /Users/admin/builder/spi-builder-workspace/.derivedData/Build/Products/Debug-appletvos -F /Applications/Xcode-16.1.0.app/Contents/Developer/Platforms/AppleTVOS.platform/Developer/Library/Frameworks -F /Applications/Xcode-16.1.0.app/Contents/Developer/Platforms/AppleTVOS.platform/Developer/SDKs/AppleTVOS18.1.sdk/Developer/Library/Frameworks -no-color-diagnostics -enable-testing -g -debug-info-format\=dwarf -dwarf-version\=4 -module-cache-path /Users/admin/builder/spi-builder-workspace/.derivedData/ModuleCache.noindex -swift-version 5 -enforce-exclusivity\=checked -stats-output-dir /Users/admin/builder/spi-builder-workspace/.stats -Onone -D SWIFT_PACKAGE -D DEBUG -serialize-debugging-options -const-gather-protocols-file /Users/admin/builder/spi-builder-workspace/.derivedData/Build/Intermediates.noindex/swift-composable-environment.build/Debug-appletvos/GlobalEnvironment.build/Objects-normal/arm64/GlobalEnvironment_const_extract_protocols.json -enable-experimental-feature DebugDescriptionMacro -enable-experimental-feature OpaqueTypeErasure -enable-upcoming-feature StrictConcurrency -enable-upcoming-feature DisableOutwardActorInference -enable-upcoming-feature GlobalActorIsolatedTypesUsability -enable-upcoming-feature InferSendableFromCaptures -strict-concurrency\=complete -empty-abi-descriptor -plugin-path /Applications/Xcode-16.1.0.app/Contents/Developer/Toolchains/XcodeDefault.xctoolchain/usr/lib/swift/host/plugins/testing -validate-clang-modules-once -clang-build-session-file /Users/admin/builder/spi-builder-workspace/.derivedData/ModuleCache.noindex/Session.modulevalidation -Xcc -working-directory -Xcc /Users/admin/builder/spi-builder-workspace -resource-dir /Applications/Xcode-16.1.0.app/Contents/Developer/Toolchains/XcodeDefault.xctoolchain/usr/lib/swift -enable-anonymous-context-mangled-names -file-compilation-dir /Users/admin/builder/spi-builder-workspace -Xcc -D_LIBCPP_HARDENING_MODE\=_LIBCPP_HARDENING_MODE_DEBUG -Xcc -ivfsstatcache -Xcc /Users/admin/builder/spi-builder-workspace/.derivedData/SDKStatCaches.noindex/appletvos18.1-22J572-e7fdd8cf9ffd4d4af20823079b51a726.sdkstatcache -Xcc -I/Users/admin/builder/spi-builder-workspace/.derivedData/Build/Intermediates.noindex/swift-composable-environment.build/Debug-appletvos/GlobalEnvironment.build/swift-overrides.hmap -Xcc -I/Users/admin/builder/spi-builder-workspace/.derivedData/Build/Products/Debug-appletvos/include -Xcc -I/Users/admin/builder/spi-builder-workspace/.derivedData/Build/Intermediates.noindex/swift-composable-environment.build/Debug-appletvos/GlobalEnvironment.build/DerivedSources-normal/arm64 -Xcc -I/Users/admin/builder/spi-builder-workspace/.derivedData/Build/Intermediates.noindex/swift-composable-environment.build/Debug-appletvos/GlobalEnvironment.build/DerivedSources/arm64 -Xcc -I/Users/admin/builder/spi-builder-workspace/.derivedData/Build/Intermediates.noindex/swift-composable-environment.build/Debug-appletvos/GlobalEnvironment.build/DerivedSources -Xcc -DSWIFT_PACKAGE -Xcc -DDEBUG\=1 -module-name GlobalEnvironment -frontend-parseable-output -disable-clang-spi -target-sdk-version 18.1 -target-sdk-name appletvos18.1 -external-plugin-path /Applications/Xcode-16.1.0.app/Contents/Developer/Platforms/AppleTVOS.platform/Developer/usr/lib/swift/host/plugins\#/Applications/Xcode-16.1.0.app/Contents/Developer/Platforms/AppleTVOS.platform/Developer/usr/bin/swift-plugin-server -external-plugin-path /Applications/Xcode-16.1.0.app/Contents/Developer/Platforms/AppleTVOS.platform/Developer/usr/local/lib/swift/host/plugins\#/Applications/Xcode-16.1.0.app/Contents/Developer/Platforms/AppleTVOS.platform/Developer/usr/bin/swift-plugin-server -plugin-path /Applications/Xcode-16.1.0.app/Contents/Developer/Toolchains/XcodeDefault.xctoolchain/usr/lib/swift/host/plugins -plugin-path /Applications/Xcode-16.1.0.app/Contents/Developer/Toolchains/XcodeDefault.xctoolchain/usr/local/lib/swift/host/plugins -emit-module-doc-path /Users/admin/builder/spi-builder-workspace/.derivedData/Build/Intermediates.noindex/swift-composable-environment.build/Debug-appletvos/GlobalEnvironment.build/Objects-normal/arm64/GlobalEnvironment.swiftdoc -emit-module-source-info-path /Users/admin/builder/spi-builder-workspace/.derivedData/Build/Intermediates.noindex/swift-composable-environment.build/Debug-appletvos/GlobalEnvironment.build/Objects-normal/arm64/GlobalEnvironment.swiftsourceinfo -emit-objc-header-path /Users/admin/builder/spi-builder-workspace/.derivedData/Build/Intermediates.noindex/swift-composable-environment.build/Debug-appletvos/GlobalEnvironment.build/Objects-normal/arm64/GlobalEnvironment-Swift.h -serialize-diagnostics-path /Users/admin/builder/spi-builder-workspace/.derivedData/Build/Intermediates.noindex/swift-composable-environment.build/Debug-appletvos/GlobalEnvironment.build/Objects-normal/arm64/GlobalEnvironment-master-emit-module.dia -emit-dependencies-path /Users/admin/builder/spi-builder-workspace/.derivedData/Build/Intermediates.noindex/swift-composable-environment.build/Debug-appletvos/GlobalEnvironment.build/Objects-normal/arm64/GlobalEnvironment-master-emit-module.d -o /Users/admin/builder/spi-builder-workspace/.derivedData/Build/Intermediates.noindex/swift-composable-environment.build/Debug-appletvos/GlobalEnvironment.build/Objects-normal/arm64/GlobalEnvironment.swiftmodule -emit-abi-descriptor-path /Users/admin/builder/spi-builder-workspace/.derivedData/Build/Intermediates.noindex/swift-composable-environment.build/Debug-appletvos/GlobalEnvironment.build/Objects-normal/arm64/GlobalEnvironment.abi.json
EmitSwiftModule normal arm64 (in target 'GlobalEnvironment' from project 'swift-composable-environment')
cd /Users/admin/builder/spi-builder-workspace
/Applications/Xcode-16.1.0.app/Contents/Developer/Toolchains/XcodeDefault.xctoolchain/usr/bin/swift-frontend -emit-module -experimental-skip-non-inlinable-function-bodies-without-types /Users/admin/builder/spi-builder-workspace/Sources/GlobalEnvironment/Dependency.swift /Users/admin/builder/spi-builder-workspace/Sources/GlobalEnvironment/Deprecations/ComposableEnvironment+Migration.swift /Users/admin/builder/spi-builder-workspace/Sources/GlobalEnvironment/Deprecations/Reducers+Deprecations.swift /Users/admin/builder/spi-builder-workspace/Sources/GlobalEnvironment/DerivedEnvironment.swift /Users/admin/builder/spi-builder-workspace/Sources/GlobalEnvironment/GlobalEnvironment.swift /Users/admin/builder/spi-builder-workspace/Sources/GlobalEnvironment/Reducer+GlobalEnvironment.swift -target arm64-apple-tvos13.0 -Xllvm -aarch64-use-tbi -enable-objc-interop -stack-check -sdk /Applications/Xcode-16.1.0.app/Contents/Developer/Platforms/AppleTVOS.platform/Developer/SDKs/AppleTVOS18.1.sdk -I /Users/admin/builder/spi-builder-workspace/.derivedData/Build/Products/Debug-appletvos -I /Applications/Xcode-16.1.0.app/Contents/Developer/Platforms/AppleTVOS.platform/Developer/usr/lib -F /Users/admin/builder/spi-builder-workspace/.derivedData/Build/Products/Debug-appletvos/PackageFrameworks -F /Users/admin/builder/spi-builder-workspace/.derivedData/Build/Products/Debug-appletvos/PackageFrameworks -F /Users/admin/builder/spi-builder-workspace/.derivedData/Build/Products/Debug-appletvos/PackageFrameworks -F /Users/admin/builder/spi-builder-workspace/.derivedData/Build/Products/Debug-appletvos/PackageFrameworks -F /Users/admin/builder/spi-builder-workspace/.derivedData/Build/Products/Debug-appletvos/PackageFrameworks -F /Users/admin/builder/spi-builder-workspace/.derivedData/Build/Products/Debug-appletvos/PackageFrameworks -F /Users/admin/builder/spi-builder-workspace/.derivedData/Build/Products/Debug-appletvos/PackageFrameworks -F /Users/admin/builder/spi-builder-workspace/.derivedData/Build/Products/Debug-appletvos/PackageFrameworks -F /Users/admin/builder/spi-builder-workspace/.derivedData/Build/Products/Debug-appletvos/PackageFrameworks -F /Users/admin/builder/spi-builder-workspace/.derivedData/Build/Products/Debug-appletvos/PackageFrameworks -F /Users/admin/builder/spi-builder-workspace/.derivedData/Build/Products/Debug-appletvos/PackageFrameworks -F /Users/admin/builder/spi-builder-workspace/.derivedData/Build/Products/Debug-appletvos/PackageFrameworks -F /Users/admin/builder/spi-builder-workspace/.derivedData/Build/Products/Debug-appletvos/PackageFrameworks -F /Users/admin/builder/spi-builder-workspace/.derivedData/Build/Products/Debug-appletvos/PackageFrameworks -F /Users/admin/builder/spi-builder-workspace/.derivedData/Build/Products/Debug-appletvos/PackageFrameworks -F /Users/admin/builder/spi-builder-workspace/.derivedData/Build/Products/Debug-appletvos -F /Applications/Xcode-16.1.0.app/Contents/Developer/Platforms/AppleTVOS.platform/Developer/Library/Frameworks -F /Applications/Xcode-16.1.0.app/Contents/Developer/Platforms/AppleTVOS.platform/Developer/SDKs/AppleTVOS18.1.sdk/Developer/Library/Frameworks -no-color-diagnostics -enable-testing -g -debug-info-format\=dwarf -dwarf-version\=4 -module-cache-path /Users/admin/builder/spi-builder-workspace/.derivedData/ModuleCache.noindex -swift-version 5 -enforce-exclusivity\=checked -stats-output-dir /Users/admin/builder/spi-builder-workspace/.stats -Onone -D SWIFT_PACKAGE -D DEBUG -serialize-debugging-options -const-gather-protocols-file /Users/admin/builder/spi-builder-workspace/.derivedData/Build/Intermediates.noindex/swift-composable-environment.build/Debug-appletvos/GlobalEnvironment.build/Objects-normal/arm64/GlobalEnvironment_const_extract_protocols.json -enable-experimental-feature DebugDescriptionMacro -enable-experimental-feature OpaqueTypeErasure -enable-upcoming-feature StrictConcurrency -enable-upcoming-feature DisableOutwardActorInference -enable-upcoming-feature GlobalActorIsolatedTypesUsability -enable-upcoming-feature InferSendableFromCaptures -strict-concurrency\=complete -empty-abi-descriptor -plugin-path /Applications/Xcode-16.1.0.app/Contents/Developer/Toolchains/XcodeDefault.xctoolchain/usr/lib/swift/host/plugins/testing -validate-clang-modules-once -clang-build-session-file /Users/admin/builder/spi-builder-workspace/.derivedData/ModuleCache.noindex/Session.modulevalidation -Xcc -working-directory -Xcc /Users/admin/builder/spi-builder-workspace -resource-dir /Applications/Xcode-16.1.0.app/Contents/Developer/Toolchains/XcodeDefault.xctoolchain/usr/lib/swift -enable-anonymous-context-mangled-names -file-compilation-dir /Users/admin/builder/spi-builder-workspace -Xcc -D_LIBCPP_HARDENING_MODE\=_LIBCPP_HARDENING_MODE_DEBUG -Xcc -ivfsstatcache -Xcc /Users/admin/builder/spi-builder-workspace/.derivedData/SDKStatCaches.noindex/appletvos18.1-22J572-e7fdd8cf9ffd4d4af20823079b51a726.sdkstatcache -Xcc -I/Users/admin/builder/spi-builder-workspace/.derivedData/Build/Intermediates.noindex/swift-composable-environment.build/Debug-appletvos/GlobalEnvironment.build/swift-overrides.hmap -Xcc -I/Users/admin/builder/spi-builder-workspace/.derivedData/Build/Products/Debug-appletvos/include -Xcc -I/Users/admin/builder/spi-builder-workspace/.derivedData/Build/Intermediates.noindex/swift-composable-environment.build/Debug-appletvos/GlobalEnvironment.build/DerivedSources-normal/arm64 -Xcc -I/Users/admin/builder/spi-builder-workspace/.derivedData/Build/Intermediates.noindex/swift-composable-environment.build/Debug-appletvos/GlobalEnvironment.build/DerivedSources/arm64 -Xcc -I/Users/admin/builder/spi-builder-workspace/.derivedData/Build/Intermediates.noindex/swift-composable-environment.build/Debug-appletvos/GlobalEnvironment.build/DerivedSources -Xcc -DSWIFT_PACKAGE -Xcc -DDEBUG\=1 -module-name GlobalEnvironment -frontend-parseable-output -disable-clang-spi -target-sdk-version 18.1 -target-sdk-name appletvos18.1 -external-plugin-path /Applications/Xcode-16.1.0.app/Contents/Developer/Platforms/AppleTVOS.platform/Developer/usr/lib/swift/host/plugins\#/Applications/Xcode-16.1.0.app/Contents/Developer/Platforms/AppleTVOS.platform/Developer/usr/bin/swift-plugin-server -external-plugin-path /Applications/Xcode-16.1.0.app/Contents/Developer/Platforms/AppleTVOS.platform/Developer/usr/local/lib/swift/host/plugins\#/Applications/Xcode-16.1.0.app/Contents/Developer/Platforms/AppleTVOS.platform/Developer/usr/bin/swift-plugin-server -plugin-path /Applications/Xcode-16.1.0.app/Contents/Developer/Toolchains/XcodeDefault.xctoolchain/usr/lib/swift/host/plugins -plugin-path /Applications/Xcode-16.1.0.app/Contents/Developer/Toolchains/XcodeDefault.xctoolchain/usr/local/lib/swift/host/plugins -emit-module-doc-path /Users/admin/builder/spi-builder-workspace/.derivedData/Build/Intermediates.noindex/swift-composable-environment.build/Debug-appletvos/GlobalEnvironment.build/Objects-normal/arm64/GlobalEnvironment.swiftdoc -emit-module-source-info-path /Users/admin/builder/spi-builder-workspace/.derivedData/Build/Intermediates.noindex/swift-composable-environment.build/Debug-appletvos/GlobalEnvironment.build/Objects-normal/arm64/GlobalEnvironment.swiftsourceinfo -emit-objc-header-path /Users/admin/builder/spi-builder-workspace/.derivedData/Build/Intermediates.noindex/swift-composable-environment.build/Debug-appletvos/GlobalEnvironment.build/Objects-normal/arm64/GlobalEnvironment-Swift.h -serialize-diagnostics-path /Users/admin/builder/spi-builder-workspace/.derivedData/Build/Intermediates.noindex/swift-composable-environment.build/Debug-appletvos/GlobalEnvironment.build/Objects-normal/arm64/GlobalEnvironment-master-emit-module.dia -emit-dependencies-path /Users/admin/builder/spi-builder-workspace/.derivedData/Build/Intermediates.noindex/swift-composable-environment.build/Debug-appletvos/GlobalEnvironment.build/Objects-normal/arm64/GlobalEnvironment-master-emit-module.d -o /Users/admin/builder/spi-builder-workspace/.derivedData/Build/Intermediates.noindex/swift-composable-environment.build/Debug-appletvos/GlobalEnvironment.build/Objects-normal/arm64/GlobalEnvironment.swiftmodule -emit-abi-descriptor-path /Users/admin/builder/spi-builder-workspace/.derivedData/Build/Intermediates.noindex/swift-composable-environment.build/Debug-appletvos/GlobalEnvironment.build/Objects-normal/arm64/GlobalEnvironment.abi.json
SwiftCompile normal arm64 Compiling\ Reducers+Deprecations.swift /Users/admin/builder/spi-builder-workspace/Sources/GlobalEnvironment/Deprecations/Reducers+Deprecations.swift (in target 'GlobalEnvironment' from project 'swift-composable-environment')
cd /Users/admin/builder/spi-builder-workspace
builtin-swiftTaskExecution -- /Applications/Xcode-16.1.0.app/Contents/Developer/Toolchains/XcodeDefault.xctoolchain/usr/bin/swift-frontend -frontend -c /Users/admin/builder/spi-builder-workspace/Sources/GlobalEnvironment/Dependency.swift /Users/admin/builder/spi-builder-workspace/Sources/GlobalEnvironment/Deprecations/ComposableEnvironment+Migration.swift -primary-file /Users/admin/builder/spi-builder-workspace/Sources/GlobalEnvironment/Deprecations/Reducers+Deprecations.swift /Users/admin/builder/spi-builder-workspace/Sources/GlobalEnvironment/DerivedEnvironment.swift /Users/admin/builder/spi-builder-workspace/Sources/GlobalEnvironment/GlobalEnvironment.swift /Users/admin/builder/spi-builder-workspace/Sources/GlobalEnvironment/Reducer+GlobalEnvironment.swift -emit-dependencies-path /Users/admin/builder/spi-builder-workspace/.derivedData/Build/Intermediates.noindex/swift-composable-environment.build/Debug-appletvos/GlobalEnvironment.build/Objects-normal/arm64/Reducers+Deprecations.d -emit-const-values-path /Users/admin/builder/spi-builder-workspace/.derivedData/Build/Intermediates.noindex/swift-composable-environment.build/Debug-appletvos/GlobalEnvironment.build/Objects-normal/arm64/Reducers+Deprecations.swiftconstvalues -emit-reference-dependencies-path /Users/admin/builder/spi-builder-workspace/.derivedData/Build/Intermediates.noindex/swift-composable-environment.build/Debug-appletvos/GlobalEnvironment.build/Objects-normal/arm64/Reducers+Deprecations.swiftdeps -serialize-diagnostics-path /Users/admin/builder/spi-builder-workspace/.derivedData/Build/Intermediates.noindex/swift-composable-environment.build/Debug-appletvos/GlobalEnvironment.build/Objects-normal/arm64/Reducers+Deprecations.dia -target arm64-apple-tvos13.0 -Xllvm -aarch64-use-tbi -enable-objc-interop -stack-check -sdk /Applications/Xcode-16.1.0.app/Contents/Developer/Platforms/AppleTVOS.platform/Developer/SDKs/AppleTVOS18.1.sdk -I /Users/admin/builder/spi-builder-workspace/.derivedData/Build/Products/Debug-appletvos -I /Applications/Xcode-16.1.0.app/Contents/Developer/Platforms/AppleTVOS.platform/Developer/usr/lib -F /Users/admin/builder/spi-builder-workspace/.derivedData/Build/Products/Debug-appletvos/PackageFrameworks -F /Users/admin/builder/spi-builder-workspace/.derivedData/Build/Products/Debug-appletvos/PackageFrameworks -F /Users/admin/builder/spi-builder-workspace/.derivedData/Build/Products/Debug-appletvos/PackageFrameworks -F /Users/admin/builder/spi-builder-workspace/.derivedData/Build/Products/Debug-appletvos/PackageFrameworks -F /Users/admin/builder/spi-builder-workspace/.derivedData/Build/Products/Debug-appletvos/PackageFrameworks -F /Users/admin/builder/spi-builder-workspace/.derivedData/Build/Products/Debug-appletvos/PackageFrameworks -F /Users/admin/builder/spi-builder-workspace/.derivedData/Build/Products/Debug-appletvos/PackageFrameworks -F /Users/admin/builder/spi-builder-workspace/.derivedData/Build/Products/Debug-appletvos/PackageFrameworks -F /Users/admin/builder/spi-builder-workspace/.derivedData/Build/Products/Debug-appletvos/PackageFrameworks -F /Users/admin/builder/spi-builder-workspace/.derivedData/Build/Products/Debug-appletvos/PackageFrameworks -F /Users/admin/builder/spi-builder-workspace/.derivedData/Build/Products/Debug-appletvos/PackageFrameworks -F /Users/admin/builder/spi-builder-workspace/.derivedData/Build/Products/Debug-appletvos/PackageFrameworks -F /Users/admin/builder/spi-builder-workspace/.derivedData/Build/Products/Debug-appletvos/PackageFrameworks -F /Users/admin/builder/spi-builder-workspace/.derivedData/Build/Products/Debug-appletvos/PackageFrameworks -F /Users/admin/builder/spi-builder-workspace/.derivedData/Build/Products/Debug-appletvos/PackageFrameworks -F /Users/admin/builder/spi-builder-workspace/.derivedData/Build/Products/Debug-appletvos -F /Applications/Xcode-16.1.0.app/Contents/Developer/Platforms/AppleTVOS.platform/Developer/Library/Frameworks -F /Applications/Xcode-16.1.0.app/Contents/Developer/Platforms/AppleTVOS.platform/Developer/SDKs/AppleTVOS18.1.sdk/Developer/Library/Frameworks -no-color-diagnostics -enable-testing -g -debug-info-format\=dwarf -dwarf-version\=4 -module-cache-path /Users/admin/builder/spi-builder-workspace/.derivedData/ModuleCache.noindex -swift-version 5 -enforce-exclusivity\=checked -stats-output-dir /Users/admin/builder/spi-builder-workspace/.stats -Onone -D SWIFT_PACKAGE -D DEBUG -serialize-debugging-options -const-gather-protocols-file /Users/admin/builder/spi-builder-workspace/.derivedData/Build/Intermediates.noindex/swift-composable-environment.build/Debug-appletvos/GlobalEnvironment.build/Objects-normal/arm64/GlobalEnvironment_const_extract_protocols.json -enable-experimental-feature DebugDescriptionMacro -enable-experimental-feature OpaqueTypeErasure -enable-upcoming-feature StrictConcurrency -enable-upcoming-feature DisableOutwardActorInference -enable-upcoming-feature GlobalActorIsolatedTypesUsability -enable-upcoming-feature InferSendableFromCaptures -strict-concurrency\=complete -empty-abi-descriptor -plugin-path /Applications/Xcode-16.1.0.app/Contents/Developer/Toolchains/XcodeDefault.xctoolchain/usr/lib/swift/host/plugins/testing -validate-clang-modules-once -clang-build-session-file /Users/admin/builder/spi-builder-workspace/.derivedData/ModuleCache.noindex/Session.modulevalidation -Xcc -working-directory -Xcc /Users/admin/builder/spi-builder-workspace -resource-dir /Applications/Xcode-16.1.0.app/Contents/Developer/Toolchains/XcodeDefault.xctoolchain/usr/lib/swift -enable-anonymous-context-mangled-names -file-compilation-dir /Users/admin/builder/spi-builder-workspace -Xcc -D_LIBCPP_HARDENING_MODE\=_LIBCPP_HARDENING_MODE_DEBUG -Xcc -ivfsstatcache -Xcc /Users/admin/builder/spi-builder-workspace/.derivedData/SDKStatCaches.noindex/appletvos18.1-22J572-e7fdd8cf9ffd4d4af20823079b51a726.sdkstatcache -Xcc -I/Users/admin/builder/spi-builder-workspace/.derivedData/Build/Intermediates.noindex/swift-composable-environment.build/Debug-appletvos/GlobalEnvironment.build/swift-overrides.hmap -Xcc -I/Users/admin/builder/spi-builder-workspace/.derivedData/Build/Products/Debug-appletvos/include -Xcc -I/Users/admin/builder/spi-builder-workspace/.derivedData/Build/Intermediates.noindex/swift-composable-environment.build/Debug-appletvos/GlobalEnvironment.build/DerivedSources-normal/arm64 -Xcc -I/Users/admin/builder/spi-builder-workspace/.derivedData/Build/Intermediates.noindex/swift-composable-environment.build/Debug-appletvos/GlobalEnvironment.build/DerivedSources/arm64 -Xcc -I/Users/admin/builder/spi-builder-workspace/.derivedData/Build/Intermediates.noindex/swift-composable-environment.build/Debug-appletvos/GlobalEnvironment.build/DerivedSources -Xcc -DSWIFT_PACKAGE -Xcc -DDEBUG\=1 -module-name GlobalEnvironment -frontend-parseable-output -disable-clang-spi -target-sdk-version 18.1 -target-sdk-name appletvos18.1 -external-plugin-path /Applications/Xcode-16.1.0.app/Contents/Developer/Platforms/AppleTVOS.platform/Developer/usr/lib/swift/host/plugins\#/Applications/Xcode-16.1.0.app/Contents/Developer/Platforms/AppleTVOS.platform/Developer/usr/bin/swift-plugin-server -external-plugin-path /Applications/Xcode-16.1.0.app/Contents/Developer/Platforms/AppleTVOS.platform/Developer/usr/local/lib/swift/host/plugins\#/Applications/Xcode-16.1.0.app/Contents/Developer/Platforms/AppleTVOS.platform/Developer/usr/bin/swift-plugin-server -plugin-path /Applications/Xcode-16.1.0.app/Contents/Developer/Toolchains/XcodeDefault.xctoolchain/usr/lib/swift/host/plugins -plugin-path /Applications/Xcode-16.1.0.app/Contents/Developer/Toolchains/XcodeDefault.xctoolchain/usr/local/lib/swift/host/plugins -o /Users/admin/builder/spi-builder-workspace/.derivedData/Build/Intermediates.noindex/swift-composable-environment.build/Debug-appletvos/GlobalEnvironment.build/Objects-normal/arm64/Reducers+Deprecations.o -index-unit-output-path /swift-composable-environment.build/Debug-appletvos/GlobalEnvironment.build/Objects-normal/arm64/Reducers+Deprecations.o -index-store-path /Users/admin/builder/spi-builder-workspace/.derivedData/Index.noindex/DataStore -index-system-modules
Error opening -stats-output-dir file '/Users/admin/builder/spi-builder-workspace/.stats/stats-1732835185988268-swift-frontend-GlobalEnvironment-Reducers_Deprecations.swift-arm64_apple_tvos13.0-o-Onone-753147086.json' for writing
===-------------------------------------------------------------------------===
Swift compilation
===-------------------------------------------------------------------------===
Total Execution Time: 0.4743 seconds (0.5170 wall clock)
---User Time--- --System Time-- --User+System-- ---Wall Time--- --- Name ---
0.0527 ( 32.3%) 0.1210 ( 38.9%) 0.1737 ( 36.6%) 0.1816 ( 35.1%) parse-and-resolve-imports
0.0524 ( 32.2%) 0.1207 ( 38.7%) 0.1731 ( 36.5%) 0.1810 ( 35.0%) Import resolution
0.0070 ( 4.3%) 0.0082 ( 2.6%) 0.0151 ( 3.2%) 0.0173 ( 3.4%) perform-sema
0.0069 ( 4.3%) 0.0082 ( 2.6%) 0.0151 ( 3.2%) 0.0173 ( 3.3%) TypeCheckSourceFileRequest
0.0069 ( 4.2%) 0.0081 ( 2.6%) 0.0150 ( 3.2%) 0.0172 ( 3.3%) Type checking and Semantic analysis
0.0067 ( 4.1%) 0.0079 ( 2.5%) 0.0146 ( 3.1%) 0.0168 ( 3.2%) typecheck-decl
0.0043 ( 2.6%) 0.0046 ( 1.5%) 0.0089 ( 1.9%) 0.0089 ( 1.7%) InterfaceTypeRequest
0.0036 ( 2.2%) 0.0042 ( 1.4%) 0.0078 ( 1.6%) 0.0078 ( 1.5%) GenericSignatureRequest
0.0012 ( 0.7%) 0.0040 ( 1.3%) 0.0052 ( 1.1%) 0.0058 ( 1.1%) load-stdlib
0.0027 ( 1.7%) 0.0030 ( 1.0%) 0.0058 ( 1.2%) 0.0058 ( 1.1%) InferredGenericSignatureRequest
0.0012 ( 0.7%) 0.0017 ( 0.5%) 0.0028 ( 0.6%) 0.0050 ( 1.0%) UnqualifiedLookupRequest
0.0025 ( 1.5%) 0.0023 ( 0.7%) 0.0048 ( 1.0%) 0.0048 ( 0.9%) LookupConformanceInModuleRequest
0.0011 ( 0.7%) 0.0014 ( 0.5%) 0.0025 ( 0.5%) 0.0047 ( 0.9%) performUnqualifiedLookup
0.0010 ( 0.6%) 0.0010 ( 0.3%) 0.0020 ( 0.4%) 0.0042 ( 0.8%) typecheck-expr
0.0015 ( 0.9%) 0.0025 ( 0.8%) 0.0040 ( 0.8%) 0.0040 ( 0.8%) ResolveTypeRequest
0.0008 ( 0.5%) 0.0008 ( 0.2%) 0.0016 ( 0.3%) 0.0037 ( 0.7%) TypeCheckFunctionBodyRequest
0.0006 ( 0.4%) 0.0009 ( 0.3%) 0.0015 ( 0.3%) 0.0037 ( 0.7%) QualifiedLookupRequest
0.0007 ( 0.4%) 0.0007 ( 0.2%) 0.0014 ( 0.3%) 0.0035 ( 0.7%) typecheck-stmt
0.0004 ( 0.3%) 0.0003 ( 0.1%) 0.0008 ( 0.2%) 0.0030 ( 0.6%) PatternBindingEntryRequest
0.0003 ( 0.2%) 0.0002 ( 0.1%) 0.0005 ( 0.1%) 0.0027 ( 0.5%) precheck-expr
0.0011 ( 0.7%) 0.0007 ( 0.2%) 0.0018 ( 0.4%) 0.0018 ( 0.3%) LookupInModuleRequest
0.0008 ( 0.5%) 0.0009 ( 0.3%) 0.0017 ( 0.4%) 0.0017 ( 0.3%) ModuleQualifiedLookupRequest
0.0005 ( 0.3%) 0.0011 ( 0.3%) 0.0016 ( 0.3%) 0.0016 ( 0.3%) RequirementRequest
0.0007 ( 0.4%) 0.0008 ( 0.3%) 0.0014 ( 0.3%) 0.0014 ( 0.3%) DefaultArgumentExprRequest
0.0003 ( 0.2%) 0.0010 ( 0.3%) 0.0013 ( 0.3%) 0.0013 ( 0.3%) SemanticDeclAttrsRequest
0.0005 ( 0.3%) 0.0008 ( 0.2%) 0.0013 ( 0.3%) 0.0013 ( 0.2%) import-clang-decl
0.0005 ( 0.3%) 0.0006 ( 0.2%) 0.0011 ( 0.2%) 0.0011 ( 0.2%) DirectLookupRequest
0.0003 ( 0.2%) 0.0007 ( 0.2%) 0.0009 ( 0.2%) 0.0009 ( 0.2%) ActorIsolationRequest
0.0005 ( 0.3%) 0.0003 ( 0.1%) 0.0008 ( 0.2%) 0.0008 ( 0.2%) ParseTopLevelDeclsRequest
0.0005 ( 0.3%) 0.0003 ( 0.1%) 0.0008 ( 0.2%) 0.0008 ( 0.2%) ParseSourceFileRequest
0.0003 ( 0.2%) 0.0003 ( 0.1%) 0.0006 ( 0.1%) 0.0006 ( 0.1%) CollectOverriddenDeclsRequest
0.0003 ( 0.2%) 0.0003 ( 0.1%) 0.0006 ( 0.1%) 0.0006 ( 0.1%) USRGenerationRequest
0.0003 ( 0.2%) 0.0002 ( 0.1%) 0.0005 ( 0.1%) 0.0005 ( 0.1%) ProvideDefaultImplForRequest
0.0003 ( 0.2%) 0.0002 ( 0.1%) 0.0005 ( 0.1%) 0.0005 ( 0.1%) build-rewrite-system
0.0003 ( 0.2%) 0.0002 ( 0.1%) 0.0005 ( 0.1%) 0.0005 ( 0.1%) ExtendedNominalRequest
0.0002 ( 0.1%) 0.0001 ( 0.0%) 0.0002 ( 0.1%) 0.0002 ( 0.0%) IsNonUserModuleRequest
0.0001 ( 0.0%) 0.0001 ( 0.0%) 0.0002 ( 0.0%) 0.0002 ( 0.0%) LocalDiscriminatorsRequest
0.0001 ( 0.1%) 0.0001 ( 0.0%) 0.0002 ( 0.0%) 0.0002 ( 0.0%) HasIsolatedSelfRequest
0.0001 ( 0.1%) 0.0001 ( 0.0%) 0.0002 ( 0.0%) 0.0002 ( 0.0%) DefaultInitializerIsolation
0.0001 ( 0.0%) 0.0001 ( 0.0%) 0.0002 ( 0.0%) 0.0002 ( 0.0%) IsActorRequest
0.0000 ( 0.0%) 0.0001 ( 0.0%) 0.0001 ( 0.0%) 0.0001 ( 0.0%) AttachedPropertyWrappersRequest
0.0000 ( 0.0%) 0.0001 ( 0.0%) 0.0001 ( 0.0%) 0.0001 ( 0.0%) PotentialMacroExpansionsInContextRequest
0.0001 ( 0.0%) 0.0001 ( 0.0%) 0.0001 ( 0.0%) 0.0001 ( 0.0%) DefaultTypeRequest
0.0000 ( 0.0%) 0.0001 ( 0.0%) 0.0001 ( 0.0%) 0.0001 ( 0.0%) DefaultAndMaxAccessLevelRequest
0.0000 ( 0.0%) 0.0001 ( 0.0%) 0.0001 ( 0.0%) 0.0001 ( 0.0%) TypeDeclsFromWhereClauseRequest
0.0000 ( 0.0%) 0.0001 ( 0.0%) 0.0001 ( 0.0%) 0.0001 ( 0.0%) PropertyWrapperAuxiliaryVariablesRequest
0.0000 ( 0.0%) 0.0000 ( 0.0%) 0.0001 ( 0.0%) 0.0001 ( 0.0%) IsGetterMutatingRequest
0.0000 ( 0.0%) 0.0000 ( 0.0%) 0.0001 ( 0.0%) 0.0001 ( 0.0%) InheritedProtocolsRequest
0.0000 ( 0.0%) 0.0000 ( 0.0%) 0.0001 ( 0.0%) 0.0001 ( 0.0%) ExpandPeerMacroRequest
0.0000 ( 0.0%) 0.0000 ( 0.0%) 0.0001 ( 0.0%) 0.0001 ( 0.0%) ExpandExtensionMacros
0.0000 ( 0.0%) 0.0000 ( 0.0%) 0.0000 ( 0.0%) 0.0000 ( 0.0%) IsDynamicRequest
0.0000 ( 0.0%) 0.0000 ( 0.0%) 0.0000 ( 0.0%) 0.0000 ( 0.0%) ExpandChildTypeRefinementContextsRequest
0.0000 ( 0.0%) 0.0000 ( 0.0%) 0.0000 ( 0.0%) 0.0000 ( 0.0%) ProtocolDependenciesRequest
0.0000 ( 0.0%) 0.0000 ( 0.0%) 0.0000 ( 0.0%) 0.0000 ( 0.0%) ExpandMemberAttributeMacros
0.0000 ( 0.0%) 0.0000 ( 0.0%) 0.0000 ( 0.0%) 0.0000 ( 0.0%) SPIGroupsRequest
0.0000 ( 0.0%) 0.0000 ( 0.0%) 0.0000 ( 0.0%) 0.0000 ( 0.0%) CheckInconsistentWeakLinkedImportsRequest
0.0000 ( 0.0%) 0.0000 ( 0.0%) 0.0000 ( 0.0%) 0.0000 ( 0.0%) AllInheritedProtocolsRequest
0.0000 ( 0.0%) 0.0000 ( 0.0%) 0.0000 ( 0.0%) 0.0000 ( 0.0%) ExtendedTypeRequest
0.0000 ( 0.0%) 0.0000 ( 0.0%) 0.0000 ( 0.0%) 0.0000 ( 0.0%) ConditionalRequirementsRequest
0.0000 ( 0.0%) 0.0000 ( 0.0%) 0.0000 ( 0.0%) 0.0000 ( 0.0%) CheckInconsistentImplementationOnlyImportsRequest
0.0000 ( 0.0%) 0.0000 ( 0.0%) 0.0000 ( 0.0%) 0.0000 ( 0.0%) ResultTypeRequest
0.0000 ( 0.0%) 0.0000 ( 0.0%) 0.0000 ( 0.0%) 0.0000 ( 0.0%) SelfBoundsFromWhereClauseRequest
0.0000 ( 0.0%) 0.0000 ( 0.0%) 0.0000 ( 0.0%) 0.0000 ( 0.0%) FragileFunctionKindRequest
0.0000 ( 0.0%) 0.0000 ( 0.0%) 0.0000 ( 0.0%) 0.0000 ( 0.0%) StorageImplInfoRequest
0.0000 ( 0.0%) 0.0000 ( 0.0%) 0.0000 ( 0.0%) 0.0000 ( 0.0%) InheritedDeclsReferencedRequest
0.0000 ( 0.0%) 0.0000 ( 0.0%) 0.0000 ( 0.0%) 0.0000 ( 0.0%) GlobalActorAttributeRequest
0.0000 ( 0.0%) 0.0000 ( 0.0%) 0.0000 ( 0.0%) 0.0000 ( 0.0%) CheckRedeclarationRequest
0.0000 ( 0.0%) 0.0000 ( 0.0%) 0.0000 ( 0.0%) 0.0000 ( 0.0%) DynamicallyReplacedDeclRequest
0.0000 ( 0.0%) 0.0000 ( 0.0%) 0.0000 ( 0.0%) 0.0000 ( 0.0%) GenericParamListRequest
0.0000 ( 0.0%) 0.0000 ( 0.0%) 0.0000 ( 0.0%) 0.0000 ( 0.0%) OverriddenDeclsRequest
0.0000 ( 0.0%) 0.0000 ( 0.0%) 0.0000 ( 0.0%) 0.0000 ( 0.0%) IsObjCRequest
0.0000 ( 0.0%) 0.0000 ( 0.0%) 0.0000 ( 0.0%) 0.0000 ( 0.0%) IsFinalRequest
0.0000 ( 0.0%) 0.0000 ( 0.0%) 0.0000 ( 0.0%) 0.0000 ( 0.0%) RequirementSignatureRequest
0.0000 ( 0.0%) 0.0000 ( 0.0%) 0.0000 ( 0.0%) 0.0000 ( 0.0%) HasStorageRequest
0.0000 ( 0.0%) 0.0000 ( 0.0%) 0.0000 ( 0.0%) 0.0000 ( 0.0%) ResultBuilderTypeRequest
0.0000 ( 0.0%) 0.0000 ( 0.0%) 0.0000 ( 0.0%) 0.0000 ( 0.0%) ApplyAccessNoteRequest
0.0000 ( 0.0%) 0.0000 ( 0.0%) 0.0000 ( 0.0%) 0.0000 ( 0.0%) module-populate-cache
0.0000 ( 0.0%) 0.0000 ( 0.0%) 0.0000 ( 0.0%) 0.0000 ( 0.0%) AttachedResultBuilderRequest
0.0000 ( 0.0%) 0.0000 ( 0.0%) 0.0000 ( 0.0%) 0.0000 ( 0.0%) LifetimeDependenceInfoRequest
0.0000 ( 0.0%) 0.0000 ( 0.0%) 0.0000 ( 0.0%) 0.0000 ( 0.0%) ParamSpecifierRequest
0.0000 ( 0.0%) 0.0000 ( 0.0%) 0.0000 ( 0.0%) 0.0000 ( 0.0%) HasImportsMatchingFlagRequest
0.0000 ( 0.0%) 0.0000 ( 0.0%) 0.0000 ( 0.0%) 0.0000 ( 0.0%) ObjCInterfaceAndImplementationRequest
0.0000 ( 0.0%) 0.0000 ( 0.0%) 0.0000 ( 0.0%) 0.0000 ( 0.0%) HasCircularInheritedProtocolsRequest
0.0000 ( 0.0%) 0.0000 ( 0.0%) 0.0000 ( 0.0%) 0.0000 ( 0.0%) ModuleImplicitImportsRequest
0.0000 ( 0.0%) 0.0000 ( 0.0%) 0.0000 ( 0.0%) 0.0000 ( 0.0%) LocalTypeDeclsRequest
0.0000 ( 0.0%) 0.0000 ( 0.0%) 0.0000 ( 0.0%) 0.0000 ( 0.0%) AccessLevelRequest
0.0000 ( 0.0%) 0.0000 ( 0.0%) 0.0000 ( 0.0%) 0.0000 ( 0.0%) PrimaryAssociatedTypesRequest
0.0000 ( 0.0%) 0.0000 ( 0.0%) 0.0000 ( 0.0%) 0.0000 ( 0.0%) ExpandBodyMacroRequest
0.0000 ( 0.0%) 0.0000 ( 0.0%) 0.0000 ( 0.0%) 0.0000 ( 0.0%) ResolvePatternRequest
0.0000 ( 0.0%) 0.0000 ( 0.0%) 0.0000 ( 0.0%) 0.0000 ( 0.0%) ExpandAccessorMacros
0.0000 ( 0.0%) 0.0000 ( 0.0%) 0.0000 ( 0.0%) 0.0000 ( 0.0%) IsDistributedActorRequest
0.0000 ( 0.0%) 0.0000 ( 0.0%) 0.0000 ( 0.0%) 0.0000 ( 0.0%) IsSetterMutatingRequest
0.0000 ( 0.0%) 0.0000 ( 0.0%) 0.0000 ( 0.0%) 0.0000 ( 0.0%) perform-whole-module-type-checking
0.0000 ( 0.0%) 0.0000 ( 0.0%) 0.0000 ( 0.0%) 0.0000 ( 0.0%) PatternTypeRequest
0.0000 ( 0.0%) 0.0000 ( 0.0%) 0.0000 ( 0.0%) 0.0000 ( 0.0%) IsStaticRequest
0.0000 ( 0.0%) 0.0000 ( 0.0%) 0.0000 ( 0.0%) 0.0000 ( 0.0%) UnderlyingTypeDeclsReferencedRequest
0.0000 ( 0.0%) 0.0000 ( 0.0%) 0.0000 ( 0.0%) 0.0000 ( 0.0%) PreCheckReturnStmtRequest
0.0000 ( 0.0%) 0.0000 ( 0.0%) 0.0000 ( 0.0%) 0.0000 ( 0.0%) PreCheckFunctionBodyRequest
0.0000 ( 0.0%) 0.0000 ( 0.0%) 0.0000 ( 0.0%) 0.0000 ( 0.0%) CheckInconsistentAccessLevelOnImport
0.0000 ( 0.0%) 0.0000 ( 0.0%) 0.0000 ( 0.0%) 0.0000 ( 0.0%) PrimarySourceFilesRequest
0.0000 ( 0.0%) 0.0000 ( 0.0%) 0.0000 ( 0.0%) 0.0000 ( 0.0%) source-file-populate-cache
0.0000 ( 0.0%) 0.0000 ( 0.0%) 0.0000 ( 0.0%) 0.0000 ( 0.0%) IsFunctionBodySkippedRequest
0.0000 ( 0.0%) 0.0000 ( 0.0%) 0.0000 ( 0.0%) 0.0000 ( 0.0%) SelfAccessKindRequest
0.0000 ( 0.0%) 0.0000 ( 0.0%) 0.0000 ( 0.0%) 0.0000 ( 0.0%) CheckInconsistentSPIOnlyImportsRequest
0.0000 ( 0.0%) 0.0000 ( 0.0%) 0.0000 ( 0.0%) 0.0000 ( 0.0%) ExpandPreambleMacroRequest
0.0000 ( 0.0%) 0.0000 ( 0.0%) 0.0000 ( 0.0%) 0.0000 ( 0.0%) RequiresOpaqueAccessorsRequest
0.0000 ( 0.0%) 0.0000 ( 0.0%) 0.0000 ( 0.0%) 0.0000 ( 0.0%) IsImplicitlyUnwrappedOptionalRequest
0.0000 ( 0.0%) 0.0000 ( 0.0%) 0.0000 ( 0.0%) 0.0000 ( 0.0%) RawCommentRequest
0.0000 ( 0.0%) 0.0000 ( 0.0%) 0.0000 ( 0.0%) 0.0000 ( 0.0%) PropertyWrapperMutabilityRequest
0.0000 ( 0.0%) 0.0000 ( 0.0%) 0.0000 ( 0.0%) 0.0000 ( 0.0%) LookupAllConformancesInContextRequest
0.0000 ( 0.0%) 0.0000 ( 0.0%) 0.0000 ( 0.0%) 0.0000 ( 0.0%) CheckInconsistentAccessLevelOnImportSameFileRequest
0.0000 ( 0.0%) 0.0000 ( 0.0%) 0.0000 ( 0.0%) 0.0000 ( 0.0%) AST verification
0.0000 ( 0.0%) 0.0000 ( 0.0%) 0.0000 ( 0.0%) 0.0000 ( 0.0%) PropertyWrapperInitializerInfoRequest
0.1628 (100.0%) 0.3115 (100.0%) 0.4743 (100.0%) 0.5170 (100.0%) Total
===-------------------------------------------------------------------------===
Running Program
===-------------------------------------------------------------------------===
Total Execution Time: 0.2021 seconds (0.2129 wall clock)
---User Time--- --System Time-- --User+System-- ---Wall Time--- --- Name ---
0.0632 (100.0%) 0.1389 (100.0%) 0.2021 (100.0%) 0.2129 (100.0%) Building Target
0.0632 (100.0%) 0.1389 (100.0%) 0.2021 (100.0%) 0.2129 (100.0%) Total
SwiftCompile normal arm64 /Users/admin/builder/spi-builder-workspace/Sources/GlobalEnvironment/Deprecations/Reducers+Deprecations.swift (in target 'GlobalEnvironment' from project 'swift-composable-environment')
cd /Users/admin/builder/spi-builder-workspace
/Applications/Xcode-16.1.0.app/Contents/Developer/Toolchains/XcodeDefault.xctoolchain/usr/bin/swift-frontend -c /Users/admin/builder/spi-builder-workspace/Sources/GlobalEnvironment/Dependency.swift /Users/admin/builder/spi-builder-workspace/Sources/GlobalEnvironment/Deprecations/ComposableEnvironment+Migration.swift -primary-file /Users/admin/builder/spi-builder-workspace/Sources/GlobalEnvironment/Deprecations/Reducers+Deprecations.swift /Users/admin/builder/spi-builder-workspace/Sources/GlobalEnvironment/DerivedEnvironment.swift /Users/admin/builder/spi-builder-workspace/Sources/GlobalEnvironment/GlobalEnvironment.swift /Users/admin/builder/spi-builder-workspace/Sources/GlobalEnvironment/Reducer+GlobalEnvironment.swift -emit-dependencies-path /Users/admin/builder/spi-builder-workspace/.derivedData/Build/Intermediates.noindex/swift-composable-environment.build/Debug-appletvos/GlobalEnvironment.build/Objects-normal/arm64/Reducers+Deprecations.d -emit-const-values-path /Users/admin/builder/spi-builder-workspace/.derivedData/Build/Intermediates.noindex/swift-composable-environment.build/Debug-appletvos/GlobalEnvironment.build/Objects-normal/arm64/Reducers+Deprecations.swiftconstvalues -emit-reference-dependencies-path /Users/admin/builder/spi-builder-workspace/.derivedData/Build/Intermediates.noindex/swift-composable-environment.build/Debug-appletvos/GlobalEnvironment.build/Objects-normal/arm64/Reducers+Deprecations.swiftdeps -serialize-diagnostics-path /Users/admin/builder/spi-builder-workspace/.derivedData/Build/Intermediates.noindex/swift-composable-environment.build/Debug-appletvos/GlobalEnvironment.build/Objects-normal/arm64/Reducers+Deprecations.dia -target arm64-apple-tvos13.0 -Xllvm -aarch64-use-tbi -enable-objc-interop -stack-check -sdk /Applications/Xcode-16.1.0.app/Contents/Developer/Platforms/AppleTVOS.platform/Developer/SDKs/AppleTVOS18.1.sdk -I /Users/admin/builder/spi-builder-workspace/.derivedData/Build/Products/Debug-appletvos -I /Applications/Xcode-16.1.0.app/Contents/Developer/Platforms/AppleTVOS.platform/Developer/usr/lib -F /Users/admin/builder/spi-builder-workspace/.derivedData/Build/Products/Debug-appletvos/PackageFrameworks -F /Users/admin/builder/spi-builder-workspace/.derivedData/Build/Products/Debug-appletvos/PackageFrameworks -F /Users/admin/builder/spi-builder-workspace/.derivedData/Build/Products/Debug-appletvos/PackageFrameworks -F /Users/admin/builder/spi-builder-workspace/.derivedData/Build/Products/Debug-appletvos/PackageFrameworks -F /Users/admin/builder/spi-builder-workspace/.derivedData/Build/Products/Debug-appletvos/PackageFrameworks -F /Users/admin/builder/spi-builder-workspace/.derivedData/Build/Products/Debug-appletvos/PackageFrameworks -F /Users/admin/builder/spi-builder-workspace/.derivedData/Build/Products/Debug-appletvos/PackageFrameworks -F /Users/admin/builder/spi-builder-workspace/.derivedData/Build/Products/Debug-appletvos/PackageFrameworks -F /Users/admin/builder/spi-builder-workspace/.derivedData/Build/Products/Debug-appletvos/PackageFrameworks -F /Users/admin/builder/spi-builder-workspace/.derivedData/Build/Products/Debug-appletvos/PackageFrameworks -F /Users/admin/builder/spi-builder-workspace/.derivedData/Build/Products/Debug-appletvos/PackageFrameworks -F /Users/admin/builder/spi-builder-workspace/.derivedData/Build/Products/Debug-appletvos/PackageFrameworks -F /Users/admin/builder/spi-builder-workspace/.derivedData/Build/Products/Debug-appletvos/PackageFrameworks -F /Users/admin/builder/spi-builder-workspace/.derivedData/Build/Products/Debug-appletvos/PackageFrameworks -F /Users/admin/builder/spi-builder-workspace/.derivedData/Build/Products/Debug-appletvos/PackageFrameworks -F /Users/admin/builder/spi-builder-workspace/.derivedData/Build/Products/Debug-appletvos -F /Applications/Xcode-16.1.0.app/Contents/Developer/Platforms/AppleTVOS.platform/Developer/Library/Frameworks -F /Applications/Xcode-16.1.0.app/Contents/Developer/Platforms/AppleTVOS.platform/Developer/SDKs/AppleTVOS18.1.sdk/Developer/Library/Frameworks -no-color-diagnostics -enable-testing -g -debug-info-format\=dwarf -dwarf-version\=4 -module-cache-path /Users/admin/builder/spi-builder-workspace/.derivedData/ModuleCache.noindex -swift-version 5 -enforce-exclusivity\=checked -stats-output-dir /Users/admin/builder/spi-builder-workspace/.stats -Onone -D SWIFT_PACKAGE -D DEBUG -serialize-debugging-options -const-gather-protocols-file /Users/admin/builder/spi-builder-workspace/.derivedData/Build/Intermediates.noindex/swift-composable-environment.build/Debug-appletvos/GlobalEnvironment.build/Objects-normal/arm64/GlobalEnvironment_const_extract_protocols.json -enable-experimental-feature DebugDescriptionMacro -enable-experimental-feature OpaqueTypeErasure -enable-upcoming-feature StrictConcurrency -enable-upcoming-feature DisableOutwardActorInference -enable-upcoming-feature GlobalActorIsolatedTypesUsability -enable-upcoming-feature InferSendableFromCaptures -strict-concurrency\=complete -empty-abi-descriptor -plugin-path /Applications/Xcode-16.1.0.app/Contents/Developer/Toolchains/XcodeDefault.xctoolchain/usr/lib/swift/host/plugins/testing -validate-clang-modules-once -clang-build-session-file /Users/admin/builder/spi-builder-workspace/.derivedData/ModuleCache.noindex/Session.modulevalidation -Xcc -working-directory -Xcc /Users/admin/builder/spi-builder-workspace -resource-dir /Applications/Xcode-16.1.0.app/Contents/Developer/Toolchains/XcodeDefault.xctoolchain/usr/lib/swift -enable-anonymous-context-mangled-names -file-compilation-dir /Users/admin/builder/spi-builder-workspace -Xcc -D_LIBCPP_HARDENING_MODE\=_LIBCPP_HARDENING_MODE_DEBUG -Xcc -ivfsstatcache -Xcc /Users/admin/builder/spi-builder-workspace/.derivedData/SDKStatCaches.noindex/appletvos18.1-22J572-e7fdd8cf9ffd4d4af20823079b51a726.sdkstatcache -Xcc -I/Users/admin/builder/spi-builder-workspace/.derivedData/Build/Intermediates.noindex/swift-composable-environment.build/Debug-appletvos/GlobalEnvironment.build/swift-overrides.hmap -Xcc -I/Users/admin/builder/spi-builder-workspace/.derivedData/Build/Products/Debug-appletvos/include -Xcc -I/Users/admin/builder/spi-builder-workspace/.derivedData/Build/Intermediates.noindex/swift-composable-environment.build/Debug-appletvos/GlobalEnvironment.build/DerivedSources-normal/arm64 -Xcc -I/Users/admin/builder/spi-builder-workspace/.derivedData/Build/Intermediates.noindex/swift-composable-environment.build/Debug-appletvos/GlobalEnvironment.build/DerivedSources/arm64 -Xcc -I/Users/admin/builder/spi-builder-workspace/.derivedData/Build/Intermediates.noindex/swift-composable-environment.build/Debug-appletvos/GlobalEnvironment.build/DerivedSources -Xcc -DSWIFT_PACKAGE -Xcc -DDEBUG\=1 -module-name GlobalEnvironment -frontend-parseable-output -disable-clang-spi -target-sdk-version 18.1 -target-sdk-name appletvos18.1 -external-plugin-path /Applications/Xcode-16.1.0.app/Contents/Developer/Platforms/AppleTVOS.platform/Developer/usr/lib/swift/host/plugins\#/Applications/Xcode-16.1.0.app/Contents/Developer/Platforms/AppleTVOS.platform/Developer/usr/bin/swift-plugin-server -external-plugin-path /Applications/Xcode-16.1.0.app/Contents/Developer/Platforms/AppleTVOS.platform/Developer/usr/local/lib/swift/host/plugins\#/Applications/Xcode-16.1.0.app/Contents/Developer/Platforms/AppleTVOS.platform/Developer/usr/bin/swift-plugin-server -plugin-path /Applications/Xcode-16.1.0.app/Contents/Developer/Toolchains/XcodeDefault.xctoolchain/usr/lib/swift/host/plugins -plugin-path /Applications/Xcode-16.1.0.app/Contents/Developer/Toolchains/XcodeDefault.xctoolchain/usr/local/lib/swift/host/plugins -o /Users/admin/builder/spi-builder-workspace/.derivedData/Build/Intermediates.noindex/swift-composable-environment.build/Debug-appletvos/GlobalEnvironment.build/Objects-normal/arm64/Reducers+Deprecations.o -index-unit-output-path /swift-composable-environment.build/Debug-appletvos/GlobalEnvironment.build/Objects-normal/arm64/Reducers+Deprecations.o -index-store-path /Users/admin/builder/spi-builder-workspace/.derivedData/Index.noindex/DataStore -index-system-modules
/Users/admin/builder/spi-builder-workspace/Sources/GlobalEnvironment/Deprecations/Reducers+Deprecations.swift:9:25: error: cannot find type 'Environment' in scope
extension Reducer where Environment: GlobalEnvironment {
^~~~~~~~~~~
/Users/admin/builder/spi-builder-workspace/Sources/GlobalEnvironment/Deprecations/Reducers+Deprecations.swift:16:8: error: protocol type 'Reducer' specialized with too many type arguments (got 3, but expected 2)
) -> Reducer<GlobalState, GlobalAction, GlobalEnvironment> {
^
/Users/admin/builder/spi-builder-workspace/Sources/GlobalEnvironment/Deprecations/Reducers+Deprecations.swift:37:8: error: protocol type 'Reducer' specialized with too many type arguments (got 3, but expected 2)
) -> Reducer<GlobalState, GlobalAction, GlobalEnvironment> {
^
/Users/admin/builder/spi-builder-workspace/Sources/GlobalEnvironment/Deprecations/Reducers+Deprecations.swift:58:8: error: protocol type 'Reducer' specialized with too many type arguments (got 3, but expected 2)
) -> Reducer<GlobalState, GlobalAction, GlobalEnvironment> {
^
/Users/admin/builder/spi-builder-workspace/Sources/GlobalEnvironment/Deprecations/Reducers+Deprecations.swift:17:17: error: cannot find 'Environment' in scope
let local = Environment()
^~~~~~~~~~~
/Users/admin/builder/spi-builder-workspace/Sources/GlobalEnvironment/Deprecations/Reducers+Deprecations.swift:38:17: error: cannot find 'Environment' in scope
let local = Environment()
^~~~~~~~~~~
/Users/admin/builder/spi-builder-workspace/Sources/GlobalEnvironment/Deprecations/Reducers+Deprecations.swift:59:17: error: cannot find 'Environment' in scope
let local = Environment()
^~~~~~~~~~~
SwiftCompile normal arm64 Compiling\ Reducer+GlobalEnvironment.swift /Users/admin/builder/spi-builder-workspace/Sources/GlobalEnvironment/Reducer+GlobalEnvironment.swift (in target 'GlobalEnvironment' from project 'swift-composable-environment')
cd /Users/admin/builder/spi-builder-workspace
builtin-swiftTaskExecution -- /Applications/Xcode-16.1.0.app/Contents/Developer/Toolchains/XcodeDefault.xctoolchain/usr/bin/swift-frontend -frontend -c /Users/admin/builder/spi-builder-workspace/Sources/GlobalEnvironment/Dependency.swift /Users/admin/builder/spi-builder-workspace/Sources/GlobalEnvironment/Deprecations/ComposableEnvironment+Migration.swift /Users/admin/builder/spi-builder-workspace/Sources/GlobalEnvironment/Deprecations/Reducers+Deprecations.swift /Users/admin/builder/spi-builder-workspace/Sources/GlobalEnvironment/DerivedEnvironment.swift /Users/admin/builder/spi-builder-workspace/Sources/GlobalEnvironment/GlobalEnvironment.swift -primary-file /Users/admin/builder/spi-builder-workspace/Sources/GlobalEnvironment/Reducer+GlobalEnvironment.swift -emit-dependencies-path /Users/admin/builder/spi-builder-workspace/.derivedData/Build/Intermediates.noindex/swift-composable-environment.build/Debug-appletvos/GlobalEnvironment.build/Objects-normal/arm64/Reducer+GlobalEnvironment.d -emit-const-values-path /Users/admin/builder/spi-builder-workspace/.derivedData/Build/Intermediates.noindex/swift-composable-environment.build/Debug-appletvos/GlobalEnvironment.build/Objects-normal/arm64/Reducer+GlobalEnvironment.swiftconstvalues -emit-reference-dependencies-path /Users/admin/builder/spi-builder-workspace/.derivedData/Build/Intermediates.noindex/swift-composable-environment.build/Debug-appletvos/GlobalEnvironment.build/Objects-normal/arm64/Reducer+GlobalEnvironment.swiftdeps -serialize-diagnostics-path /Users/admin/builder/spi-builder-workspace/.derivedData/Build/Intermediates.noindex/swift-composable-environment.build/Debug-appletvos/GlobalEnvironment.build/Objects-normal/arm64/Reducer+GlobalEnvironment.dia -target arm64-apple-tvos13.0 -Xllvm -aarch64-use-tbi -enable-objc-interop -stack-check -sdk /Applications/Xcode-16.1.0.app/Contents/Developer/Platforms/AppleTVOS.platform/Developer/SDKs/AppleTVOS18.1.sdk -I /Users/admin/builder/spi-builder-workspace/.derivedData/Build/Products/Debug-appletvos -I /Applications/Xcode-16.1.0.app/Contents/Developer/Platforms/AppleTVOS.platform/Developer/usr/lib -F /Users/admin/builder/spi-builder-workspace/.derivedData/Build/Products/Debug-appletvos/PackageFrameworks -F /Users/admin/builder/spi-builder-workspace/.derivedData/Build/Products/Debug-appletvos/PackageFrameworks -F /Users/admin/builder/spi-builder-workspace/.derivedData/Build/Products/Debug-appletvos/PackageFrameworks -F /Users/admin/builder/spi-builder-workspace/.derivedData/Build/Products/Debug-appletvos/PackageFrameworks -F /Users/admin/builder/spi-builder-workspace/.derivedData/Build/Products/Debug-appletvos/PackageFrameworks -F /Users/admin/builder/spi-builder-workspace/.derivedData/Build/Products/Debug-appletvos/PackageFrameworks -F /Users/admin/builder/spi-builder-workspace/.derivedData/Build/Products/Debug-appletvos/PackageFrameworks -F /Users/admin/builder/spi-builder-workspace/.derivedData/Build/Products/Debug-appletvos/PackageFrameworks -F /Users/admin/builder/spi-builder-workspace/.derivedData/Build/Products/Debug-appletvos/PackageFrameworks -F /Users/admin/builder/spi-builder-workspace/.derivedData/Build/Products/Debug-appletvos/PackageFrameworks -F /Users/admin/builder/spi-builder-workspace/.derivedData/Build/Products/Debug-appletvos/PackageFrameworks -F /Users/admin/builder/spi-builder-workspace/.derivedData/Build/Products/Debug-appletvos/PackageFrameworks -F /Users/admin/builder/spi-builder-workspace/.derivedData/Build/Products/Debug-appletvos/PackageFrameworks -F /Users/admin/builder/spi-builder-workspace/.derivedData/Build/Products/Debug-appletvos/PackageFrameworks -F /Users/admin/builder/spi-builder-workspace/.derivedData/Build/Products/Debug-appletvos/PackageFrameworks -F /Users/admin/builder/spi-builder-workspace/.derivedData/Build/Products/Debug-appletvos -F /Applications/Xcode-16.1.0.app/Contents/Developer/Platforms/AppleTVOS.platform/Developer/Library/Frameworks -F /Applications/Xcode-16.1.0.app/Contents/Developer/Platforms/AppleTVOS.platform/Developer/SDKs/AppleTVOS18.1.sdk/Developer/Library/Frameworks -no-color-diagnostics -enable-testing -g -debug-info-format\=dwarf -dwarf-version\=4 -module-cache-path /Users/admin/builder/spi-builder-workspace/.derivedData/ModuleCache.noindex -swift-version 5 -enforce-exclusivity\=checked -stats-output-dir /Users/admin/builder/spi-builder-workspace/.stats -Onone -D SWIFT_PACKAGE -D DEBUG -serialize-debugging-options -const-gather-protocols-file /Users/admin/builder/spi-builder-workspace/.derivedData/Build/Intermediates.noindex/swift-composable-environment.build/Debug-appletvos/GlobalEnvironment.build/Objects-normal/arm64/GlobalEnvironment_const_extract_protocols.json -enable-experimental-feature DebugDescriptionMacro -enable-experimental-feature OpaqueTypeErasure -enable-upcoming-feature StrictConcurrency -enable-upcoming-feature DisableOutwardActorInference -enable-upcoming-feature GlobalActorIsolatedTypesUsability -enable-upcoming-feature InferSendableFromCaptures -strict-concurrency\=complete -empty-abi-descriptor -plugin-path /Applications/Xcode-16.1.0.app/Contents/Developer/Toolchains/XcodeDefault.xctoolchain/usr/lib/swift/host/plugins/testing -validate-clang-modules-once -clang-build-session-file /Users/admin/builder/spi-builder-workspace/.derivedData/ModuleCache.noindex/Session.modulevalidation -Xcc -working-directory -Xcc /Users/admin/builder/spi-builder-workspace -resource-dir /Applications/Xcode-16.1.0.app/Contents/Developer/Toolchains/XcodeDefault.xctoolchain/usr/lib/swift -enable-anonymous-context-mangled-names -file-compilation-dir /Users/admin/builder/spi-builder-workspace -Xcc -D_LIBCPP_HARDENING_MODE\=_LIBCPP_HARDENING_MODE_DEBUG -Xcc -ivfsstatcache -Xcc /Users/admin/builder/spi-builder-workspace/.derivedData/SDKStatCaches.noindex/appletvos18.1-22J572-e7fdd8cf9ffd4d4af20823079b51a726.sdkstatcache -Xcc -I/Users/admin/builder/spi-builder-workspace/.derivedData/Build/Intermediates.noindex/swift-composable-environment.build/Debug-appletvos/GlobalEnvironment.build/swift-overrides.hmap -Xcc -I/Users/admin/builder/spi-builder-workspace/.derivedData/Build/Products/Debug-appletvos/include -Xcc -I/Users/admin/builder/spi-builder-workspace/.derivedData/Build/Intermediates.noindex/swift-composable-environment.build/Debug-appletvos/GlobalEnvironment.build/DerivedSources-normal/arm64 -Xcc -I/Users/admin/builder/spi-builder-workspace/.derivedData/Build/Intermediates.noindex/swift-composable-environment.build/Debug-appletvos/GlobalEnvironment.build/DerivedSources/arm64 -Xcc -I/Users/admin/builder/spi-builder-workspace/.derivedData/Build/Intermediates.noindex/swift-composable-environment.build/Debug-appletvos/GlobalEnvironment.build/DerivedSources -Xcc -DSWIFT_PACKAGE -Xcc -DDEBUG\=1 -module-name GlobalEnvironment -frontend-parseable-output -disable-clang-spi -target-sdk-version 18.1 -target-sdk-name appletvos18.1 -external-plugin-path /Applications/Xcode-16.1.0.app/Contents/Developer/Platforms/AppleTVOS.platform/Developer/usr/lib/swift/host/plugins\#/Applications/Xcode-16.1.0.app/Contents/Developer/Platforms/AppleTVOS.platform/Developer/usr/bin/swift-plugin-server -external-plugin-path /Applications/Xcode-16.1.0.app/Contents/Developer/Platforms/AppleTVOS.platform/Developer/usr/local/lib/swift/host/plugins\#/Applications/Xcode-16.1.0.app/Contents/Developer/Platforms/AppleTVOS.platform/Developer/usr/bin/swift-plugin-server -plugin-path /Applications/Xcode-16.1.0.app/Contents/Developer/Toolchains/XcodeDefault.xctoolchain/usr/lib/swift/host/plugins -plugin-path /Applications/Xcode-16.1.0.app/Contents/Developer/Toolchains/XcodeDefault.xctoolchain/usr/local/lib/swift/host/plugins -o /Users/admin/builder/spi-builder-workspace/.derivedData/Build/Intermediates.noindex/swift-composable-environment.build/Debug-appletvos/GlobalEnvironment.build/Objects-normal/arm64/Reducer+GlobalEnvironment.o -index-unit-output-path /swift-composable-environment.build/Debug-appletvos/GlobalEnvironment.build/Objects-normal/arm64/Reducer+GlobalEnvironment.o -index-store-path /Users/admin/builder/spi-builder-workspace/.derivedData/Index.noindex/DataStore -index-system-modules
SwiftCompile normal arm64 /Users/admin/builder/spi-builder-workspace/Sources/GlobalEnvironment/Reducer+GlobalEnvironment.swift (in target 'GlobalEnvironment' from project 'swift-composable-environment')
cd /Users/admin/builder/spi-builder-workspace
/Applications/Xcode-16.1.0.app/Contents/Developer/Toolchains/XcodeDefault.xctoolchain/usr/bin/swift-frontend -c /Users/admin/builder/spi-builder-workspace/Sources/GlobalEnvironment/Dependency.swift /Users/admin/builder/spi-builder-workspace/Sources/GlobalEnvironment/Deprecations/ComposableEnvironment+Migration.swift /Users/admin/builder/spi-builder-workspace/Sources/GlobalEnvironment/Deprecations/Reducers+Deprecations.swift /Users/admin/builder/spi-builder-workspace/Sources/GlobalEnvironment/DerivedEnvironment.swift /Users/admin/builder/spi-builder-workspace/Sources/GlobalEnvironment/GlobalEnvironment.swift -primary-file /Users/admin/builder/spi-builder-workspace/Sources/GlobalEnvironment/Reducer+GlobalEnvironment.swift -emit-dependencies-path /Users/admin/builder/spi-builder-workspace/.derivedData/Build/Intermediates.noindex/swift-composable-environment.build/Debug-appletvos/GlobalEnvironment.build/Objects-normal/arm64/Reducer+GlobalEnvironment.d -emit-const-values-path /Users/admin/builder/spi-builder-workspace/.derivedData/Build/Intermediates.noindex/swift-composable-environment.build/Debug-appletvos/GlobalEnvironment.build/Objects-normal/arm64/Reducer+GlobalEnvironment.swiftconstvalues -emit-reference-dependencies-path /Users/admin/builder/spi-builder-workspace/.derivedData/Build/Intermediates.noindex/swift-composable-environment.build/Debug-appletvos/GlobalEnvironment.build/Objects-normal/arm64/Reducer+GlobalEnvironment.swiftdeps -serialize-diagnostics-path /Users/admin/builder/spi-builder-workspace/.derivedData/Build/Intermediates.noindex/swift-composable-environment.build/Debug-appletvos/GlobalEnvironment.build/Objects-normal/arm64/Reducer+GlobalEnvironment.dia -target arm64-apple-tvos13.0 -Xllvm -aarch64-use-tbi -enable-objc-interop -stack-check -sdk /Applications/Xcode-16.1.0.app/Contents/Developer/Platforms/AppleTVOS.platform/Developer/SDKs/AppleTVOS18.1.sdk -I /Users/admin/builder/spi-builder-workspace/.derivedData/Build/Products/Debug-appletvos -I /Applications/Xcode-16.1.0.app/Contents/Developer/Platforms/AppleTVOS.platform/Developer/usr/lib -F /Users/admin/builder/spi-builder-workspace/.derivedData/Build/Products/Debug-appletvos/PackageFrameworks -F /Users/admin/builder/spi-builder-workspace/.derivedData/Build/Products/Debug-appletvos/PackageFrameworks -F /Users/admin/builder/spi-builder-workspace/.derivedData/Build/Products/Debug-appletvos/PackageFrameworks -F /Users/admin/builder/spi-builder-workspace/.derivedData/Build/Products/Debug-appletvos/PackageFrameworks -F /Users/admin/builder/spi-builder-workspace/.derivedData/Build/Products/Debug-appletvos/PackageFrameworks -F /Users/admin/builder/spi-builder-workspace/.derivedData/Build/Products/Debug-appletvos/PackageFrameworks -F /Users/admin/builder/spi-builder-workspace/.derivedData/Build/Products/Debug-appletvos/PackageFrameworks -F /Users/admin/builder/spi-builder-workspace/.derivedData/Build/Products/Debug-appletvos/PackageFrameworks -F /Users/admin/builder/spi-builder-workspace/.derivedData/Build/Products/Debug-appletvos/PackageFrameworks -F /Users/admin/builder/spi-builder-workspace/.derivedData/Build/Products/Debug-appletvos/PackageFrameworks -F /Users/admin/builder/spi-builder-workspace/.derivedData/Build/Products/Debug-appletvos/PackageFrameworks -F /Users/admin/builder/spi-builder-workspace/.derivedData/Build/Products/Debug-appletvos/PackageFrameworks -F /Users/admin/builder/spi-builder-workspace/.derivedData/Build/Products/Debug-appletvos/PackageFrameworks -F /Users/admin/builder/spi-builder-workspace/.derivedData/Build/Products/Debug-appletvos/PackageFrameworks -F /Users/admin/builder/spi-builder-workspace/.derivedData/Build/Products/Debug-appletvos/PackageFrameworks -F /Users/admin/builder/spi-builder-workspace/.derivedData/Build/Products/Debug-appletvos -F /Applications/Xcode-16.1.0.app/Contents/Developer/Platforms/AppleTVOS.platform/Developer/Library/Frameworks -F /Applications/Xcode-16.1.0.app/Contents/Developer/Platforms/AppleTVOS.platform/Developer/SDKs/AppleTVOS18.1.sdk/Developer/Library/Frameworks -no-color-diagnostics -enable-testing -g -debug-info-format\=dwarf -dwarf-version\=4 -module-cache-path /Users/admin/builder/spi-builder-workspace/.derivedData/ModuleCache.noindex -swift-version 5 -enforce-exclusivity\=checked -stats-output-dir /Users/admin/builder/spi-builder-workspace/.stats -Onone -D SWIFT_PACKAGE -D DEBUG -serialize-debugging-options -const-gather-protocols-file /Users/admin/builder/spi-builder-workspace/.derivedData/Build/Intermediates.noindex/swift-composable-environment.build/Debug-appletvos/GlobalEnvironment.build/Objects-normal/arm64/GlobalEnvironment_const_extract_protocols.json -enable-experimental-feature DebugDescriptionMacro -enable-experimental-feature OpaqueTypeErasure -enable-upcoming-feature StrictConcurrency -enable-upcoming-feature DisableOutwardActorInference -enable-upcoming-feature GlobalActorIsolatedTypesUsability -enable-upcoming-feature InferSendableFromCaptures -strict-concurrency\=complete -empty-abi-descriptor -plugin-path /Applications/Xcode-16.1.0.app/Contents/Developer/Toolchains/XcodeDefault.xctoolchain/usr/lib/swift/host/plugins/testing -validate-clang-modules-once -clang-build-session-file /Users/admin/builder/spi-builder-workspace/.derivedData/ModuleCache.noindex/Session.modulevalidation -Xcc -working-directory -Xcc /Users/admin/builder/spi-builder-workspace -resource-dir /Applications/Xcode-16.1.0.app/Contents/Developer/Toolchains/XcodeDefault.xctoolchain/usr/lib/swift -enable-anonymous-context-mangled-names -file-compilation-dir /Users/admin/builder/spi-builder-workspace -Xcc -D_LIBCPP_HARDENING_MODE\=_LIBCPP_HARDENING_MODE_DEBUG -Xcc -ivfsstatcache -Xcc /Users/admin/builder/spi-builder-workspace/.derivedData/SDKStatCaches.noindex/appletvos18.1-22J572-e7fdd8cf9ffd4d4af20823079b51a726.sdkstatcache -Xcc -I/Users/admin/builder/spi-builder-workspace/.derivedData/Build/Intermediates.noindex/swift-composable-environment.build/Debug-appletvos/GlobalEnvironment.build/swift-overrides.hmap -Xcc -I/Users/admin/builder/spi-builder-workspace/.derivedData/Build/Products/Debug-appletvos/include -Xcc -I/Users/admin/builder/spi-builder-workspace/.derivedData/Build/Intermediates.noindex/swift-composable-environment.build/Debug-appletvos/GlobalEnvironment.build/DerivedSources-normal/arm64 -Xcc -I/Users/admin/builder/spi-builder-workspace/.derivedData/Build/Intermediates.noindex/swift-composable-environment.build/Debug-appletvos/GlobalEnvironment.build/DerivedSources/arm64 -Xcc -I/Users/admin/builder/spi-builder-workspace/.derivedData/Build/Intermediates.noindex/swift-composable-environment.build/Debug-appletvos/GlobalEnvironment.build/DerivedSources -Xcc -DSWIFT_PACKAGE -Xcc -DDEBUG\=1 -module-name GlobalEnvironment -frontend-parseable-output -disable-clang-spi -target-sdk-version 18.1 -target-sdk-name appletvos18.1 -external-plugin-path /Applications/Xcode-16.1.0.app/Contents/Developer/Platforms/AppleTVOS.platform/Developer/usr/lib/swift/host/plugins\#/Applications/Xcode-16.1.0.app/Contents/Developer/Platforms/AppleTVOS.platform/Developer/usr/bin/swift-plugin-server -external-plugin-path /Applications/Xcode-16.1.0.app/Contents/Developer/Platforms/AppleTVOS.platform/Developer/usr/local/lib/swift/host/plugins\#/Applications/Xcode-16.1.0.app/Contents/Developer/Platforms/AppleTVOS.platform/Developer/usr/bin/swift-plugin-server -plugin-path /Applications/Xcode-16.1.0.app/Contents/Developer/Toolchains/XcodeDefault.xctoolchain/usr/lib/swift/host/plugins -plugin-path /Applications/Xcode-16.1.0.app/Contents/Developer/Toolchains/XcodeDefault.xctoolchain/usr/local/lib/swift/host/plugins -o /Users/admin/builder/spi-builder-workspace/.derivedData/Build/Intermediates.noindex/swift-composable-environment.build/Debug-appletvos/GlobalEnvironment.build/Objects-normal/arm64/Reducer+GlobalEnvironment.o -index-unit-output-path /swift-composable-environment.build/Debug-appletvos/GlobalEnvironment.build/Objects-normal/arm64/Reducer+GlobalEnvironment.o -index-store-path /Users/admin/builder/spi-builder-workspace/.derivedData/Index.noindex/DataStore -index-system-modules
SwiftEmitModule normal arm64 Emitting\ module\ for\ ComposableArchitecture (in target 'ComposableArchitecture' from project 'swift-composable-architecture')
cd /Users/admin/builder/spi-builder-workspace
builtin-swiftTaskExecution -- /Applications/Xcode-16.1.0.app/Contents/Developer/Toolchains/XcodeDefault.xctoolchain/usr/bin/swift-frontend -frontend -emit-module -experimental-skip-non-inlinable-function-bodies-without-types /Users/admin/builder/spi-builder-workspace/.dependencies/checkouts/swift-composable-architecture/Sources/ComposableArchitecture/Dependencies/Dismiss.swift /Users/admin/builder/spi-builder-workspace/.dependencies/checkouts/swift-composable-architecture/Sources/ComposableArchitecture/Dependencies/IsPresented.swift /Users/admin/builder/spi-builder-workspace/.dependencies/checkouts/swift-composable-architecture/Sources/ComposableArchitecture/Effect.swift /Users/admin/builder/spi-builder-workspace/.dependencies/checkouts/swift-composable-architecture/Sources/ComposableArchitecture/Effects/Animation.swift /Users/admin/builder/spi-builder-workspace/.dependencies/checkouts/swift-composable-architecture/Sources/ComposableArchitecture/Effects/Cancellation.swift /Users/admin/builder/spi-builder-workspace/.dependencies/checkouts/swift-composable-architecture/Sources/ComposableArchitecture/Effects/EffectActions.swift /Users/admin/builder/spi-builder-workspace/.dependencies/checkouts/swift-composable-architecture/Sources/ComposableArchitecture/Effects/Publisher.swift /Users/admin/builder/spi-builder-workspace/.dependencies/checkouts/swift-composable-architecture/Sources/ComposableArchitecture/Effects/Publisher/Debouncing.swift /Users/admin/builder/spi-builder-workspace/.dependencies/checkouts/swift-composable-architecture/Sources/ComposableArchitecture/Effects/Publisher/Deferring.swift /Users/admin/builder/spi-builder-workspace/.dependencies/checkouts/swift-composable-architecture/Sources/ComposableArchitecture/Effects/Publisher/Throttling.swift /Users/admin/builder/spi-builder-workspace/.dependencies/checkouts/swift-composable-architecture/Sources/ComposableArchitecture/Effects/Publisher/Timer.swift /Users/admin/builder/spi-builder-workspace/.dependencies/checkouts/swift-composable-architecture/Sources/ComposableArchitecture/Effects/TaskResult.swift /Users/admin/builder/spi-builder-workspace/.dependencies/checkouts/swift-composable-architecture/Sources/ComposableArchitecture/Internal/AreOrderedSetsDuplicates.swift /Users/admin/builder/spi-builder-workspace/.dependencies/checkouts/swift-composable-architecture/Sources/ComposableArchitecture/Internal/Binding+IsPresent.swift /Users/admin/builder/spi-builder-workspace/.dependencies/checkouts/swift-composable-architecture/Sources/ComposableArchitecture/Internal/Box.swift /Users/admin/builder/spi-builder-workspace/.dependencies/checkouts/swift-composable-architecture/Sources/ComposableArchitecture/Internal/Create.swift /Users/admin/builder/spi-builder-workspace/.dependencies/checkouts/swift-composable-architecture/Sources/ComposableArchitecture/Internal/CurrentValueRelay.swift /Users/admin/builder/spi-builder-workspace/.dependencies/checkouts/swift-composable-architecture/Sources/ComposableArchitecture/Internal/Debug.swift /Users/admin/builder/spi-builder-workspace/.dependencies/checkouts/swift-composable-architecture/Sources/ComposableArchitecture/Internal/Deprecations.swift /Users/admin/builder/spi-builder-workspace/.dependencies/checkouts/swift-composable-architecture/Sources/ComposableArchitecture/Internal/EphemeralState.swift /Users/admin/builder/spi-builder-workspace/.dependencies/checkouts/swift-composable-architecture/Sources/ComposableArchitecture/Internal/Exports.swift /Users/admin/builder/spi-builder-workspace/.dependencies/checkouts/swift-composable-architecture/Sources/ComposableArchitecture/Internal/Locking.swift /Users/admin/builder/spi-builder-workspace/.dependencies/checkouts/swift-composable-architecture/Sources/ComposableArchitecture/Internal/NavigationID.swift /Users/admin/builder/spi-builder-workspace/.dependencies/checkouts/swift-composable-architecture/Sources/ComposableArchitecture/Internal/OpenExistential.swift /Users/admin/builder/spi-builder-workspace/.dependencies/checkouts/swift-composable-architecture/Sources/ComposableArchitecture/Internal/PresentationID.swift /Users/admin/builder/spi-builder-workspace/.dependencies/checkouts/swift-composable-architecture/Sources/ComposableArchitecture/Internal/ReturningLastNonNilValue.swift /Users/admin/builder/spi-builder-workspace/.dependencies/checkouts/swift-composable-architecture/Sources/ComposableArchitecture/Internal/RuntimeWarnings.swift /Users/admin/builder/spi-builder-workspace/.dependencies/checkouts/swift-composable-architecture/Sources/ComposableArchitecture/Internal/StackIDGenerator.swift /Users/admin/builder/spi-builder-workspace/.dependencies/checkouts/swift-composable-architecture/Sources/ComposableArchitecture/Internal/TypeName.swift /Users/admin/builder/spi-builder-workspace/.dependencies/checkouts/swift-composable-architecture/Sources/ComposableArchitecture/Reducer.swift /Users/admin/builder/spi-builder-workspace/.dependencies/checkouts/swift-composable-architecture/Sources/ComposableArchitecture/Reducer/AnyReducer/AnyReducer.swift /Users/admin/builder/spi-builder-workspace/.dependencies/checkouts/swift-composable-architecture/Sources/ComposableArchitecture/Reducer/AnyReducer/AnyReducerBinding.swift /Users/admin/builder/spi-builder-workspace/.dependencies/checkouts/swift-composable-architecture/Sources/ComposableArchitecture/Reducer/AnyReducer/AnyReducerCompatibility.swift /Users/admin/builder/spi-builder-workspace/.dependencies/checkouts/swift-composable-architecture/Sources/ComposableArchitecture/Reducer/AnyReducer/AnyReducerDebug.swift /Users/admin/builder/spi-builder-workspace/.dependencies/checkouts/swift-composable-architecture/Sources/ComposableArchitecture/Reducer/AnyReducer/AnyReducerSignpost.swift /Users/admin/builder/spi-builder-workspace/.dependencies/checkouts/swift-composable-architecture/Sources/ComposableArchitecture/Reducer/ReducerBuilder.swift /Users/admin/builder/spi-builder-workspace/.dependencies/checkouts/swift-composable-architecture/Sources/ComposableArchitecture/Reducer/Reducers/BindingReducer.swift /Users/admin/builder/spi-builder-workspace/.dependencies/checkouts/swift-composable-architecture/Sources/ComposableArchitecture/Reducer/Reducers/CombineReducers.swift /Users/admin/builder/spi-builder-workspace/.dependencies/checkouts/swift-composable-architecture/Sources/ComposableArchitecture/Reducer/Reducers/DebugReducer.swift /Users/admin/builder/spi-builder-workspace/.dependencies/checkouts/swift-composable-architecture/Sources/ComposableArchitecture/Reducer/Reducers/DependencyKeyWritingReducer.swift /Users/admin/builder/spi-builder-workspace/.dependencies/checkouts/swift-composable-architecture/Sources/ComposableArchitecture/Reducer/Reducers/EmptyReducer.swift /Users/admin/builder/spi-builder-workspace/.dependencies/checkouts/swift-composable-architecture/Sources/ComposableArchitecture/Reducer/Reducers/ForEachReducer.swift /Users/admin/builder/spi-builder-workspace/.dependencies/checkouts/swift-composable-architecture/Sources/ComposableArchitecture/Reducer/Reducers/IfCaseLetReducer.swift /Users/admin/builder/spi-builder-workspace/.dependencies/checkouts/swift-composable-architecture/Sources/ComposableArchitecture/Reducer/Reducers/IfLetReducer.swift /Users/admin/builder/spi-builder-workspace/.dependencies/checkouts/swift-composable-architecture/Sources/ComposableArchitecture/Reducer/Reducers/OnChange.swift /Users/admin/builder/spi-builder-workspace/.dependencies/checkouts/swift-composable-architecture/Sources/ComposableArchitecture/Reducer/Reducers/Optional.swift /Users/admin/builder/spi-builder-workspace/.dependencies/checkouts/swift-composable-architecture/Sources/ComposableArchitecture/Reducer/Reducers/PresentationReducer.swift /Users/admin/builder/spi-builder-workspace/.dependencies/checkouts/swift-composable-architecture/Sources/ComposableArchitecture/Reducer/Reducers/Reduce.swift /Users/admin/builder/spi-builder-workspace/.dependencies/checkouts/swift-composable-architecture/Sources/ComposableArchitecture/Reducer/Reducers/Scope.swift /Users/admin/builder/spi-builder-workspace/.dependencies/checkouts/swift-composable-architecture/Sources/ComposableArchitecture/Reducer/Reducers/SignpostReducer.swift /Users/admin/builder/spi-builder-workspace/.dependencies/checkouts/swift-composable-architecture/Sources/ComposableArchitecture/Reducer/Reducers/StackReducer.swift /Users/admin/builder/spi-builder-workspace/.dependencies/checkouts/swift-composable-architecture/Sources/ComposableArchitecture/Store.swift /Users/admin/builder/spi-builder-workspace/.dependencies/checkouts/swift-composable-architecture/Sources/ComposableArchitecture/SwiftUI/Alert.swift /Users/admin/builder/spi-builder-workspace/.dependencies/checkouts/swift-composable-architecture/Sources/ComposableArchitecture/SwiftUI/Binding.swift /Users/admin/builder/spi-builder-workspace/.dependencies/checkouts/swift-composable-architecture/Sources/ComposableArchitecture/SwiftUI/ConfirmationDialog.swift /Users/admin/builder/spi-builder-workspace/.dependencies/checkouts/swift-composable-architecture/Sources/ComposableArchitecture/SwiftUI/Deprecated/ActionSheet.swift /Users/admin/builder/spi-builder-workspace/.dependencies/checkouts/swift-composable-architecture/Sources/ComposableArchitecture/SwiftUI/Deprecated/LegacyAlert.swift /Users/admin/builder/spi-builder-workspace/.dependencies/checkouts/swift-composable-architecture/Sources/ComposableArchitecture/SwiftUI/Deprecated/NavigationLinkStore.swift /Users/admin/builder/spi-builder-workspace/.dependencies/checkouts/swift-composable-architecture/Sources/ComposableArchitecture/SwiftUI/ForEachStore.swift /Users/admin/builder/spi-builder-workspace/.dependencies/checkouts/swift-composable-architecture/Sources/ComposableArchitecture/SwiftUI/FullScreenCover.swift /Users/admin/builder/spi-builder-workspace/.dependencies/checkouts/swift-composable-architecture/Sources/ComposableArchitecture/SwiftUI/IfLetStore.swift /Users/admin/builder/spi-builder-workspace/.dependencies/checkouts/swift-composable-architecture/Sources/ComposableArchitecture/SwiftUI/NavigationDestination.swift /Users/admin/builder/spi-builder-workspace/.dependencies/checkouts/swift-composable-architecture/Sources/ComposableArchitecture/SwiftUI/NavigationStackStore.swift /Users/admin/builder/spi-builder-workspace/.dependencies/checkouts/swift-composable-architecture/Sources/ComposableArchitecture/SwiftUI/Popover.swift /Users/admin/builder/spi-builder-workspace/.dependencies/checkouts/swift-composable-architecture/Sources/ComposableArchitecture/SwiftUI/PresentationModifier.swift /Users/admin/builder/spi-builder-workspace/.dependencies/checkouts/swift-composable-architecture/Sources/ComposableArchitecture/SwiftUI/Sheet.swift /Users/admin/builder/spi-builder-workspace/.dependencies/checkouts/swift-composable-architecture/Sources/ComposableArchitecture/SwiftUI/SwitchStore.swift /Users/admin/builder/spi-builder-workspace/.dependencies/checkouts/swift-composable-architecture/Sources/ComposableArchitecture/SwiftUI/WithViewStore.swift /Users/admin/builder/spi-builder-workspace/.dependencies/checkouts/swift-composable-architecture/Sources/ComposableArchitecture/TestStore.swift /Users/admin/builder/spi-builder-workspace/.dependencies/checkouts/swift-composable-architecture/Sources/ComposableArchitecture/UIKit/AlertStateUIKit.swift /Users/admin/builder/spi-builder-workspace/.dependencies/checkouts/swift-composable-architecture/Sources/ComposableArchitecture/UIKit/IfLetUIKit.swift /Users/admin/builder/spi-builder-workspace/.dependencies/checkouts/swift-composable-architecture/Sources/ComposableArchitecture/ViewStore.swift -target arm64-apple-tvos13.0 -Xllvm -aarch64-use-tbi -enable-objc-interop -stack-check -sdk /Applications/Xcode-16.1.0.app/Contents/Developer/Platforms/AppleTVOS.platform/Developer/SDKs/AppleTVOS18.1.sdk -I /Users/admin/builder/spi-builder-workspace/.derivedData/Build/Products/Debug-appletvos -I /Applications/Xcode-16.1.0.app/Contents/Developer/Platforms/AppleTVOS.platform/Developer/usr/lib -F /Users/admin/builder/spi-builder-workspace/.derivedData/Build/Products/Debug-appletvos/PackageFrameworks -F /Users/admin/builder/spi-builder-workspace/.derivedData/Build/Products/Debug-appletvos/PackageFrameworks -F /Users/admin/builder/spi-builder-workspace/.derivedData/Build/Products/Debug-appletvos/PackageFrameworks -F /Users/admin/builder/spi-builder-workspace/.derivedData/Build/Products/Debug-appletvos/PackageFrameworks -F /Users/admin/builder/spi-builder-workspace/.derivedData/Build/Products/Debug-appletvos/PackageFrameworks -F /Users/admin/builder/spi-builder-workspace/.derivedData/Build/Products/Debug-appletvos/PackageFrameworks -F /Users/admin/builder/spi-builder-workspace/.derivedData/Build/Products/Debug-appletvos/PackageFrameworks -F /Users/admin/builder/spi-builder-workspace/.derivedData/Build/Products/Debug-appletvos/PackageFrameworks -F /Users/admin/builder/spi-builder-workspace/.derivedData/Build/Products/Debug-appletvos/PackageFrameworks -F /Users/admin/builder/spi-builder-workspace/.derivedData/Build/Products/Debug-appletvos/PackageFrameworks -F /Users/admin/builder/spi-builder-workspace/.derivedData/Build/Products/Debug-appletvos/PackageFrameworks -F /Users/admin/builder/spi-builder-workspace/.derivedData/Build/Products/Debug-appletvos -F /Applications/Xcode-16.1.0.app/Contents/Developer/Platforms/AppleTVOS.platform/Developer/Library/Frameworks -F /Applications/Xcode-16.1.0.app/Contents/Developer/Platforms/AppleTVOS.platform/Developer/SDKs/AppleTVOS18.1.sdk/Developer/Library/Frameworks -no-color-diagnostics -enable-testing -g -debug-info-format\=dwarf -dwarf-version\=4 -module-cache-path /Users/admin/builder/spi-builder-workspace/.derivedData/ModuleCache.noindex -suppress-warnings -swift-version 5 -enforce-exclusivity\=checked -stats-output-dir /Users/admin/builder/spi-builder-workspace/.stats -Onone -D SWIFT_PACKAGE -D DEBUG -serialize-debugging-options -const-gather-protocols-file /Users/admin/builder/spi-builder-workspace/.derivedData/Build/Intermediates.noindex/swift-composable-architecture.build/Debug-appletvos/ComposableArchitecture.build/Objects-normal/arm64/ComposableArchitecture_const_extract_protocols.json -enable-experimental-feature DebugDescriptionMacro -enable-experimental-feature OpaqueTypeErasure -enable-upcoming-feature StrictConcurrency -enable-upcoming-feature DisableOutwardActorInference -enable-upcoming-feature GlobalActorIsolatedTypesUsability -enable-upcoming-feature InferSendableFromCaptures -strict-concurrency\=complete -empty-abi-descriptor -plugin-path /Applications/Xcode-16.1.0.app/Contents/Developer/Toolchains/XcodeDefault.xctoolchain/usr/lib/swift/host/plugins/testing -validate-clang-modules-once -clang-build-session-file /Users/admin/builder/spi-builder-workspace/.derivedData/ModuleCache.noindex/Session.modulevalidation -Xcc -working-directory -Xcc /Users/admin/builder/spi-builder-workspace -resource-dir /Applications/Xcode-16.1.0.app/Contents/Developer/Toolchains/XcodeDefault.xctoolchain/usr/lib/swift -enable-anonymous-context-mangled-names -file-compilation-dir /Users/admin/builder/spi-builder-workspace -Xcc -D_LIBCPP_HARDENING_MODE\=_LIBCPP_HARDENING_MODE_DEBUG -Xcc -ivfsstatcache -Xcc /Users/admin/builder/spi-builder-workspace/.derivedData/SDKStatCaches.noindex/appletvos18.1-22J572-e7fdd8cf9ffd4d4af20823079b51a726.sdkstatcache -Xcc -I/Users/admin/builder/spi-builder-workspace/.derivedData/Build/Intermediates.noindex/swift-composable-architecture.build/Debug-appletvos/ComposableArchitecture.build/swift-overrides.hmap -Xcc -I/Users/admin/builder/spi-builder-workspace/.derivedData/Build/Products/Debug-appletvos/include -Xcc -I/Users/admin/builder/spi-builder-workspace/.derivedData/Build/Intermediates.noindex/swift-composable-architecture.build/Debug-appletvos/ComposableArchitecture.build/DerivedSources-normal/arm64 -Xcc -I/Users/admin/builder/spi-builder-workspace/.derivedData/Build/Intermediates.noindex/swift-composable-architecture.build/Debug-appletvos/ComposableArchitecture.build/DerivedSources/arm64 -Xcc -I/Users/admin/builder/spi-builder-workspace/.derivedData/Build/Intermediates.noindex/swift-composable-architecture.build/Debug-appletvos/ComposableArchitecture.build/DerivedSources -Xcc -DSWIFT_PACKAGE -Xcc -DDEBUG\=1 -module-name ComposableArchitecture -frontend-parseable-output -disable-clang-spi -target-sdk-version 18.1 -target-sdk-name appletvos18.1 -external-plugin-path /Applications/Xcode-16.1.0.app/Contents/Developer/Platforms/AppleTVOS.platform/Developer/usr/lib/swift/host/plugins\#/Applications/Xcode-16.1.0.app/Contents/Developer/Platforms/AppleTVOS.platform/Developer/usr/bin/swift-plugin-server -external-plugin-path /Applications/Xcode-16.1.0.app/Contents/Developer/Platforms/AppleTVOS.platform/Developer/usr/local/lib/swift/host/plugins\#/Applications/Xcode-16.1.0.app/Contents/Developer/Platforms/AppleTVOS.platform/Developer/usr/bin/swift-plugin-server -plugin-path /Applications/Xcode-16.1.0.app/Contents/Developer/Toolchains/XcodeDefault.xctoolchain/usr/lib/swift/host/plugins -plugin-path /Applications/Xcode-16.1.0.app/Contents/Developer/Toolchains/XcodeDefault.xctoolchain/usr/local/lib/swift/host/plugins -emit-module-doc-path /Users/admin/builder/spi-builder-workspace/.derivedData/Build/Intermediates.noindex/swift-composable-architecture.build/Debug-appletvos/ComposableArchitecture.build/Objects-normal/arm64/ComposableArchitecture.swiftdoc -emit-module-source-info-path /Users/admin/builder/spi-builder-workspace/.derivedData/Build/Intermediates.noindex/swift-composable-architecture.build/Debug-appletvos/ComposableArchitecture.build/Objects-normal/arm64/ComposableArchitecture.swiftsourceinfo -emit-objc-header-path /Users/admin/builder/spi-builder-workspace/.derivedData/Build/Intermediates.noindex/swift-composable-architecture.build/Debug-appletvos/ComposableArchitecture.build/Objects-normal/arm64/ComposableArchitecture-Swift.h -serialize-diagnostics-path /Users/admin/builder/spi-builder-workspace/.derivedData/Build/Intermediates.noindex/swift-composable-architecture.build/Debug-appletvos/ComposableArchitecture.build/Objects-normal/arm64/ComposableArchitecture-master-emit-module.dia -emit-dependencies-path /Users/admin/builder/spi-builder-workspace/.derivedData/Build/Intermediates.noindex/swift-composable-architecture.build/Debug-appletvos/ComposableArchitecture.build/Objects-normal/arm64/ComposableArchitecture-master-emit-module.d -o /Users/admin/builder/spi-builder-workspace/.derivedData/Build/Intermediates.noindex/swift-composable-architecture.build/Debug-appletvos/ComposableArchitecture.build/Objects-normal/arm64/ComposableArchitecture.swiftmodule -emit-abi-descriptor-path /Users/admin/builder/spi-builder-workspace/.derivedData/Build/Intermediates.noindex/swift-composable-architecture.build/Debug-appletvos/ComposableArchitecture.build/Objects-normal/arm64/ComposableArchitecture.abi.json
Command SwiftEmitModule failed with a nonzero exit code
** BUILD FAILED **
The following build commands failed:
EmitSwiftModule normal arm64 (in target 'ComposableEnvironment' from project 'swift-composable-environment')
SwiftEmitModule normal arm64 Emitting\ module\ for\ ComposableEnvironment (in target 'ComposableEnvironment' from project 'swift-composable-environment')
SwiftCompile normal arm64 /Users/admin/builder/spi-builder-workspace/Sources/ComposableEnvironment/Deprecations/Reducers+Deprecations.swift (in target 'ComposableEnvironment' from project 'swift-composable-environment')
SwiftCompile normal arm64 Compiling\ Reducers+Deprecations.swift /Users/admin/builder/spi-builder-workspace/Sources/ComposableEnvironment/Deprecations/Reducers+Deprecations.swift (in target 'ComposableEnvironment' from project 'swift-composable-environment')
SwiftCompile normal arm64 Compiling\ Reducer+ComposableEnvironment.swift /Users/admin/builder/spi-builder-workspace/Sources/ComposableEnvironment/Reducer+ComposableEnvironment.swift (in target 'ComposableEnvironment' from project 'swift-composable-environment')
SwiftCompile normal arm64 /Users/admin/builder/spi-builder-workspace/Sources/ComposableEnvironment/Reducer+ComposableEnvironment.swift (in target 'ComposableEnvironment' from project 'swift-composable-environment')
SwiftCompile normal arm64 Compiling\ Reducers+Deprecations.swift /Users/admin/builder/spi-builder-workspace/Sources/GlobalEnvironment/Deprecations/Reducers+Deprecations.swift (in target 'GlobalEnvironment' from project 'swift-composable-environment')
SwiftCompile normal arm64 /Users/admin/builder/spi-builder-workspace/Sources/GlobalEnvironment/Deprecations/Reducers+Deprecations.swift (in target 'GlobalEnvironment' from project 'swift-composable-environment')
SwiftEmitModule normal arm64 Emitting\ module\ for\ ComposableArchitecture (in target 'ComposableArchitecture' from project 'swift-composable-architecture')
Building workspace ComposableEnvironment with scheme swift-composable-environment-Package
(10 failures)
BUILD FAILURE 6.0 tvOS